lucene-dev mailing list archives

Site index · List index
Message view « Date » · « Thread »
Top « Date » · « Thread »
From Policeman Jenkins Server <jenk...@thetaphi.de>
Subject [JENKINS] Lucene-Solr-7.x-Linux (32bit/jdk1.8.0_144) - Build # 705 - Unstable!
Date Mon, 30 Oct 2017 19:10:52 GMT
Build: https://jenkins.thetaphi.de/job/Lucene-Solr-7.x-Linux/705/
Java: 32bit/jdk1.8.0_144 -client -XX:+UseParallelGC

4 tests failed.
FAILED:  org.apache.solr.cloud.CdcrBootstrapTest.testBootstrapWithContinousIndexingOnSourceCluster

Error Message:
Document mismatch on target after sync expected:<2000> but was:<1901>

Stack Trace:
java.lang.AssertionError: Document mismatch on target after sync expected:<2000> but was:<1901>
	at __randomizedtesting.SeedInfo.seed([3F6CA6603083910D:EB29ED39D7D522F6]:0)
	at org.junit.Assert.fail(Assert.java:93)
	at org.junit.Assert.failNotEquals(Assert.java:647)
	at org.junit.Assert.assertEquals(Assert.java:128)
	at org.junit.Assert.assertEquals(Assert.java:472)
	at org.apache.solr.cloud.CdcrBootstrapTest.testBootstrapWithContinousIndexingOnSourceCluster(CdcrBootstrapTest.java:294)
	at sun.reflect.NativeMethodAccessorImpl.invoke0(Native Method)
	at sun.reflect.NativeMethodAccessorImpl.invoke(NativeMethodAccessorImpl.java:62)
	at sun.reflect.DelegatingMethodAccessorImpl.invoke(DelegatingMethodAccessorImpl.java:43)
	at java.lang.reflect.Method.invoke(Method.java:498)
	at com.carrotsearch.randomizedtesting.RandomizedRunner.invoke(RandomizedRunner.java:1737)
	at com.carrotsearch.randomizedtesting.RandomizedRunner$8.evaluate(RandomizedRunner.java:934)
	at com.carrotsearch.randomizedtesting.RandomizedRunner$9.evaluate(RandomizedRunner.java:970)
	at com.carrotsearch.randomizedtesting.RandomizedRunner$10.evaluate(RandomizedRunner.java:984)
	at com.carrotsearch.randomizedtesting.rules.SystemPropertiesRestoreRule$1.evaluate(SystemPropertiesRestoreRule.java:57)
	at org.apache.lucene.util.TestRuleSetupTeardownChained$1.evaluate(TestRuleSetupTeardownChained.java:49)
	at org.apache.lucene.util.AbstractBeforeAfterRule$1.evaluate(AbstractBeforeAfterRule.java:45)
	at org.apache.lucene.util.TestRuleThreadAndTestName$1.evaluate(TestRuleThreadAndTestName.java:48)
	at org.apache.lucene.util.TestRuleIgnoreAfterMaxFailures$1.evaluate(TestRuleIgnoreAfterMaxFailures.java:64)
	at org.apache.lucene.util.TestRuleMarkFailure$1.evaluate(TestRuleMarkFailure.java:47)
	at com.carrotsearch.randomizedtesting.rules.StatementAdapter.evaluate(StatementAdapter.java:36)
	at com.carrotsearch.randomizedtesting.ThreadLeakControl$StatementRunner.run(ThreadLeakControl.java:368)
	at com.carrotsearch.randomizedtesting.ThreadLeakControl.forkTimeoutingTask(ThreadLeakControl.java:817)
	at com.carrotsearch.randomizedtesting.ThreadLeakControl$3.evaluate(ThreadLeakControl.java:468)
	at com.carrotsearch.randomizedtesting.RandomizedRunner.runSingleTest(RandomizedRunner.java:943)
	at com.carrotsearch.randomizedtesting.RandomizedRunner$5.evaluate(RandomizedRunner.java:829)
	at com.carrotsearch.randomizedtesting.RandomizedRunner$6.evaluate(RandomizedRunner.java:879)
	at com.carrotsearch.randomizedtesting.RandomizedRunner$7.evaluate(RandomizedRunner.java:890)
	at com.carrotsearch.randomizedtesting.rules.StatementAdapter.evaluate(StatementAdapter.java:36)
	at com.carrotsearch.randomizedtesting.rules.SystemPropertiesRestoreRule$1.evaluate(SystemPropertiesRestoreRule.java:57)
	at org.apache.lucene.util.AbstractBeforeAfterRule$1.evaluate(AbstractBeforeAfterRule.java:45)
	at com.carrotsearch.randomizedtesting.rules.StatementAdapter.evaluate(StatementAdapter.java:36)
	at org.apache.lucene.util.TestRuleStoreClassName$1.evaluate(TestRuleStoreClassName.java:41)
	at com.carrotsearch.randomizedtesting.rules.NoShadowingOrOverridesOnMethodsRule$1.evaluate(NoShadowingOrOverridesOnMethodsRule.java:40)
	at com.carrotsearch.randomizedtesting.rules.NoShadowingOrOverridesOnMethodsRule$1.evaluate(NoShadowingOrOverridesOnMethodsRule.java:40)
	at com.carrotsearch.randomizedtesting.rules.StatementAdapter.evaluate(StatementAdapter.java:36)
	at com.carrotsearch.randomizedtesting.rules.StatementAdapter.evaluate(StatementAdapter.java:36)
	at com.carrotsearch.randomizedtesting.rules.StatementAdapter.evaluate(StatementAdapter.java:36)
	at org.apache.lucene.util.TestRuleAssertionsRequired$1.evaluate(TestRuleAssertionsRequired.java:53)
	at org.apache.lucene.util.TestRuleMarkFailure$1.evaluate(TestRuleMarkFailure.java:47)
	at org.apache.lucene.util.TestRuleIgnoreAfterMaxFailures$1.evaluate(TestRuleIgnoreAfterMaxFailures.java:64)
	at org.apache.lucene.util.TestRuleIgnoreTestSuites$1.evaluate(TestRuleIgnoreTestSuites.java:54)
	at com.carrotsearch.randomizedtesting.rules.StatementAdapter.evaluate(StatementAdapter.java:36)
	at com.carrotsearch.randomizedtesting.ThreadLeakControl$StatementRunner.run(ThreadLeakControl.java:368)
	at java.lang.Thread.run(Thread.java:748)


FAILED:  org.apache.solr.cloud.CollectionStateFormat2Test.testZkNodeLocation

Error Message:
Error from server at https://127.0.0.1:35103/solr: create the collection time out:180s

Stack Trace:
org.apache.solr.client.solrj.impl.HttpSolrClient$RemoteSolrException: Error from server at https://127.0.0.1:35103/solr: create the collection time out:180s
	at __randomizedtesting.SeedInfo.seed([3F6CA6603083910D:70C12CC09DEC1FF9]:0)
	at org.apache.solr.client.solrj.impl.HttpSolrClient.executeMethod(HttpSolrClient.java:626)
	at org.apache.solr.client.solrj.impl.HttpSolrClient.request(HttpSolrClient.java:253)
	at org.apache.solr.client.solrj.impl.HttpSolrClient.request(HttpSolrClient.java:242)
	at org.apache.solr.client.solrj.impl.LBHttpSolrClient.doRequest(LBHttpSolrClient.java:483)
	at org.apache.solr.client.solrj.impl.LBHttpSolrClient.request(LBHttpSolrClient.java:413)
	at org.apache.solr.client.solrj.impl.CloudSolrClient.sendRequest(CloudSolrClient.java:1096)
	at org.apache.solr.client.solrj.impl.CloudSolrClient.requestWithRetryOnStaleState(CloudSolrClient.java:875)
	at org.apache.solr.client.solrj.impl.CloudSolrClient.request(CloudSolrClient.java:808)
	at org.apache.solr.client.solrj.SolrRequest.process(SolrRequest.java:178)
	at org.apache.solr.client.solrj.SolrRequest.process(SolrRequest.java:195)
	at org.apache.solr.cloud.CollectionStateFormat2Test.testZkNodeLocation(CollectionStateFormat2Test.java:48)
	at sun.reflect.NativeMethodAccessorImpl.invoke0(Native Method)
	at sun.reflect.NativeMethodAccessorImpl.invoke(NativeMethodAccessorImpl.java:62)
	at sun.reflect.DelegatingMethodAccessorImpl.invoke(DelegatingMethodAccessorImpl.java:43)
	at java.lang.reflect.Method.invoke(Method.java:498)
	at com.carrotsearch.randomizedtesting.RandomizedRunner.invoke(RandomizedRunner.java:1737)
	at com.carrotsearch.randomizedtesting.RandomizedRunner$8.evaluate(RandomizedRunner.java:934)
	at com.carrotsearch.randomizedtesting.RandomizedRunner$9.evaluate(RandomizedRunner.java:970)
	at com.carrotsearch.randomizedtesting.RandomizedRunner$10.evaluate(RandomizedRunner.java:984)
	at com.carrotsearch.randomizedtesting.rules.SystemPropertiesRestoreRule$1.evaluate(SystemPropertiesRestoreRule.java:57)
	at org.apache.lucene.util.TestRuleSetupTeardownChained$1.evaluate(TestRuleSetupTeardownChained.java:49)
	at org.apache.lucene.util.AbstractBeforeAfterRule$1.evaluate(AbstractBeforeAfterRule.java:45)
	at org.apache.lucene.util.TestRuleThreadAndTestName$1.evaluate(TestRuleThreadAndTestName.java:48)
	at org.apache.lucene.util.TestRuleIgnoreAfterMaxFailures$1.evaluate(TestRuleIgnoreAfterMaxFailures.java:64)
	at org.apache.lucene.util.TestRuleMarkFailure$1.evaluate(TestRuleMarkFailure.java:47)
	at com.carrotsearch.randomizedtesting.rules.StatementAdapter.evaluate(StatementAdapter.java:36)
	at com.carrotsearch.randomizedtesting.ThreadLeakControl$StatementRunner.run(ThreadLeakControl.java:368)
	at com.carrotsearch.randomizedtesting.ThreadLeakControl.forkTimeoutingTask(ThreadLeakControl.java:817)
	at com.carrotsearch.randomizedtesting.ThreadLeakControl$3.evaluate(ThreadLeakControl.java:468)
	at com.carrotsearch.randomizedtesting.RandomizedRunner.runSingleTest(RandomizedRunner.java:943)
	at com.carrotsearch.randomizedtesting.RandomizedRunner$5.evaluate(RandomizedRunner.java:829)
	at com.carrotsearch.randomizedtesting.RandomizedRunner$6.evaluate(RandomizedRunner.java:879)
	at com.carrotsearch.randomizedtesting.RandomizedRunner$7.evaluate(RandomizedRunner.java:890)
	at com.carrotsearch.randomizedtesting.rules.StatementAdapter.evaluate(StatementAdapter.java:36)
	at com.carrotsearch.randomizedtesting.rules.SystemPropertiesRestoreRule$1.evaluate(SystemPropertiesRestoreRule.java:57)
	at org.apache.lucene.util.AbstractBeforeAfterRule$1.evaluate(AbstractBeforeAfterRule.java:45)
	at com.carrotsearch.randomizedtesting.rules.StatementAdapter.evaluate(StatementAdapter.java:36)
	at org.apache.lucene.util.TestRuleStoreClassName$1.evaluate(TestRuleStoreClassName.java:41)
	at com.carrotsearch.randomizedtesting.rules.NoShadowingOrOverridesOnMethodsRule$1.evaluate(NoShadowingOrOverridesOnMethodsRule.java:40)
	at com.carrotsearch.randomizedtesting.rules.NoShadowingOrOverridesOnMethodsRule$1.evaluate(NoShadowingOrOverridesOnMethodsRule.java:40)
	at com.carrotsearch.randomizedtesting.rules.StatementAdapter.evaluate(StatementAdapter.java:36)
	at com.carrotsearch.randomizedtesting.rules.StatementAdapter.evaluate(StatementAdapter.java:36)
	at com.carrotsearch.randomizedtesting.rules.StatementAdapter.evaluate(StatementAdapter.java:36)
	at org.apache.lucene.util.TestRuleAssertionsRequired$1.evaluate(TestRuleAssertionsRequired.java:53)
	at org.apache.lucene.util.TestRuleMarkFailure$1.evaluate(TestRuleMarkFailure.java:47)
	at org.apache.lucene.util.TestRuleIgnoreAfterMaxFailures$1.evaluate(TestRuleIgnoreAfterMaxFailures.java:64)
	at org.apache.lucene.util.TestRuleIgnoreTestSuites$1.evaluate(TestRuleIgnoreTestSuites.java:54)
	at com.carrotsearch.randomizedtesting.rules.StatementAdapter.evaluate(StatementAdapter.java:36)
	at com.carrotsearch.randomizedtesting.ThreadLeakControl$StatementRunner.run(ThreadLeakControl.java:368)
	at java.lang.Thread.run(Thread.java:748)


FAILED:  org.apache.solr.cloud.CollectionStateFormat2Test.testConfNameAndCollectionNameSame

Error Message:
Error from server at https://127.0.0.1:35103/solr: Could not fully create collection: .system

Stack Trace:
org.apache.solr.client.solrj.impl.HttpSolrClient$RemoteSolrException: Error from server at https://127.0.0.1:35103/solr: Could not fully create collection: .system
	at __randomizedtesting.SeedInfo.seed([3F6CA6603083910D:460AEDB39204C621]:0)
	at org.apache.solr.client.solrj.impl.HttpSolrClient.executeMethod(HttpSolrClient.java:626)
	at org.apache.solr.client.solrj.impl.HttpSolrClient.request(HttpSolrClient.java:253)
	at org.apache.solr.client.solrj.impl.HttpSolrClient.request(HttpSolrClient.java:242)
	at org.apache.solr.client.solrj.impl.LBHttpSolrClient.doRequest(LBHttpSolrClient.java:483)
	at org.apache.solr.client.solrj.impl.LBHttpSolrClient.request(LBHttpSolrClient.java:413)
	at org.apache.solr.client.solrj.impl.CloudSolrClient.sendRequest(CloudSolrClient.java:1096)
	at org.apache.solr.client.solrj.impl.CloudSolrClient.requestWithRetryOnStaleState(CloudSolrClient.java:875)
	at org.apache.solr.client.solrj.impl.CloudSolrClient.request(CloudSolrClient.java:808)
	at org.apache.solr.client.solrj.SolrRequest.process(SolrRequest.java:178)
	at org.apache.solr.client.solrj.SolrRequest.process(SolrRequest.java:195)
	at org.apache.solr.cloud.CollectionStateFormat2Test.testConfNameAndCollectionNameSame(CollectionStateFormat2Test.java:40)
	at sun.reflect.NativeMethodAccessorImpl.invoke0(Native Method)
	at sun.reflect.NativeMethodAccessorImpl.invoke(NativeMethodAccessorImpl.java:62)
	at sun.reflect.DelegatingMethodAccessorImpl.invoke(DelegatingMethodAccessorImpl.java:43)
	at java.lang.reflect.Method.invoke(Method.java:498)
	at com.carrotsearch.randomizedtesting.RandomizedRunner.invoke(RandomizedRunner.java:1737)
	at com.carrotsearch.randomizedtesting.RandomizedRunner$8.evaluate(RandomizedRunner.java:934)
	at com.carrotsearch.randomizedtesting.RandomizedRunner$9.evaluate(RandomizedRunner.java:970)
	at com.carrotsearch.randomizedtesting.RandomizedRunner$10.evaluate(RandomizedRunner.java:984)
	at com.carrotsearch.randomizedtesting.rules.SystemPropertiesRestoreRule$1.evaluate(SystemPropertiesRestoreRule.java:57)
	at org.apache.lucene.util.TestRuleSetupTeardownChained$1.evaluate(TestRuleSetupTeardownChained.java:49)
	at org.apache.lucene.util.AbstractBeforeAfterRule$1.evaluate(AbstractBeforeAfterRule.java:45)
	at org.apache.lucene.util.TestRuleThreadAndTestName$1.evaluate(TestRuleThreadAndTestName.java:48)
	at org.apache.lucene.util.TestRuleIgnoreAfterMaxFailures$1.evaluate(TestRuleIgnoreAfterMaxFailures.java:64)
	at org.apache.lucene.util.TestRuleMarkFailure$1.evaluate(TestRuleMarkFailure.java:47)
	at com.carrotsearch.randomizedtesting.rules.StatementAdapter.evaluate(StatementAdapter.java:36)
	at com.carrotsearch.randomizedtesting.ThreadLeakControl$StatementRunner.run(ThreadLeakControl.java:368)
	at com.carrotsearch.randomizedtesting.ThreadLeakControl.forkTimeoutingTask(ThreadLeakControl.java:817)
	at com.carrotsearch.randomizedtesting.ThreadLeakControl$3.evaluate(ThreadLeakControl.java:468)
	at com.carrotsearch.randomizedtesting.RandomizedRunner.runSingleTest(RandomizedRunner.java:943)
	at com.carrotsearch.randomizedtesting.RandomizedRunner$5.evaluate(RandomizedRunner.java:829)
	at com.carrotsearch.randomizedtesting.RandomizedRunner$6.evaluate(RandomizedRunner.java:879)
	at com.carrotsearch.randomizedtesting.RandomizedRunner$7.evaluate(RandomizedRunner.java:890)
	at com.carrotsearch.randomizedtesting.rules.StatementAdapter.evaluate(StatementAdapter.java:36)
	at com.carrotsearch.randomizedtesting.rules.SystemPropertiesRestoreRule$1.evaluate(SystemPropertiesRestoreRule.java:57)
	at org.apache.lucene.util.AbstractBeforeAfterRule$1.evaluate(AbstractBeforeAfterRule.java:45)
	at com.carrotsearch.randomizedtesting.rules.StatementAdapter.evaluate(StatementAdapter.java:36)
	at org.apache.lucene.util.TestRuleStoreClassName$1.evaluate(TestRuleStoreClassName.java:41)
	at com.carrotsearch.randomizedtesting.rules.NoShadowingOrOverridesOnMethodsRule$1.evaluate(NoShadowingOrOverridesOnMethodsRule.java:40)
	at com.carrotsearch.randomizedtesting.rules.NoShadowingOrOverridesOnMethodsRule$1.evaluate(NoShadowingOrOverridesOnMethodsRule.java:40)
	at com.carrotsearch.randomizedtesting.rules.StatementAdapter.evaluate(StatementAdapter.java:36)
	at com.carrotsearch.randomizedtesting.rules.StatementAdapter.evaluate(StatementAdapter.java:36)
	at com.carrotsearch.randomizedtesting.rules.StatementAdapter.evaluate(StatementAdapter.java:36)
	at org.apache.lucene.util.TestRuleAssertionsRequired$1.evaluate(TestRuleAssertionsRequired.java:53)
	at org.apache.lucene.util.TestRuleMarkFailure$1.evaluate(TestRuleMarkFailure.java:47)
	at org.apache.lucene.util.TestRuleIgnoreAfterMaxFailures$1.evaluate(TestRuleIgnoreAfterMaxFailures.java:64)
	at org.apache.lucene.util.TestRuleIgnoreTestSuites$1.evaluate(TestRuleIgnoreTestSuites.java:54)
	at com.carrotsearch.randomizedtesting.rules.StatementAdapter.evaluate(StatementAdapter.java:36)
	at com.carrotsearch.randomizedtesting.ThreadLeakControl$StatementRunner.run(ThreadLeakControl.java:368)
	at java.lang.Thread.run(Thread.java:748)


FAILED:  org.apache.solr.cloud.DeleteShardTest.test

Error Message:
Error from server at https://127.0.0.1:34597/solr: The slice: shard1 is currently active. Only non-active (or custom-hashed) slices can be deleted.

Stack Trace:
org.apache.solr.client.solrj.impl.HttpSolrClient$RemoteSolrException: Error from server at https://127.0.0.1:34597/solr: The slice: shard1 is currently active. Only non-active (or custom-hashed) slices can be deleted.
	at __randomizedtesting.SeedInfo.seed([3F6CA6603083910D:B73899BA9E7FFCF5]:0)
	at org.apache.solr.client.solrj.impl.HttpSolrClient.executeMethod(HttpSolrClient.java:626)
	at org.apache.solr.client.solrj.impl.HttpSolrClient.request(HttpSolrClient.java:253)
	at org.apache.solr.client.solrj.impl.HttpSolrClient.request(HttpSolrClient.java:242)
	at org.apache.solr.client.solrj.impl.LBHttpSolrClient.doRequest(LBHttpSolrClient.java:483)
	at org.apache.solr.client.solrj.impl.LBHttpSolrClient.request(LBHttpSolrClient.java:413)
	at org.apache.solr.client.solrj.impl.CloudSolrClient.sendRequest(CloudSolrClient.java:1096)
	at org.apache.solr.client.solrj.impl.CloudSolrClient.requestWithRetryOnStaleState(CloudSolrClient.java:875)
	at org.apache.solr.client.solrj.impl.CloudSolrClient.request(CloudSolrClient.java:808)
	at org.apache.solr.client.solrj.SolrRequest.process(SolrRequest.java:178)
	at org.apache.solr.client.solrj.SolrRequest.process(SolrRequest.java:195)
	at org.apache.solr.cloud.DeleteShardTest.test(DeleteShardTest.java:71)
	at sun.reflect.NativeMethodAccessorImpl.invoke0(Native Method)
	at sun.reflect.NativeMethodAccessorImpl.invoke(NativeMethodAccessorImpl.java:62)
	at sun.reflect.DelegatingMethodAccessorImpl.invoke(DelegatingMethodAccessorImpl.java:43)
	at java.lang.reflect.Method.invoke(Method.java:498)
	at com.carrotsearch.randomizedtesting.RandomizedRunner.invoke(RandomizedRunner.java:1737)
	at com.carrotsearch.randomizedtesting.RandomizedRunner$8.evaluate(RandomizedRunner.java:934)
	at com.carrotsearch.randomizedtesting.RandomizedRunner$9.evaluate(RandomizedRunner.java:970)
	at com.carrotsearch.randomizedtesting.RandomizedRunner$10.evaluate(RandomizedRunner.java:984)
	at com.carrotsearch.randomizedtesting.rules.SystemPropertiesRestoreRule$1.evaluate(SystemPropertiesRestoreRule.java:57)
	at org.apache.lucene.util.TestRuleSetupTeardownChained$1.evaluate(TestRuleSetupTeardownChained.java:49)
	at org.apache.lucene.util.AbstractBeforeAfterRule$1.evaluate(AbstractBeforeAfterRule.java:45)
	at org.apache.lucene.util.TestRuleThreadAndTestName$1.evaluate(TestRuleThreadAndTestName.java:48)
	at org.apache.lucene.util.TestRuleIgnoreAfterMaxFailures$1.evaluate(TestRuleIgnoreAfterMaxFailures.java:64)
	at org.apache.lucene.util.TestRuleMarkFailure$1.evaluate(TestRuleMarkFailure.java:47)
	at com.carrotsearch.randomizedtesting.rules.StatementAdapter.evaluate(StatementAdapter.java:36)
	at com.carrotsearch.randomizedtesting.ThreadLeakControl$StatementRunner.run(ThreadLeakControl.java:368)
	at com.carrotsearch.randomizedtesting.ThreadLeakControl.forkTimeoutingTask(ThreadLeakControl.java:817)
	at com.carrotsearch.randomizedtesting.ThreadLeakControl$3.evaluate(ThreadLeakControl.java:468)
	at com.carrotsearch.randomizedtesting.RandomizedRunner.runSingleTest(RandomizedRunner.java:943)
	at com.carrotsearch.randomizedtesting.RandomizedRunner$5.evaluate(RandomizedRunner.java:829)
	at com.carrotsearch.randomizedtesting.RandomizedRunner$6.evaluate(RandomizedRunner.java:879)
	at com.carrotsearch.randomizedtesting.RandomizedRunner$7.evaluate(RandomizedRunner.java:890)
	at com.carrotsearch.randomizedtesting.rules.StatementAdapter.evaluate(StatementAdapter.java:36)
	at com.carrotsearch.randomizedtesting.rules.SystemPropertiesRestoreRule$1.evaluate(SystemPropertiesRestoreRule.java:57)
	at org.apache.lucene.util.AbstractBeforeAfterRule$1.evaluate(AbstractBeforeAfterRule.java:45)
	at com.carrotsearch.randomizedtesting.rules.StatementAdapter.evaluate(StatementAdapter.java:36)
	at org.apache.lucene.util.TestRuleStoreClassName$1.evaluate(TestRuleStoreClassName.java:41)
	at com.carrotsearch.randomizedtesting.rules.NoShadowingOrOverridesOnMethodsRule$1.evaluate(NoShadowingOrOverridesOnMethodsRule.java:40)
	at com.carrotsearch.randomizedtesting.rules.NoShadowingOrOverridesOnMethodsRule$1.evaluate(NoShadowingOrOverridesOnMethodsRule.java:40)
	at com.carrotsearch.randomizedtesting.rules.StatementAdapter.evaluate(StatementAdapter.java:36)
	at com.carrotsearch.randomizedtesting.rules.StatementAdapter.evaluate(StatementAdapter.java:36)
	at com.carrotsearch.randomizedtesting.rules.StatementAdapter.evaluate(StatementAdapter.java:36)
	at org.apache.lucene.util.TestRuleAssertionsRequired$1.evaluate(TestRuleAssertionsRequired.java:53)
	at org.apache.lucene.util.TestRuleMarkFailure$1.evaluate(TestRuleMarkFailure.java:47)
	at org.apache.lucene.util.TestRuleIgnoreAfterMaxFailures$1.evaluate(TestRuleIgnoreAfterMaxFailures.java:64)
	at org.apache.lucene.util.TestRuleIgnoreTestSuites$1.evaluate(TestRuleIgnoreTestSuites.java:54)
	at com.carrotsearch.randomizedtesting.rules.StatementAdapter.evaluate(StatementAdapter.java:36)
	at com.carrotsearch.randomizedtesting.ThreadLeakControl$StatementRunner.run(ThreadLeakControl.java:368)
	at java.lang.Thread.run(Thread.java:748)




Build Log:
[...truncated 12564 lines...]
   [junit4] Suite: org.apache.solr.cloud.CollectionStateFormat2Test
   [junit4]   2> 1028333 INFO  (SUITE-CollectionStateFormat2Test-seed#[3F6CA6603083910D]-worker) [    ] o.a.s.SolrTestCaseJ4 SecureRandom sanity checks: test.solr.allowed.securerandom=null & java.security.egd=file:/dev/./urandom
   [junit4]   2> Creating dataDir: /home/jenkins/workspace/Lucene-Solr-7.x-Linux/solr/build/solr-core/test/J0/temp/solr.cloud.CollectionStateFormat2Test_3F6CA6603083910D-001/init-core-data-001
   [junit4]   2> 1028333 WARN  (SUITE-CollectionStateFormat2Test-seed#[3F6CA6603083910D]-worker) [    ] o.a.s.SolrTestCaseJ4 startTrackingSearchers: numOpens=25 numCloses=25
   [junit4]   2> 1028334 INFO  (SUITE-CollectionStateFormat2Test-seed#[3F6CA6603083910D]-worker) [    ] o.a.s.SolrTestCaseJ4 Using PointFields (NUMERIC_POINTS_SYSPROP=true) w/NUMERIC_DOCVALUES_SYSPROP=true
   [junit4]   2> 1028335 INFO  (SUITE-CollectionStateFormat2Test-seed#[3F6CA6603083910D]-worker) [    ] o.a.s.SolrTestCaseJ4 Randomized ssl (true) and clientAuth (true) via: @org.apache.solr.util.RandomizeSSL(reason=, ssl=NaN, value=NaN, clientAuth=NaN)
   [junit4]   2> 1028336 INFO  (SUITE-CollectionStateFormat2Test-seed#[3F6CA6603083910D]-worker) [    ] o.a.s.c.MiniSolrCloudCluster Starting cluster of 4 servers in /home/jenkins/workspace/Lucene-Solr-7.x-Linux/solr/build/solr-core/test/J0/temp/solr.cloud.CollectionStateFormat2Test_3F6CA6603083910D-001/tempDir-001
   [junit4]   2> 1028337 INFO  (SUITE-CollectionStateFormat2Test-seed#[3F6CA6603083910D]-worker) [    ] o.a.s.c.ZkTestServer STARTING ZK TEST SERVER
   [junit4]   2> 1028337 INFO  (Thread-1027) [    ] o.a.s.c.ZkTestServer client port:0.0.0.0/0.0.0.0:0
   [junit4]   2> 1028337 INFO  (Thread-1027) [    ] o.a.s.c.ZkTestServer Starting server
   [junit4]   2> 1028338 ERROR (Thread-1027) [    ] o.a.z.s.ZooKeeperServer ZKShutdownHandler is not registered, so ZooKeeper server won't take any action on ERROR or SHUTDOWN server state changes
   [junit4]   2> 1028437 INFO  (SUITE-CollectionStateFormat2Test-seed#[3F6CA6603083910D]-worker) [    ] o.a.s.c.ZkTestServer start zk server on port:44035
   [junit4]   2> 1028446 INFO  (jetty-launcher-670-thread-1) [    ] o.e.j.s.Server jetty-9.3.20.v20170531
   [junit4]   2> 1028446 INFO  (jetty-launcher-670-thread-2) [    ] o.e.j.s.Server jetty-9.3.20.v20170531
   [junit4]   2> 1028446 INFO  (jetty-launcher-670-thread-3) [    ] o.e.j.s.Server jetty-9.3.20.v20170531
   [junit4]   2> 1028448 INFO  (jetty-launcher-670-thread-4) [    ] o.e.j.s.Server jetty-9.3.20.v20170531
   [junit4]   2> 1028453 INFO  (jetty-launcher-670-thread-1) [    ] o.e.j.s.h.ContextHandler Started o.e.j.s.ServletContextHandler@1f68167{/solr,null,AVAILABLE}
   [junit4]   2> 1028453 INFO  (jetty-launcher-670-thread-2) [    ] o.e.j.s.h.ContextHandler Started o.e.j.s.ServletContextHandler@8f1f2{/solr,null,AVAILABLE}
   [junit4]   2> 1028453 INFO  (jetty-launcher-670-thread-4) [    ] o.e.j.s.h.ContextHandler Started o.e.j.s.ServletContextHandler@18d1216{/solr,null,AVAILABLE}
   [junit4]   2> 1028453 INFO  (jetty-launcher-670-thread-3) [    ] o.e.j.s.h.ContextHandler Started o.e.j.s.ServletContextHandler@1dd8828{/solr,null,AVAILABLE}
   [junit4]   2> 1028459 INFO  (jetty-launcher-670-thread-4) [    ] o.e.j.s.AbstractConnector Started ServerConnector@d1752e{SSL,[ssl, http/1.1]}{127.0.0.1:35103}
   [junit4]   2> 1028459 INFO  (jetty-launcher-670-thread-1) [    ] o.e.j.s.AbstractConnector Started ServerConnector@183e81d{SSL,[ssl, http/1.1]}{127.0.0.1:46275}
   [junit4]   2> 1028459 INFO  (jetty-launcher-670-thread-4) [    ] o.e.j.s.Server Started @1029894ms
   [junit4]   2> 1028459 INFO  (jetty-launcher-670-thread-3) [    ] o.e.j.s.AbstractConnector Started ServerConnector@1c70672{SSL,[ssl, http/1.1]}{127.0.0.1:42569}
   [junit4]   2> 1028459 INFO  (jetty-launcher-670-thread-4) [    ] o.a.s.c.s.e.JettySolrRunner Jetty properties: {hostContext=/solr, hostPort=35103}
   [junit4]   2> 1028459 INFO  (jetty-launcher-670-thread-3) [    ] o.e.j.s.Server Started @1029894ms
   [junit4]   2> 1028459 INFO  (jetty-launcher-670-thread-2) [    ] o.e.j.s.AbstractConnector Started ServerConnector@1838613{SSL,[ssl, http/1.1]}{127.0.0.1:43837}
   [junit4]   2> 1028459 INFO  (jetty-launcher-670-thread-3) [    ] o.a.s.c.s.e.JettySolrRunner Jetty properties: {hostContext=/solr, hostPort=42569}
   [junit4]   2> 1028459 INFO  (jetty-launcher-670-thread-2) [    ] o.e.j.s.Server Started @1029894ms
   [junit4]   2> 1028459 INFO  (jetty-launcher-670-thread-1) [    ] o.e.j.s.Server Started @1029894ms
   [junit4]   2> 1028459 INFO  (jetty-launcher-670-thread-2) [    ] o.a.s.c.s.e.JettySolrRunner Jetty properties: {hostContext=/solr, hostPort=43837}
   [junit4]   2> 1028459 INFO  (jetty-launcher-670-thread-1) [    ] o.a.s.c.s.e.JettySolrRunner Jetty properties: {hostContext=/solr, hostPort=46275}
   [junit4]   2> 1028459 ERROR (jetty-launcher-670-thread-4) [    ] o.a.s.u.StartupLoggingUtils Missing Java Option solr.log.dir. Logging may be missing or incomplete.
   [junit4]   2> 1028459 ERROR (jetty-launcher-670-thread-2) [    ] o.a.s.u.StartupLoggingUtils Missing Java Option solr.log.dir. Logging may be missing or incomplete.
   [junit4]   2> 1028459 INFO  (jetty-launcher-670-thread-4) [    ] o.a.s.s.SolrDispatchFilter  ___      _       Welcome to Apache Solr™ version 7.2.0
   [junit4]   2> 1028459 ERROR (jetty-launcher-670-thread-1) [    ] o.a.s.u.StartupLoggingUtils Missing Java Option solr.log.dir. Logging may be missing or incomplete.
   [junit4]   2> 1028459 INFO  (jetty-launcher-670-thread-4) [    ] o.a.s.s.SolrDispatchFilter / __| ___| |_ _   Starting in cloud mode on port null
   [junit4]   2> 1028459 INFO  (jetty-launcher-670-thread-1) [    ] o.a.s.s.SolrDispatchFilter  ___      _       Welcome to Apache Solr™ version 7.2.0
   [junit4]   2> 1028459 INFO  (jetty-launcher-670-thread-1) [    ] o.a.s.s.SolrDispatchFilter / __| ___| |_ _   Starting in cloud mode on port null
   [junit4]   2> 1028459 INFO  (jetty-launcher-670-thread-1) [    ] o.a.s.s.SolrDispatchFilter \__ \/ _ \ | '_|  Install dir: null
   [junit4]   2> 1028459 INFO  (jetty-launcher-670-thread-1) [    ] o.a.s.s.SolrDispatchFilter |___/\___/_|_|    Start time: 2017-10-30T18:27:32.400Z
   [junit4]   2> 1028459 ERROR (jetty-launcher-670-thread-3) [    ] o.a.s.u.StartupLoggingUtils Missing Java Option solr.log.dir. Logging may be missing or incomplete.
   [junit4]   2> 1028459 INFO  (jetty-launcher-670-thread-4) [    ] o.a.s.s.SolrDispatchFilter \__ \/ _ \ | '_|  Install dir: null
   [junit4]   2> 1028460 INFO  (jetty-launcher-670-thread-3) [    ] o.a.s.s.SolrDispatchFilter  ___      _       Welcome to Apache Solr™ version 7.2.0
   [junit4]   2> 1028460 INFO  (jetty-launcher-670-thread-4) [    ] o.a.s.s.SolrDispatchFilter |___/\___/_|_|    Start time: 2017-10-30T18:27:32.401Z
   [junit4]   2> 1028460 INFO  (jetty-launcher-670-thread-3) [    ] o.a.s.s.SolrDispatchFilter / __| ___| |_ _   Starting in cloud mode on port null
   [junit4]   2> 1028459 INFO  (jetty-launcher-670-thread-2) [    ] o.a.s.s.SolrDispatchFilter  ___      _       Welcome to Apache Solr™ version 7.2.0
   [junit4]   2> 1028460 INFO  (jetty-launcher-670-thread-3) [    ] o.a.s.s.SolrDispatchFilter \__ \/ _ \ | '_|  Install dir: null
   [junit4]   2> 1028460 INFO  (jetty-launcher-670-thread-2) [    ] o.a.s.s.SolrDispatchFilter / __| ___| |_ _   Starting in cloud mode on port null
   [junit4]   2> 1028460 INFO  (jetty-launcher-670-thread-3) [    ] o.a.s.s.SolrDispatchFilter |___/\___/_|_|    Start time: 2017-10-30T18:27:32.401Z
   [junit4]   2> 1028460 INFO  (jetty-launcher-670-thread-2) [    ] o.a.s.s.SolrDispatchFilter \__ \/ _ \ | '_|  Install dir: null
   [junit4]   2> 1028460 INFO  (jetty-launcher-670-thread-2) [    ] o.a.s.s.SolrDispatchFilter |___/\___/_|_|    Start time: 2017-10-30T18:27:32.401Z
   [junit4]   2> 1028471 INFO  (jetty-launcher-670-thread-1) [    ] o.a.s.s.SolrDispatchFilter solr.xml found in ZooKeeper. Loading...
   [junit4]   2> 1028471 INFO  (jetty-launcher-670-thread-3) [    ] o.a.s.s.SolrDispatchFilter solr.xml found in ZooKeeper. Loading...
   [junit4]   2> 1028471 INFO  (jetty-launcher-670-thread-4) [    ] o.a.s.s.SolrDispatchFilter solr.xml found in ZooKeeper. Loading...
   [junit4]   2> 1028472 INFO  (jetty-launcher-670-thread-2) [    ] o.a.s.s.SolrDispatchFilter solr.xml found in ZooKeeper. Loading...
   [junit4]   2> 1028482 INFO  (jetty-launcher-670-thread-2) [    ] o.a.s.c.ZkContainer Zookeeper client=127.0.0.1:44035/solr
   [junit4]   2> 1028482 INFO  (jetty-launcher-670-thread-3) [    ] o.a.s.c.ZkContainer Zookeeper client=127.0.0.1:44035/solr
   [junit4]   2> 1028485 INFO  (jetty-launcher-670-thread-1) [    ] o.a.s.c.ZkContainer Zookeeper client=127.0.0.1:44035/solr
   [junit4]   2> 1028486 INFO  (jetty-launcher-670-thread-4) [    ] o.a.s.c.ZkContainer Zookeeper client=127.0.0.1:44035/solr
   [junit4]   2> 1028490 WARN  (NIOServerCxn.Factory:0.0.0.0/0.0.0.0:0) [    ] o.a.z.s.NIOServerCnxn caught end of stream exception
   [junit4]   2> EndOfStreamException: Unable to read additional data from client sessionid 0x15f6e89e7370006, likely client has closed socket
   [junit4]   2> 	at org.apache.zookeeper.server.NIOServerCnxn.doIO(NIOServerCnxn.java:239)
   [junit4]   2> 	at org.apache.zookeeper.server.NIOServerCnxnFactory.run(NIOServerCnxnFactory.java:203)
   [junit4]   2> 	at java.lang.Thread.run(Thread.java:748)
   [junit4]   2> 1028496 WARN  (NIOServerCxn.Factory:0.0.0.0/0.0.0.0:0) [    ] o.a.z.s.NIOServerCnxn caught end of stream exception
   [junit4]   2> EndOfStreamException: Unable to read additional data from client sessionid 0x15f6e89e7370008, likely client has closed socket
   [junit4]   2> 	at org.apache.zookeeper.server.NIOServerCnxn.doIO(NIOServerCnxn.java:239)
   [junit4]   2> 	at org.apache.zookeeper.server.NIOServerCnxnFactory.run(NIOServerCnxnFactory.java:203)
   [junit4]   2> 	at java.lang.Thread.run(Thread.java:748)
   [junit4]   2> 1028582 INFO  (jetty-launcher-670-thread-3) [n:127.0.0.1:42569_solr    ] o.a.s.c.Overseer Overseer (id=null) closing
   [junit4]   2> 1028582 INFO  (jetty-launcher-670-thread-2) [n:127.0.0.1:43837_solr    ] o.a.s.c.Overseer Overseer (id=null) closing
   [junit4]   2> 1028582 INFO  (jetty-launcher-670-thread-1) [n:127.0.0.1:46275_solr    ] o.a.s.c.Overseer Overseer (id=null) closing
   [junit4]   2> 1028583 INFO  (jetty-launcher-670-thread-3) [n:127.0.0.1:42569_solr    ] o.a.s.c.OverseerElectionContext I am going to be the leader 127.0.0.1:42569_solr
   [junit4]   2> 1028583 INFO  (jetty-launcher-670-thread-4) [n:127.0.0.1:35103_solr    ] o.a.s.c.Overseer Overseer (id=null) closing
   [junit4]   2> 1028583 INFO  (jetty-launcher-670-thread-1) [n:127.0.0.1:46275_solr    ] o.a.s.c.ZkController Register node as live in ZooKeeper:/live_nodes/127.0.0.1:46275_solr
   [junit4]   2> 1028583 INFO  (jetty-launcher-670-thread-3) [n:127.0.0.1:42569_solr    ] o.a.s.c.Overseer Overseer (id=98919255394156554-127.0.0.1:42569_solr-n_0000000000) starting
   [junit4]   2> 1028586 INFO  (zkCallback-690-thread-1-processing-n:127.0.0.1:42569_solr) [n:127.0.0.1:42569_solr    ] o.a.s.c.c.ZkStateReader Updated live nodes from ZooKeeper... (0) -> (1)
   [junit4]   2> 1028586 INFO  (zkCallback-692-thread-1-processing-n:127.0.0.1:46275_solr) [n:127.0.0.1:46275_solr    ] o.a.s.c.c.ZkStateReader Updated live nodes from ZooKeeper... (0) -> (1)
   [junit4]   2> 1028587 INFO  (jetty-launcher-670-thread-4) [n:127.0.0.1:35103_solr    ] o.a.s.c.ZkController Register node as live in ZooKeeper:/live_nodes/127.0.0.1:35103_solr
   [junit4]   2> 1028586 INFO  (zkCallback-691-thread-1-processing-n:127.0.0.1:35103_solr) [n:127.0.0.1:35103_solr    ] o.a.s.c.c.ZkStateReader Updated live nodes from ZooKeeper... (0) -> (1)
   [junit4]   2> 1028592 INFO  (zkCallback-689-thread-1-processing-n:127.0.0.1:43837_solr) [n:127.0.0.1:43837_solr    ] o.a.s.c.c.ZkStateReader Updated live nodes from ZooKeeper... (0) -> (1)
   [junit4]   2> 1028596 INFO  (zkCallback-691-thread-1-processing-n:127.0.0.1:35103_solr) [n:127.0.0.1:35103_solr    ] o.a.s.c.c.ZkStateReader Updated live nodes from ZooKeeper... (1) -> (2)
   [junit4]   2> 1028596 INFO  (zkCallback-690-thread-1-processing-n:127.0.0.1:42569_solr) [n:127.0.0.1:42569_solr    ] o.a.s.c.c.ZkStateReader Updated live nodes from ZooKeeper... (1) -> (2)
   [junit4]   2> 1028597 INFO  (zkCallback-689-thread-1-processing-n:127.0.0.1:43837_solr) [n:127.0.0.1:43837_solr    ] o.a.s.c.c.ZkStateReader Updated live nodes from ZooKeeper... (1) -> (2)
   [junit4]   2> 1028597 INFO  (jetty-launcher-670-thread-2) [n:127.0.0.1:43837_solr    ] o.a.s.c.ZkController Register node as live in ZooKeeper:/live_nodes/127.0.0.1:43837_solr
   [junit4]   2> 1028597 INFO  (jetty-launcher-670-thread-3) [n:127.0.0.1:42569_solr    ] o.a.s.c.ZkController Register node as live in ZooKeeper:/live_nodes/127.0.0.1:42569_solr
   [junit4]   2> 1028600 INFO  (zkCallback-692-thread-1-processing-n:127.0.0.1:46275_solr) [n:127.0.0.1:46275_solr    ] o.a.s.c.c.ZkStateReader Updated live nodes from ZooKeeper... (1) -> (2)
   [junit4]   2> 1028601 INFO  (zkCallback-689-thread-1-processing-n:127.0.0.1:43837_solr) [n:127.0.0.1:43837_solr    ] o.a.s.c.c.ZkStateReader Updated live nodes from ZooKeeper... (2) -> (4)
   [junit4]   2> 1028604 INFO  (zkCallback-690-thread-1-processing-n:127.0.0.1:42569_solr) [n:127.0.0.1:42569_solr    ] o.a.s.c.c.ZkStateReader Updated live nodes from ZooKeeper... (2) -> (3)
   [junit4]   2> 1028605 INFO  (zkCallback-692-thread-2-processing-n:127.0.0.1:46275_solr) [n:127.0.0.1:46275_solr    ] o.a.s.c.c.ZkStateReader Updated live nodes from ZooKeeper... (2) -> (4)
   [junit4]   2> 1028605 INFO  (zkCallback-691-thread-1-processing-n:127.0.0.1:35103_solr) [n:127.0.0.1:35103_solr    ] o.a.s.c.c.ZkStateReader Updated live nodes from ZooKeeper... (2) -> (4)
   [junit4]   2> 1028605 INFO  (zkCallback-690-thread-2-processing-n:127.0.0.1:42569_solr) [n:127.0.0.1:42569_solr    ] o.a.s.c.c.ZkStateReader Updated live nodes from ZooKeeper... (3) -> (4)
   [junit4]   2> 1028757 INFO  (jetty-launcher-670-thread-1) [n:127.0.0.1:46275_solr    ] o.a.s.m.r.SolrJmxReporter JMX monitoring for 'solr_46275.solr.node' (registry 'solr.node') enabled at server: com.sun.jmx.mbeanserver.JmxMBeanServer@1700038
   [junit4]   2> 1028769 INFO  (jetty-launcher-670-thread-1) [n:127.0.0.1:46275_solr    ] o.a.s.m.r.SolrJmxReporter JMX monitoring for 'solr_46275.solr.jvm' (registry 'solr.jvm') enabled at server: com.sun.jmx.mbeanserver.JmxMBeanServer@1700038
   [junit4]   2> 1028769 INFO  (jetty-launcher-670-thread-1) [n:127.0.0.1:46275_solr    ] o.a.s.m.r.SolrJmxReporter JMX monitoring for 'solr_46275.solr.jetty' (registry 'solr.jetty') enabled at server: com.sun.jmx.mbeanserver.JmxMBeanServer@1700038
   [junit4]   2> 1028771 INFO  (jetty-launcher-670-thread-1) [n:127.0.0.1:46275_solr    ] o.a.s.c.CorePropertiesLocator Found 0 core definitions underneath /home/jenkins/workspace/Lucene-Solr-7.x-Linux/solr/build/solr-core/test/J0/temp/solr.cloud.CollectionStateFormat2Test_3F6CA6603083910D-001/tempDir-001/node1/.
   [junit4]   2> 1028801 INFO  (jetty-launcher-670-thread-4) [n:127.0.0.1:35103_solr    ] o.a.s.m.r.SolrJmxReporter JMX monitoring for 'solr_35103.solr.node' (registry 'solr.node') enabled at server: com.sun.jmx.mbeanserver.JmxMBeanServer@1700038
   [junit4]   2> 1028802 INFO  (jetty-launcher-670-thread-2) [n:127.0.0.1:43837_solr    ] o.a.s.m.r.SolrJmxReporter JMX monitoring for 'solr_43837.solr.node' (registry 'solr.node') enabled at server: com.sun.jmx.mbeanserver.JmxMBeanServer@1700038
   [junit4]   2> 1028811 INFO  (jetty-launcher-670-thread-4) [n:127.0.0.1:35103_solr    ] o.a.s.m.r.SolrJmxReporter JMX monitoring for 'solr_35103.solr.jvm' (registry 'solr.jvm') enabled at server: com.sun.jmx.mbeanserver.JmxMBeanServer@1700038
   [junit4]   2> 1028811 INFO  (jetty-launcher-670-thread-4) [n:127.0.0.1:35103_solr    ] o.a.s.m.r.SolrJmxReporter JMX monitoring for 'solr_35103.solr.jetty' (registry 'solr.jetty') enabled at server: com.sun.jmx.mbeanserver.JmxMBeanServer@1700038
   [junit4]   2> 1028812 INFO  (jetty-launcher-670-thread-4) [n:127.0.0.1:35103_solr    ] o.a.s.c.CorePropertiesLocator Found 0 core definitions underneath /home/jenkins/workspace/Lucene-Solr-7.x-Linux/solr/build/solr-core/test/J0/temp/solr.cloud.CollectionStateFormat2Test_3F6CA6603083910D-001/tempDir-001/node4/.
   [junit4]   2> 1028816 INFO  (jetty-launcher-670-thread-2) [n:127.0.0.1:43837_solr    ] o.a.s.m.r.SolrJmxReporter JMX monitoring for 'solr_43837.solr.jvm' (registry 'solr.jvm') enabled at server: com.sun.jmx.mbeanserver.JmxMBeanServer@1700038
   [junit4]   2> 1028816 INFO  (jetty-launcher-670-thread-2) [n:127.0.0.1:43837_solr    ] o.a.s.m.r.SolrJmxReporter JMX monitoring for 'solr_43837.solr.jetty' (registry 'solr.jetty') enabled at server: com.sun.jmx.mbeanserver.JmxMBeanServer@1700038
   [junit4]   2> 1028817 INFO  (jetty-launcher-670-thread-2) [n:127.0.0.1:43837_solr    ] o.a.s.c.CorePropertiesLocator Found 0 core definitions underneath /home/jenkins/workspace/Lucene-Solr-7.x-Linux/solr/build/solr-core/test/J0/temp/solr.cloud.CollectionStateFormat2Test_3F6CA6603083910D-001/tempDir-001/node2/.
   [junit4]   2> 1028918 INFO  (jetty-launcher-670-thread-3) [n:127.0.0.1:42569_solr    ] o.a.s.m.r.SolrJmxReporter JMX monitoring for 'solr_42569.solr.node' (registry 'solr.node') enabled at server: com.sun.jmx.mbeanserver.JmxMBeanServer@1700038
   [junit4]   2> 1028926 INFO  (jetty-launcher-670-thread-3) [n:127.0.0.1:42569_solr    ] o.a.s.m.r.SolrJmxReporter JMX monitoring for 'solr_42569.solr.jvm' (registry 'solr.jvm') enabled at server: com.sun.jmx.mbeanserver.JmxMBeanServer@1700038
   [junit4]   2> 1028926 INFO  (jetty-launcher-670-thread-3) [n:127.0.0.1:42569_solr    ] o.a.s.m.r.SolrJmxReporter JMX monitoring for 'solr_42569.solr.jetty' (registry 'solr.jetty') enabled at server: com.sun.jmx.mbeanserver.JmxMBeanServer@1700038
   [junit4]   2> 1028927 INFO  (jetty-launcher-670-thread-3) [n:127.0.0.1:42569_solr    ] o.a.s.c.CorePropertiesLocator Found 0 core definitions underneath /home/jenkins/workspace/Lucene-Solr-7.x-Linux/solr/build/solr-core/test/J0/temp/solr.cloud.CollectionStateFormat2Test_3F6CA6603083910D-001/tempDir-001/node3/.
   [junit4]   2> 1028970 INFO  (SUITE-CollectionStateFormat2Test-seed#[3F6CA6603083910D]-worker) [    ] o.a.s.c.c.ZkStateReader Updated live nodes from ZooKeeper... (0) -> (4)
   [junit4]   2> 1028970 INFO  (SUITE-CollectionStateFormat2Test-seed#[3F6CA6603083910D]-worker) [    ] o.a.s.c.s.i.ZkClientClusterStateProvider Cluster at 127.0.0.1:44035/solr ready
   [junit4]   2> 1029000 INFO  (TEST-CollectionStateFormat2Test.testZkNodeLocation-seed#[3F6CA6603083910D]) [    ] o.a.s.SolrTestCaseJ4 ###Starting testZkNodeLocation
   [junit4]   2> 1029069 INFO  (qtp2729915-4823) [n:127.0.0.1:35103_solr    ] o.a.s.h.a.CollectionsHandler Invoked Collection Action :create with params replicationFactor=2&collection.configName=conf&name=myExternColl&nrtReplicas=2&action=CREATE&numShards=2&wt=javabin&version=2 and sendToOCPQueue=true
   [junit4]   2> 1029070 INFO  (OverseerThreadFactory-1879-thread-1-processing-n:127.0.0.1:42569_solr) [n:127.0.0.1:42569_solr    ] o.a.s.c.CreateCollectionCmd Create collection myExternColl
   [junit4]   2> 1029175 INFO  (OverseerStateUpdate-98919255394156554-127.0.0.1:42569_solr-n_0000000000) [n:127.0.0.1:42569_solr    ] o.a.s.c.o.SliceMutator createReplica() {
   [junit4]   2>   "operation":"ADDREPLICA",
   [junit4]   2>   "collection":"myExternColl",
   [junit4]   2>   "shard":"shard1",
   [junit4]   2>   "core":"myExternColl_shard1_replica_n1",
   [junit4]   2>   "state":"down",
   [junit4]   2>   "base_url":"https://127.0.0.1:42569/solr",
   [junit4]   2>   "type":"NRT",
   [junit4]   2>   "waitForFinalState":"false"} 
   [junit4]   2> 1029176 INFO  (OverseerStateUpdate-98919255394156554-127.0.0.1:42569_solr-n_0000000000) [n:127.0.0.1:42569_solr    ] o.a.s.c.o.SliceMutator createReplica() {
   [junit4]   2>   "operation":"ADDREPLICA",
   [junit4]   2>   "collection":"myExternColl",
   [junit4]   2>   "shard":"shard1",
   [junit4]   2>   "core":"myExternColl_shard1_replica_n2",
   [junit4]   2>   "state":"down",
   [junit4]   2>   "base_url":"https://127.0.0.1:35103/solr",
   [junit4]   2>   "type":"NRT",
   [junit4]   2>   "waitForFinalState":"false"} 
   [junit4]   2> 1029178 INFO  (OverseerStateUpdate-98919255394156554-127.0.0.1:42569_solr-n_0000000000) [n:127.0.0.1:42569_solr    ] o.a.s.c.o.SliceMutator createReplica() {
   [junit4]   2>   "operation":"ADDREPLICA",
   [junit4]   2>   "collection":"myExternColl",
   [junit4]   2>   "shard":"shard2",
   [junit4]   2>   "core":"myExternColl_shard2_replica_n4",
   [junit4]   2>   "state":"down",
   [junit4]   2>   "base_url":"https://127.0.0.1:43837/solr",
   [junit4]   2>   "type":"NRT",
   [junit4]   2>   "waitForFinalState":"false"} 
   [junit4]   2> 1029178 INFO  (OverseerStateUpdate-98919255394156554-127.0.0.1:42569_solr-n_0000000000) [n:127.0.0.1:42569_solr    ] o.a.s.c.o.SliceMutator createReplica() {
   [junit4]   2>   "operation":"ADDREPLICA",
   [junit4]   2>   "collection":"myExternColl",
   [junit4]   2>   "shard":"shard2",
   [junit4]   2>   "core":"myExternColl_shard2_replica_n6",
   [junit4]   2>   "state":"down",
   [junit4]   2>   "base_url":"https://127.0.0.1:46275/solr",
   [junit4]   2>   "type":"NRT",
   [junit4]   2>   "waitForFinalState":"false"} 
   [junit4]   2> 1029408 INFO  (qtp2729915-4850) [n:127.0.0.1:35103_solr    ] o.a.s.h.a.CoreAdminOperation core create command qt=/admin/cores&coreNodeName=core_node5&collection.configName=conf&newCollection=true&name=myExternColl_shard1_replica_n2&action=CREATE&numShards=2&collection=myExternColl&shard=shard1&wt=javabin&version=2&replicaType=NRT
   [junit4]   2> 1029408 INFO  (qtp2729915-4850) [n:127.0.0.1:35103_solr    ] o.a.s.c.TransientSolrCoreCacheDefault Allocating transient cache for 2147483647 transient cores
   [junit4]   2> 1029496 INFO  (qtp15682254-4818) [n:127.0.0.1:42569_solr    ] o.a.s.h.a.CoreAdminOperation core create command qt=/admin/cores&coreNodeName=core_node3&collection.configName=conf&newCollection=true&name=myExternColl_shard1_replica_n1&action=CREATE&numShards=2&collection=myExternColl&shard=shard1&wt=javabin&version=2&replicaType=NRT
   [junit4]   2> 1029496 INFO  (qtp15682254-4818) [n:127.0.0.1:42569_solr    ] o.a.s.c.TransientSolrCoreCacheDefault Allocating transient cache for 2147483647 transient cores
   [junit4]   2> 1029502 INFO  (qtp18629706-4820) [n:127.0.0.1:46275_solr    ] o.a.s.h.a.CoreAdminOperation core create command qt=/admin/cores&coreNodeName=core_node8&collection.configName=conf&newCollection=true&name=myExternColl_shard2_replica_n6&action=CREATE&numShards=2&collection=myExternColl&shard=shard2&wt=javabin&version=2&replicaType=NRT
   [junit4]   2> 1029503 INFO  (qtp18629706-4820) [n:127.0.0.1:46275_solr    ] o.a.s.c.TransientSolrCoreCacheDefault Allocating transient cache for 2147483647 transient cores
   [junit4]   2> 1029507 INFO  (qtp29224234-4819) [n:127.0.0.1:43837_solr    ] o.a.s.h.a.CoreAdminOperation core create command qt=/admin/cores&coreNodeName=core_node7&collection.configName=conf&newCollection=true&name=myExternColl_shard2_replica_n4&action=CREATE&numShards=2&collection=myExternColl&shard=shard2&wt=javabin&version=2&replicaType=NRT
   [junit4]   2> 1029508 INFO  (qtp29224234-4819) [n:127.0.0.1:43837_solr    ] o.a.s.c.TransientSolrCoreCacheDefault Allocating transient cache for 2147483647 transient cores
   [junit4]   2> 1029611 INFO  (zkCallback-690-thread-1-processing-n:127.0.0.1:42569_solr) [n:127.0.0.1:42569_solr    ] o.a.s.c.c.ZkStateReader A cluster state change: [WatchedEvent state:SyncConnected type:NodeDataChanged path:/collections/myExternColl/state.json] for collection [myExternColl] has occurred - updating... (live nodes size: [4])
   [junit4]   2> 1029611 INFO  (zkCallback-689-thread-1-processing-n:127.0.0.1:43837_solr) [n:127.0.0.1:43837_solr    ] o.a.s.c.c.ZkStateReader A cluster state change: [WatchedEvent state:SyncConnected type:NodeDataChanged path:/collections/myExternColl/state.json] for collection [myExternColl] has occurred - updating... (live nodes size: [4])
   [junit4]   2> 1029611 INFO  (zkCallback-691-thread-1-processing-n:127.0.0.1:35103_solr) [n:127.0.0.1:35103_solr    ] o.a.s.c.c.ZkStateReader A cluster state change: [WatchedEvent state:SyncConnected type:NodeDataChanged path:/collections/myExternColl/state.json] for collection [myExternColl] has occurred - updating... (live nodes size: [4])
   [junit4]   2> 1029611 INFO  (zkCallback-692-thread-2-processing-n:127.0.0.1:46275_solr) [n:127.0.0.1:46275_solr    ] o.a.s.c.c.ZkStateReader A cluster state change: [WatchedEvent state:SyncConnected type:NodeDataChanged path:/collections/myExternColl/state.json] for collection [myExternColl] has occurred - updating... (live nodes size: [4])
   [junit4]   2> 1029611 INFO  (zkCallback-692-thread-1-processing-n:127.0.0.1:46275_solr) [n:127.0.0.1:46275_solr    ] o.a.s.c.c.ZkStateReader A cluster state change: [WatchedEvent state:SyncConnected type:NodeDataChanged path:/collections/myExternColl/state.json] for collection [myExternColl] has occurred - updating... (live nodes size: [4])
   [junit4]   2> 1029611 INFO  (zkCallback-690-thread-2-processing-n:127.0.0.1:42569_solr) [n:127.0.0.1:42569_solr    ] o.a.s.c.c.ZkStateReader A cluster state change: [WatchedEvent state:SyncConnected type:NodeDataChanged path:/collections/myExternColl/state.json] for collection [myExternColl] has occurred - updating... (live nodes size: [4])
   [junit4]   2> 1029612 INFO  (zkCallback-689-thread-2-processing-n:127.0.0.1:43837_solr) [n:127.0.0.1:43837_solr    ] o.a.s.c.c.ZkStateReader A cluster state change: [WatchedEvent state:SyncConnected type:NodeDataChanged path:/collections/myExternColl/state.json] for collection [myExternColl] has occurred - updating... (live nodes size: [4])
   [junit4]   2> 1029612 INFO  (zkCallback-691-thread-2-processing-n:127.0.0.1:35103_solr) [n:127.0.0.1:35103_solr    ] o.a.s.c.c.ZkStateReader A cluster state change: [WatchedEvent state:SyncConnected type:NodeDataChanged path:/collections/myExternColl/state.json] for collection [myExternColl] has occurred - updating... (live nodes size: [4])
   [junit4]   2> 1030434 INFO  (qtp2729915-4850) [n:127.0.0.1:35103_solr c:myExternColl s:shard1 r:core_node5 x:myExternColl_shard1_replica_n2] o.a.s.c.SolrConfig Using Lucene MatchVersion: 7.2.0
   [junit4]   2> 1030448 INFO  (qtp2729915-4850) [n:127.0.0.1:35103_solr c:myExternColl s:shard1 r:core_node5 x:myExternColl_shard1_replica_n2] o.a.s.s.IndexSchema [myExternColl_shard1_replica_n2] Schema name=minimal
   [junit4]   2> 1030485 INFO  (qtp2729915-4850) [n:127.0.0.1:35103_solr c:myExternColl s:shard1 r:core_node5 x:myExternColl_shard1_replica_n2] o.a.s.s.IndexSchema Loaded schema minimal/1.1 with uniqueid field id
   [junit4]   2> 1030485 INFO  (qtp2729915-4850) [n:127.0.0.1:35103_solr c:myExternColl s:shard1 r:core_node5 x:myExternColl_shard1_replica_n2] o.a.s.c.CoreContainer Creating SolrCore 'myExternColl_shard1_replica_n2' using configuration from collection myExternColl, trusted=true
   [junit4]   2> 1030485 INFO  (qtp2729915-4850) [n:127.0.0.1:35103_solr c:myExternColl s:shard1 r:core_node5 x:myExternColl_shard1_replica_n2] o.a.s.m.r.SolrJmxReporter JMX monitoring for 'solr_35103.solr.core.myExternColl.shard1.replica_n2' (registry 'solr.core.myExternColl.shard1.replica_n2') enabled at server: com.sun.jmx.mbeanserver.JmxMBeanServer@1700038
   [junit4]   2> 1030486 INFO  (qtp2729915-4850) [n:127.0.0.1:35103_solr c:myExternColl s:shard1 r:core_node5 x:myExternColl_shard1_replica_n2] o.a.s.c.SolrCore solr.RecoveryStrategy.Builder
   [junit4]   2> 1030486 INFO  (qtp2729915-4850) [n:127.0.0.1:35103_solr c:myExternColl s:shard1 r:core_node5 x:myExternColl_shard1_replica_n2] o.a.s.c.SolrCore [[myExternColl_shard1_replica_n2] ] Opening new SolrCore at [/home/jenkins/workspace/Lucene-Solr-7.x-Linux/solr/build/solr-core/test/J0/temp/solr.cloud.CollectionStateFormat2Test_3F6CA6603083910D-001/tempDir-001/node4/myExternColl_shard1_replica_n2], dataDir=[/home/jenkins/workspace/Lucene-Solr-7.x-Linux/solr/build/solr-core/test/J0/temp/solr.cloud.CollectionStateFormat2Test_3F6CA6603083910D-001/tempDir-001/node4/./myExternColl_shard1_replica_n2/data/]
   [junit4]   2> 1030517 INFO  (qtp18629706-4820) [n:127.0.0.1:46275_solr c:myExternColl s:shard2 r:core_node8 x:myExternColl_shard2_replica_n6] o.a.s.c.SolrConfig Using Lucene MatchVersion: 7.2.0
   [junit4]   2> 1030520 INFO  (qtp15682254-4818) [n:127.0.0.1:42569_solr c:myExternColl s:shard1 r:core_node3 x:myExternColl_shard1_replica_n1] o.a.s.c.SolrConfig Using Lucene MatchVersion: 7.2.0
   [junit4]   2> 1030525 INFO  (qtp29224234-4819) [n:127.0.0.1:43837_solr c:myExternColl s:shard2 r:core_node7 x:myExternColl_shard2_replica_n4] o.a.s.c.SolrConfig Using Lucene MatchVersion: 7.2.0
   [junit4]   2> 1030537 INFO  (qtp18629706-4820) [n:127.0.0.1:46275_solr c:myExternColl s:shard2 r:core_node8 x:myExternColl_shard2_replica_n6] o.a.s.s.IndexSchema [myExternColl_shard2_replica_n6] Schema name=minimal
   [junit4]   2> 1030538 INFO  (qtp29224234-4819) [n:127.0.0.1:43837_solr c:myExternColl s:shard2 r:core_node7 x:myExternColl_shard2_replica_n4] o.a.s.s.IndexSchema [myExternColl_shard2_replica_n4] Schema name=minimal
   [junit4]   2> 1030540 INFO  (qtp18629706-4820) [n:127.0.0.1:46275_solr c:myExternColl s:shard2 r:core_node8 x:myExternColl_shard2_replica_n6] o.a.s.s.IndexSchema Loaded schema minimal/1.1 with uniqueid field id
   [junit4]   2> 1030540 INFO  (qtp18629706-4820) [n:127.0.0.1:46275_solr c:myExternColl s:shard2 r:core_node8 x:myExternColl_shard2_replica_n6] o.a.s.c.CoreContainer Creating SolrCore 'myExternColl_shard2_replica_n6' using configuration from collection myExternColl, trusted=true
   [junit4]   2> 1030540 INFO  (qtp29224234-4819) [n:127.0.0.1:43837_solr c:myExternColl s:shard2 r:core_node7 x:myExternColl_shard2_replica_n4] o.a.s.s.IndexSchema Loaded schema minimal/1.1 with uniqueid field id
   [junit4]   2> 1030541 INFO  (qtp29224234-4819) [n:127.0.0.1:43837_solr c:myExternColl s:shard2 r:core_node7 x:myExternColl_shard2_replica_n4] o.a.s.c.CoreContainer Creating SolrCore 'myExternColl_shard2_replica_n4' using configuration from collection myExternColl, trusted=true
   [junit4]   2> 1030542 INFO  (qtp29224234-4819) [n:127.0.0.1:43837_solr c:myExternColl s:shard2 r:core_node7 x:myExternColl_shard2_replica_n4] o.a.s.m.r.SolrJmxReporter JMX monitoring for 'solr_43837.solr.core.myExternColl.shard2.replica_n4' (registry 'solr.core.myExternColl.shard2.replica_n4') enabled at server: com.sun.jmx.mbeanserver.JmxMBeanServer@1700038
   [junit4]   2> 1030542 INFO  (qtp18629706-4820) [n:127.0.0.1:46275_solr c:myExternColl s:shard2 r:core_node8 x:myExternColl_shard2_replica_n6] o.a.s.m.r.SolrJmxReporter JMX monitoring for 'solr_46275.solr.core.myExternColl.shard2.replica_n6' (registry 'solr.core.myExternColl.shard2.replica_n6') enabled at server: com.sun.jmx.mbeanserver.JmxMBeanServer@1700038
   [junit4]   2> 1030542 INFO  (qtp29224234-4819) [n:127.0.0.1:43837_solr c:myExternColl s:shard2 r:core_node7 x:myExternColl_shard2_replica_n4] o.a.s.c.SolrCore solr.RecoveryStrategy.Builder
   [junit4]   2> 1030542 INFO  (qtp18629706-4820) [n:127.0.0.1:46275_solr c:myExternColl s:shard2 r:core_node8 x:myExternColl_shard2_replica_n6] o.a.s.c.SolrCore solr.RecoveryStrategy.Builder
   [junit4]   2> 1030542 INFO  (qtp29224234-4819) [n:127.0.0.1:43837_solr c:myExternColl s:shard2 r:core_node7 x:myExternColl_shard2_replica_n4] o.a.s.c.SolrCore [[myExternColl_shard2_replica_n4] ] Opening new SolrCore at [/home/jenkins/workspace/Lucene-Solr-7.x-Linux/solr/build/solr-core/test/J0/temp/solr.cloud.CollectionStateFormat2Test_3F6CA6603083910D-001/tempDir-001/node2/myExternColl_shard2_replica_n4], dataDir=[/home/jenkins/workspace/Lucene-Solr-7.x-Linux/solr/build/solr-core/test/J0/temp/solr.cloud.CollectionStateFormat2Test_3F6CA6603083910D-001/tempDir-001/node2/./myExternColl_shard2_replica_n4/data/]
   [junit4]   2> 1030542 INFO  (qtp18629706-4820) [n:127.0.0.1:46275_solr c:myExternColl s:shard2 r:core_node8 x:myExternColl_shard2_replica_n6] o.a.s.c.SolrCore [[myExternColl_shard2_replica_n6] ] Opening new SolrCore at [/home/jenkins/workspace/Lucene-Solr-7.x-Linux/solr/build/solr-core/test/J0/temp/solr.cloud.CollectionStateFormat2Test_3F6CA6603083910D-001/tempDir-001/node1/myExternColl_shard2_replica_n6], dataDir=[/home/jenkins/workspace/Lucene-Solr-7.x-Linux/solr/build/solr-core/test/J0/temp/solr.cloud.CollectionStateFormat2Test_3F6CA6603083910D-001/tempDir-001/node1/./myExternColl_shard2_replica_n6/data/]
   [junit4]   2> 1030544 INFO  (qtp15682254-4818) [n:127.0.0.1:42569_solr c:myExternColl s:shard1 r:core_node3 x:myExternColl_shard1_replica_n1] o.a.s.s.IndexSchema [myExternColl_shard1_replica_n1] Schema name=minimal
   [junit4]   2> 1030547 INFO  (qtp15682254-4818) [n:127.0.0.1:42569_solr c:myExternColl s:shard1 r:core_node3 x:myExternColl_shard1_replica_n1] o.a.s.s.IndexSchema Loaded schema minimal/1.1 with uniqueid field id
   [junit4]   2> 1030547 INFO  (qtp15682254-4818) [n:127.0.0.1:42569_solr c:myExternColl s:shard1 r:core_node3 x:myExternColl_shard1_replica_n1] o.a.s.c.CoreContainer Creating SolrCore 'myExternColl_shard1_replica_n1' using configuration from collection myExternColl, trusted=true
   [junit4]   2> 1030548 INFO  (qtp15682254-4818) [n:127.0.0.1:42569_solr c:myExternColl s:shard1 r:core_node3 x:myExternColl_shard1_replica_n1] o.a.s.m.r.SolrJmxReporter JMX monitoring for 'solr_42569.solr.core.myExternColl.shard1.replica_n1' (registry 'solr.core.myExternColl.shard1.replica_n1') enabled at server: com.sun.jmx.mbeanserver.JmxMBeanServer@1700038
   [junit4]   2> 1030548 INFO  (qtp15682254-4818) [n:127.0.0.1:42569_solr c:myExternColl s:shard1 r:core_node3 x:myExternColl_shard1_replica_n1] o.a.s.c.SolrCore solr.RecoveryStrategy.Builder
   [junit4]   2> 1030548 INFO  (qtp15682254-4818) [n:127.0.0.1:42569_solr c:myExternColl s:shard1 r:core_node3 x:myExternColl_shard1_replica_n1] o.a.s.c.SolrCore [[myExternColl_shard1_replica_n1] ] Opening new SolrCore at [/home/jenkins/workspace/Lucene-Solr-7.x-Linux/solr/build/solr-core/test/J0/temp/solr.cloud.CollectionStateFormat2Test_3F6CA6603083910D-001/tempDir-001/node3/myExternColl_shard1_replica_n1], dataDir=[/home/jenkins/workspace/Lucene-Solr-7.x-Linux/solr/build/solr-core/test/J0/temp/solr.cloud.CollectionStateFormat2Test_3F6CA6603083910D-001/tempDir-001/node3/./myExternColl_shard1_replica_n1/data/]
   [junit4]   2> 1030565 INFO  (qtp2729915-4850) [n:127.0.0.1:35103_solr c:myExternColl s:shard1 r:core_node5 x:myExternColl_shard1_replica_n2] o.a.s.u.UpdateHandler Using UpdateLog implementation: org.apache.solr.update.UpdateLog
   [junit4]   2> 1030565 INFO  (qtp2729915-4850) [n:127.0.0.1:35103_solr c:myExternColl s:shard1 r:core_node5 x:myExternColl_shard1_replica_n2] o.a.s.u.UpdateLog Initializing UpdateLog: dataDir=null defaultSyncLevel=FLUSH numRecordsToKeep=100 maxNumLogsToKeep=10 numVersionBuckets=65536
   [junit4]   2> 1030566 INFO  (qtp2729915-4850) [n:127.0.0.1:35103_solr c:myExternColl s:shard1 r:core_node5 x:myExternColl_shard1_replica_n2] o.a.s.u.CommitTracker Hard AutoCommit: disabled
   [junit4]   2> 1030566 INFO  (qtp2729915-4850) [n:127.0.0.1:35103_solr c:myExternColl s:shard1 r:core_node5 x:myExternColl_shard1_replica_n2] o.a.s.u.CommitTracker Soft AutoCommit: disabled
   [junit4]   2> 1030569 INFO  (qtp2729915-4850) [n:127.0.0.1:35103_solr c:myExternColl s:shard1 r:core_node5 x:myExternColl_shard1_replica_n2] o.a.s.s.SolrIndexSearcher Opening [Searcher@14e81d1[myExternColl_shard1_replica_n2] main]
   [junit4]   2> 1030572 INFO  (qtp2729915-4850) [n:127.0.0.1:35103_solr c:myExternColl s:shard1 r:core_node5 x:myExternColl_shard1_replica_n2] o.a.s.r.ManagedResourceStorage Configured ZooKeeperStorageIO with znodeBase: /configs/conf
   [junit4]   2> 1030574 INFO  (qtp2729915-4850) [n:127.0.0.1:35103_solr c:myExternColl s:shard1 r:core_node5 x:myExternColl_shard1_replica_n2] o.a.s.r.ManagedResourceStorage Loaded null at path _rest_managed.json using ZooKeeperStorageIO:path=/configs/conf
   [junit4]   2> 1030575 INFO  (qtp2729915-4850) [n:127.0.0.1:35103_solr c:myExternColl s:shard1 r:core_node5 x:myExternColl_shard1_replica_n2] o.a.s.h.ReplicationHandler Commits will be reserved for 10000ms.
   [junit4]   2> 1030577 INFO  (searcherExecutor-1888-thread-1-processing-n:127.0.0.1:35103_solr x:myExternColl_shard1_replica_n2 s:shard1 c:myExternColl r:core_node5) [n:127.0.0.1:35103_solr c:myExternColl s:shard1 r:core_node5 x:myExternColl_shard1_replica_n2] o.a.s.c.SolrCore [myExternColl_shard1_replica_n2] Registered new searcher Searcher@14e81d1[myExternColl_shard1_replica_n2] main{ExitableDirectoryReader(UninvertingDirectoryReader())}
   [junit4]   2> 1030577 INFO  (qtp2729915-4850) [n:127.0.0.1:35103_solr c:myExternColl s:shard1 r:core_node5 x:myExternColl_shard1_replica_n2] o.a.s.u.UpdateLog Could not find max version in index or recent updates, using new clock 1582708088654266368
   [junit4]   2> 1030593 INFO  (qtp2729915-4850) [n:127.0.0.1:35103_solr c:myExternColl s:shard1 r:core_node5 x:myExternColl_shard1_replica_n2] o.a.s.c.ShardLeaderElectionContext Waiting until we see more replicas up for shard shard1: total=2 found=1 timeoutin=9999ms
   [junit4]   2> 1030622 INFO  (qtp29224234-4819) [n:127.0.0.1:43837_solr c:myExternColl s:shard2 r:core_node7 x:myExternColl_shard2_replica_n4] o.a.s.u.UpdateHandler Using UpdateLog implementation: org.apache.solr.update.UpdateLog
   [junit4]   2> 1030622 INFO  (qtp29224234-4819) [n:127.0.0.1:43837_solr c:myExternColl s:shard2 r:core_node7 x:myExternColl_shard2_replica_n4] o.a.s.u.UpdateLog Initializing UpdateLog: dataDir=null defaultSyncLevel=FLUSH numRecordsToKeep=100 maxNumLogsToKeep=10 numVersionBuckets=65536
   [junit4]   2> 1030622 INFO  (qtp18629706-4820) [n:127.0.0.1:46275_solr c:myExternColl s:shard2 r:core_node8 x:myExternColl_shard2_replica_n6] o.a.s.u.UpdateHandler Using UpdateLog implementation: org.apache.solr.update.UpdateLog
   [junit4]   2> 1030622 INFO  (qtp18629706-4820) [n:127.0.0.1:46275_solr c:myExternColl s:shard2 r:core_node8 x:myExternColl_shard2_replica_n6] o.a.s.u.UpdateLog Initializing UpdateLog: dataDir=null defaultSyncLevel=FLUSH numRecordsToKeep=100 maxNumLogsToKeep=10 numVersionBuckets=65536
   [junit4]   2> 1030623 INFO  (qtp29224234-4819) [n:127.0.0.1:43837_solr c:myExternColl s:shard2 r:core_node7 x:myExternColl_shard2_replica_n4] o.a.s.u.CommitTracker Hard AutoCommit: disabled
   [junit4]   2> 1030623 INFO  (qtp29224234-4819) [n:127.0.0.1:43837_solr c:myExternColl s:shard2 r:core_node7 x:myExternColl_shard2_replica_n4] o.a.s.u.CommitTracker Soft AutoCommit: disabled
   [junit4]   2> 1030623 INFO  (qtp18629706-4820) [n:127.0.0.1:46275_solr c:myExternColl s:shard2 r:core_node8 x:myExternColl_shard2_replica_n6] o.a.s.u.CommitTracker Hard AutoCommit: disabled
   [junit4]   2> 1030623 INFO  (qtp18629706-4820) [n:127.0.0.1:46275_solr c:myExternColl s:shard2 r:core_node8 x:myExternColl_shard2_replica_n6] o.a.s.u.CommitTracker Soft AutoCommit: disabled
   [junit4]   2> 1030624 INFO  (qtp15682254-4818) [n:127.0.0.1:42569_solr c:myExternColl s:shard1 r:core_node3 x:myExternColl_shard1_replica_n1] o.a.s.u.UpdateHandler Using UpdateLog implementation: org.apache.solr.update.UpdateLog
   [junit4]   2> 1030624 INFO  (qtp15682254-4818) [n:127.0.0.1:42569_solr c:myExternColl s:shard1 r:core_node3 x:myExternColl_shard1_replica_n1] o.a.s.u.UpdateLog Initializing UpdateLog: dataDir=null defaultSyncLevel=FLUSH numRecordsToKeep=100 maxNumLogsToKeep=10 numVersionBuckets=65536
   [junit4]   2> 1030625 INFO  (qtp15682254-4818) [n:127.0.0.1:42569_solr c:myExternColl s:shard1 r:core_node3 x:myExternColl_shard1_replica_n1] o.a.s.u.CommitTracker Hard AutoCommit: disabled
   [junit4]   2> 1030626 INFO  (qtp15682254-4818) [n:127.0.0.1:42569_solr c:myExternColl s:shard1 r:core_node3 x:myExternColl_shard1_replica_n1] o.a.s.u.CommitTracker Soft AutoCommit: disabled
   [junit4]   2> 1030627 INFO  (qtp29224234-4819) [n:127.0.0.1:43837_solr c:myExternColl s:shard2 r:core_node7 x:myExternColl_shard2_replica_n4] o.a.s.s.SolrIndexSearcher Opening [Searcher@166efd9[myExternColl_shard2_replica_n4] main]
   [junit4]   2> 1030627 INFO  (qtp15682254-4818) [n:127.0.0.1:42569_solr c:myExternColl s:shard1 r:core_node3 x:myExternColl_shard1_replica_n1] o.a.s.s.SolrIndexSearcher Opening [Searcher@1e098e5[myExternColl_shard1_replica_n1] main]
   [junit4]   2> 1030627 INFO  (qtp18629706-4820) [n:127.0.0.1:46275_solr c:myExternColl s:shard2 r:core_node8 x:myExternColl_shard2_replica_n6] o.a.s.s.SolrIndexSearcher Opening [Searcher@19e8cff[myExternColl_shard2_replica_n6] main]
   [junit4]   2> 1030629 INFO  (qtp15682254-4818) [n:127.0.0.1:42569_solr c:myExternColl s:shard1 r:core_node3 x:myExternColl_shard1_replica_n1] o.a.s.r.ManagedResourceStorage Configured ZooKeeperStorageIO with znodeBase: /configs/conf
   [junit4]   2> 1030629 INFO  (qtp29224234-4819) [n:127.0.0.1:43837_solr c:myExternColl s:shard2 r:core_node7 x:myExternColl_shard2_replica_n4] o.a.s.r.ManagedResourceStorage Configured ZooKeeperStorageIO with znodeBase: /configs/conf
   [junit4]   2> 1030629 INFO  (qtp15682254-4818) [n:127.0.0.1:42569_solr c:myExternColl s:shard1 r:core_node3 x:myExternColl_shard1_replica_n1] o.a.s.r.ManagedResourceStorage Loaded null at path _rest_managed.json using ZooKeeperStorageIO:path=/configs/conf
   [junit4]   2> 1030629 INFO  (qtp29224234-4819) [n:127.0.0.1:43837_solr c:myExternColl s:shard2 r:core_node7 x:myExternColl_shard2_replica_n4] o.a.s.r.ManagedResourceStorage Loaded null at path _rest_managed.json using ZooKeeperStorageIO:path=/configs/conf
   [junit4]   2> 1030630 INFO  (qtp15682254-4818) [n:127.0.0.1:42569_solr c:myExternColl s:shard1 r:core_node3 x:myExternColl_shard1_replica_n1] o.a.s.h.ReplicationHandler Commits will be reserved for 10000ms.
   [junit4]   2> 1030630 INFO  (qtp29224234-4819) [n:127.0.0.1:43837_solr c:myExternColl s:shard2 r:core_node7 x:myExternColl_shard2_replica_n4] o.a.s.h.ReplicationHandler Commits will be reserved for 10000ms.
   [junit4]   2> 1030630 INFO  (qtp18629706-4820) [n:127.0.0.1:46275_solr c:myExternColl s:shard2 r:core_node8 x:myExternColl_shard2_replica_n6] o.a.s.r.ManagedResourceStorage Configured ZooKeeperStorageIO with znodeBase: /configs/conf
   [junit4]   2> 1030631 INFO  (qtp18629706-4820) [n:127.0.0.1:46275_solr c:myExternColl s:shard2 r:core_node8 x:myExternColl_shard2_replica_n6] o.a.s.r.ManagedResourceStorage Loaded null at path _rest_managed.json using ZooKeeperStorageIO:path=/configs/conf
   [junit4]   2> 1030632 INFO  (qtp18629706-4820) [n:127.0.0.1:46275_solr c:myExternColl s:shard2 r:core_node8 x:myExternColl_shard2_replica_n6] o.a.s.h.ReplicationHandler Commits will be reserved for 10000ms.
   [junit4]   2> 1030632 INFO  (searcherExecutor-1892-thread-1-processing-n:127.0.0.1:42569_solr x:myExternColl_shard1_replica_n1 s:shard1 c:myExternColl r:core_node3) [n:127.0.0.1:42569_solr c:myExternColl s:shard1 r:core_node3 x:myExternColl_shard1_replica_n1] o.a.s.c.SolrCore [myExternColl_shard1_replica_n1] Registered new searcher Searcher@1e098e5[myExternColl_shard1_replica_n1] main{ExitableDirectoryReader(UninvertingDirectoryReader())}
   [junit4]   2> 1030632 INFO  (qtp15682254-4818) [n:127.0.0.1:42569_solr c:myExternColl s:shard1 r:core_node3 x:myExternColl_shard1_replica_n1] o.a.s.u.UpdateLog Could not find max version in index or recent updates, using new clock 1582708088711938048
   [junit4]   2> 1030633 INFO  (searcherExecutor-1890-thread-1-processing-n:127.0.0.1:46275_solr x:myExternColl_shard2_replica_n6 s:shard2 c:myExternColl r:core_node8) [n:127.0.0.1:46275_solr c:myExternColl s:shard2 r:core_node8 x:myExternColl_shard2_replica_n6] o.a.s.c.SolrCore [myExternColl_shard2_replica_n6] Registered new searcher Searcher@19e8cff[myExternColl_shard2_replica_n6] main{ExitableDirectoryReader(UninvertingDirectoryReader())}
   [junit4]   2> 1030633 INFO  (qtp18629706-4820) [n:127.0.0.1:46275_solr c:myExternColl s:shard2 r:core_node8 x:myExternColl_shard2_replica_n6] o.a.s.u.UpdateLog Could not find max version in index or recent updates, using new clock 1582708088712986624
   [junit4]   2> 1030633 INFO  (searcherExecutor-1891-thread-1-processing-n:127.0.0.1:43837_solr x:myExternColl_shard2_replica_n4 s:shard2 c:myExternColl r:core_node7) [n:127.0.0.1:43837_solr c:myExternColl s:shard2 r:core_node7 x:myExternColl_shard2_replica_n4] o.a.s.c.SolrCore [myExternColl_shard2_replica_n4] Registered new searcher Searcher@166efd9[myExternColl_shard2_replica_n4] main{ExitableDirectoryReader(UninvertingDirectoryReader())}
   [junit4]   2> 1030633 INFO  (qtp29224234-4819) [n:127.0.0.1:43837_solr c:myExternColl s:shard2 r:core_node7 x:myExternColl_shard2_replica_n4] o.a.s.u.UpdateLog Could not find max version in index or recent updates, using new clock 1582708088712986624
   [junit4]   2> 1030637 INFO  (qtp18629706-4820) [n:127.0.0.1:46275_solr c:myExternColl s:shard2 r:core_node8 x:myExternColl_shard2_replica_n6] o.a.s.c.ShardLeaderElectionContext Enough replicas found to continue.
   [junit4]   2> 1030637 INFO  (qtp18629706-4820) [n:127.0.0.1:46275_solr c:myExternColl s:shard2 r:core_node8 x:myExternColl_shard2_replica_n6] o.a.s.c.ShardLeaderElectionContext I may be the new leader - try and sync
   [junit4]   2> 1030637 INFO  (qtp18629706-4820) [n:127.0.0.1:46275_solr c:myExternColl s:shard2 r:core_node8 x:myExternColl_shard2_replica_n6] o.a.s.c.SyncStrategy Sync replicas to https://127.0.0.1:46275/solr/myExternColl_shard2_replica_n6/
   [junit4]   2> 1030637 INFO  (qtp18629706-4820) [n:127.0.0.1:46275_solr c:myExternColl s:shard2 r:core_node8 x:myExternColl_shard2_replica_n6] o.a.s.u.PeerSync PeerSync: core=myExternColl_shard2_replica_n6 url=https://127.0.0.1:46275/solr START replicas=[https://127.0.0.1:43837/solr/myExternColl_shard2_replica_n4/] nUpdates=100
   [junit4]   2> 1030644 INFO  (qtp29224234-4822) [n:127.0.0.1:43837_solr c:myExternColl s:shard2 r:core_node7 x:myExternColl_shard2_replica_n4] o.a.s.c.S.Request [myExternColl_shard2_replica_n4]  webapp=/solr path=/get params={distrib=false&qt=/get&fingerprint=false&getVersions=100&wt=javabin&version=2} status=0 QTime=0
   [junit4]   2> 1030938 INFO  (qtp18629706-4820) [n:127.0.0.1:46275_solr c:myExternColl s:shard2 r:core_node8 x:myExternColl_shard2_replica_n6] o.a.s.u.PeerSync PeerSync: core=myExternColl_shard2_replica_n6 url=https://127.0.0.1:46275/solr DONE.  We have no versions.  sync failed.
   [junit4]   2> 1030938 INFO  (qtp18629706-4820) [n:127.0.0.1:46275_solr c:myExternColl s:shard2 r:core_node8 x:myExternColl_shard2_replica_n6] o.a.s.c.SyncStrategy Leader's attempt to sync with shard failed, moving to the next candidate
   [junit4]   2> 1030938 INFO  (qtp18629706-4820) [n:127.0.0.1:46275_solr c:myExternColl s:shard2 r:core_node8 x:myExternColl_shard2_replica_n6] o.a.s.c.ShardLeaderElectionContext We failed sync, but we have no versions - we can't sync in that case - we were active before, so become leader anyway
   [junit4]   2> 1030938 INFO  (qtp18629706-4820) [n:127.0.0.1:46275_solr c:myExternColl s:shard2 r:core_node8 x:myExternColl_shard2_replica_n6] o.a.s.c.ShardLeaderElectionContext Found all replicas participating in election, clear LIR
   [junit4]   2> 1030940 INFO  (qtp18629706-4820) [n:127.0.0.1:46275_solr c:myExternColl s:shard2 r:core_node8 x:myExternColl_shard2_replica_n6] o.a.s.c.ShardLeaderElectionContext I am the new leader: https://127.0.0.1:46275/solr/myExternColl_shard2_replica_n6/ shard2
   [junit4]   2> 1031093 INFO  (qtp2729915-4850) [n:127.0.0.1:35103_solr c:myExternColl s:shard1 r:core_node5 x:myExternColl_shard1_replica_n2] o.a.s.c.ShardLeaderElectionContext Enough replicas found to continue.
   [junit4]   2> 1031093 INFO  (qtp2729915-4850) [n:127.0.0.1:35103_solr c:myExternColl s:shard1 r:core_node5 x:myExternColl_shard1_replica_n2] o.a.s.c.ShardLeaderElectionContext I may be the new leader - try and sync
   [junit4]   2> 1031093 INFO  (qtp2729915-4850) [n:127.0.0.1:35103_solr c:myExternColl s:shard1 r:core_node5 x:myExternColl_shard1_replica_n2] o.a.s.c.SyncStrategy Sync replicas to https://127.0.0.1:35103/solr/myExternColl_shard1_replica_n2/
   [junit4]   2> 1031094 INFO  (qtp2729915-4850) [n:127.0.0.1:35103_solr c:myExternColl s:shard1 r:core_node5 x:myExternColl_shard1_replica_n2] o.a.s.u.PeerSync PeerSync: core=myExternColl_shard1_replica_n2 url=https://127.0.0.1:35103/solr START replicas=[https://127.0.0.1:42569/solr/myExternColl_shard1_replica_n1/] nUpdates=100
   [junit4]   2> 1031105 INFO  (qtp15682254-4824) [n:127.0.0.1:42569_solr c:myExternColl s:shard1 r:core_node3 x:myExternColl_shard1_replica_n1] o.a.s.c.S.Request [myExternColl_shard1_replica_n1]  webapp=/solr path=/get params={distrib=false&qt=/get&fingerprint=false&getVersions=100&wt=javabin&version=2} status=0 QTime=0
   [junit4]   2> 1031394 INFO  (qtp2729915-4850) [n:127.0.0.1:35103_solr c:myExternColl s:shard1 r:core_node5 x:myExternColl_shard1_replica_n2] o.a.s.u.PeerSync PeerSync: core=myExternColl_shard1_replica_n2 url=https://127.0.0.1:35103/solr DONE.  We have no versions.  sync failed.
   [junit4]   2> 1031394 INFO  (qtp2729915-4850) [n:127.0.0.1:35103_solr c:myExternColl s:shard1 r:core_node5 x:myExternColl_shard1_replica_n2] o.a.s.c.SyncStrategy Leader's attempt to sync with shard failed, moving to the next candidate
   [junit4]   2> 1031394 INFO  (qtp2729915-4850) [n:127.0.0.1:35103_solr c:myExternColl s:shard1 r:core_node5 x:myExternColl_shard1_replica_n2] o.a.s.c.ShardLeaderElectionContext We failed sync, but we have no versions - we can't sync in that case - we were active before, so become leader anyway
   [junit4]   2> 1031394 INFO  (qtp2729915-4850) [n:127.0.0.1:35103_solr c:myExternColl s:shard1 r:core_node5 x:myExternColl_shard1_replica_n2] o.a.s.c.ShardLeaderElectionContext Found all replicas participating in election, clear LIR
   [junit4]   2> 1031397 INFO  (qtp2729915-4850) [n:127.0.0.1:35103_solr c:myExternColl s:shard1 r:core_node5 x:myExternColl_shard1_replica_n2] o.a.s.c.ShardLeaderElectionContext I am the new leader: https://127.0.0.1:35103/solr/myExternColl_shard1_replica_n2/ shard1
   [junit4]   2> 1209072 ERROR (qtp2729915-4823) [n:127.0.0.1:35103_solr    ] o.a.s.h.RequestHandlerBase org.apache.solr.common.SolrException: create the collection time out:180s
   [junit4]   2> 	at org.apache.solr.handler.admin.CollectionsHandler.handleResponse(CollectionsHandler.java:312)
   [junit4]   2> 	at org.apache.solr.handler.admin.CollectionsHandler.invokeAction(CollectionsHandler.java:244)
   [junit4]   2> 	at org.apache.solr.handler.admin.CollectionsHandler.handleRequestBody(CollectionsHandler.java:222)
   [junit4]   2> 	at org.apache.solr.handler.RequestHandlerBase.handleRequest(RequestHandlerBase.java:177)
   [junit4]   2> 	at org.apache.solr.servlet.HttpSolrCall.handleAdmin(HttpSolrCall.java:735)
   [junit4]   2> 	at org.apache.solr.servlet.HttpSolrCall.handleAdminRequest(HttpSolrCall.java:716)
   [junit4]   2> 	at org.apache.solr.servlet.HttpSolrCall.call(HttpSolrCall.java:497)
   [junit4]   2> 	at org.apache.solr.servlet.SolrDispatchFilter.doFilter(SolrDispatchFilter.java:382)
   [junit4]   2> 	at org.apache.solr.servlet.SolrDispatchFilter.doFilter(SolrDispatchFilter.java:326)
   [junit4]   2> 	at org.eclipse.jetty.servlet.ServletHandler$CachedChain.doFilter(ServletHandler.java:1759)
   [junit4]   2> 	at org.apache.solr.client.solrj.embedded.JettySolrRunner$DebugFilter.doFilter(JettySolrRunner.java:139)
   [junit4]   2> 	at org.eclipse.jetty.servlet.ServletHandler$CachedChain.doFilter(ServletHandler.java:1759)
   [junit4]   2> 	at org.eclipse.jetty.servlet.ServletHandler.doHandle(ServletHandler.java:582)
   [junit4]   2> 	at org.eclipse.jetty.server.session.SessionHandler.doHandle(SessionHandler.java:224)
   [junit4]   2> 	at org.eclipse.jetty.server.handler.ContextHandler.doHandle(ContextHandler.java:1180)
   [junit4]   2> 	at org.eclipse.jetty.servlet.ServletHandler.doScope(ServletHandler.java:512)
   [junit4]   2> 	at org.eclipse.jetty.server.session.SessionHandler.doScope(SessionHandler.java:185)
   [junit4]   2> 	at org.eclipse.jetty.server.handler.ContextHandler.doScope(ContextHandler.java:1112)
   [junit4]   2> 	at org.eclipse.jetty.server.handler.ScopedHandler.handle(ScopedHandler.java:141)
   [junit4]   2> 	at org.eclipse.jetty.server.handler.gzip.GzipHandler.handle(GzipHandler.java:493)
   [junit4]   2> 	at org.eclipse.jetty.server.handler.HandlerWrapper.handle(HandlerWrapper.java:134)
   [junit4]   2> 	at org.eclipse.jetty.server.Server.handle(Server.java:534)
   [junit4]   2> 	at org.eclipse.jetty.server.HttpChannel.handle(HttpChannel.java:320)
   [junit4]   2> 	at org.eclipse.jetty.server.HttpConnection.onFillable(HttpConnection.java:251)
   [junit4]   2> 	at org.eclipse.jetty.io.AbstractConnection$ReadCallback.succeeded(AbstractConnection.java:283)
   [junit4]   2> 	at org.eclipse.jetty.io.FillInterest.fillable(FillInterest.java:108)
   [junit4]   2> 	at org.eclipse.jetty.io.ssl.SslConnection.onFillable(SslConnection.java:251)
   [junit4]   2> 	at org.eclipse.jetty.io.AbstractConnection$ReadCallback.succeeded(AbstractConnection.java:283)
   [junit4]   2> 	at org.eclipse.jetty.io.FillInterest.fillable(FillInterest.java:108)
   [junit4]   2> 	at org.eclipse.jetty.io.SelectChannelEndPoint$2.run(SelectChannelEndPoint.java:93)
   [junit4]   2> 	at org.eclipse.jetty.util.thread.strategy.ExecuteProduceConsume.executeProduceConsume(ExecuteProduceConsume.java:303)
   [junit4]   2> 	at org.eclipse.jetty.util.thread.strategy.ExecuteProduceConsume.produceConsume(ExecuteProduceConsume.java:148)
   [junit4]   2> 	at org.eclipse.jetty.util.thread.strategy.ExecuteProduceConsume.run(ExecuteProduceConsume.java:136)
   [junit4]   2> 	at org.eclipse.jetty.util.thread.QueuedThreadPool.runJob(QueuedThreadPool.java:671)
   [junit4]   2> 	at org.eclipse.jetty.util.thread.QueuedThreadPool$2.run(QueuedThreadPool.java:589)
   [junit4]   2> 	at java.lang.Thread.run(Thread.java:748)
   [junit4]   2> 
   [junit4]   2> 1209094 INFO  (qtp2729915-4823) [n:127.0.0.1:35103_solr    ] o.a.s.s.HttpSolrCall [admin] webapp=null path=/admin/collections params={replicationFactor=2&collection.configName=conf&name=myExternColl&nrtReplicas=2&action=CREATE&numShards=2&wt=javabin&version=2} status=500 QTime=180025
   [junit4]   2> 1209095 ERROR (qtp2729915-4823) [n:127.0.0.1:35103_solr    ] o.a.s.s.HttpSolrCall null:org.apache.solr.common.SolrException: create the collection time out:180s
   [junit4]   2> 	at org.apache.solr.handler.admin.CollectionsHandler.handleResponse(CollectionsHandler.java:312)
   [junit4]   2> 	at org.apache.solr.handler.admin.CollectionsHandler.invokeAction(CollectionsHandler.java:244)
   [junit4]   2> 	at org.apache.solr.handler.admin.CollectionsHandler.handleRequestBody(CollectionsHandler.java:222)
   [junit4]   2> 	at org.apache.solr.handler.RequestHandlerBase.handleRequest(RequestHandlerBase.java:177)
   [junit4]   2> 	at org.apache.solr.servlet.HttpSolrCall.handleAdmin(HttpSolrCall.java:735)
   [junit4]   2> 	at org.apache.solr.servlet.HttpSolrCall.handleAdminRequest(HttpSolrCall.java:716)
   [junit4]   2> 	at org.apache.solr.servlet.HttpSolrCall.call(HttpSolrCall.java:497)
   [junit4]   2> 	at org.apache.solr.servlet.SolrDispatchFilter.doFilter(SolrDispatchFilter.java:382)
   [junit4]   2> 	at org.apache.solr.servlet.SolrDispatchFilter.doFilter(SolrDispatchFilter.java:326)
   [junit4]   2> 	at org.eclipse.jetty.servlet.ServletHandler$CachedChain.doFilter(ServletHandler.java:1759)
   [junit4]   2> 	at org.apache.solr.client.solrj.embedded.JettySolrRunner$DebugFilter.doFilter(JettySolrRunner.java:139)
   [junit4]   2> 	at org.eclipse.jetty.servlet.ServletHandler$CachedChain.doFilter(ServletHandler.java:1759)
   [junit4]   2> 	at org.eclipse.jetty.servlet.ServletHandler.doHandle(ServletHandler.java:582)
   [junit4]   2> 	at org.eclipse.jetty.server.session.SessionHandler.doHandle(SessionHandler.java:224)
   [junit4]   2> 	at org.eclipse.jetty.server.handler.ContextHandler.doHandle(ContextHandler.java:1180)
   [junit4]   2> 	at org.eclipse.jetty.servlet.ServletHandler.doScope(ServletHandler.java:512)
   [junit4]   2> 	at org.eclipse.jetty.server.session.SessionHandler.doScope(SessionHandler.java:185)
   [junit4]   2> 	at org.eclipse.jetty.server.handler.ContextHandler.doScope(ContextHandler.java:1112)
   [junit4]   2> 	at org.eclipse.jetty.server.handler.ScopedHandler.handle(ScopedHandler.java:141)
   [junit4]   2> 	at org.eclipse.jetty.server.handler.gzip.GzipHandler.handle(GzipHandler.java:493)
   [junit4]   2> 	at org.eclipse.jetty.server.handler.HandlerWrapper.handle(HandlerWrapper.java:134)
   [junit4]   2> 	at org.eclipse.jetty.server.Server.handle(Server.java:534)
   [junit4]   2> 	at org.eclipse.jetty.server.HttpChannel.handle(HttpChannel.java:320)
   [junit4]   2> 	at org.eclipse.jetty.server.HttpConnection.onFillable(HttpConnection.java:251)
   [junit4]   2> 	at org.eclipse.jetty.io.AbstractConnection$ReadCallback.succeeded(AbstractConnection.java:283)
   [junit4]   2> 	at org.eclipse.jetty.io.FillInterest.fillable(FillInterest.java:108)
   [junit4]   2> 	at org.eclipse.jetty.io.ssl.SslConnection.onFillable(SslConnection.java:251)
   [junit4]   2> 	at org.eclipse.jetty.io.AbstractConnection$ReadCallback.succeeded(AbstractConnection.java:283)
   [junit4]   2> 	at org.eclipse.jetty.io.FillInterest.fillable(FillInterest.java:108)
   [junit4]   2> 	at org.eclipse.jetty.io.SelectChannelEndPoint$2.run(SelectChannelEndPoint.java:93)
   [junit4]   2> 	at org.eclipse.jetty.util.thread.strategy.ExecuteProduceConsume.executeProduceConsume(ExecuteProduceConsume.java:303)
   [junit4]   2> 	at org.eclipse.jetty.util.thread.strategy.ExecuteProduceConsume.produceConsume(ExecuteProduceConsume.java:148)
   [junit4]   2> 	at org.eclipse.jetty.util.thread.strategy.ExecuteProduceConsume.run(ExecuteProduceConsume.java:136)
   [junit4]   2> 	at org.eclipse.jetty.util.thread.QueuedThreadPool.runJob(QueuedThreadPool.java:671)
   [junit4]   2> 	at org.eclipse.jetty.util.thread.QueuedThreadPool$2.run(QueuedThreadPool.java:589)
   [junit4]   2> 	at java.lang.Thread.run(Thread.java:748)
   [junit4]   2> 
   [junit4]   2> 1209097 INFO  (TEST-CollectionStateFormat2Test.testZkNodeLocation-seed#[3F6CA6603083910D]) [    ] o.a.s.SolrTestCaseJ4 ###Ending testZkNodeLocation
   [junit4]   2> NOTE: reproduce with: ant test  -Dtestcase=CollectionStateFormat2Test -Dtests.method=testZkNodeLocation -Dtests.seed=3F6CA6603083910D -Dtests.multiplier=3 -Dtests.slow=true -Dtests.locale=sl-SI -Dtests.timezone=Asia/Famagusta -Dtests.asserts=true -Dtests.file.encoding=UTF-8
   [junit4] ERROR    180s J0 | CollectionStateFormat2Test.testZkNodeLocation <<<
   [junit4]    > Throwable #1: org.apache.solr.client.solrj.impl.HttpSolrClient$RemoteSolrException: Error from server at https://127.0.0.1:35103/solr: create the collection time out:180s
   [junit4]    > 	at __randomizedtesting.SeedInfo.seed([3F6CA6603083910D:70C12CC09DEC1FF9]:0)
   [junit4]    > 	at org.apache.solr.client.solrj.impl.HttpSolrClient.executeMethod(HttpSolrClient.java:626)
   [junit4]    > 	at org.apache.solr.client.solrj.impl.HttpSolrClient.request(HttpSolrClient.java:253)
   [junit4]    > 	at org.apache.solr.client.solrj.impl.HttpSolrClient.request(HttpSolrClient.java:242)
   [junit4]    > 	at org.apache.solr.client.solrj.impl.LBHttpSolrClient.doRequest(LBHttpSolrClient.java:483)
   [junit4]    > 	at org.apache.solr.client.solrj.impl.LBHttpSolrClient.request(LBHttpSolrClient.java:413)
   [junit4]    > 	at org.apache.solr.client.solrj.impl.CloudSolrClient.sendRequest(CloudSolrClient.java:1096)
   [junit4]    > 	at org.apache.solr.client.solrj.impl.CloudSolrClient.requestWithRetryOnStaleState(CloudSolrClient.java:875)
   [junit4]    > 	at org.apache.solr.client.solrj.impl.CloudSolrClient.request(CloudSolrClient.java:808)
   [junit4]    > 	at org.apache.solr.client.solrj.SolrRequest.process(SolrRequest.java:178)
   [junit4]    > 	at org.apache.solr.client.solrj.SolrRequest.process(SolrRequest.java:195)
   [junit4]    > 	at org.apache.solr.cloud.CollectionStateFormat2Test.testZkNodeLocation(CollectionStateFormat2Test.java:48)
   [junit4]    > 	at java.lang.Thread.run(Thread.java:748)
   [junit4]   2> 1209149 INFO  (TEST-CollectionStateFormat2Test.testConfNameAndCollectionNameSame-seed#[3F6CA6603083910D]) [    ] o.a.s.SolrTestCaseJ4 ###Starting testConfNameAndCollectionNameSame
   [junit4]   2> 1209150 INFO  (qtp2729915-4843) [n:127.0.0.1:35103_solr    ] o.a.s.h.a.CollectionsHandler Invoked Collection Action :create with params pullReplicas=0&replicationFactor=1&name=.system&nrtReplicas=1&action=CREATE&numShards=2&tlogReplicas=0&wt=javabin&version=2 and sendToOCPQueue=true
   [junit4]   2> 1209156 INFO  (OverseerThreadFactory-1879-thread-2-processing-n:127.0.0.1:42569_solr) [n:127.0.0.1:42569_solr    ] o.a.s.c.CreateCollectionCmd Create collection .system
   [junit4]   2> 1239199 ERROR (OverseerThreadFactory-1879-thread-2-processing-n:127.0.0.1:42569_solr) [n:127.0.0.1:42569_solr    ] o.a.s.c.OverseerCollectionMessageHandler Collection: .system operation: create failed:org.apache.solr.common.SolrException: Could not fully create collection: .system
   [junit4]   2> 	at org.apache.solr.cloud.CreateCollectionCmd.call(CreateCollectionCmd.java:215)
   [junit4]   2> 	at org.apache.solr.cloud.OverseerCollectionMessageHandler.processMessage(OverseerCollectionMessageHandler.java:229)
   [junit4]   2> 	at org.apache.solr.cloud.OverseerTaskProcessor$Runner.run(OverseerTaskProcessor.java:464)
   [junit4]   2> 	at org.apache.solr.common.util.ExecutorUtil$MDCAwareThreadPoolExecutor.lambda$execute$0(ExecutorUtil.java:188)
   [junit4]   2> 	at java.util.concurrent.ThreadPoolExecutor.runWorker(ThreadPoolExecutor.java:1149)
   [junit4]   2> 	at java.util.concurrent.ThreadPoolExecutor$Worker.run(ThreadPoolExecutor.java:624)
   [junit4]   2> 	at java.lang.Thread.run(Thread.java:748)
   [junit4]   2> 
   [junit4]   2> 1239210 INFO  (qtp2729915-4843) [n:127.0.0.1:35103_solr    ] o.a.s.s.HttpSolrCall [admin] webapp=null path=/admin/collections params={pullReplicas=0&replicationFactor=1&name=.system&nrtReplicas=1&action=CREATE&numShards=2&tlogReplicas=0&wt=javabin&version=2} status=500 QTime=30060
   [junit4]   2> 1239211 ERROR (qtp2729915-4843) [n:127.0.0.1:35103_solr    ] o.a.s.s.HttpSolrCall null:org.apache.solr.common.SolrException: Could not fully create collection: .system
   [junit4]   2> 	at org.apache.solr.handler.admin.CollectionsHandler.handleResponse(CollectionsHandler.java:307)
   [junit4]   2> 	at org.apache.solr.handler.admin.CollectionsHandler.invokeAction(CollectionsHandler.java:244)
   [junit4]   2> 	at org.apache.solr.handler.admin.CollectionsHandler.handleRequestBody(CollectionsHandler.java:222)
   [junit4]   2> 	at org.apache.solr.handler.RequestHandlerBase.handleRequest(RequestHandlerBase.java:177)
   [junit4]   2> 	at org.apache.solr.servlet.HttpSolrCall.handleAdmin(HttpSolrCall.java:735)
   [junit4]   2> 	at org.apache.solr.servlet.HttpSolrCall.handleAdminRequest(HttpSolrCall.java:716)
   [junit4]   2> 	at org.apache.solr.servlet.HttpSolrCall.call(HttpSolrCall.java:497)
   [junit4]   2> 	at org.apache.solr.servlet.SolrDispatchFilter.doFilter(SolrDispatchFilter.java:382)
   [junit4]   2> 	at org.apache.solr.servlet.SolrDispatchFilter.doFilter(SolrDispatchFilter.java:326)
   [junit4]   2> 	at org.eclipse.jetty.servlet.ServletHandler$CachedChain.doFilter(ServletHandler.java:1759)
   [junit4]   2> 	at org.apache.solr.client.solrj.embedded.JettySolrRunner$DebugFilter.doFilter(JettySolrRunner.java:139)
   [junit4]   2> 	at org.eclipse.jetty.servlet.ServletHandler$CachedChain.doFilter(ServletHandler.java:1759)
   [junit4]   2> 	at org.eclipse.jetty.servlet.ServletHandler.doHandle(ServletHandler.java:582)
   [junit4]   2> 	at org.eclipse.jetty.server.session.SessionHandler.doHandle(SessionHandler.java:224)
   [junit4]   2> 	at org.eclipse.jetty.server.handler.ContextHandler.doHandle(ContextHandler.java:1180)
   [junit4]   2> 	at org.eclipse.jetty.servlet.ServletHandler.doScope(ServletHandler.java:512)
   [junit4]   2> 	at org.eclipse.jetty.server.session.SessionHandler.doScope(SessionHandler.java:185)
   [junit4]   2> 	at org.eclipse.jetty.server.handler.ContextHandler.doScope(ContextHandler.java:1112)
   [junit4]   2> 	at org.eclipse.jetty.server.handler.ScopedHandler.handle(ScopedHandler.java:141)
   [junit4]   2> 	at org.eclipse.jetty.server.handler.gzip.GzipHandler.handle(GzipHandler.java:493)
   [junit4]   2> 	at org.eclipse.jetty.server.handler.HandlerWrapper.handle(HandlerWrapper.java:134)
   [junit4]   2> 	at org.eclipse.jetty.server.Server.handle(Server.java:534)
   [junit4]   2> 	at org.eclipse.jetty.server.HttpChannel.handle(HttpChannel.java:320)
   [junit4]   2> 	at org.eclipse.jetty.server.HttpConnection.onFillable(HttpConnection.java:251)
   [junit4]   2> 	at org.eclipse.jetty.io.AbstractConnection$ReadCallback.succeeded(AbstractConnection.java:283)
   [junit4]   2> 	at org.eclipse.jetty.io.FillInterest.fillable(FillInterest.java:108)
   [junit4]   2> 	at org.eclipse.jetty.io.ssl.SslConnection.onFillable(SslConnection.java:251)
   [junit4]   2> 	at org.eclipse.jetty.io.AbstractConnection$ReadCallback.succeeded(AbstractConnection.java:283)
   [junit4]   2> 	at org.eclipse.jetty.io.FillInterest.fillable(FillInterest.java:108)
   [junit4]   2> 	at org.eclipse.jetty.io.SelectChannelEndPoint$2.run(SelectChannelEndPoint.java:93)
   [junit4]   2> 	at org.eclipse.jetty.util.thread.strategy.ExecuteProduceConsume.executeProduceConsume(ExecuteProduceConsume.java:303)
   [junit4]   2> 	at org.eclipse.jetty.util.thread.strategy.ExecuteProduceConsume.produceConsume(ExecuteProduceConsume.java:148)
   [junit4]   2> 	at org.eclipse.jetty.util.thread.strategy.ExecuteProduceConsume.run(ExecuteProduceConsume.java:136)
   [junit4]   2> 	at org.eclipse.jetty.util.thread.QueuedThreadPool.runJob(QueuedThreadPool.java:671)
   [junit4]   2> 	at org.eclipse.jetty.util.thread.QueuedThreadPool$2.run(QueuedThreadPool.java:589)
   [junit4]   2> 	at java.lang.Thread.run(Thread.java:748)
   [junit4]   2> 
   [junit4]   2> 1239212 INFO  (TEST-CollectionStateFormat2Test.testConfNameAndCollectionNameSame-seed#[3F6CA6603083910D]) [    ] o.a.s.SolrTestCaseJ4 ###Ending testConfNameAndCollectionNameSame
   [junit4]   2> NOTE: reproduce with: ant test  -Dtestcase=CollectionStateFormat2Test -Dtests.method=testConfNameAndCollectionNameSame -Dtests.seed=3F6CA6603083910D -Dtests.multiplier=3 -Dtests.slow=true -Dtests.locale=sl-SI -Dtests.timezone=Asia/Famagusta -Dtests.asserts=true -Dtests.file.encoding=UTF-8
   [junit4] ERROR   30.1s J0 | CollectionStateFormat2Test.testConfNameAndCollectionNameSame <<<
   [junit4]    > Throwable #1: org.apache.solr.client.solrj.impl.HttpSolrClient$RemoteSolrException: Error from server at https://127.0.0.1:35103/solr: Could not fully create collection: .system
   [junit4]    > 	at __randomizedtesting.SeedInfo.seed([3F6CA6603083910D:460AEDB39204C621]:0)
   [junit4]    > 	at org.apache.solr.client.solrj.impl.HttpSolrClient.executeMethod(HttpSolrClient.java:626)
   [junit4]    > 	at org.apache.solr.client.solrj.impl.HttpSolrClient.request(HttpSolrClient.java:253)
   [junit4]    > 	at org.apache.solr.client.solrj.impl.HttpSolrClient.request(HttpSolrClient.java:242)
   [junit4]    > 	at org.apache.solr.client.solrj.impl.LBHttpSolrClient.doRequest(LBHttpSolrClient.java:483)
   [junit4]    > 	at org.apache.solr.client.solrj.impl.LBHttpSolrClient.request(LBHttpSolrClient.java:413)
   [junit4]    > 	at org.apache.solr.client.solrj.impl.CloudSolrClient.sendRequest(CloudSolrClient.java:1096)
   [junit4]    > 	at org.apache.solr.client.solrj.impl.CloudSolrClient.requestWithRetryOnStaleState(CloudSolrClient.java:875)
   [junit4]    > 	at org.apache.solr.client.solrj.impl.CloudSolrClient.request(CloudSolrClient.java:808)
   [junit4]    > 	at org.apache.solr.client.solrj.SolrRequest.process(SolrRequest.java:178)
   [junit4]    > 	at org.apache.solr.client.solrj.SolrRequest.process(SolrRequest.java:195)
   [junit4]    > 	at org.apache.solr.cloud.CollectionStateFormat2Test.testConfNameAndCollectionNameSame(CollectionStateFormat2Test.java:40)
   [junit4]    > 	at java.lang.Thread.run(Thread.java:748)
   [junit4]   2> 1239216 INFO  (jetty-closer-671-thread-1) [    ] o.e.j.s.AbstractConnector Stopped ServerConnector@183e81d{SSL,[ssl, http/1.1]}{127.0.0.1:0}
   [junit4]   2> 1239216 INFO  (jetty-closer-671-thread-3) [    ] o.e.j.s.AbstractConnector Stopped ServerConnector@1838613{SSL,[ssl, http/1.1]}{127.0.0.1:0}
   [junit4]   2> 1239216 ERROR (OverseerThreadFactory-1879-thread-1-processing-n:127.0.0.1:42569_solr) [n:127.0.0.1:42569_solr    ] o.a.s.c.OverseerCollectionMessageHandler Error from shard: https://127.0.0.1:46275/solr
   [junit4]   2> org.apache.solr.client.solrj.SolrServerException: IOException occured when talking to server at: https://127.0.0.1:46275/solr
   [junit4]   2> 	at org.apache.solr.client.solrj.impl.HttpSolrClient.executeMethod(HttpSolrClient.java:640)
   [junit4]   2> 	at org.apache.solr.client.solrj.impl.HttpSolrClient.request(HttpSolrClient.java:253)
   [junit4]   2> 	at org.apache.solr.client.solrj.impl.HttpSolrClient.request(HttpSolrClient.java:242)
   [junit4]   2> 	at org.apache.solr.client.solrj.SolrClient.request(SolrClient.java:1219)

[...truncated too long message...]

hard_test s:c r:core_node6 x:deleteshard_test_c_replica_n3] o.a.s.m.SolrMetricManager Closing metric reporters for registry=solr.core.deleteshard_test.c.replica_n3, tag=21651750
   [junit4]   2> 2019996 INFO  (coreCloseExecutor-8261-thread-1) [n:127.0.0.1:37107_solr c:deleteshard_test s:c r:core_node6 x:deleteshard_test_c_replica_n3] o.a.s.m.r.SolrJmxReporter Closing reporter [org.apache.solr.metrics.reporters.SolrJmxReporter@f5e412: rootName = solr_37107, domain = solr.core.deleteshard_test.c.replica_n3, service url = null, agent id = null] for registry solr.core.deleteshard_test.c.replica_n3 / com.codahale.metrics.MetricRegistry@93b76d
   [junit4]   2> 2019996 INFO  (coreCloseExecutor-8261-thread-2) [n:127.0.0.1:37107_solr c:deleteShard s:shard2 r:core_node4 x:deleteShard_shard2_replica_n2] o.a.s.c.SolrCore [deleteShard_shard2_replica_n2]  CLOSING SolrCore org.apache.solr.core.SolrCore@e943df
   [junit4]   2> 2020001 INFO  (coreCloseExecutor-8260-thread-1) [n:127.0.0.1:34597_solr c:deleteShard s:shard1 r:core_node3 x:deleteShard_shard1_replica_n1] o.a.s.m.SolrMetricManager Closing metric reporters for registry=solr.collection.deleteShard.shard1.leader, tag=20179651
   [junit4]   2> 2020002 INFO  (jetty-closer-5108-thread-1) [    ] o.a.s.c.Overseer Overseer (id=98919319899668486-127.0.0.1:34597_solr-n_0000000000) closing
   [junit4]   2> 2020002 INFO  (OverseerStateUpdate-98919319899668486-127.0.0.1:34597_solr-n_0000000000) [n:127.0.0.1:34597_solr    ] o.a.s.c.Overseer Overseer Loop exiting : 127.0.0.1:34597_solr
   [junit4]   2> 2020002 WARN  (OverseerAutoScalingTriggerThread-98919319899668486-127.0.0.1:34597_solr-n_0000000000) [n:127.0.0.1:34597_solr    ] o.a.s.c.a.OverseerTriggerThread OverseerTriggerThread woken up but we are closed, exiting.
   [junit4]   2> 2020004 INFO  (jetty-closer-5108-thread-1) [    ] o.e.j.s.h.ContextHandler Stopped o.e.j.s.ServletContextHandler@1f5f9da{/solr,null,UNAVAILABLE}
   [junit4]   2> 2020005 INFO  (zkCallback-5118-thread-1-processing-n:127.0.0.1:37107_solr) [n:127.0.0.1:37107_solr    ] o.a.s.c.OverseerElectionContext I am going to be the leader 127.0.0.1:37107_solr
   [junit4]   2> 2020011 INFO  (coreCloseExecutor-8261-thread-1) [n:127.0.0.1:37107_solr c:deleteshard_test s:c r:core_node6 x:deleteshard_test_c_replica_n3] o.a.s.m.SolrMetricManager Closing metric reporters for registry=solr.collection.deleteshard_test.c.leader, tag=21651750
   [junit4]   2> 2020011 INFO  (coreCloseExecutor-8261-thread-2) [n:127.0.0.1:37107_solr c:deleteShard s:shard2 r:core_node4 x:deleteShard_shard2_replica_n2] o.a.s.m.SolrMetricManager Closing metric reporters for registry=solr.core.deleteShard.shard2.replica_n2, tag=15287263
   [junit4]   2> 2020011 INFO  (coreCloseExecutor-8261-thread-2) [n:127.0.0.1:37107_solr c:deleteShard s:shard2 r:core_node4 x:deleteShard_shard2_replica_n2] o.a.s.m.r.SolrJmxReporter Closing reporter [org.apache.solr.metrics.reporters.SolrJmxReporter@247a5e: rootName = solr_37107, domain = solr.core.deleteShard.shard2.replica_n2, service url = null, agent id = null] for registry solr.core.deleteShard.shard2.replica_n2 / com.codahale.metrics.MetricRegistry@121d325
   [junit4]   2> 2020021 INFO  (coreCloseExecutor-8261-thread-2) [n:127.0.0.1:37107_solr c:deleteShard s:shard2 r:core_node4 x:deleteShard_shard2_replica_n2] o.a.s.m.SolrMetricManager Closing metric reporters for registry=solr.collection.deleteShard.shard2.leader, tag=15287263
   [junit4]   2> 2020022 INFO  (jetty-closer-5108-thread-2) [    ] o.e.j.s.h.ContextHandler Stopped o.e.j.s.ServletContextHandler@54a785{/solr,null,UNAVAILABLE}
   [junit4]   2> 2020022 ERROR (SUITE-DeleteShardTest-seed#[3F6CA6603083910D]-worker) [    ] o.a.z.s.ZooKeeperServer ZKShutdownHandler is not registered, so ZooKeeper server won't take any action on ERROR or SHUTDOWN server state changes
   [junit4]   2> 2020023 INFO  (SUITE-DeleteShardTest-seed#[3F6CA6603083910D]-worker) [    ] o.a.s.c.ZkTestServer connecting to 127.0.0.1:39417 39417
   [junit4]   2> 2025997 INFO  (Thread-3623) [    ] o.a.s.c.ZkTestServer connecting to 127.0.0.1:39417 39417
   [junit4]   2> 2025999 WARN  (Thread-3623) [    ] o.a.s.c.ZkTestServer Watch limit violations: 
   [junit4]   2> Maximum concurrent create/delete watches above limit:
   [junit4]   2> 
   [junit4]   2> 	3	/solr/aliases.json
   [junit4]   2> 	3	/solr/configs/conf
   [junit4]   2> 	2	/solr/security.json
   [junit4]   2> 
   [junit4]   2> Maximum concurrent data watches above limit:
   [junit4]   2> 
   [junit4]   2> 	18	/solr/collections/deleteshard_test/state.json
   [junit4]   2> 	13	/solr/collections/deleteShard/state.json
   [junit4]   2> 	3	/solr/clusterstate.json
   [junit4]   2> 	3	/solr/clusterprops.json
   [junit4]   2> 
   [junit4]   2> Maximum concurrent children watches above limit:
   [junit4]   2> 
   [junit4]   2> 	3	/solr/live_nodes
   [junit4]   2> 	3	/solr/collections
   [junit4]   2> 
   [junit4]   2> NOTE: leaving temporary files on disk at: /home/jenkins/workspace/Lucene-Solr-7.x-Linux/solr/build/solr-core/test/J1/temp/solr.cloud.DeleteShardTest_3F6CA6603083910D-001
   [junit4]   2> NOTE: test params are: codec=Asserting(Lucene70): {}, docValues:{}, maxPointsInLeafNode=414, maxMBSortInHeap=5.977430030924053, sim=RandomSimilarity(queryNorm=false): {}, locale=sr-CS, timezone=Atlantic/Stanley
   [junit4]   2> NOTE: Linux 4.10.0-37-generic i386/Oracle Corporation 1.8.0_144 (32-bit)/cpus=8,threads=1,free=49744264,total=523501568
   [junit4]   2> NOTE: All tests run in this JVM: [MoveReplicaHDFSTest, PathHierarchyTokenizerFactoryTest, NumericFieldsTest, VMParamsZkACLAndCredentialsProvidersTest, TestCloudDeleteByQuery, CollectionsAPIDistributedZkTest, TestSortByMinMaxFunction, DistributedDebugComponentTest, UUIDUpdateProcessorFallbackTest, MoreLikeThisHandlerTest, TestConfigSetsAPIZkFailure, CloudExitableDirectoryReaderTest, SolrRequestParserTest, TestInfoStreamLogging, AssignTest, ShardRoutingTest, TestHighFrequencyDictionaryFactory, TestNumericRangeQuery64, TermVectorComponentDistributedTest, ConcurrentDeleteAndCreateCollectionTest, TestCloudNestedDocsSort, TestSerializedLuceneMatchVersion, TestPKIAuthenticationPlugin, LukeRequestHandlerTest, TestStressLucene, SchemaVersionSpecificBehaviorTest, SolrJmxReporterTest, ZkSolrClientTest, HLLSerializationTest, TestManagedSynonymFilterFactory, HdfsUnloadDistributedZkTest, TestCollationField, TestStressLiveNodes, AddSchemaFieldsUpdateProcessorFactoryTest, TestSolrConfigHandlerConcurrent, TestDocumentBuilder, ChaosMonkeySafeLeaderTest, TestSolr4Spatial2, TestJsonFacets, TestSolrCLIRunExample, DistributedFacetPivotLargeTest, TestInitQParser, HighlighterConfigTest, BufferStoreTest, PingRequestHandlerTest, TestQueryWrapperFilter, RequestHandlersTest, OverseerStatusTest, ExitableDirectoryReaderTest, DocValuesMultiTest, DeleteLastCustomShardedReplicaTest, TestBinaryResponseWriter, ExecutePlanActionTest, TestClusterStateMutator, TestCloudSchemaless, CloneFieldUpdateProcessorFactoryTest, SolrMetricManagerTest, TestSchemaResource, TestMacros, BlockJoinFacetRandomTest, JvmMetricsTest, TestSubQueryTransformer, BooleanFieldTest, SuggesterTSTTest, MBeansHandlerTest, NotRequiredUniqueKeyTest, HttpPartitionTest, TestCustomStream, CoreAdminRequestStatusTest, PreAnalyzedFieldTest, TestFaceting, HdfsSyncSliceTest, TestSkipOverseerOperations, DistributedIntervalFacetingTest, TestExactStatsCache, TestInPlaceUpdatesStandalone, NodeAddedTriggerTest, MetricsHandlerTest, BadIndexSchemaTest, DistributedVersionInfoTest, RecoveryAfterSoftCommitTest, TestLeaderInitiatedRecoveryThread, TestCollectionsAPIViaSolrCloudCluster, TestWriterPerf, DebugComponentTest, OpenExchangeRatesOrgProviderTest, SimpleMLTQParserTest, DocumentAnalysisRequestHandlerTest, HighlighterMaxOffsetTest, ConvertedLegacyTest, MergeStrategyTest, ReplicationFactorTest, TestRequestForwarding, DirectUpdateHandlerTest, TestSimpleTrackingShardHandler, DistributedTermsComponentTest, InfixSuggestersTest, TestSolrConfigHandler, TestFastWriter, ConjunctionSolrSpellCheckerTest, TestSolrCoreSnapshots, TestJettySolrRunner, TestBM25SimilarityFactory, TestQuerySenderNoQuery, TestLegacyField, TestRetrieveFieldsOptimizer, TestDistribDocBasedVersion, TestRandomRequestDistribution, TestMiniSolrCloudClusterSSL, TestAnalyzedSuggestions, TestXmlQParser, TestSegmentSorting, TestPseudoReturnFields, MetricUtilsTest, CircularListTest, TestSolrQueryParser, TestSearcherReuse, TestUseDocValuesAsStored, TemplateUpdateProcessorTest, TestIntervalFaceting, ZkCLITest, TestRandomDVFaceting, ShardRoutingCustomTest, TestRecovery, TestReload, TestRangeQuery, SolrCmdDistributorTest, PeerSyncTest, TestLazyCores, SolrIndexSplitterTest, TestExtendedDismaxParser, SuggesterFSTTest, CoreAdminHandlerTest, PolyFieldTest, TestUpdate, TestAtomicUpdateErrorCases, DirectUpdateHandlerOptimizeTest, StatelessScriptUpdateProcessorFactoryTest, CacheHeaderTest, TestSurroundQueryParser, TestReversedWildcardFilterFactory, FileBasedSpellCheckerTest, DocumentBuilderTest, TermVectorComponentTest, IndexSchemaRuntimeFieldTest, RegexBoostProcessorTest, TestJmxIntegration, QueryParsingTest, BinaryUpdateRequestHandlerTest, TestComponentsName, TestLFUCache, TestSystemIdResolver, PrimUtilsTest, DateFieldTest, SpellingQueryConverterTest, DOMUtilTest, RAMDirectoryFactoryTest, TestSolrJ, TestLRUCache, ZkNodePropsTest, SliceStateTest, SystemInfoHandlerTest, DistributedMLTComponentTest, TestRTGBase, CursorPagingTest, TestCursorMarkWithoutUniqueKey, TestDistributedMissingSort, TestTolerantSearch, TestLuceneIndexBackCompat, TestEmbeddedSolrServerAdminHandler, TestEmbeddedSolrServerSchemaAPI, AddReplicaTest, AssignBackwardCompatibilityTest, CdcrRequestHandlerTest, ChaosMonkeySafeLeaderWithPullReplicasTest, CleanupOldIndexTest, CollectionTooManyReplicasTest, CollectionsAPIAsyncDistributedZkTest, CollectionsAPISolrJTest, DeleteNodeTest, DeleteShardTest]
   [junit4] Completed [484/745 (3!)] on J1 in 13.20s, 2 tests, 1 error <<< FAILURES!

[...truncated 43928 lines...]

Mime
View raw message