lucene-dev mailing list archives

Site index · List index
Message view « Date » · « Thread »
Top « Date » · « Thread »
From Policeman Jenkins Server <jenk...@thetaphi.de>
Subject [JENKINS] Lucene-Solr-7.x-MacOSX (64bit/jdk-9) - Build # 257 - Still Unstable!
Date Fri, 20 Oct 2017 15:09:38 GMT
Build: https://jenkins.thetaphi.de/job/Lucene-Solr-7.x-MacOSX/257/
Java: 64bit/jdk-9 -XX:+UseCompressedOops -XX:+UseConcMarkSweepGC --illegal-access=deny

2 tests failed.
FAILED:  org.apache.solr.cloud.ShardSplitTest.testSplitAfterFailedSplit

Error Message:
expected:<1> but was:<2>

Stack Trace:
java.lang.AssertionError: expected:<1> but was:<2>
	at __randomizedtesting.SeedInfo.seed([3C79BDD2D611A463:C5342E7DEA64E9E9]:0)
	at org.junit.Assert.fail(Assert.java:93)
	at org.junit.Assert.failNotEquals(Assert.java:647)
	at org.junit.Assert.assertEquals(Assert.java:128)
	at org.junit.Assert.assertEquals(Assert.java:472)
	at org.junit.Assert.assertEquals(Assert.java:456)
	at org.apache.solr.cloud.ShardSplitTest.testSplitAfterFailedSplit(ShardSplitTest.java:279)
	at java.base/jdk.internal.reflect.NativeMethodAccessorImpl.invoke0(Native Method)
	at java.base/jdk.internal.reflect.NativeMethodAccessorImpl.invoke(NativeMethodAccessorImpl.java:62)
	at java.base/jdk.internal.reflect.DelegatingMethodAccessorImpl.invoke(DelegatingMethodAccessorImpl.java:43)
	at java.base/java.lang.reflect.Method.invoke(Method.java:564)
	at com.carrotsearch.randomizedtesting.RandomizedRunner.invoke(RandomizedRunner.java:1737)
	at com.carrotsearch.randomizedtesting.RandomizedRunner$8.evaluate(RandomizedRunner.java:934)
	at com.carrotsearch.randomizedtesting.RandomizedRunner$9.evaluate(RandomizedRunner.java:970)
	at com.carrotsearch.randomizedtesting.RandomizedRunner$10.evaluate(RandomizedRunner.java:984)
	at org.apache.solr.BaseDistributedSearchTestCase$ShardsRepeatRule$ShardsFixedStatement.callStatement(BaseDistributedSearchTestCase.java:993)
	at org.apache.solr.BaseDistributedSearchTestCase$ShardsRepeatRule$ShardsStatement.evaluate(BaseDistributedSearchTestCase.java:968)
	at com.carrotsearch.randomizedtesting.rules.SystemPropertiesRestoreRule$1.evaluate(SystemPropertiesRestoreRule.java:57)
	at org.apache.lucene.util.TestRuleSetupTeardownChained$1.evaluate(TestRuleSetupTeardownChained.java:49)
	at org.apache.lucene.util.AbstractBeforeAfterRule$1.evaluate(AbstractBeforeAfterRule.java:45)
	at org.apache.lucene.util.TestRuleThreadAndTestName$1.evaluate(TestRuleThreadAndTestName.java:48)
	at org.apache.lucene.util.TestRuleIgnoreAfterMaxFailures$1.evaluate(TestRuleIgnoreAfterMaxFailures.java:64)
	at org.apache.lucene.util.TestRuleMarkFailure$1.evaluate(TestRuleMarkFailure.java:47)
	at com.carrotsearch.randomizedtesting.rules.StatementAdapter.evaluate(StatementAdapter.java:36)
	at com.carrotsearch.randomizedtesting.ThreadLeakControl$StatementRunner.run(ThreadLeakControl.java:368)
	at com.carrotsearch.randomizedtesting.ThreadLeakControl.forkTimeoutingTask(ThreadLeakControl.java:817)
	at com.carrotsearch.randomizedtesting.ThreadLeakControl$3.evaluate(ThreadLeakControl.java:468)
	at com.carrotsearch.randomizedtesting.RandomizedRunner.runSingleTest(RandomizedRunner.java:943)
	at com.carrotsearch.randomizedtesting.RandomizedRunner$5.evaluate(RandomizedRunner.java:829)
	at com.carrotsearch.randomizedtesting.RandomizedRunner$6.evaluate(RandomizedRunner.java:879)
	at com.carrotsearch.randomizedtesting.RandomizedRunner$7.evaluate(RandomizedRunner.java:890)
	at com.carrotsearch.randomizedtesting.rules.StatementAdapter.evaluate(StatementAdapter.java:36)
	at com.carrotsearch.randomizedtesting.rules.SystemPropertiesRestoreRule$1.evaluate(SystemPropertiesRestoreRule.java:57)
	at org.apache.lucene.util.AbstractBeforeAfterRule$1.evaluate(AbstractBeforeAfterRule.java:45)
	at com.carrotsearch.randomizedtesting.rules.StatementAdapter.evaluate(StatementAdapter.java:36)
	at org.apache.lucene.util.TestRuleStoreClassName$1.evaluate(TestRuleStoreClassName.java:41)
	at com.carrotsearch.randomizedtesting.rules.NoShadowingOrOverridesOnMethodsRule$1.evaluate(NoShadowingOrOverridesOnMethodsRule.java:40)
	at com.carrotsearch.randomizedtesting.rules.NoShadowingOrOverridesOnMethodsRule$1.evaluate(NoShadowingOrOverridesOnMethodsRule.java:40)
	at com.carrotsearch.randomizedtesting.rules.StatementAdapter.evaluate(StatementAdapter.java:36)
	at com.carrotsearch.randomizedtesting.rules.StatementAdapter.evaluate(StatementAdapter.java:36)
	at org.apache.lucene.util.TestRuleAssertionsRequired$1.evaluate(TestRuleAssertionsRequired.java:53)
	at org.apache.lucene.util.TestRuleMarkFailure$1.evaluate(TestRuleMarkFailure.java:47)
	at org.apache.lucene.util.TestRuleIgnoreAfterMaxFailures$1.evaluate(TestRuleIgnoreAfterMaxFailures.java:64)
	at org.apache.lucene.util.TestRuleIgnoreTestSuites$1.evaluate(TestRuleIgnoreTestSuites.java:54)
	at com.carrotsearch.randomizedtesting.rules.StatementAdapter.evaluate(StatementAdapter.java:36)
	at com.carrotsearch.randomizedtesting.ThreadLeakControl$StatementRunner.run(ThreadLeakControl.java:368)
	at java.base/java.lang.Thread.run(Thread.java:844)


FAILED:  org.apache.solr.handler.TestReplicationHandler.doTestIndexAndConfigReplication

Error Message:
Index 0 out-of-bounds for length 0

Stack Trace:
java.lang.IndexOutOfBoundsException: Index 0 out-of-bounds for length 0
	at __randomizedtesting.SeedInfo.seed([3C79BDD2D611A463:2831E687F516197D]:0)
	at java.base/jdk.internal.util.Preconditions.outOfBounds(Preconditions.java:64)
	at java.base/jdk.internal.util.Preconditions.outOfBoundsCheckIndex(Preconditions.java:70)
	at java.base/jdk.internal.util.Preconditions.checkIndex(Preconditions.java:248)
	at java.base/java.util.Objects.checkIndex(Objects.java:372)
	at java.base/java.util.ArrayList.get(ArrayList.java:439)
	at org.apache.solr.handler.TestReplicationHandler.doTestIndexAndConfigReplication(TestReplicationHandler.java:561)
	at java.base/jdk.internal.reflect.NativeMethodAccessorImpl.invoke0(Native Method)
	at java.base/jdk.internal.reflect.NativeMethodAccessorImpl.invoke(NativeMethodAccessorImpl.java:62)
	at java.base/jdk.internal.reflect.DelegatingMethodAccessorImpl.invoke(DelegatingMethodAccessorImpl.java:43)
	at java.base/java.lang.reflect.Method.invoke(Method.java:564)
	at com.carrotsearch.randomizedtesting.RandomizedRunner.invoke(RandomizedRunner.java:1737)
	at com.carrotsearch.randomizedtesting.RandomizedRunner$8.evaluate(RandomizedRunner.java:934)
	at com.carrotsearch.randomizedtesting.RandomizedRunner$9.evaluate(RandomizedRunner.java:970)
	at com.carrotsearch.randomizedtesting.RandomizedRunner$10.evaluate(RandomizedRunner.java:984)
	at com.carrotsearch.randomizedtesting.rules.SystemPropertiesRestoreRule$1.evaluate(SystemPropertiesRestoreRule.java:57)
	at org.apache.lucene.util.TestRuleSetupTeardownChained$1.evaluate(TestRuleSetupTeardownChained.java:49)
	at org.apache.lucene.util.AbstractBeforeAfterRule$1.evaluate(AbstractBeforeAfterRule.java:45)
	at org.apache.lucene.util.TestRuleThreadAndTestName$1.evaluate(TestRuleThreadAndTestName.java:48)
	at org.apache.lucene.util.TestRuleIgnoreAfterMaxFailures$1.evaluate(TestRuleIgnoreAfterMaxFailures.java:64)
	at org.apache.lucene.util.TestRuleMarkFailure$1.evaluate(TestRuleMarkFailure.java:47)
	at com.carrotsearch.randomizedtesting.rules.StatementAdapter.evaluate(StatementAdapter.java:36)
	at com.carrotsearch.randomizedtesting.ThreadLeakControl$StatementRunner.run(ThreadLeakControl.java:368)
	at com.carrotsearch.randomizedtesting.ThreadLeakControl.forkTimeoutingTask(ThreadLeakControl.java:817)
	at com.carrotsearch.randomizedtesting.ThreadLeakControl$3.evaluate(ThreadLeakControl.java:468)
	at com.carrotsearch.randomizedtesting.RandomizedRunner.runSingleTest(RandomizedRunner.java:943)
	at com.carrotsearch.randomizedtesting.RandomizedRunner$5.evaluate(RandomizedRunner.java:829)
	at com.carrotsearch.randomizedtesting.RandomizedRunner$6.evaluate(RandomizedRunner.java:879)
	at com.carrotsearch.randomizedtesting.RandomizedRunner$7.evaluate(RandomizedRunner.java:890)
	at com.carrotsearch.randomizedtesting.rules.StatementAdapter.evaluate(StatementAdapter.java:36)
	at com.carrotsearch.randomizedtesting.rules.SystemPropertiesRestoreRule$1.evaluate(SystemPropertiesRestoreRule.java:57)
	at org.apache.lucene.util.AbstractBeforeAfterRule$1.evaluate(AbstractBeforeAfterRule.java:45)
	at com.carrotsearch.randomizedtesting.rules.StatementAdapter.evaluate(StatementAdapter.java:36)
	at org.apache.lucene.util.TestRuleStoreClassName$1.evaluate(TestRuleStoreClassName.java:41)
	at com.carrotsearch.randomizedtesting.rules.NoShadowingOrOverridesOnMethodsRule$1.evaluate(NoShadowingOrOverridesOnMethodsRule.java:40)
	at com.carrotsearch.randomizedtesting.rules.NoShadowingOrOverridesOnMethodsRule$1.evaluate(NoShadowingOrOverridesOnMethodsRule.java:40)
	at com.carrotsearch.randomizedtesting.rules.StatementAdapter.evaluate(StatementAdapter.java:36)
	at com.carrotsearch.randomizedtesting.rules.StatementAdapter.evaluate(StatementAdapter.java:36)
	at org.apache.lucene.util.TestRuleAssertionsRequired$1.evaluate(TestRuleAssertionsRequired.java:53)
	at org.apache.lucene.util.TestRuleMarkFailure$1.evaluate(TestRuleMarkFailure.java:47)
	at org.apache.lucene.util.TestRuleIgnoreAfterMaxFailures$1.evaluate(TestRuleIgnoreAfterMaxFailures.java:64)
	at org.apache.lucene.util.TestRuleIgnoreTestSuites$1.evaluate(TestRuleIgnoreTestSuites.java:54)
	at com.carrotsearch.randomizedtesting.rules.StatementAdapter.evaluate(StatementAdapter.java:36)
	at com.carrotsearch.randomizedtesting.ThreadLeakControl$StatementRunner.run(ThreadLeakControl.java:368)
	at java.base/java.lang.Thread.run(Thread.java:844)




Build Log:
[...truncated 1720 lines...]
   [junit4] JVM J0: stderr was not empty, see: /Users/jenkins/workspace/Lucene-Solr-7.x-MacOSX/lucene/build/core/test/temp/junit4-J0-20171020_133646_10717529629774601926996.syserr
   [junit4] >>> JVM J0 emitted unexpected output (verbatim) ----
   [junit4] Java HotSpot(TM) 64-Bit Server VM warning: Option UseConcMarkSweepGC was deprecated in version 9.0 and will likely be removed in a future release.
   [junit4] <<< JVM J0: EOF ----

[...truncated 3 lines...]
   [junit4] JVM J1: stderr was not empty, see: /Users/jenkins/workspace/Lucene-Solr-7.x-MacOSX/lucene/build/core/test/temp/junit4-J1-20171020_133646_1072817899855316049306.syserr
   [junit4] >>> JVM J1 emitted unexpected output (verbatim) ----
   [junit4] Java HotSpot(TM) 64-Bit Server VM warning: Option UseConcMarkSweepGC was deprecated in version 9.0 and will likely be removed in a future release.
   [junit4] <<< JVM J1: EOF ----

[...truncated 288 lines...]
   [junit4] JVM J1: stderr was not empty, see: /Users/jenkins/workspace/Lucene-Solr-7.x-MacOSX/lucene/build/test-framework/test/temp/junit4-J1-20171020_134458_3127800329948950715786.syserr
   [junit4] >>> JVM J1 emitted unexpected output (verbatim) ----
   [junit4] Java HotSpot(TM) 64-Bit Server VM warning: Option UseConcMarkSweepGC was deprecated in version 9.0 and will likely be removed in a future release.
   [junit4] <<< JVM J1: EOF ----

[...truncated 3 lines...]
   [junit4] JVM J0: stderr was not empty, see: /Users/jenkins/workspace/Lucene-Solr-7.x-MacOSX/lucene/build/test-framework/test/temp/junit4-J0-20171020_134458_31212025481294575444605.syserr
   [junit4] >>> JVM J0 emitted unexpected output (verbatim) ----
   [junit4] Java HotSpot(TM) 64-Bit Server VM warning: Option UseConcMarkSweepGC was deprecated in version 9.0 and will likely be removed in a future release.
   [junit4] <<< JVM J0: EOF ----

[...truncated 1030 lines...]
   [junit4] JVM J1: stderr was not empty, see: /Users/jenkins/workspace/Lucene-Solr-7.x-MacOSX/lucene/build/analysis/common/test/temp/junit4-J1-20171020_134627_96911617417794988246530.syserr
   [junit4] >>> JVM J1 emitted unexpected output (verbatim) ----
   [junit4] Java HotSpot(TM) 64-Bit Server VM warning: Option UseConcMarkSweepGC was deprecated in version 9.0 and will likely be removed in a future release.
   [junit4] <<< JVM J1: EOF ----

[...truncated 27 lines...]
   [junit4] JVM J0: stderr was not empty, see: /Users/jenkins/workspace/Lucene-Solr-7.x-MacOSX/lucene/build/analysis/common/test/temp/junit4-J0-20171020_134627_96910407418942527207880.syserr
   [junit4] >>> JVM J0 emitted unexpected output (verbatim) ----
   [junit4] Java HotSpot(TM) 64-Bit Server VM warning: Option UseConcMarkSweepGC was deprecated in version 9.0 and will likely be removed in a future release.
   [junit4] <<< JVM J0: EOF ----

[...truncated 226 lines...]
   [junit4] JVM J1: stderr was not empty, see: /Users/jenkins/workspace/Lucene-Solr-7.x-MacOSX/lucene/build/analysis/icu/test/temp/junit4-J1-20171020_134939_5162495341506318855971.syserr
   [junit4] >>> JVM J1 emitted unexpected output (verbatim) ----
   [junit4] Java HotSpot(TM) 64-Bit Server VM warning: Option UseConcMarkSweepGC was deprecated in version 9.0 and will likely be removed in a future release.
   [junit4] <<< JVM J1: EOF ----

[...truncated 3 lines...]
   [junit4] JVM J0: stderr was not empty, see: /Users/jenkins/workspace/Lucene-Solr-7.x-MacOSX/lucene/build/analysis/icu/test/temp/junit4-J0-20171020_134939_51618411155718585700015.syserr
   [junit4] >>> JVM J0 emitted unexpected output (verbatim) ----
   [junit4] Java HotSpot(TM) 64-Bit Server VM warning: Option UseConcMarkSweepGC was deprecated in version 9.0 and will likely be removed in a future release.
   [junit4] <<< JVM J0: EOF ----

[...truncated 246 lines...]
   [junit4] JVM J0: stderr was not empty, see: /Users/jenkins/workspace/Lucene-Solr-7.x-MacOSX/lucene/build/analysis/kuromoji/test/temp/junit4-J0-20171020_135001_69818155133176184425028.syserr
   [junit4] >>> JVM J0 emitted unexpected output (verbatim) ----
   [junit4] Java HotSpot(TM) 64-Bit Server VM warning: Option UseConcMarkSweepGC was deprecated in version 9.0 and will likely be removed in a future release.
   [junit4] <<< JVM J0: EOF ----

[...truncated 6 lines...]
   [junit4] JVM J1: stderr was not empty, see: /Users/jenkins/workspace/Lucene-Solr-7.x-MacOSX/lucene/build/analysis/kuromoji/test/temp/junit4-J1-20171020_135001_6988155131901402343811.syserr
   [junit4] >>> JVM J1 emitted unexpected output (verbatim) ----
   [junit4] Java HotSpot(TM) 64-Bit Server VM warning: Option UseConcMarkSweepGC was deprecated in version 9.0 and will likely be removed in a future release.
   [junit4] <<< JVM J1: EOF ----

[...truncated 154 lines...]
   [junit4] JVM J1: stderr was not empty, see: /Users/jenkins/workspace/Lucene-Solr-7.x-MacOSX/lucene/build/analysis/morfologik/test/temp/junit4-J1-20171020_135047_93515611277045265534722.syserr
   [junit4] >>> JVM J1 emitted unexpected output (verbatim) ----
   [junit4] Java HotSpot(TM) 64-Bit Server VM warning: Option UseConcMarkSweepGC was deprecated in version 9.0 and will likely be removed in a future release.
   [junit4] <<< JVM J1: EOF ----

[...truncated 3 lines...]
   [junit4] JVM J0: stderr was not empty, see: /Users/jenkins/workspace/Lucene-Solr-7.x-MacOSX/lucene/build/analysis/morfologik/test/temp/junit4-J0-20171020_135047_9354433588232145318044.syserr
   [junit4] >>> JVM J0 emitted unexpected output (verbatim) ----
   [junit4] Java HotSpot(TM) 64-Bit Server VM warning: Option UseConcMarkSweepGC was deprecated in version 9.0 and will likely be removed in a future release.
   [junit4] <<< JVM J0: EOF ----

[...truncated 166 lines...]
   [junit4] JVM J0: stderr was not empty, see: /Users/jenkins/workspace/Lucene-Solr-7.x-MacOSX/lucene/build/analysis/phonetic/test/temp/junit4-J0-20171020_135052_9877162920690839092409.syserr
   [junit4] >>> JVM J0 emitted unexpected output (verbatim) ----
   [junit4] Java HotSpot(TM) 64-Bit Server VM warning: Option UseConcMarkSweepGC was deprecated in version 9.0 and will likely be removed in a future release.
   [junit4] <<< JVM J0: EOF ----

[...truncated 3 lines...]
   [junit4] JVM J1: stderr was not empty, see: /Users/jenkins/workspace/Lucene-Solr-7.x-MacOSX/lucene/build/analysis/phonetic/test/temp/junit4-J1-20171020_135052_98716230259099056202863.syserr
   [junit4] >>> JVM J1 emitted unexpected output (verbatim) ----
   [junit4] Java HotSpot(TM) 64-Bit Server VM warning: Option UseConcMarkSweepGC was deprecated in version 9.0 and will likely be removed in a future release.
   [junit4] <<< JVM J1: EOF ----

[...truncated 151 lines...]
   [junit4] JVM J0: stderr was not empty, see: /Users/jenkins/workspace/Lucene-Solr-7.x-MacOSX/lucene/build/analysis/smartcn/test/temp/junit4-J0-20171020_135105_83715419536117375974295.syserr
   [junit4] >>> JVM J0 emitted unexpected output (verbatim) ----
   [junit4] Java HotSpot(TM) 64-Bit Server VM warning: Option UseConcMarkSweepGC was deprecated in version 9.0 and will likely be removed in a future release.
   [junit4] <<< JVM J0: EOF ----

[...truncated 3 lines...]
   [junit4] JVM J1: stderr was not empty, see: /Users/jenkins/workspace/Lucene-Solr-7.x-MacOSX/lucene/build/analysis/smartcn/test/temp/junit4-J1-20171020_135105_8375838516348684934621.syserr
   [junit4] >>> JVM J1 emitted unexpected output (verbatim) ----
   [junit4] Java HotSpot(TM) 64-Bit Server VM warning: Option UseConcMarkSweepGC was deprecated in version 9.0 and will likely be removed in a future release.
   [junit4] <<< JVM J1: EOF ----

[...truncated 159 lines...]
   [junit4] JVM J1: stderr was not empty, see: /Users/jenkins/workspace/Lucene-Solr-7.x-MacOSX/lucene/build/analysis/stempel/test/temp/junit4-J1-20171020_135113_9365899706539600680176.syserr
   [junit4] >>> JVM J1 emitted unexpected output (verbatim) ----
   [junit4] Java HotSpot(TM) 64-Bit Server VM warning: Option UseConcMarkSweepGC was deprecated in version 9.0 and will likely be removed in a future release.
   [junit4] <<< JVM J1: EOF ----

   [junit4] JVM J0: stderr was not empty, see: /Users/jenkins/workspace/Lucene-Solr-7.x-MacOSX/lucene/build/analysis/stempel/test/temp/junit4-J0-20171020_135113_93617046480342080730725.syserr
   [junit4] >>> JVM J0 emitted unexpected output (verbatim) ----
   [junit4] Java HotSpot(TM) 64-Bit Server VM warning: Option UseConcMarkSweepGC was deprecated in version 9.0 and will likely be removed in a future release.
   [junit4] <<< JVM J0: EOF ----

[...truncated 167 lines...]
   [junit4] JVM J0: stderr was not empty, see: /Users/jenkins/workspace/Lucene-Solr-7.x-MacOSX/lucene/build/analysis/uima/test/temp/junit4-J0-20171020_135117_37311534029467026362909.syserr
   [junit4] >>> JVM J0 emitted unexpected output (verbatim) ----
   [junit4] Java HotSpot(TM) 64-Bit Server VM warning: Option UseConcMarkSweepGC was deprecated in version 9.0 and will likely be removed in a future release.
   [junit4] <<< JVM J0: EOF ----

[...truncated 189 lines...]
   [junit4] JVM J1: stderr was not empty, see: /Users/jenkins/workspace/Lucene-Solr-7.x-MacOSX/lucene/build/backward-codecs/test/temp/junit4-J1-20171020_135130_30217877656771241220463.syserr
   [junit4] >>> JVM J1 emitted unexpected output (verbatim) ----
   [junit4] Java HotSpot(TM) 64-Bit Server VM warning: Option UseConcMarkSweepGC was deprecated in version 9.0 and will likely be removed in a future release.
   [junit4] <<< JVM J1: EOF ----

[...truncated 33 lines...]
   [junit4] JVM J0: stderr was not empty, see: /Users/jenkins/workspace/Lucene-Solr-7.x-MacOSX/lucene/build/backward-codecs/test/temp/junit4-J0-20171020_135130_3027244708906802177515.syserr
   [junit4] >>> JVM J0 emitted unexpected output (verbatim) ----
   [junit4] Java HotSpot(TM) 64-Bit Server VM warning: Option UseConcMarkSweepGC was deprecated in version 9.0 and will likely be removed in a future release.
   [junit4] <<< JVM J0: EOF ----

[...truncated 1270 lines...]
   [junit4] JVM J1: stderr was not empty, see: /Users/jenkins/workspace/Lucene-Solr-7.x-MacOSX/lucene/build/benchmark/test/temp/junit4-J1-20171020_135257_0905453494763897464152.syserr
   [junit4] >>> JVM J1 emitted unexpected output (verbatim) ----
   [junit4] Java HotSpot(TM) 64-Bit Server VM warning: Option UseConcMarkSweepGC was deprecated in version 9.0 and will likely be removed in a future release.
   [junit4] <<< JVM J1: EOF ----

   [junit4] JVM J0: stderr was not empty, see: /Users/jenkins/workspace/Lucene-Solr-7.x-MacOSX/lucene/build/benchmark/test/temp/junit4-J0-20171020_135257_090770375728598234014.syserr
   [junit4] >>> JVM J0 emitted unexpected output (verbatim) ----
   [junit4] Java HotSpot(TM) 64-Bit Server VM warning: Option UseConcMarkSweepGC was deprecated in version 9.0 and will likely be removed in a future release.
   [junit4] <<< JVM J0: EOF ----

[...truncated 231 lines...]
   [junit4] JVM J0: stderr was not empty, see: /Users/jenkins/workspace/Lucene-Solr-7.x-MacOSX/lucene/build/classification/test/temp/junit4-J0-20171020_135307_9314909746456814582434.syserr
   [junit4] >>> JVM J0 emitted unexpected output (verbatim) ----
   [junit4] Java HotSpot(TM) 64-Bit Server VM warning: Option UseConcMarkSweepGC was deprecated in version 9.0 and will likely be removed in a future release.
   [junit4] <<< JVM J0: EOF ----

[...truncated 3 lines...]
   [junit4] JVM J1: stderr was not empty, see: /Users/jenkins/workspace/Lucene-Solr-7.x-MacOSX/lucene/build/classification/test/temp/junit4-J1-20171020_135307_93111781107769625697449.syserr
   [junit4] >>> JVM J1 emitted unexpected output (verbatim) ----
   [junit4] Java HotSpot(TM) 64-Bit Server VM warning: Option UseConcMarkSweepGC was deprecated in version 9.0 and will likely be removed in a future release.
   [junit4] <<< JVM J1: EOF ----

[...truncated 259 lines...]
   [junit4] JVM J1: stderr was not empty, see: /Users/jenkins/workspace/Lucene-Solr-7.x-MacOSX/lucene/build/codecs/test/temp/junit4-J1-20171020_135325_0346464668979702355789.syserr
   [junit4] >>> JVM J1 emitted unexpected output (verbatim) ----
   [junit4] Java HotSpot(TM) 64-Bit Server VM warning: Option UseConcMarkSweepGC was deprecated in version 9.0 and will likely be removed in a future release.
   [junit4] <<< JVM J1: EOF ----

[...truncated 3 lines...]
   [junit4] JVM J0: stderr was not empty, see: /Users/jenkins/workspace/Lucene-Solr-7.x-MacOSX/lucene/build/codecs/test/temp/junit4-J0-20171020_135325_0341276998816631004380.syserr
   [junit4] >>> JVM J0 emitted unexpected output (verbatim) ----
   [junit4] Java HotSpot(TM) 64-Bit Server VM warning: Option UseConcMarkSweepGC was deprecated in version 9.0 and will likely be removed in a future release.
   [junit4] <<< JVM J0: EOF ----

[...truncated 240 lines...]
   [junit4] JVM J0: stderr was not empty, see: /Users/jenkins/workspace/Lucene-Solr-7.x-MacOSX/lucene/build/demo/test/temp/junit4-J0-20171020_135512_7535757045329862070360.syserr
   [junit4] >>> JVM J0 emitted unexpected output (verbatim) ----
   [junit4] Java HotSpot(TM) 64-Bit Server VM warning: Option UseConcMarkSweepGC was deprecated in version 9.0 and will likely be removed in a future release.
   [junit4] <<< JVM J0: EOF ----

   [junit4] JVM J1: stderr was not empty, see: /Users/jenkins/workspace/Lucene-Solr-7.x-MacOSX/lucene/build/demo/test/temp/junit4-J1-20171020_135512_7534565019565103926041.syserr
   [junit4] >>> JVM J1 emitted unexpected output (verbatim) ----
   [junit4] Java HotSpot(TM) 64-Bit Server VM warning: Option UseConcMarkSweepGC was deprecated in version 9.0 and will likely be removed in a future release.
   [junit4] <<< JVM J1: EOF ----

[...truncated 164 lines...]
   [junit4] JVM J0: stderr was not empty, see: /Users/jenkins/workspace/Lucene-Solr-7.x-MacOSX/lucene/build/expressions/test/temp/junit4-J0-20171020_135516_4718986322000967527001.syserr
   [junit4] >>> JVM J0 emitted unexpected output (verbatim) ----
   [junit4] Java HotSpot(TM) 64-Bit Server VM warning: Option UseConcMarkSweepGC was deprecated in version 9.0 and will likely be removed in a future release.
   [junit4] <<< JVM J0: EOF ----

[...truncated 9 lines...]
   [junit4] JVM J1: stderr was not empty, see: /Users/jenkins/workspace/Lucene-Solr-7.x-MacOSX/lucene/build/expressions/test/temp/junit4-J1-20171020_135516_4711014912068712400079.syserr
   [junit4] >>> JVM J1 emitted unexpected output (verbatim) ----
   [junit4] Java HotSpot(TM) 64-Bit Server VM warning: Option UseConcMarkSweepGC was deprecated in version 9.0 and will likely be removed in a future release.
   [junit4] <<< JVM J1: EOF ----

[...truncated 226 lines...]
   [junit4] JVM J1: stderr was not empty, see: /Users/jenkins/workspace/Lucene-Solr-7.x-MacOSX/lucene/build/facet/test/temp/junit4-J1-20171020_135525_22113604749061681810307.syserr
   [junit4] >>> JVM J1 emitted unexpected output (verbatim) ----
   [junit4] Java HotSpot(TM) 64-Bit Server VM warning: Option UseConcMarkSweepGC was deprecated in version 9.0 and will likely be removed in a future release.
   [junit4] <<< JVM J1: EOF ----

[...truncated 3 lines...]
   [junit4] JVM J0: stderr was not empty, see: /Users/jenkins/workspace/Lucene-Solr-7.x-MacOSX/lucene/build/facet/test/temp/junit4-J0-20171020_135525_22115575965671033859536.syserr
   [junit4] >>> JVM J0 emitted unexpected output (verbatim) ----
   [junit4] Java HotSpot(TM) 64-Bit Server VM warning: Option UseConcMarkSweepGC was deprecated in version 9.0 and will likely be removed in a future release.
   [junit4] <<< JVM J0: EOF ----

[...truncated 179 lines...]
   [junit4] JVM J1: stderr was not empty, see: /Users/jenkins/workspace/Lucene-Solr-7.x-MacOSX/lucene/build/grouping/test/temp/junit4-J1-20171020_135552_19412734244075955192029.syserr
   [junit4] >>> JVM J1 emitted unexpected output (verbatim) ----
   [junit4] Java HotSpot(TM) 64-Bit Server VM warning: Option UseConcMarkSweepGC was deprecated in version 9.0 and will likely be removed in a future release.
   [junit4] <<< JVM J1: EOF ----

[...truncated 3 lines...]
   [junit4] JVM J0: stderr was not empty, see: /Users/jenkins/workspace/Lucene-Solr-7.x-MacOSX/lucene/build/grouping/test/temp/junit4-J0-20171020_135552_1934028929215186413399.syserr
   [junit4] >>> JVM J0 emitted unexpected output (verbatim) ----
   [junit4] Java HotSpot(TM) 64-Bit Server VM warning: Option UseConcMarkSweepGC was deprecated in version 9.0 and will likely be removed in a future release.
   [junit4] <<< JVM J0: EOF ----

[...truncated 243 lines...]
   [junit4] JVM J1: stderr was not empty, see: /Users/jenkins/workspace/Lucene-Solr-7.x-MacOSX/lucene/build/highlighter/test/temp/junit4-J1-20171020_135600_55811789049785234179420.syserr
   [junit4] >>> JVM J1 emitted unexpected output (verbatim) ----
   [junit4] Java HotSpot(TM) 64-Bit Server VM warning: Option UseConcMarkSweepGC was deprecated in version 9.0 and will likely be removed in a future release.
   [junit4] <<< JVM J1: EOF ----

[...truncated 3 lines...]
   [junit4] JVM J0: stderr was not empty, see: /Users/jenkins/workspace/Lucene-Solr-7.x-MacOSX/lucene/build/highlighter/test/temp/junit4-J0-20171020_135600_558940692694877487823.syserr
   [junit4] >>> JVM J0 emitted unexpected output (verbatim) ----
   [junit4] Java HotSpot(TM) 64-Bit Server VM warning: Option UseConcMarkSweepGC was deprecated in version 9.0 and will likely be removed in a future release.
   [junit4] <<< JVM J0: EOF ----

[...truncated 163 lines...]
   [junit4] JVM J1: stderr was not empty, see: /Users/jenkins/workspace/Lucene-Solr-7.x-MacOSX/lucene/build/join/test/temp/junit4-J1-20171020_135618_22216621721169660094555.syserr
   [junit4] >>> JVM J1 emitted unexpected output (verbatim) ----
   [junit4] Java HotSpot(TM) 64-Bit Server VM warning: Option UseConcMarkSweepGC was deprecated in version 9.0 and will likely be removed in a future release.
   [junit4] <<< JVM J1: EOF ----

[...truncated 3 lines...]
   [junit4] JVM J0: stderr was not empty, see: /Users/jenkins/workspace/Lucene-Solr-7.x-MacOSX/lucene/build/join/test/temp/junit4-J0-20171020_135618_22217237398133050050029.syserr
   [junit4] >>> JVM J0 emitted unexpected output (verbatim) ----
   [junit4] Java HotSpot(TM) 64-Bit Server VM warning: Option UseConcMarkSweepGC was deprecated in version 9.0 and will likely be removed in a future release.
   [junit4] <<< JVM J0: EOF ----

[...truncated 147 lines...]
   [junit4] JVM J0: stderr was not empty, see: /Users/jenkins/workspace/Lucene-Solr-7.x-MacOSX/lucene/build/memory/test/temp/junit4-J0-20171020_135634_5953603036354251660452.syserr
   [junit4] >>> JVM J0 emitted unexpected output (verbatim) ----
   [junit4] Java HotSpot(TM) 64-Bit Server VM warning: Option UseConcMarkSweepGC was deprecated in version 9.0 and will likely be removed in a future release.
   [junit4] <<< JVM J0: EOF ----

[...truncated 3 lines...]
   [junit4] JVM J1: stderr was not empty, see: /Users/jenkins/workspace/Lucene-Solr-7.x-MacOSX/lucene/build/memory/test/temp/junit4-J1-20171020_135634_59513368804929570446804.syserr
   [junit4] >>> JVM J1 emitted unexpected output (verbatim) ----
   [junit4] Java HotSpot(TM) 64-Bit Server VM warning: Option UseConcMarkSweepGC was deprecated in version 9.0 and will likely be removed in a future release.
   [junit4] <<< JVM J1: EOF ----

[...truncated 178 lines...]
   [junit4] JVM J1: stderr was not empty, see: /Users/jenkins/workspace/Lucene-Solr-7.x-MacOSX/lucene/build/misc/test/temp/junit4-J1-20171020_135643_8212643477207914749122.syserr
   [junit4] >>> JVM J1 emitted unexpected output (verbatim) ----
   [junit4] Java HotSpot(TM) 64-Bit Server VM warning: Option UseConcMarkSweepGC was deprecated in version 9.0 and will likely be removed in a future release.
   [junit4] <<< JVM J1: EOF ----

[...truncated 7 lines...]
   [junit4] JVM J0: stderr was not empty, see: /Users/jenkins/workspace/Lucene-Solr-7.x-MacOSX/lucene/build/misc/test/temp/junit4-J0-20171020_135643_8217868523737612207126.syserr
   [junit4] >>> JVM J0 emitted unexpected output (verbatim) ----
   [junit4] Java HotSpot(TM) 64-Bit Server VM warning: Option UseConcMarkSweepGC was deprecated in version 9.0 and will likely be removed in a future release.
   [junit4] <<< JVM J0: EOF ----

[...truncated 312 lines...]
   [junit4] JVM J0: stderr was not empty, see: /Users/jenkins/workspace/Lucene-Solr-7.x-MacOSX/lucene/build/queries/test/temp/junit4-J0-20171020_135713_02516866227424289537308.syserr
   [junit4] >>> JVM J0 emitted unexpected output (verbatim) ----
   [junit4] Java HotSpot(TM) 64-Bit Server VM warning: Option UseConcMarkSweepGC was deprecated in version 9.0 and will likely be removed in a future release.
   [junit4] <<< JVM J0: EOF ----

[...truncated 3 lines...]
   [junit4] JVM J1: stderr was not empty, see: /Users/jenkins/workspace/Lucene-Solr-7.x-MacOSX/lucene/build/queries/test/temp/junit4-J1-20171020_135713_0252302231610016251858.syserr
   [junit4] >>> JVM J1 emitted unexpected output (verbatim) ----
   [junit4] Java HotSpot(TM) 64-Bit Server VM warning: Option UseConcMarkSweepGC was deprecated in version 9.0 and will likely be removed in a future release.
   [junit4] <<< JVM J1: EOF ----

[...truncated 227 lines...]
   [junit4] JVM J0: stderr was not empty, see: /Users/jenkins/workspace/Lucene-Solr-7.x-MacOSX/lucene/build/queryparser/test/temp/junit4-J0-20171020_135726_4084835063896557796720.syserr
   [junit4] JVM J1: stderr was not empty, see: /Users/jenkins/workspace/Lucene-Solr-7.x-MacOSX/lucene/build/queryparser/test/temp/junit4-J1-20171020_135726_4086715885092040111260.syserr
   [junit4] >>> JVM J1 emitted unexpected output (verbatim) ----
   [junit4] Java HotSpot(TM) 64-Bit Server VM warning: Option UseConcMarkSweepGC was deprecated in version 9.0 and will likely be removed in a future release.
   [junit4] <<< JVM J1: EOF ----

[...truncated 190 lines...]
   [junit4] JVM J1: stderr was not empty, see: /Users/jenkins/workspace/Lucene-Solr-7.x-MacOSX/lucene/build/replicator/test/temp/junit4-J1-20171020_135736_1385260108225939347852.syserr
   [junit4] >>> JVM J1 emitted unexpected output (verbatim) ----
   [junit4] Java HotSpot(TM) 64-Bit Server VM warning: Option UseConcMarkSweepGC was deprecated in version 9.0 and will likely be removed in a future release.
   [junit4] <<< JVM J1: EOF ----

[...truncated 23 lines...]
   [junit4] JVM J0: stderr was not empty, see: /Users/jenkins/workspace/Lucene-Solr-7.x-MacOSX/lucene/build/replicator/test/temp/junit4-J0-20171020_135736_1385212046536438293967.syserr
   [junit4] >>> JVM J0 emitted unexpected output (verbatim) ----
   [junit4] Java HotSpot(TM) 64-Bit Server VM warning: Option UseConcMarkSweepGC was deprecated in version 9.0 and will likely be removed in a future release.
   [junit4] <<< JVM J0: EOF ----

[...truncated 220 lines...]
   [junit4] JVM J0: stderr was not empty, see: /Users/jenkins/workspace/Lucene-Solr-7.x-MacOSX/lucene/build/sandbox/test/temp/junit4-J0-20171020_135751_6531110597388032929034.syserr
   [junit4] >>> JVM J0 emitted unexpected output (verbatim) ----
   [junit4] Java HotSpot(TM) 64-Bit Server VM warning: Option UseConcMarkSweepGC was deprecated in version 9.0 and will likely be removed in a future release.
   [junit4] <<< JVM J0: EOF ----

[...truncated 3 lines...]
   [junit4] JVM J1: stderr was not empty, see: /Users/jenkins/workspace/Lucene-Solr-7.x-MacOSX/lucene/build/sandbox/test/temp/junit4-J1-20171020_135751_6539877665169111401801.syserr
   [junit4] >>> JVM J1 emitted unexpected output (verbatim) ----
   [junit4] Java HotSpot(TM) 64-Bit Server VM warning: Option UseConcMarkSweepGC was deprecated in version 9.0 and will likely be removed in a future release.
   [junit4] <<< JVM J1: EOF ----

[...truncated 418 lines...]
   [junit4] JVM J1: stderr was not empty, see: /Users/jenkins/workspace/Lucene-Solr-7.x-MacOSX/lucene/build/spatial-extras/test/temp/junit4-J1-20171020_135823_13716207037609705457662.syserr
   [junit4] >>> JVM J1 emitted unexpected output (verbatim) ----
   [junit4] Java HotSpot(TM) 64-Bit Server VM warning: Option UseConcMarkSweepGC was deprecated in version 9.0 and will likely be removed in a future release.
   [junit4] <<< JVM J1: EOF ----

   [junit4] JVM J0: stderr was not empty, see: /Users/jenkins/workspace/Lucene-Solr-7.x-MacOSX/lucene/build/spatial-extras/test/temp/junit4-J0-20171020_135823_13718307610496542398134.syserr
   [junit4] >>> JVM J0 emitted unexpected output (verbatim) ----
   [junit4] Java HotSpot(TM) 64-Bit Server VM warning: Option UseConcMarkSweepGC was deprecated in version 9.0 and will likely be removed in a future release.
   [junit4] <<< JVM J0: EOF ----

[...truncated 146 lines...]
   [junit4] JVM J0: stderr was not empty, see: /Users/jenkins/workspace/Lucene-Solr-7.x-MacOSX/lucene/build/spatial/test/temp/junit4-J0-20171020_135841_2799746175466237201890.syserr
   [junit4] >>> JVM J0 emitted unexpected output (verbatim) ----
   [junit4] Java HotSpot(TM) 64-Bit Server VM warning: Option UseConcMarkSweepGC was deprecated in version 9.0 and will likely be removed in a future release.
   [junit4] <<< JVM J0: EOF ----

[...truncated 165 lines...]
   [junit4] JVM J0: stderr was not empty, see: /Users/jenkins/workspace/Lucene-Solr-7.x-MacOSX/lucene/build/spatial3d/test/temp/junit4-J0-20171020_135844_1036014814721790376969.syserr
   [junit4] >>> JVM J0 emitted unexpected output (verbatim) ----
   [junit4] Java HotSpot(TM) 64-Bit Server VM warning: Option UseConcMarkSweepGC was deprecated in version 9.0 and will likely be removed in a future release.
   [junit4] <<< JVM J0: EOF ----

[...truncated 14 lines...]
   [junit4] JVM J1: stderr was not empty, see: /Users/jenkins/workspace/Lucene-Solr-7.x-MacOSX/lucene/build/spatial3d/test/temp/junit4-J1-20171020_135844_10314856115003087879777.syserr
   [junit4] >>> JVM J1 emitted unexpected output (verbatim) ----
   [junit4] Java HotSpot(TM) 64-Bit Server VM warning: Option UseConcMarkSweepGC was deprecated in version 9.0 and will likely be removed in a future release.
   [junit4] <<< JVM J1: EOF ----

[...truncated 250 lines...]
   [junit4] JVM J1: stderr was not empty, see: /Users/jenkins/workspace/Lucene-Solr-7.x-MacOSX/lucene/build/suggest/test/temp/junit4-J1-20171020_135911_32410465038727163997945.syserr
   [junit4] >>> JVM J1 emitted unexpected output (verbatim) ----
   [junit4] Java HotSpot(TM) 64-Bit Server VM warning: Option UseConcMarkSweepGC was deprecated in version 9.0 and will likely be removed in a future release.
   [junit4] <<< JVM J1: EOF ----

[...truncated 3 lines...]
   [junit4] JVM J0: stderr was not empty, see: /Users/jenkins/workspace/Lucene-Solr-7.x-MacOSX/lucene/build/suggest/test/temp/junit4-J0-20171020_135911_32417830341991244112741.syserr
   [junit4] >>> JVM J0 emitted unexpected output (verbatim) ----
   [junit4] Java HotSpot(TM) 64-Bit Server VM warning: Option UseConcMarkSweepGC was deprecated in version 9.0 and will likely be removed in a future release.
   [junit4] <<< JVM J0: EOF ----

[...truncated 2947 lines...]
   [junit4] Suite: org.apache.solr.handler.TestReplicationHandler
   [junit4]   2> 1553006 INFO  (SUITE-TestReplicationHandler-seed#[3C79BDD2D611A463]-worker) [    ] o.a.s.SolrTestCaseJ4 SecureRandom sanity checks: test.solr.allowed.securerandom=null & java.security.egd=file:/dev/./urandom
   [junit4]   2> Creating dataDir: /Users/jenkins/workspace/Lucene-Solr-7.x-MacOSX/solr/build/solr-core/test/J1/temp/solr.handler.TestReplicationHandler_3C79BDD2D611A463-001/init-core-data-001
   [junit4]   2> 1553006 WARN  (SUITE-TestReplicationHandler-seed#[3C79BDD2D611A463]-worker) [    ] o.a.s.SolrTestCaseJ4 startTrackingSearchers: numOpens=7 numCloses=7
   [junit4]   2> 1553006 INFO  (SUITE-TestReplicationHandler-seed#[3C79BDD2D611A463]-worker) [    ] o.a.s.SolrTestCaseJ4 Using PointFields (NUMERIC_POINTS_SYSPROP=true) w/NUMERIC_DOCVALUES_SYSPROP=true
   [junit4]   2> 1553007 INFO  (SUITE-TestReplicationHandler-seed#[3C79BDD2D611A463]-worker) [    ] o.a.s.SolrTestCaseJ4 Randomized ssl (false) and clientAuth (false) via: @org.apache.solr.SolrTestCaseJ4$SuppressSSL(bugUrl="None") w/ MAC_OS_X supressed clientAuth
   [junit4] IGNOR/A 0.00s J1 | TestReplicationHandler.doTestIndexFetchOnMasterRestart
   [junit4]    > Assumption #1: 'awaitsfix' test group is disabled (@AwaitsFix(bugUrl="https://issues.apache.org/jira/browse/SOLR-9036"))
   [junit4]   2> 1553008 INFO  (TEST-TestReplicationHandler.doTestRepeater-seed#[3C79BDD2D611A463]) [    ] o.a.s.SolrTestCaseJ4 ###Starting doTestRepeater
   [junit4]   2> 1553009 INFO  (TEST-TestReplicationHandler.doTestRepeater-seed#[3C79BDD2D611A463]) [    ] o.a.s.SolrTestCaseJ4 Writing core.properties file to /Users/jenkins/workspace/Lucene-Solr-7.x-MacOSX/solr/build/solr-core/test/J1/temp/solr.handler.TestReplicationHandler_3C79BDD2D611A463-001/solr-instance-001/collection1
   [junit4]   2> 1553015 INFO  (TEST-TestReplicationHandler.doTestRepeater-seed#[3C79BDD2D611A463]) [    ] o.e.j.s.Server jetty-9.3.20.v20170531
   [junit4]   2> 1553016 INFO  (TEST-TestReplicationHandler.doTestRepeater-seed#[3C79BDD2D611A463]) [    ] o.e.j.s.h.ContextHandler Started o.e.j.s.ServletContextHandler@2653f86d{/solr,null,AVAILABLE}
   [junit4]   2> 1553017 INFO  (TEST-TestReplicationHandler.doTestRepeater-seed#[3C79BDD2D611A463]) [    ] o.e.j.s.AbstractConnector Started ServerConnector@2912e26{HTTP/1.1,[http/1.1]}{127.0.0.1:59635}
   [junit4]   2> 1553018 INFO  (TEST-TestReplicationHandler.doTestRepeater-seed#[3C79BDD2D611A463]) [    ] o.e.j.s.Server Started @1554789ms
   [junit4]   2> 1553018 INFO  (TEST-TestReplicationHandler.doTestRepeater-seed#[3C79BDD2D611A463]) [    ] o.a.s.c.s.e.JettySolrRunner Jetty properties: {hostContext=/solr, solr.data.dir=/Users/jenkins/workspace/Lucene-Solr-7.x-MacOSX/solr/build/solr-core/test/J1/temp/solr.handler.TestReplicationHandler_3C79BDD2D611A463-001/solr-instance-001/collection1/data, hostPort=59635}
   [junit4]   2> 1553018 ERROR (TEST-TestReplicationHandler.doTestRepeater-seed#[3C79BDD2D611A463]) [    ] o.a.s.u.StartupLoggingUtils Missing Java Option solr.log.dir. Logging may be missing or incomplete.
   [junit4]   2> 1553018 INFO  (TEST-TestReplicationHandler.doTestRepeater-seed#[3C79BDD2D611A463]) [    ] o.a.s.s.SolrDispatchFilter  ___      _       Welcome to Apache Solr™ version 7.2.0
   [junit4]   2> 1553018 INFO  (TEST-TestReplicationHandler.doTestRepeater-seed#[3C79BDD2D611A463]) [    ] o.a.s.s.SolrDispatchFilter / __| ___| |_ _   Starting in standalone mode on port null
   [junit4]   2> 1553018 INFO  (TEST-TestReplicationHandler.doTestRepeater-seed#[3C79BDD2D611A463]) [    ] o.a.s.s.SolrDispatchFilter \__ \/ _ \ | '_|  Install dir: null, Default config dir: null
   [junit4]   2> 1553018 INFO  (TEST-TestReplicationHandler.doTestRepeater-seed#[3C79BDD2D611A463]) [    ] o.a.s.s.SolrDispatchFilter |___/\___/_|_|    Start time: 2017-10-20T14:26:10.245593Z
   [junit4]   2> 1553018 INFO  (TEST-TestReplicationHandler.doTestRepeater-seed#[3C79BDD2D611A463]) [    ] o.a.s.c.SolrXmlConfig Loading container configuration from /Users/jenkins/workspace/Lucene-Solr-7.x-MacOSX/solr/build/solr-core/test/J1/temp/solr.handler.TestReplicationHandler_3C79BDD2D611A463-001/solr-instance-001/solr.xml
   [junit4]   2> 1553020 INFO  (TEST-TestReplicationHandler.doTestRepeater-seed#[3C79BDD2D611A463]) [    ] o.a.s.c.SolrXmlConfig Configuration parameter autoReplicaFailoverWorkLoopDelay is ignored
   [junit4]   2> 1553020 INFO  (TEST-TestReplicationHandler.doTestRepeater-seed#[3C79BDD2D611A463]) [    ] o.a.s.c.SolrXmlConfig Configuration parameter autoReplicaFailoverBadNodeExpiration is ignored
   [junit4]   2> 1553021 INFO  (TEST-TestReplicationHandler.doTestRepeater-seed#[3C79BDD2D611A463]) [    ] o.a.s.c.SolrXmlConfig MBean server found: com.sun.jmx.mbeanserver.JmxMBeanServer@2e100ee5, but no JMX reporters were configured - adding default JMX reporter.
   [junit4]   2> 1553051 INFO  (TEST-TestReplicationHandler.doTestRepeater-seed#[3C79BDD2D611A463]) [    ] o.a.s.m.r.SolrJmxReporter JMX monitoring for 'solr.node' (registry 'solr.node') enabled at server: com.sun.jmx.mbeanserver.JmxMBeanServer@2e100ee5
   [junit4]   2> 1553061 INFO  (TEST-TestReplicationHandler.doTestRepeater-seed#[3C79BDD2D611A463]) [    ] o.a.s.m.r.SolrJmxReporter JMX monitoring for 'solr.jvm' (registry 'solr.jvm') enabled at server: com.sun.jmx.mbeanserver.JmxMBeanServer@2e100ee5
   [junit4]   2> 1553061 INFO  (TEST-TestReplicationHandler.doTestRepeater-seed#[3C79BDD2D611A463]) [    ] o.a.s.m.r.SolrJmxReporter JMX monitoring for 'solr.jetty' (registry 'solr.jetty') enabled at server: com.sun.jmx.mbeanserver.JmxMBeanServer@2e100ee5
   [junit4]   2> 1553072 INFO  (TEST-TestReplicationHandler.doTestRepeater-seed#[3C79BDD2D611A463]) [    ] o.a.s.c.CorePropertiesLocator Found 1 core definitions underneath /Users/jenkins/workspace/Lucene-Solr-7.x-MacOSX/solr/build/solr-core/test/J1/temp/solr.handler.TestReplicationHandler_3C79BDD2D611A463-001/solr-instance-001/.
   [junit4]   2> 1553072 INFO  (TEST-TestReplicationHandler.doTestRepeater-seed#[3C79BDD2D611A463]) [    ] o.a.s.c.CorePropertiesLocator Cores are: [collection1]
   [junit4]   2> 1553072 INFO  (coreLoadExecutor-6181-thread-1) [    ] o.a.s.c.TransientSolrCoreCacheDefault Allocating transient cache for 4 transient cores
   [junit4]   2> 1553078 INFO  (coreLoadExecutor-6181-thread-1) [    ] o.a.s.c.SolrConfig Using Lucene MatchVersion: 7.2.0
   [junit4]   2> 1553083 INFO  (coreLoadExecutor-6181-thread-1) [    ] o.a.s.s.IndexSchema [collection1] Schema name=test
   [junit4]   2> 1553084 INFO  (coreLoadExecutor-6181-thread-1) [    ] o.a.s.s.IndexSchema Loaded schema test/1.2 with uniqueid field id
   [junit4]   2> 1553084 INFO  (coreLoadExecutor-6181-thread-1) [    ] o.a.s.c.CoreContainer Creating SolrCore 'collection1' using configuration from instancedir /Users/jenkins/workspace/Lucene-Solr-7.x-MacOSX/solr/build/solr-core/test/J1/temp/solr.handler.TestReplicationHandler_3C79BDD2D611A463-001/solr-instance-001/./collection1, trusted=true
   [junit4]   2> 1553084 INFO  (coreLoadExecutor-6181-thread-1) [    ] o.a.s.m.r.SolrJmxReporter JMX monitoring for 'solr.core.collection1' (registry 'solr.core.collection1') enabled at server: com.sun.jmx.mbeanserver.JmxMBeanServer@2e100ee5
   [junit4]   2> 1553084 INFO  (coreLoadExecutor-6181-thread-1) [    ] o.a.s.c.SolrCore solr.RecoveryStrategy.Builder
   [junit4]   2> 1553084 INFO  (coreLoadExecutor-6181-thread-1) [    ] o.a.s.c.SolrCore [[collection1] ] Opening new SolrCore at [/Users/jenkins/workspace/Lucene-Solr-7.x-MacOSX/solr/build/solr-core/test/J1/temp/solr.handler.TestReplicationHandler_3C79BDD2D611A463-001/solr-instance-001/collection1], dataDir=[/Users/jenkins/workspace/Lucene-Solr-7.x-MacOSX/solr/build/solr-core/test/J1/temp/solr.handler.TestReplicationHandler_3C79BDD2D611A463-001/solr-instance-001/./collection1/data/]
   [junit4]   2> 1553086 INFO  (coreLoadExecutor-6181-thread-1) [    ] o.a.s.u.RandomMergePolicy RandomMergePolicy wrapping class org.apache.lucene.index.TieredMergePolicy: [TieredMergePolicy: maxMergeAtOnce=29, maxMergeAtOnceExplicit=39, maxMergedSegmentMB=6.3740234375, floorSegmentMB=0.451171875, forceMergeDeletesPctAllowed=23.350755422085285, segmentsPerTier=12.0, maxCFSSegmentSizeMB=8.796093022207999E12, noCFSRatio=0.4534729295200872
   [junit4]   2> 1553121 INFO  (coreLoadExecutor-6181-thread-1) [    ] o.a.s.u.CommitTracker Hard AutoCommit: disabled
   [junit4]   2> 1553121 INFO  (coreLoadExecutor-6181-thread-1) [    ] o.a.s.u.CommitTracker Soft AutoCommit: disabled
   [junit4]   2> 1553122 INFO  (coreLoadExecutor-6181-thread-1) [    ] o.a.s.u.RandomMergePolicy RandomMergePolicy wrapping class org.apache.lucene.index.AlcoholicMergePolicy: [AlcoholicMergePolicy: minMergeSize=0, mergeFactor=10, maxMergeSize=706327558, maxMergeSizeForForcedMerge=9223372036854775807, calibrateSizeByDeletes=true, maxMergeDocs=2147483647, maxCFSSegmentSizeMB=8.796093022207999E12, noCFSRatio=0.1]
   [junit4]   2> 1553123 INFO  (coreLoadExecutor-6181-thread-1) [    ] o.a.s.s.SolrIndexSearcher Opening [Searcher@26dd9e66[collection1] main]
   [junit4]   2> 1553123 INFO  (coreLoadExecutor-6181-thread-1) [    ] o.a.s.r.ManagedResourceStorage File-based storage initialized to use dir: /Users/jenkins/workspace/Lucene-Solr-7.x-MacOSX/solr/build/solr-core/test/J1/temp/solr.handler.TestReplicationHandler_3C79BDD2D611A463-001/solr-instance-001/collection1/conf
   [junit4]   2> 1553123 INFO  (coreLoadExecutor-6181-thread-1) [    ] o.a.s.h.ReplicationHandler Replication enabled for following config files: schema.xml,xslt/dummy.xsl
   [junit4]   2> 1553123 INFO  (coreLoadExecutor-6181-thread-1) [    ] o.a.s.h.ReplicationHandler Commits will be reserved for 10000ms.
   [junit4]   2> 1553124 INFO  (searcherExecutor-6182-thread-1) [    ] o.a.s.c.SolrCore [collection1] Registered new searcher Searcher@26dd9e66[collection1] main{ExitableDirectoryReader(UninvertingDirectoryReader())}
   [junit4]   2> 1553125 INFO  (TEST-TestReplicationHandler.doTestRepeater-seed#[3C79BDD2D611A463]) [    ] o.a.s.SolrTestCaseJ4 Writing core.properties file to /Users/jenkins/workspace/Lucene-Solr-7.x-MacOSX/solr/build/solr-core/test/J1/temp/solr.handler.TestReplicationHandler_3C79BDD2D611A463-001/solr-instance-002/collection1
   [junit4]   2> 1553128 INFO  (TEST-TestReplicationHandler.doTestRepeater-seed#[3C79BDD2D611A463]) [    ] o.e.j.s.Server jetty-9.3.20.v20170531
   [junit4]   2> 1553129 INFO  (TEST-TestReplicationHandler.doTestRepeater-seed#[3C79BDD2D611A463]) [    ] o.e.j.s.h.ContextHandler Started o.e.j.s.ServletContextHandler@74381125{/solr,null,AVAILABLE}
   [junit4]   2> 1553129 INFO  (TEST-TestReplicationHandler.doTestRepeater-seed#[3C79BDD2D611A463]) [    ] o.e.j.s.AbstractConnector Started ServerConnector@1740668{HTTP/1.1,[http/1.1]}{127.0.0.1:59636}
   [junit4]   2> 1553129 INFO  (TEST-TestReplicationHandler.doTestRepeater-seed#[3C79BDD2D611A463]) [    ] o.e.j.s.Server Started @1554901ms
   [junit4]   2> 1553129 INFO  (TEST-TestReplicationHandler.doTestRepeater-seed#[3C79BDD2D611A463]) [    ] o.a.s.c.s.e.JettySolrRunner Jetty properties: {hostContext=/solr, solr.data.dir=/Users/jenkins/workspace/Lucene-Solr-7.x-MacOSX/solr/build/solr-core/test/J1/temp/solr.handler.TestReplicationHandler_3C79BDD2D611A463-001/solr-instance-002/collection1/data, hostPort=59636}
   [junit4]   2> 1553130 ERROR (TEST-TestReplicationHandler.doTestRepeater-seed#[3C79BDD2D611A463]) [    ] o.a.s.u.StartupLoggingUtils Missing Java Option solr.log.dir. Logging may be missing or incomplete.
   [junit4]   2> 1553130 INFO  (TEST-TestReplicationHandler.doTestRepeater-seed#[3C79BDD2D611A463]) [    ] o.a.s.s.SolrDispatchFilter  ___      _       Welcome to Apache Solr™ version 7.2.0
   [junit4]   2> 1553130 INFO  (TEST-TestReplicationHandler.doTestRepeater-seed#[3C79BDD2D611A463]) [    ] o.a.s.s.SolrDispatchFilter / __| ___| |_ _   Starting in standalone mode on port null
   [junit4]   2> 1553130 INFO  (TEST-TestReplicationHandler.doTestRepeater-seed#[3C79BDD2D611A463]) [    ] o.a.s.s.SolrDispatchFilter \__ \/ _ \ | '_|  Install dir: null, Default config dir: null
   [junit4]   2> 1553130 INFO  (TEST-TestReplicationHandler.doTestRepeater-seed#[3C79BDD2D611A463]) [    ] o.a.s.s.SolrDispatchFilter |___/\___/_|_|    Start time: 2017-10-20T14:26:10.357705Z
   [junit4]   2> 1553130 INFO  (TEST-TestReplicationHandler.doTestRepeater-seed#[3C79BDD2D611A463]) [    ] o.a.s.c.SolrXmlConfig Loading container configuration from /Users/jenkins/workspace/Lucene-Solr-7.x-MacOSX/solr/build/solr-core/test/J1/temp/solr.handler.TestReplicationHandler_3C79BDD2D611A463-001/solr-instance-002/solr.xml
   [junit4]   2> 1553132 INFO  (TEST-TestReplicationHandler.doTestRepeater-seed#[3C79BDD2D611A463]) [    ] o.a.s.c.SolrXmlConfig Configuration parameter autoReplicaFailoverWorkLoopDelay is ignored
   [junit4]   2> 1553132 INFO  (TEST-TestReplicationHandler.doTestRepeater-seed#[3C79BDD2D611A463]) [    ] o.a.s.c.SolrXmlConfig Configuration parameter autoReplicaFailoverBadNodeExpiration is ignored
   [junit4]   2> 1553133 INFO  (TEST-TestReplicationHandler.doTestRepeater-seed#[3C79BDD2D611A463]) [    ] o.a.s.c.SolrXmlConfig MBean server found: com.sun.jmx.mbeanserver.JmxMBeanServer@2e100ee5, but no JMX reporters were configured - adding default JMX reporter.
   [junit4]   2> 1553161 INFO  (TEST-TestReplicationHandler.doTestRepeater-seed#[3C79BDD2D611A463]) [    ] o.a.s.m.r.SolrJmxReporter JMX monitoring for 'solr.node' (registry 'solr.node') enabled at server: com.sun.jmx.mbeanserver.JmxMBeanServer@2e100ee5
   [junit4]   2> 1553173 INFO  (TEST-TestReplicationHandler.doTestRepeater-seed#[3C79BDD2D611A463]) [    ] o.a.s.m.r.SolrJmxReporter JMX monitoring for 'solr.jvm' (registry 'solr.jvm') enabled at server: com.sun.jmx.mbeanserver.JmxMBeanServer@2e100ee5
   [junit4]   2> 1553173 INFO  (TEST-TestReplicationHandler.doTestRepeater-seed#[3C79BDD2D611A463]) [    ] o.a.s.m.r.SolrJmxReporter JMX monitoring for 'solr.jetty' (registry 'solr.jetty') enabled at server: com.sun.jmx.mbeanserver.JmxMBeanServer@2e100ee5
   [junit4]   2> 1553174 INFO  (TEST-TestReplicationHandler.doTestRepeater-seed#[3C79BDD2D611A463]) [    ] o.a.s.c.CorePropertiesLocator Found 1 core definitions underneath /Users/jenkins/workspace/Lucene-Solr-7.x-MacOSX/solr/build/solr-core/test/J1/temp/solr.handler.TestReplicationHandler_3C79BDD2D611A463-001/solr-instance-002/.
   [junit4]   2> 1553175 INFO  (TEST-TestReplicationHandler.doTestRepeater-seed#[3C79BDD2D611A463]) [    ] o.a.s.c.CorePropertiesLocator Cores are: [collection1]
   [junit4]   2> 1553175 INFO  (coreLoadExecutor-6191-thread-1) [    ] o.a.s.c.TransientSolrCoreCacheDefault Allocating transient cache for 4 transient cores
   [junit4]   2> 1553179 INFO  (coreLoadExecutor-6191-thread-1) [    ] o.a.s.c.SolrConfig Using Lucene MatchVersion: 7.2.0
   [junit4]   2> 1553183 INFO  (coreLoadExecutor-6191-thread-1) [    ] o.a.s.s.IndexSchema [collection1] Schema name=test
   [junit4]   2> 1553183 INFO  (coreLoadExecutor-6191-thread-1) [    ] o.a.s.s.IndexSchema Loaded schema test/1.2 with uniqueid field id
   [junit4]   2> 1553184 INFO  (coreLoadExecutor-6191-thread-1) [    ] o.a.s.c.CoreContainer Creating SolrCore 'collection1' using configuration from instancedir /Users/jenkins/workspace/Lucene-Solr-7.x-MacOSX/solr/build/solr-core/test/J1/temp/solr.handler.TestReplicationHandler_3C79BDD2D611A463-001/solr-instance-002/./collection1, trusted=true
   [junit4]   2> 1553184 INFO  (coreLoadExecutor-6191-thread-1) [    ] o.a.s.m.r.SolrJmxReporter JMX monitoring for 'solr.core.collection1' (registry 'solr.core.collection1') enabled at server: com.sun.jmx.mbeanserver.JmxMBeanServer@2e100ee5
   [junit4]   2> 1553184 INFO  (coreLoadExecutor-6191-thread-1) [    ] o.a.s.c.SolrCore solr.RecoveryStrategy.Builder
   [junit4]   2> 1553184 INFO  (coreLoadExecutor-6191-thread-1) [    ] o.a.s.c.SolrCore [[collection1] ] Opening new SolrCore at [/Users/jenkins/workspace/Lucene-Solr-7.x-MacOSX/solr/build/solr-core/test/J1/temp/solr.handler.TestReplicationHandler_3C79BDD2D611A463-001/solr-instance-002/collection1], dataDir=[/Users/jenkins/workspace/Lucene-Solr-7.x-MacOSX/solr/build/solr-core/test/J1/temp/solr.handler.TestReplicationHandler_3C79BDD2D611A463-001/solr-instance-002/./collection1/data/]
   [junit4]   2> 1553185 INFO  (coreLoadExecutor-6191-thread-1) [    ] o.a.s.u.RandomMergePolicy RandomMergePolicy wrapping class org.apache.lucene.index.TieredMergePolicy: [TieredMergePolicy: maxMergeAtOnce=29, maxMergeAtOnceExplicit=39, maxMergedSegmentMB=6.3740234375, floorSegmentMB=0.451171875, forceMergeDeletesPctAllowed=23.350755422085285, segmentsPerTier=12.0, maxCFSSegmentSizeMB=8.796093022207999E12, noCFSRatio=0.4534729295200872
   [junit4]   2> 1553226 INFO  (coreLoadExecutor-6191-thread-1) [    ] o.a.s.u.CommitTracker Hard AutoCommit: disabled
   [junit4]   2> 1553227 INFO  (coreLoadExecutor-6191-thread-1) [    ] o.a.s.u.CommitTracker Soft AutoCommit: disabled
   [junit4]   2> 1553227 INFO  (coreLoadExecutor-6191-thread-1) [    ] o.a.s.u.RandomMergePolicy RandomMergePolicy wrapping class org.apache.lucene.index.AlcoholicMergePolicy: [AlcoholicMergePolicy: minMergeSize=0, mergeFactor=10, maxMergeSize=706327558, maxMergeSizeForForcedMerge=9223372036854775807, calibrateSizeByDeletes=true, maxMergeDocs=2147483647, maxCFSSegmentSizeMB=8.796093022207999E12, noCFSRatio=0.1]
   [junit4]   2> 1553227 INFO  (coreLoadExecutor-6191-thread-1) [    ] o.a.s.s.SolrIndexSearcher Opening [Searcher@24fb5d5c[collection1] main]
   [junit4]   2> 1553228 INFO  (coreLoadExecutor-6191-thread-1) [    ] o.a.s.r.ManagedResourceStorage File-based storage initialized to use dir: /Users/jenkins/workspace/Lucene-Solr-7.x-MacOSX/solr/build/solr-core/test/J1/temp/solr.handler.TestReplicationHandler_3C79BDD2D611A463-001/solr-instance-002/collection1/conf
   [junit4]   2> 1553229 INFO  (coreLoadExecutor-6191-thread-1) [    ] o.a.s.h.ReplicationHandler Poll scheduled at an interval of 1000ms
   [junit4]   2> 1553229 INFO  (coreLoadExecutor-6191-thread-1) [    ] o.a.s.h.ReplicationHandler Commits will be reserved for 10000ms.
   [junit4]   2> 1553229 INFO  (searcherExecutor-6192-thread-1) [    ] o.a.s.c.SolrCore [collection1] Registered new searcher Searcher@24fb5d5c[collection1] main{ExitableDirectoryReader(UninvertingDirectoryReader())}
   [junit4]   2> 1553232 INFO  (TEST-TestReplicationHandler.doTestRepeater-seed#[3C79BDD2D611A463]) [    ] o.e.j.s.AbstractConnector Stopped ServerConnector@1740668{HTTP/1.1,[http/1.1]}{127.0.0.1:0}
   [junit4]   2> 1553232 INFO  (TEST-TestReplicationHandler.doTestRepeater-seed#[3C79BDD2D611A463]) [    ] o.a.s.c.CoreContainer Shutting down CoreContainer instance=52006600
   [junit4]   2> 1553232 INFO  (TEST-TestReplicationHandler.doTestRepeater-seed#[3C79BDD2D611A463]) [    ] o.a.s.m.SolrMetricManager Closing metric reporters for registry=solr.node, tag=null
   [junit4]   2> 1553232 INFO  (TEST-TestReplicationHandler.doTestRepeater-seed#[3C79BDD2D611A463]) [    ] o.a.s.m.r.SolrJmxReporter Closing reporter [org.apache.solr.metrics.reporters.SolrJmxReporter@26d3a6f2: rootName = null, domain = solr.node, service url = null, agent id = null] for registry solr.node / com.codahale.metrics.MetricRegistry@2392ce3b
   [junit4]   2> 1553232 INFO  (qtp1640737036-12845) [    ] o.a.s.c.S.Request [collection1]  webapp=/solr path=/replication params={qt=/replication&wt=javabin&version=2&command=indexversion} status=0 QTime=0
   [junit4]   2> 1553233 INFO  (indexFetcher-6196-thread-1) [    ] o.a.s.h.IndexFetcher Master's generation: 1
   [junit4]   2> 1553233 INFO  (indexFetcher-6196-thread-1) [    ] o.a.s.h.IndexFetcher Master's version: 0
   [junit4]   2> 1553233 INFO  (indexFetcher-6196-thread-1) [    ] o.a.s.h.IndexFetcher Slave's generation: 1
   [junit4]   2> 1553233 INFO  (indexFetcher-6196-thread-1) [    ] o.a.s.h.IndexFetcher Slave's version: 0
   [junit4]   2> 1553233 INFO  (indexFetcher-6196-thread-1) [    ] o.a.s.h.IndexFetcher New index in Master. Deleting mine...
   [junit4]   2> 1553233 INFO  (indexFetcher-6196-thread-1) [    ] o.a.s.u.DirectUpdateHandler2 start commit{,optimize=false,openSearcher=true,waitSearcher=true,expungeDeletes=false,softCommit=false,prepareCommit=false}
   [junit4]   2> 1553233 INFO  (indexFetcher-6196-thread-1) [    ] o.a.s.u.SolrIndexWriter Calling setCommitData with IW:org.apache.solr.update.SolrIndexWriter@13b53ced commitCommandVersion:0
   [junit4]   2> 1553233 INFO  (indexFetcher-6196-thread-1) [    ] o.a.s.s.SolrIndexSearcher Opening [Searcher@59780eed[collection1] main]
   [junit4]   2> 1553233 INFO  (indexFetcher-6196-thread-1) [    ] o.a.s.u.DirectUpdateHandler2 end_commit_flush
   [junit4]   2> 1553234 INFO  (searcherExecutor-6192-thread-1) [    ] o.a.s.c.SolrCore [collection1] Registered new searcher Searcher@59780eed[collection1] main{ExitableDirectoryReader(UninvertingDirectoryReader())}
   [junit4]   2> 1553236 INFO  (TEST-TestReplicationHandler.doTestRepeater-seed#[3C79BDD2D611A463]) [    ] o.a.s.m.SolrMetricManager Closing metric reporters for registry=solr.jvm, tag=null
   [junit4]   2> 1553236 INFO  (TEST-TestReplicationHandler.doTestRepeater-seed#[3C79BDD2D611A463]) [    ] o.a.s.m.r.SolrJmxReporter Closing reporter [org.apache.solr.metrics.reporters.SolrJmxReporter@7b5d8113: rootName = null, domain = solr.jvm, service url = null, agent id = null] for registry solr.jvm / com.codahale.metrics.MetricRegistry@71dece7c
   [junit4]   2> 1553244 INFO  (TEST-TestReplicationHandler.doTestRepeater-seed#[3C79BDD2D611A463]) [    ] o.a.s.m.SolrMetricManager Closing metric reporters for registry=solr.jetty, tag=null
   [junit4]   2> 1553244 INFO  (TEST-TestReplicationHandler.doTestRepeater-seed#[3C79BDD2D611A463]) [    ] o.a.s.m.r.SolrJmxReporter Closing reporter [org.apache.solr.metrics.reporters.SolrJmxReporter@27ef187c: rootName = null, domain = solr.jetty, service url = null, agent id = null] for registry solr.jetty / com.codahale.metrics.MetricRegistry@3cc2bb7a
   [junit4]   2> 1553244 INFO  (coreCloseExecutor-6197-thread-1) [    ] o.a.s.c.SolrCore [collection1]  CLOSING SolrCore org.apache.solr.core.SolrCore@4aae0c76
   [junit4]   2> 1553244 INFO  (coreCloseExecutor-6197-thread-1) [    ] o.a.s.m.SolrMetricManager Closing metric reporters for registry=solr.core.collection1, tag=1252920438
   [junit4]   2> 1553244 INFO  (coreCloseExecutor-6197-thread-1) [    ] o.a.s.m.r.SolrJmxReporter Closing reporter [org.apache.solr.metrics.reporters.SolrJmxReporter@689cc5f4: rootName = null, domain = solr.core.collection1, service url = null, agent id = null] for registry solr.core.collection1 / com.codahale.metrics.MetricRegistry@742a0614
   [junit4]   2> 1553252 INFO  (TEST-TestReplicationHandler.doTestRepeater-seed#[3C79BDD2D611A463]) [    ] o.e.j.s.h.ContextHandler Stopped o.e.j.s.ServletContextHandler@74381125{/solr,null,UNAVAILABLE}
   [junit4]   2> 1553253 INFO  (TEST-TestReplicationHandler.doTestRepeater-seed#[3C79BDD2D611A463]) [    ] o.e.j.s.Server jetty-9.3.20.v20170531
   [junit4]   2> 1553254 INFO  (TEST-TestReplicationHandler.doTestRepeater-seed#[3C79BDD2D611A463]) [    ] o.e.j.s.h.ContextHandler Started o.e.j.s.ServletContextHandler@73feb804{/solr,null,AVAILABLE}
   [junit4]   2> 1553255 INFO  (TEST-TestReplicationHandler.doTestRepeater-seed#[3C79BDD2D611A463]) [    ] o.e.j.s.AbstractConnector Started ServerConnector@665608d6{HTTP/1.1,[http/1.1]}{127.0.0.1:59638}
   [junit4]   2> 1553255 INFO  (TEST-TestReplicationHandler.doTestRepeater-seed#[3C79BDD2D611A463]) [    ] o.e.j.s.Server Started @1555026ms
   [junit4]   2> 1553255 INFO  (TEST-TestReplicationHandler.doTestRepeater-seed#[3C79BDD2D611A463]) [    ] o.a.s.c.s.e.JettySolrRunner Jetty properties: {hostContext=/solr, solr.data.dir=/Users/jenkins/workspace/Lucene-Solr-7.x-MacOSX/solr/build/solr-core/test/J1/temp/solr.handler.TestReplicationHandler_3C79BDD2D611A463-001/solr-instance-002/collection1/data, hostPort=59638}
   [junit4]   2> 1553255 ERROR (TEST-TestReplicationHandler.doTestRepeater-seed#[3C79BDD2D611A463]) [    ] o.a.s.u.StartupLoggingUtils Missing Java Option solr.log.dir. Logging may be missing or incomplete.
   [junit4]   2> 1553256 INFO  (TEST-TestReplicationHandler.doTestRepeater-seed#[3C79BDD2D611A463]) [    ] o.a.s.s.SolrDispatchFilter  ___      _       Welcome to Apache Solr™ version 7.2.0
   [junit4]   2> 1553256 INFO  (TEST-TestReplicationHandler.doTestRepeater-seed#[3C79BDD2D611A463]) [    ] o.a.s.s.SolrDispatchFilter / __| ___| |_ _   Starting in standalone mode on port null
   [junit4]   2> 1553256 INFO  (TEST-TestReplicationHandler.doTestRepeater-seed#[3C79BDD2D611A463]) [    ] o.a.s.s.SolrDispatchFilter \__ \/ _ \ | '_|  Install dir: null, Default config dir: null
   [junit4]   2> 1553256 INFO  (TEST-TestReplicationHandler.doTestRepeater-seed#[3C79BDD2D611A463]) [    ] o.a.s.s.SolrDispatchFilter |___/\___/_|_|    Start time: 2017-10-20T14:26:10.483665Z
   [junit4]   2> 1553256 INFO  (TEST-TestReplicationHandler.doTestRepeater-seed#[3C79BDD2D611A463]) [    ] o.a.s.c.SolrXmlConfig Loading container configuration from /Users/jenkins/workspace/Lucene-Solr-7.x-MacOSX/solr/build/solr-core/test/J1/temp/solr.handler.TestReplicationHandler_3C79BDD2D611A463-001/solr-instance-002/solr.xml
   [junit4]   2> 1553258 INFO  (TEST-TestReplicationHandler.doTestRepeater-seed#[3C79BDD2D611A463]) [    ] o.a.s.c.SolrXmlConfig Configuration parameter autoReplicaFailoverWorkLoopDelay is ignored
   [junit4]   2> 1553258 INFO  (TEST-TestReplicationHandler.doTestRepeater-seed#[3C79BDD2D611A463]) [    ] o.a.s.c.SolrXmlConfig Configuration parameter autoReplicaFailoverBadNodeExpiration is ignored
   [junit4]   2> 1553259 INFO  (TEST-TestReplicationHandler.doTestRepeater-seed#[3C79BDD2D611A463]) [    ] o.a.s.c.SolrXmlConfig MBean server found: com.sun.jmx.mbeanserver.JmxMBeanServer@2e100ee5, but no JMX reporters were configured - adding default JMX reporter.
   [junit4]   2> 1553286 INFO  (TEST-TestReplicationHandler.doTestRepeater-seed#[3C79BDD2D611A463]) [    ] o.a.s.m.r.SolrJmxReporter JMX monitoring for 'solr.node' (registry 'solr.node') enabled at server: com.sun.jmx.mbeanserver.JmxMBeanServer@2e100ee5
   [junit4]   2> 1553296 INFO  (TEST-TestReplicationHandler.doTestRepeater-seed#[3C79BDD2D611A463]) [    ] o.a.s.m.r.SolrJmxReporter JMX monitoring for 'solr.jvm' (registry 'solr.jvm') enabled at server: com.sun.jmx.mbeanserver.JmxMBeanServer@2e100ee5
   [junit4]   2> 1553296 INFO  (TEST-TestReplicationHandler.doTestRepeater-seed#[3C79BDD2D611A463]) [    ] o.a.s.m.r.SolrJmxReporter JMX monitoring for 'solr.jetty' (registry 'solr.jetty') enabled at server: com.sun.jmx.mbeanserver.JmxMBeanServer@2e100ee5
   [junit4]   2> 1553298 INFO  (TEST-TestReplicationHandler.doTestRepeater-seed#[3C79BDD2D611A463]) [    ] o.a.s.c.CorePropertiesLocator Found 1 core definitions underneath /Users/jenkins/workspace/Lucene-Solr-7.x-MacOSX/solr/build/solr-core/test/J1/temp/solr.handler.TestReplicationHandler_3C79BDD2D611A463-001/solr-instance-002/.
   [junit4]   2> 1553298 INFO  (TEST-TestReplicationHandler.doTestRepeater-seed#[3C79BDD2D611A463]) [    ] o.a.s.c.CorePropertiesLocator Cores are: [collection1]
   [junit4]   2> 1553298 INFO  (coreLoadExecutor-6204-thread-1) [    ] o.a.s.c.TransientSolrCoreCacheDefault Allocating transient cache for 4 transient cores
   [junit4]   2> 1553302 INFO  (coreLoadExecutor-6204-thread-1) [    ] o.a.s.c.SolrConfig Using Lucene MatchVersion: 7.2.0
   [junit4]   2> 1553306 INFO  (coreLoadExecutor-6204-thread-1) [    ] o.a.s.s.IndexSchema [collection1] Schema name=test
   [junit4]   2> 1553307 INFO  (coreLoadExecutor-6204-thread-1) [    ] o.a.s.s.IndexSchema Loaded schema test/1.2 with uniqueid field id
   [junit4]   2> 1553307 INFO  (coreLoadExecutor-6204-thread-1) [    ] o.a.s.c.CoreContainer Creating SolrCore 'collection1' using configuration from instancedir /Users/jenkins/workspace/Lucene-Solr-7.x-MacOSX/solr/build/solr-core/test/J1/temp/solr.handler.TestReplicationHandler_3C79BDD2D611A463-001/solr-instance-002/./collection1, trusted=true
   [junit4]   2> 1553307 INFO  (coreLoadExecutor-6204-thread-1) [    ] o.a.s.m.r.SolrJmxReporter JMX monitoring for 'solr.core.collection1' (registry 'solr.core.collection1') enabled at server: com.sun.jmx.mbeanserver.JmxMBeanServer@2e100ee5
   [junit4]   2> 1553307 INFO  (coreLoadExecutor-6204-thread-1) [    ] o.a.s.c.SolrCore solr.RecoveryStrategy.Builder
   [junit4]   2> 1553308 INFO  (coreLoadExecutor-6204-thread-1) [    ] o.a.s.c.SolrCore [[collection1] ] Opening new SolrCore at [/Users/jenkins/workspace/Lucene-Solr-7.x-MacOSX/solr/build/solr-core/test/J1/temp/solr.handler.TestReplicationHandler_3C79BDD2D611A463-001/solr-instance-002/collection1], dataDir=[/Users/jenkins/workspace/Lucene-Solr-7.x-MacOSX/solr/build/solr-core/test/J1/temp/solr.handler.TestReplicationHandler_3C79BDD2D611A463-001/solr-instance-002/./collection1/data/]
   [junit4]   2> 1553310 INFO  (coreLoadExecutor-6204-thread-1) [    ] o.a.s.u.RandomMergePolicy RandomMergePolicy wrapping class org.apache.lucene.index.TieredMergePolicy: [TieredMergePolicy: maxMergeAtOnce=29, maxMergeAtOnceExplicit=39, maxMergedSegmentMB=6.3740234375, floorSegmentMB=0.451171875, forceMergeDeletesPctAllowed=23.350755422085285, segmentsPerTier=12.0, maxCFSSegmentSizeMB=8.796093022207999E12, noCFSRatio=0.4534729295200872
   [junit4]   2> 1553347 INFO  (coreLoadExecutor-6204-thread-1) [    ] o.a.s.u.CommitTracker Hard AutoCommit: disabled
   [junit4]   2> 1553347 INFO  (coreLoadExecutor-6204-thread-1) [    ] o.a.s.u.CommitTracker Soft AutoCommit: disabled
   [junit4]   2> 1553348 INFO  (coreLoadExecutor-6204-thread-1) [    ] o.a.s.u.RandomMergePolicy RandomMergePolicy wrapping class org.apache.lucene.index.AlcoholicMergePolicy: [AlcoholicMergePolicy: minMergeSize=0, mergeFactor=10, maxMergeSize=706327558, maxMergeSizeForForcedMerge=9223372036854775807, calibrateSizeByDeletes=true, maxMergeDocs=2147483647, maxCFSSegmentSizeMB=8.796093022207999E12, noCFSRatio=0.1]
   [junit4]   2> 1553348 INFO  (coreLoadExecutor-6204-thread-1) [    ] o.a.s.s.SolrIndexSearcher Opening [Searcher@31eb9ada[collection1] main]
   [junit4]   2> 1553349 INFO  (coreLoadExecutor-6204-thread-1) [    ] o.a.s.r.ManagedResourceStorage File-based storage initialized to use dir: /Users/jenkins/workspace/Lucene-Solr-7.x-MacOSX/solr/build/solr-core/test/J1/temp/solr.handler.TestReplicationHandler_3C79BDD2D611A463-001/solr-instance-002/collection1/conf
   [junit4]   2> 1553349 INFO  (coreLoadExecutor-6204-thread-1) [    ] o.a.s.h.ReplicationHandler Commits will be reserved for 10000ms.
   [junit4]   2> 1553350 INFO  (searcherExecutor-6205-thread-1) [    ] o.a.s.c.SolrCore [collection1] Registered new searcher Searcher@31eb9ada[collection1] main{ExitableDirectoryReader(UninvertingDirectoryReader())}
   [junit4]   2> 1553351 INFO  (TEST-TestReplicationHandler.doTestRepeater-seed#[3C79BDD2D611A463]) [    ] o.a.s.SolrTestCaseJ4 Writing core.properties file to /Users/jenkins/workspace/Lucene-Solr-7.x-MacOSX/solr/build/solr-core/test/J1/temp/solr.handler.TestReplicationHandler_3C79BDD2D611A463-001/solr-instance-003/collection1
   [junit4]   2> 1553353 INFO  (TEST-TestReplicationHandler.doTestRepeater-seed#[3C79BDD2D611A463]) [    ] o.e.j.s.Server jetty-9.3.20.v20170531
   [junit4]   2> 1553355 INFO  (TEST-TestReplicationHandler.doTestRepeater-seed#[3C79BDD2D611A463]) [    ] o.e.j.s.h.ContextHandler Started o.e.j.s.ServletContextHandler@315a3d48{/solr,null,AVAILABLE}
   [junit4]   2> 1553355 INFO  (TEST-TestReplicationHandler.doTestRepeater-seed#[3C79BDD2D611A463]) [    ] o.e.j.s.AbstractConnector Started ServerConnector@11a751fb{HTTP/1.1,[http/1.1]}{127.0.0.1:59639}
   [junit4]   2> 1553355 INFO  (TEST-TestReplicationHandler.doTestRepeater-seed#[3C79BDD2D611A463]) [    ] o.e.j.s.Server Started @1555127ms
   [junit4]   2> 1553355 INFO  (TEST-TestReplicationHandler.doTestRepeater-seed#[3C79BDD2D611A463]) [    ] o.a.s.c.s.e.JettySolrRunner Jetty properties: {hostContext=/solr, solr.data.dir=/Users/jenkins/workspace/Lucene-Solr-7.x-MacOSX/solr/build/solr-core/test/J1/temp/solr.handler.TestReplicationHandler_3C79BDD2D611A463-001/solr-instance-003/collection1/data, hostPort=59639}
   [junit4]   2> 1553356 ERROR (TEST-TestReplicationHandler.doTestRepeater-seed#[3C79BDD2D611A463]) [    ] o.a.s.u.StartupLoggingUtils Missing Java Option solr.log.dir. Logging may be missing or incomplete.
   [junit4]   2> 1553356 INFO  (TEST-TestReplicationHandler.doTestRepeater-seed#[3C79BDD2D611A463]) [    ] o.a.s.s.SolrDispatchFilter  ___      _       Welcome to Apache Solr™ version 7.2.0
   [junit4]   2> 1553356 INFO  (TEST-TestReplicationHandler.doTestRepeater-seed#[3C79BDD2D611A463]) [    ] o.a.s.s.SolrDispatchFilter / __| ___| |_ _   Starting in standalone mode on port null
   [junit4]   2> 1553356 INFO  (TEST-TestReplicationHandler.doTestRepeater-seed#[3C79BDD2D611A463]) [    ] o.a.s.s.SolrDispatchFilter \__ \/ _ \ | '_|  Install dir: null, Default config dir: null
   [junit4]   2> 1553356 INFO  (TEST-TestReplicationHandler.doTestRepeater-seed#[3C79BDD2D611A463]) [    ] o.a.s.s.SolrDispatchFilter |___/\___/_|_|    Start time: 2017-10-20T14:26:10.583491Z
   [junit4]   2> 1553356 INFO  (TEST-TestReplicationHandler.doTestRepeater-seed#[3C79BDD2D611A463]) [    ] o.a.s.c.SolrXmlConfig Loading container configuration from /Users/jenkins/workspace/Lucene-Solr-7.x-MacOSX/solr/build/solr-core/test/J1/temp/solr.handler.TestReplicationHandler_3C79BDD2D611A463-001/solr-instance-003/solr.xml
   [junit4]   2> 1553356 INFO  (TEST-TestReplicationHandler.doTestRepeater-seed#[3C79BDD2D611A463]) [    ] o.a.s.c.SolrXmlConfig Configuration parameter autoReplicaFailoverWorkLoopDelay is ignored
   [junit4]   2> 1553356 INFO  (TEST-TestReplicationHandler.doTestRepeater-seed#[3C79BDD2D611A463]) [    ] o.a.s.c.SolrXmlConfig Configuration parameter autoReplicaFailoverBadNodeExpiration is ignored
   [junit4]   2> 1553356 INFO  (TEST-TestReplicationHandler.doTestRepeater-seed#[3C79BDD2D611A463]) [    ] o.a.s.c.SolrXmlConfig MBean server found: com.sun.jmx.mbeanserver.JmxMBeanServer@2e100ee5, but no JMX reporters were configured - adding default JMX reporter.
   [junit4]   2> 1553390 INFO  (TEST-TestReplicationHandler.doTestRepeater-seed#[3C79BDD2D611A463]) [    ] o.a.s.m.r.SolrJmxReporter JMX monitoring for 'solr.node' (registry 'solr.node') enabled at server: com.sun.jmx.mbeanserver.JmxMBeanServer@2e100ee5
   [junit4]   2> 1553423 INFO  (TEST-TestReplicationHandler.doTestRepeater-seed#[3C79BDD2D611A463]) [    ] o.a.s.m.r.SolrJmxReporter JMX monitoring for 'solr.jvm' (registry 'solr.jvm') enabled at server: com.sun.jmx.mbeanserver.JmxMBeanServer@2e100ee5
   [junit4]   2> 1553423 INFO  (TEST-TestReplicationHandler.doTestRepeater-seed#[3C79BDD2D611A463]) [    ] o.a.s.m.r.SolrJmxReporter JMX monitoring for 'solr.jetty' (registry 'solr.jetty') enabled at server: com.sun.jmx.mbeanserver.JmxMBeanServer@2e100ee5
   [junit4]   2> 1553425 INFO  (TEST-TestReplicationHandler.doTestRepeater-seed#[3C79BDD2D611A463]) [    ] o.a.s.c.CorePropertiesLocator Found 1 core definitions underneath /Users/jenkins/workspace/Lucene-Solr-7.x-MacOSX/solr/build/solr-core/test/J1/temp/solr.handler.TestReplicationHandler_3C79BDD2D611A463-001/solr-instance-003/.
   [junit4]   2> 1553425 INFO  (TEST-TestReplicationHandler.doTestRepeater-seed#[3C79BDD2D611A463]) [    ] o.a.s.c.CorePropertiesLocator Cores are: [collection1]
   [junit4]   2> 1553425 INFO  (coreLoadExecutor-6214-thread-1) [    ] o.a.s.c.TransientSolrCoreCacheDefault Allocating transient cache for 4 transient cores
   [junit4]   2> 1553431 INFO  (coreLoadExecutor-6214-thread-1) [    ] o.a.s.c.SolrConfig Using Lucene MatchVersion: 7.2.0
   [junit4]   2> 1553436 INFO  (coreLoadExecutor-6214-thread-1) [    ] o.a.s.s.IndexSchema [collection1] Schema name=test
   [junit4]   2> 1553437 INFO  (coreLoadExecutor-6214-thread-1) [    ] o.a.s.s.IndexSchema Loaded schema test/1.2 with uniqueid field id
   [junit4]   2> 1553437 INFO  (coreLoadExecutor-6214-thread-1) [    ] o.a.s.c.CoreContainer Creating SolrCore 'collection1' using configuration from instancedir /Users/jenkins/workspace/Lucene-Solr-7.x-MacOSX/solr/build/solr-core/test/J1/temp/solr.handler.TestReplicationHandler_3C79BDD2D611A463-001/solr-instance-003/./collection1, trusted=true
   [junit4]   2> 1553437 INFO  (coreLoadExecutor-6214-thread-1) [    ] o.a.s.m.r.SolrJmxReporter JMX monitoring for 'solr.core.collection1' (registry 'solr.core.collection1') enabled at server: com.sun.jmx.mbeanserver.JmxMBeanServer@2e100ee5
   [junit4]   2> 1553437 INFO  (coreLoadExecutor-6214-thread-1) [    ] o.a.s.c.SolrCore solr.RecoveryStrategy.Builder
   [junit4]   2> 1553438 INFO  (coreLoadExecutor-6214-thread-1) [    ] o.a.s.c.SolrCore [[collection1] ] Opening new SolrCore at [/Users/jenkins/workspace/Lucene-Solr-7.x-MacOSX/solr/build/solr-core/test/J1/temp/solr.handler.TestReplicationHandler_3C79BDD2D611A463-001/solr-instance-003/collection1], dataDir=[/Users/jenkins/workspace/Lucene-Solr-7.x-MacOSX/solr/build/solr-core/test/J1/temp/solr.handler.TestReplicationHandler_3C79BDD2D611A463-001/solr-instance-003/./collection1/data/]
   [junit4]   2> 1553441 INFO  (coreLoadExecutor-6214-thread-1) [    ] o.a.s.u.RandomMergePolicy RandomMergePolicy wrapping class org.apache.lucene.index.TieredMergePolicy: [TieredMergePolicy: maxMergeAtOnce=29, maxMergeAtOnceExplicit=39, maxMergedSegmentMB=6.3740234375, floorSegmentMB=0.451171875, forceMergeDeletesPctAllowed=23.350755422085285, segmentsPerTier=12.0, maxCFSSegmentSizeMB=8.796093022207999E12, noCFSRatio=0.4534729295200872
   [junit4]   2> 1553491 INFO  (coreLoadExecutor-6214-thread-1) [    ] o.a.s.u.CommitTracker Hard AutoCommit: disabled
   [junit4]   2> 1553491 INFO  (coreLoadExecutor-6214-thread-1) [    ] o.a.s.u.CommitTracker Soft AutoCommit: disabled
   [junit4]   2> 1553492 INFO  (coreLoadExecutor-6214-thread-1) [    ] o.a.s.u.RandomMergePolicy RandomMergePolicy wrapping class org.apache.lucene.index.AlcoholicMergePolicy: [AlcoholicMergePolicy: minMergeSize=0, mergeFactor=10, maxMergeSize=706327558, maxMergeSizeForForcedMerge=9223372036854775807, calibrateSizeByDeletes=true, maxMergeDocs=2147483647, maxCFSSegmentSizeMB=8.796093022207999E12, noCFSRatio=0.1]
   [junit4]   2> 1553492 INFO  (coreLoadExecutor-6214-thread-1) [    ] o.a.s.s.SolrIndexSearcher Opening [Searcher@313008b5[collection1] main]
   [junit4]   2> 1553493 INFO  (coreLoadExecutor-6214-thread-1) [    ] o.a.s.r.ManagedResourceStorage File-based storage initialized to use dir: /Users/jenkins/workspace/Lucene-Solr-7.x-MacOSX/solr/build/solr-core/test/J1/temp/solr.handler.TestReplicationHandler_3C79BDD2D611A463-001/solr-instance-003/collection1/conf
   [junit4]   2> 1553493 WARN  (coreLoadExecutor-6214-thread-1) [    ] o.a.s.h.IndexFetcher 'masterUrl' must be specified without the /replication suffix
   [junit4]   2> 1553494 INFO  (coreLoadExecutor-6214-thread-1) [    ] o.a.s.h.ReplicationHandler  No value set for 'pollInterval'. Timer Task not started.
   [junit4]   2> 1553494 INFO  (coreLoadExecutor-6214-thread-1) [    ] o.a.s.h.ReplicationHandler Replication enabled for following config files: schema.xml
   [junit4]   2> 1553494 INFO  (coreLoadExecutor-6214-thread-1) [    ] o.a.s.h.ReplicationHandler Commits will be reserved for 10000ms.
   [junit4]   2> 1553495 INFO  (searcherExecutor-6215-thread-1) [    ] o.a.s.c.SolrCore [collection1] Registered new searcher Searcher@313008b5[collection1] main{ExitableDirectoryReader(UninvertingDirectoryReader())}
   [junit4]   2> 1553498 INFO  (qtp1640737036-12847) [    ] o.a.s.u.p.LogUpdateProcessorFactory [collection1]  webapp=/solr path=/update params={wt=javabin&version=2}{add=[0]} 0 0
   [junit4]   2> 1553499 INFO  (qtp1640737036-12849) [    ] o.a.s.u.p.LogUpdateProcessorFactory [collection1]  webapp=/solr path=/update params={wt=javabin&version=2}{add=[1]} 0 0
   [junit4]   2> 1553499 INFO  (qtp1640737036-12849) [    ] o.a.s.u.p.LogUpdateProcessorFactory [collection1]  webapp=/solr path=/update params={wt=javabin&version=2}{add=[2]} 0 0
   [junit4]   2> 1553500 INFO  (qtp1640737036-12849) [    ] o.a.s.u.DirectUpdateHandler2 start commit{,optimize=false,openSearcher=true,waitSearcher=true,expungeDeletes=false,softCommit=false,prepareCommit=false}
   [junit4]   2> 1553500 INFO  (qtp1640737036-12849) [    ] o.a.s.u.SolrIndexWriter Calling setCommitData with IW:org.apache.solr.update.SolrIndexWriter@699b57e0 commitCommandVersion:0
   [junit4]   2> 1553501 INFO  (qtp1640737036-12849) [    ] o.a.s.s.SolrIndexSearcher Opening [Searcher@2a82fd6b[collection1] main]
   [junit4]   2> 1553502 INFO  (qtp1640737036-12849) [    ] o.a.s.u.DirectUpdateHandler2 end_commit_flush
   [junit4]   2> 1553503 INFO  (searcherExecutor-6182-thread-1) [    ] o.a.s.c.SolrCore [collection1] Registered new searcher Searcher@2a82fd6b[collection1] main{ExitableDirectoryReader(UninvertingDirectoryReader(Uninverting(_0(7.2.0):c3)))}
   [junit4]   2> 1553503 INFO  (qtp1640737036-12849) [    ] o.a.s.u.p.LogUpdateProcessorFactory [collection1]  webapp=/solr path=/update params={waitSearcher=true&commit=true&softCommit=false&wt=javabin&version=2}{commit=} 0 3
   [junit4]   2> 1553507 WARN  (explicit-fetchindex-cmd) [    ] o.a.s.h.IndexFetcher 'masterUrl' must be specified without the /replication suffix
   [junit4]   2> 1553508 INFO  (qtp1640737036-12846) [    ] o.a.s.c.S.Request [collection1]  webapp=/solr path=/replication params={qt=/replication&wt=javabin&version=2&command=indexversion} status=0 QTime=0
   [junit4]   2> 1553508 INFO  (explicit-fetchindex-cmd) [    ] o.a.s.h.IndexFetcher Master's generation: 2
   [junit4]   2> 1553508 INFO  (explicit-fetchindex-cmd) [    ] o.a.s.h.IndexFetcher Master's version: 1508509570727
   [junit4]   2> 1553508 INFO  (explicit-fetchindex-cmd) [    ] o.a.s.h.IndexFetcher Slave's generation: 1
   [junit4]   2> 1553508 INFO  (explicit-fetchindex-cmd) [    ] o.a.s.h.IndexFetcher Slave's version: 0
   [junit4]   2> 1553508 INFO  (explicit-fetchindex-cmd) [    ] o.a.s.h.IndexFetcher Starting replication process
   [junit4]   2> 1553518 INFO  (qtp1640737036-12848) [    ] o.a.s.c.S.Request [collection1]  webapp=/solr path=/replication params={generation=2&qt=/replication&wt=javabin&version=2&command=filelist} status=0 QTime=9
   [junit4]   2> 1553519 INFO  (explicit-fetchindex-cmd) [    ] o.a.s.h.IndexFetcher Number of files in latest index in master: 4
   [junit4]   2> 1553519 INFO  (explicit-fetchindex-cmd) [    ] o.a.s.u.RandomMergePolicy RandomMergePolicy wrapping class org.apache.lucene.index.AlcoholicMergePolicy: [AlcoholicMergePolicy: minMergeSize=0, mergeFactor=10, maxMergeSize=1452271016, maxMergeSizeForForcedMerge=9223372036854775807, calibrateSizeByDeletes=true, maxMergeDocs=2147483647, maxCFSSegmentSizeMB=8.796093022207999E12, noCFSRatio=0.1]
   [junit4]   2> 1553520 INFO  (explicit-fetchindex-cmd) [    ] o.a.s.u.DefaultSolrCoreState New IndexWriter is ready to be used.
   [junit4]   2> 1553520 INFO  (explicit-fetchindex-cmd) [    ] o.a.s.h.IndexFetcher Starting download (fullCopy=false) to MockDirectoryWrapper(RAMDirectory@e8900cd lockFactory=org.apache.lucene.store.SingleInstanceLockFactory@7ebb75a7)
   [junit4]   2> 1553520 INFO  (qtp1640737036-12847) [    ] o.a.s.c.S.Request [collection1]  webapp=/solr path=/replication params={generation=2&qt=/replication&file=_0.cfe&checksum=true&wt=filestream&command=filecontent} status=0 QTime=0
   [junit4]   2> 1553521 INFO  (qtp1640737036-12850) [    ] o.a.s.c.S.Request [collection1]  webapp=/solr path=/replication params={generation=2&qt=/replication&file=_0.si&checksum=true&wt=filestream&command=filecontent} status=0 QTime=0
   [junit4]   2> 1553523 INFO  (qtp1640737036-12843) [    ] o.a.s.c.S.Request [collection1]  webapp=/solr path=/replication params={generation=2&qt=/replication&file=_0.cfs&checksum=true&wt=filestream&command=filecontent} status=0 QTime=0
   [junit4]   2> 1553524 INFO  (qtp1640737036-12849) [    ] o.a.s.c.S.Request [collection1]  webapp=/solr path=/replication params={generation=2&qt=/replication&file=segments_2&checksum=true&wt=filestream&command=filecontent} status=0 QTime=0
   [junit4]   2> 1553524 INFO  (explicit-fetchindex-cmd) [    ] o.a.s.h.IndexFetcher Total time taken for download (fullCopy=false,bytesDownloaded=1974) : 0 secs (null bytes/sec) to MockDirectoryWrapper(RAMDirectory@e8900cd lockFactory=org.apache.lucene.store.SingleInstanceLockFactory@7ebb75a7)
   [junit4]   2> 1553525 INFO  (explicit-fetchindex-cmd) [    ] o.a.s.u.RandomMergePolicy RandomMergePolicy wrapping class org.apache.lucene.index.LogDocMergePolicy: [LogDocMergePolicy: minMergeSize=1000, mergeFactor=46, maxMergeSize=9223372036854775807, maxMergeSizeForForcedMerge=9223372036854775807, calibrateSizeByDeletes=false, maxMergeDocs=2147483647, maxCFSSegmentSizeMB=8.796093022207999E12, noCFSRatio=0.850104913776834]
   [junit4]   2> 1553525 INFO  (explicit-fetchindex-cmd) [    ] o.a.s.u.DefaultSolrCoreState New IndexWriter is ready to be used.
   [junit4]   2> 1553526 INFO  (explicit-fetchindex-cmd) [    ] o.a.s.s.SolrIndexSearcher Opening [Searcher@6b55c21a[collection1] main]
   [junit4]   2> 1553527 INFO  (searcherExecutor-6215-thread-1) [    ] o.a.s.c.SolrCore [collection1] Registered new searcher Searcher@6b55c21a[collection1] main{ExitableDirectoryReader(UninvertingDirectoryReader(Uninverting(_0(7.2.0):c3)))}
   [junit4]   2> 1553527 INFO  (qtp512094973-12900) [    ] o.a.s.c.S.Request [collection1]  webapp=/solr path=/replication params={wait=true&masterUrl=http://127.0.0.1:59635/solr/collection1/replication&command=fetchindex} status=0 QTime=20
   [junit4]   2> 1553530 INFO  (qtp512094973-12902) [    ] o.a.s.c.S.Request [collection1]  webapp=/solr path=/select params={q=*:*&sort=id+desc&wt=javabin&version=2} hits=3 status=0 QTime=0
   [junit4]   2> 1553530 INFO  (TEST-TestReplicationHandler.doTestRepeater-seed#[3C79BDD2D611A463]) [    ] o.a.s.h.TestReplicationHandler Waited for 0ms and found 3 docs
   [junit4]   2> 1553532 WARN  (explicit-fetchindex-cmd) [    ] o.a.s.h.IndexFetcher 'masterUrl' must be specified without the /replication suffix
   [junit4]   2> 1553534 INFO  (qtp512094973-12903) [    ] o.a.s.c.S.Request [collection1]  webapp=/solr path=/replication params={qt=/replication&wt=javabin&version=2&command=indexversion} status=0 QTime=0
   [junit4]   2> 1553534 INFO  (explicit-fetchindex-cmd) [    ] o.a.s.h.IndexFetcher Master's generation: 2
   [junit4]   2> 1553534 INFO  (explicit-fetchindex-cmd) [    ] o.a.s.h.IndexFetcher Master's version: 1508509570727
   [junit4]   2> 1553534 INFO  (explicit-fetchindex-cmd) [    ] o.a.s.h.IndexFetcher Slave's generation: 1
   [junit4]   2> 1553534 INFO  (explicit-fetchindex-cmd) [    ] o.a.s.h.IndexFetcher Slave's version: 0
   [junit4]   2> 1553534 INFO  (explicit-fetchindex-cmd) [    ] o.a.s.h.IndexFetcher Starting replication process
   [junit4]   2> 1553535 INFO  (qtp512094973-12905) [    ] o.a.s.c.S.Request [collection1]  webapp=/solr path=/replication params={generation=2&qt=/replication&wt=javabin&version=2&command=filelist} status=0 QTime=0
   [junit4]   2> 1553536 INFO  (explicit-fetchindex-cmd) [    ] o.a.s.h.IndexFetcher Number of files in latest index in master: 4
   [junit4]   2> 1553536 INFO  (explicit-fetchindex-cmd) [    ] o.a.s.u.RandomMergePolicy RandomMergePolicy wrapping class org.apache.lucene.index.AlcoholicMergePolicy: [AlcoholicMergePolicy: minMergeSize=0, mergeFactor=10, maxMergeSize=1452271016, maxMergeSizeForForcedMerge=9223372036854775807, calibrateSizeByDeletes=true, maxMergeDocs=2147483647, maxCFSSegmentSizeMB=8.796093022207999E12, noCFSRatio=0.1]
   [junit4]   2> 1553537 INFO  (explicit-fetchindex-cmd) [    ] o.a.s.u.DefaultSolrCoreState New IndexWriter is ready to be used.
   [junit4]   2> 1553537 INFO  (explicit-fetchindex-cmd) [    ] o.a.s.h.IndexFetcher Starting download (fullCopy=false) to MockDirectoryWrapper(RAMDirectory@2174f408 lockFactory=org.apache.lucene.store.SingleInstanceLockFactory@729d8b76)
   [junit4]   2> 1553538 INFO  (qtp512094973-12898) [    ] o.a.s.c.S.Request [collection1]  webapp=/solr path=/replication params={generation=2&qt=/replication&file=_0.cfe&checksum=true&wt=filestream&command=filecontent} status=0 QTime=0
   [junit4]   2> 1553539 INFO  (qtp512094973-12900) [    ] o.a.s.c.S.Request [collection1]  webapp=/solr path=/replication params={generation=2&qt=/replication&file=_0.si&checksum=true&wt=filestream&command=filecontent} status=0 QTime=0
   [junit4]   2> 1553540 INFO  (qtp512094973-12901) [    ] o.a.s.c.S.Request [collection1]  webapp=/solr path=/replication params={generation=2&qt=/replication&file=_0.cfs&checksum=true&wt=filestream&command=filecontent} status=0 QTime=0
   [junit4]   2> 1553541 INFO  (qtp512094973-12902) [    ] o.a.s.c.S.Request [collection1]  webapp=/solr path=/replication params={generation=2&qt=/replication&file=segments_2&checksum=true&wt=filestream&command=filecontent} status=0 QTime=0
   [junit4]   2> 1553542 INFO  (explicit-fetchindex-cmd) [    ] o.a.s.h.IndexFetcher Total time taken for download (fullCopy=false,bytesDownloaded=1974) : 0 secs (null bytes/sec) to MockDirectoryWrapper(RAMDirectory@2174f408 lockFactory=org.apache.lucene.store.SingleInstanceLockFactory@729d8b76)
   [junit4]   2> 1553543 INFO  (explicit-fetchindex-cmd) [    ] o.a.s.u.RandomMergePolicy RandomMergePolicy wrapping class org.apache.lucene.index.LogDocMergePolicy: [LogDocMergePolicy: minMergeSize=1000, mergeFactor=46, maxMergeSize=9223372036854775807, maxMergeSizeForForcedMerge=9223372036854775807, calibrateSizeByDeletes=false, maxMergeDocs=2147483647, maxCFSSegmentSizeMB=8.796093022207999E12, noCFSRatio=0.850104913776834]
   [junit4]   2> 1553543 INFO  (explicit-fetchindex-cmd) [    ] o.a.s.u.DefaultSolrCoreState New IndexWriter is ready to be used.
   [junit4]   2> 1553543 INFO  (explicit-fetchindex-cmd) [    ] o.a.s.s.SolrIndexSearcher Opening [Searcher@3ea6a41c[collection1] main]
   [junit4]   2> 1553545 INFO  (searcherExecutor-6205-thread-1) [    ] o.a.s.c.SolrCore [collection1] Registered new searcher Searcher@3ea6a41c[collection1] main{ExitableDirectoryReader(UninvertingDirectoryReader(Uninverting(_0(7.2.0):c3)))}
   [junit4]   2> 1553545 INFO  (qtp846608072-12883) [    ] o.a.s.c.S.Request [collection1]  webapp=/solr path=/replication params={wait=true&masterUrl=http://127.0.0.1:59639/solr/collection1/replication&command=fetchindex} status=0 QTime=13
   [junit4]   2> 1553547 INFO  (qtp846608072-12885) [    ] o.a.s.c.S.Request [collection1]  webapp=/solr path=/select params={q=*:*&sort=id+desc&wt=javabin&version=2} hits=3 status=0 QTime=0
   [junit4]   2> 1553548 INFO  (TEST-TestReplicationHandler.doTestRepeater-seed#[3C79BDD2D611A463]) [    ] o.a.s.h.TestReplicationHandler Waited for 0ms and found 3 docs
   [junit4]   2> 1553548 INFO  (qtp1640737036-12845) [    ] o.a.s.c.S.Request [collection1]  webapp=/solr path=/replication params={_trace=getDetails&qt=/replication&wt=javabin&version=2&command=details} status=0 QTime=0
   [junit4]   2> 1553549 INFO  (qtp1640737036-12846) [    ] o.a.s.c.S.Request [collection1]  webapp=/solr path=/replication params={_trace=getDetails&qt=/replication&wt=javabin&version=2&command=details} status=0 QTime=0
   [junit4]   2> 1553551 WARN  (qtp512094973-12904) [    ] o.a.s.h.ReplicationHandler Exception while invoking 'details' method for replication on master 
   [junit4]   2> org.apache.solr.client.solrj.SolrServerException: Server refused connection at: http://127.0.0.1:TEST_PORT/solr
   [junit4]   2> 	at org.apache.solr.client.solrj.impl.HttpSolrClient.executeMethod(HttpSolrClient.java:633)
   [junit4]   2> 	at org.apache.solr.client.solrj.impl.HttpSolrClient.request(HttpSolrClient.java:253)
   [junit4]   2> 	at org.apache.solr.client.solrj.impl.HttpSolrClient.request(HttpSolrClient.java:242)
   [junit4]   2> 	at org.apache.solr.client.solrj.SolrClient.request(SolrClient.java:1219)
   [junit4]   2> 	at org.apache.solr.handler.IndexFetcher.getDetails(IndexFetcher.java:1823)
   [junit4]   2> 	at org.apache.solr.handler.ReplicationHandler.getReplicationDetails(ReplicationHandler.java:954)
   [junit4]   2> 	at org.apache.solr.handler.ReplicationHandler.handleRequestBody(ReplicationHandler.java:332)
   [junit4]   2> 	at org.apache.solr.handler.RequestHandlerBase.handleRequest(RequestHandlerBase.java:177)
   [junit4]   2> 	at org.apache.solr.core.SolrCore.execute(SolrCore.java:2484)
   [junit4]   2> 	at org.apache.solr.servlet.HttpSolrCall.execute(HttpSolrCall.java:710)
   [junit4]   2> 	at org.apache.solr.servlet.HttpSolrCall.call(HttpSolrCall.java:516)
   [junit4]   2> 	at org.apache.solr.servlet.SolrDispatchFilter.doFilter(SolrDispatchFilter.java:382)
   [junit4]   2> 	at org.apache.solr.servlet.SolrDispatchFilter.doFilter(SolrDispatchFilter.java:326)
   [junit4]   2> 	at org.eclipse.jetty.servlet.ServletHandler$CachedChain.doFilter(ServletHandler.java:1759)
   [junit4]   2> 	at org.apache.solr.client.solrj.embedded.JettySolrRunner$DebugFilter.doFilter(JettySolrRunner.java:139)
   [junit4]   2> 	at org.eclipse.jetty.servlet.ServletHandler$CachedChain.doFilter(ServletHandler.java:1759)
   [junit4]   2> 	at org.eclipse.jetty.servlet.ServletHandler.doHandle(ServletHandler.java:582)
   [junit4]   2> 	at org.eclipse.jetty.server.session.SessionHandler.doHandle(SessionHandler.java:224)
   [junit4]   2> 	at org.eclipse.jetty.server.handler.ContextHandler.doHandle(ContextHandler.java:1180)
   [junit4]   2> 	at org.eclipse.jetty.servlet.ServletHandler.doScope(ServletHandler.java:512)
   [junit4]   2> 	at org.eclipse.jetty.server.session.SessionHandler.doScope(S

[...truncated too long message...]

M J1: stderr was not empty, see: /Users/jenkins/workspace/Lucene-Solr-7.x-MacOSX/solr/build/solr-solrj/test/temp/junit4-J1-20171020_145633_1621992230525010294175.syserr
   [junit4] >>> JVM J1 emitted unexpected output (verbatim) ----
   [junit4] Java HotSpot(TM) 64-Bit Server VM warning: Option UseConcMarkSweepGC was deprecated in version 9.0 and will likely be removed in a future release.
   [junit4] <<< JVM J1: EOF ----

   [junit4] JVM J0: stderr was not empty, see: /Users/jenkins/workspace/Lucene-Solr-7.x-MacOSX/solr/build/solr-solrj/test/temp/junit4-J0-20171020_145633_1627832236393933047185.syserr
   [junit4] >>> JVM J0 emitted unexpected output (verbatim) ----
   [junit4] Java HotSpot(TM) 64-Bit Server VM warning: Option UseConcMarkSweepGC was deprecated in version 9.0 and will likely be removed in a future release.
   [junit4] <<< JVM J0: EOF ----

[...truncated 1359 lines...]
   [junit4] JVM J0: stderr was not empty, see: /Users/jenkins/workspace/Lucene-Solr-7.x-MacOSX/solr/build/contrib/solr-analysis-extras/test/temp/junit4-J0-20171020_150019_91910169535783069023622.syserr
   [junit4] >>> JVM J0 emitted unexpected output (verbatim) ----
   [junit4] Java HotSpot(TM) 64-Bit Server VM warning: Option UseConcMarkSweepGC was deprecated in version 9.0 and will likely be removed in a future release.
   [junit4] <<< JVM J0: EOF ----

[...truncated 3 lines...]
   [junit4] JVM J1: stderr was not empty, see: /Users/jenkins/workspace/Lucene-Solr-7.x-MacOSX/solr/build/contrib/solr-analysis-extras/test/temp/junit4-J1-20171020_150019_91916130277380564249179.syserr
   [junit4] >>> JVM J1 emitted unexpected output (verbatim) ----
   [junit4] Java HotSpot(TM) 64-Bit Server VM warning: Option UseConcMarkSweepGC was deprecated in version 9.0 and will likely be removed in a future release.
   [junit4] <<< JVM J1: EOF ----

[...truncated 781 lines...]
   [junit4] JVM J0: stderr was not empty, see: /Users/jenkins/workspace/Lucene-Solr-7.x-MacOSX/solr/build/contrib/solr-analytics/test/temp/junit4-J0-20171020_150042_62718407888290586962318.syserr
   [junit4] >>> JVM J0 emitted unexpected output (verbatim) ----
   [junit4] Java HotSpot(TM) 64-Bit Server VM warning: Option UseConcMarkSweepGC was deprecated in version 9.0 and will likely be removed in a future release.
   [junit4] <<< JVM J0: EOF ----

[...truncated 3 lines...]
   [junit4] JVM J1: stderr was not empty, see: /Users/jenkins/workspace/Lucene-Solr-7.x-MacOSX/solr/build/contrib/solr-analytics/test/temp/junit4-J1-20171020_150042_6279626484401040979747.syserr
   [junit4] >>> JVM J1 emitted unexpected output (verbatim) ----
   [junit4] Java HotSpot(TM) 64-Bit Server VM warning: Option UseConcMarkSweepGC was deprecated in version 9.0 and will likely be removed in a future release.
   [junit4] <<< JVM J1: EOF ----

[...truncated 553 lines...]
   [junit4] JVM J1: stderr was not empty, see: /Users/jenkins/workspace/Lucene-Solr-7.x-MacOSX/solr/build/contrib/solr-clustering/test/temp/junit4-J1-20171020_150154_91911457194581686342796.syserr
   [junit4] >>> JVM J1 emitted unexpected output (verbatim) ----
   [junit4] Java HotSpot(TM) 64-Bit Server VM warning: Option UseConcMarkSweepGC was deprecated in version 9.0 and will likely be removed in a future release.
   [junit4] <<< JVM J1: EOF ----

[...truncated 3 lines...]
   [junit4] JVM J0: stderr was not empty, see: /Users/jenkins/workspace/Lucene-Solr-7.x-MacOSX/solr/build/contrib/solr-clustering/test/temp/junit4-J0-20171020_150154_91911774214055240879088.syserr
   [junit4] >>> JVM J0 emitted unexpected output (verbatim) ----
   [junit4] Java HotSpot(TM) 64-Bit Server VM warning: Option UseConcMarkSweepGC was deprecated in version 9.0 and will likely be removed in a future release.
   [junit4] <<< JVM J0: EOF ----

[...truncated 1257 lines...]
   [junit4] JVM J1: stderr was not empty, see: /Users/jenkins/workspace/Lucene-Solr-7.x-MacOSX/solr/build/contrib/solr-dataimporthandler-extras/test/temp/junit4-J1-20171020_150221_3499817895372293447807.syserr
   [junit4] >>> JVM J1 emitted unexpected output (verbatim) ----
   [junit4] Java HotSpot(TM) 64-Bit Server VM warning: Option UseConcMarkSweepGC was deprecated in version 9.0 and will likely be removed in a future release.
   [junit4] <<< JVM J1: EOF ----

[...truncated 3 lines...]
   [junit4] JVM J0: stderr was not empty, see: /Users/jenkins/workspace/Lucene-Solr-7.x-MacOSX/solr/build/contrib/solr-dataimporthandler-extras/test/temp/junit4-J0-20171020_150221_34916393416931191627415.syserr
   [junit4] >>> JVM J0 emitted unexpected output (verbatim) ----
   [junit4] Java HotSpot(TM) 64-Bit Server VM warning: Option UseConcMarkSweepGC was deprecated in version 9.0 and will likely be removed in a future release.
   [junit4] <<< JVM J0: EOF ----

[...truncated 649 lines...]
   [junit4] JVM J0: stderr was not empty, see: /Users/jenkins/workspace/Lucene-Solr-7.x-MacOSX/solr/build/contrib/solr-dataimporthandler/test/temp/junit4-J0-20171020_150232_3931654956093685455702.syserr
   [junit4] >>> JVM J0 emitted unexpected output (verbatim) ----
   [junit4] Java HotSpot(TM) 64-Bit Server VM warning: Option UseConcMarkSweepGC was deprecated in version 9.0 and will likely be removed in a future release.
   [junit4] <<< JVM J0: EOF ----

   [junit4] JVM J1: stderr was not empty, see: /Users/jenkins/workspace/Lucene-Solr-7.x-MacOSX/solr/build/contrib/solr-dataimporthandler/test/temp/junit4-J1-20171020_150232_39316824488829711585830.syserr
   [junit4] >>> JVM J1 emitted unexpected output (verbatim) ----
   [junit4] Java HotSpot(TM) 64-Bit Server VM warning: Option UseConcMarkSweepGC was deprecated in version 9.0 and will likely be removed in a future release.
   [junit4] <<< JVM J1: EOF ----

[...truncated 554 lines...]
   [junit4] JVM J1: stderr was not empty, see: /Users/jenkins/workspace/Lucene-Solr-7.x-MacOSX/solr/build/contrib/solr-cell/test/temp/junit4-J1-20171020_150301_89213073145095306797854.syserr
   [junit4] >>> JVM J1 emitted unexpected output (verbatim) ----
   [junit4] Java HotSpot(TM) 64-Bit Server VM warning: Option UseConcMarkSweepGC was deprecated in version 9.0 and will likely be removed in a future release.
   [junit4] <<< JVM J1: EOF ----

[...truncated 6 lines...]
   [junit4] JVM J0: stderr was not empty, see: /Users/jenkins/workspace/Lucene-Solr-7.x-MacOSX/solr/build/contrib/solr-cell/test/temp/junit4-J0-20171020_150301_89218440810493098333056.syserr
   [junit4] >>> JVM J0 emitted unexpected output (verbatim) ----
   [junit4] Java HotSpot(TM) 64-Bit Server VM warning: Option UseConcMarkSweepGC was deprecated in version 9.0 and will likely be removed in a future release.
   [junit4] <<< JVM J0: EOF ----

[...truncated 561 lines...]
   [junit4] JVM J1: stderr was not empty, see: /Users/jenkins/workspace/Lucene-Solr-7.x-MacOSX/solr/build/contrib/solr-langid/test/temp/junit4-J1-20171020_150319_6007013395703585754722.syserr
   [junit4] >>> JVM J1 emitted unexpected output (verbatim) ----
   [junit4] Java HotSpot(TM) 64-Bit Server VM warning: Option UseConcMarkSweepGC was deprecated in version 9.0 and will likely be removed in a future release.
   [junit4] <<< JVM J1: EOF ----

   [junit4] JVM J0: stderr was not empty, see: /Users/jenkins/workspace/Lucene-Solr-7.x-MacOSX/solr/build/contrib/solr-langid/test/temp/junit4-J0-20171020_150319_59917964036047792832359.syserr
   [junit4] >>> JVM J0 emitted unexpected output (verbatim) ----
   [junit4] Java HotSpot(TM) 64-Bit Server VM warning: Option UseConcMarkSweepGC was deprecated in version 9.0 and will likely be removed in a future release.
   [junit4] <<< JVM J0: EOF ----

[...truncated 648 lines...]
   [junit4] JVM J1: stderr was not empty, see: /Users/jenkins/workspace/Lucene-Solr-7.x-MacOSX/solr/build/contrib/solr-ltr/test/temp/junit4-J1-20171020_150329_5452306211907977042760.syserr
   [junit4] >>> JVM J1 emitted unexpected output (verbatim) ----
   [junit4] Java HotSpot(TM) 64-Bit Server VM warning: Option UseConcMarkSweepGC was deprecated in version 9.0 and will likely be removed in a future release.
   [junit4] <<< JVM J1: EOF ----

[...truncated 3 lines...]
   [junit4] JVM J0: stderr was not empty, see: /Users/jenkins/workspace/Lucene-Solr-7.x-MacOSX/solr/build/contrib/solr-ltr/test/temp/junit4-J0-20171020_150329_5452049355431775449514.syserr
   [junit4] >>> JVM J0 emitted unexpected output (verbatim) ----
   [junit4] Java HotSpot(TM) 64-Bit Server VM warning: Option UseConcMarkSweepGC was deprecated in version 9.0 and will likely be removed in a future release.
   [junit4] <<< JVM J0: EOF ----

[...truncated 595 lines...]
   [junit4] JVM J1: stderr was not empty, see: /Users/jenkins/workspace/Lucene-Solr-7.x-MacOSX/solr/build/contrib/solr-uima/test/temp/junit4-J1-20171020_150404_36715182995924690638591.syserr
   [junit4] >>> JVM J1 emitted unexpected output (verbatim) ----
   [junit4] Java HotSpot(TM) 64-Bit Server VM warning: Option UseConcMarkSweepGC was deprecated in version 9.0 and will likely be removed in a future release.
   [junit4] <<< JVM J1: EOF ----

[...truncated 3 lines...]
   [junit4] JVM J0: stderr was not empty, see: /Users/jenkins/workspace/Lucene-Solr-7.x-MacOSX/solr/build/contrib/solr-uima/test/temp/junit4-J0-20171020_150404_36714756907635421829974.syserr
   [junit4] >>> JVM J0 emitted unexpected output (verbatim) ----
   [junit4] Java HotSpot(TM) 64-Bit Server VM warning: Option UseConcMarkSweepGC was deprecated in version 9.0 and will likely be removed in a future release.
   [junit4] <<< JVM J0: EOF ----

[...truncated 548 lines...]
   [junit4] JVM J0: stderr was not empty, see: /Users/jenkins/workspace/Lucene-Solr-7.x-MacOSX/solr/build/contrib/solr-velocity/test/temp/junit4-J0-20171020_150431_137177423656737162827.syserr
   [junit4] >>> JVM J0 emitted unexpected output (verbatim) ----
   [junit4] Java HotSpot(TM) 64-Bit Server VM warning: Option UseConcMarkSweepGC was deprecated in version 9.0 and will likely be removed in a future release.
   [junit4] <<< JVM J0: EOF ----

[...truncated 31627 lines...]

Mime
View raw message