lucene-dev mailing list archives

Site index · List index
Message view « Date » · « Thread »
Top « Date » · « Thread »
From Policeman Jenkins Server <jenk...@thetaphi.de>
Subject [JENKINS] Lucene-Solr-7.x-Solaris (64bit/jdk1.8.0) - Build # 255 - Still Unstable!
Date Sun, 22 Oct 2017 09:23:33 GMT
Build: https://jenkins.thetaphi.de/job/Lucene-Solr-7.x-Solaris/255/
Java: 64bit/jdk1.8.0 -XX:-UseCompressedOops -XX:+UseParallelGC

3 tests failed.
FAILED:  org.apache.solr.cloud.TestConfigSetsAPI.testUploadErrors

Error Message:
java.util.concurrent.TimeoutException: Could not connect to ZooKeeper 127.0.0.1:44033 within 30000 ms

Stack Trace:
org.apache.solr.common.SolrException: java.util.concurrent.TimeoutException: Could not connect to ZooKeeper 127.0.0.1:44033 within 30000 ms
	at org.apache.solr.common.cloud.SolrZkClient.<init>(SolrZkClient.java:183)
	at org.apache.solr.common.cloud.SolrZkClient.<init>(SolrZkClient.java:117)
	at org.apache.solr.common.cloud.SolrZkClient.<init>(SolrZkClient.java:112)
	at org.apache.solr.common.cloud.SolrZkClient.<init>(SolrZkClient.java:99)
	at org.apache.solr.cloud.MiniSolrCloudCluster.<init>(MiniSolrCloudCluster.java:232)
	at org.apache.solr.cloud.MiniSolrCloudCluster.<init>(MiniSolrCloudCluster.java:195)
	at org.apache.solr.cloud.MiniSolrCloudCluster.<init>(MiniSolrCloudCluster.java:122)
	at org.apache.solr.cloud.TestConfigSetsAPI.setUp(TestConfigSetsAPI.java:115)
	at sun.reflect.NativeMethodAccessorImpl.invoke0(Native Method)
	at sun.reflect.NativeMethodAccessorImpl.invoke(NativeMethodAccessorImpl.java:62)
	at sun.reflect.DelegatingMethodAccessorImpl.invoke(DelegatingMethodAccessorImpl.java:43)
	at java.lang.reflect.Method.invoke(Method.java:498)
	at com.carrotsearch.randomizedtesting.RandomizedRunner.invoke(RandomizedRunner.java:1737)
	at com.carrotsearch.randomizedtesting.RandomizedRunner$9.evaluate(RandomizedRunner.java:968)
	at com.carrotsearch.randomizedtesting.RandomizedRunner$10.evaluate(RandomizedRunner.java:984)
	at com.carrotsearch.randomizedtesting.rules.SystemPropertiesRestoreRule$1.evaluate(SystemPropertiesRestoreRule.java:57)
	at org.apache.lucene.util.TestRuleSetupTeardownChained$1.evaluate(TestRuleSetupTeardownChained.java:49)
	at org.apache.lucene.util.AbstractBeforeAfterRule$1.evaluate(AbstractBeforeAfterRule.java:45)
	at org.apache.lucene.util.TestRuleThreadAndTestName$1.evaluate(TestRuleThreadAndTestName.java:48)
	at org.apache.lucene.util.TestRuleIgnoreAfterMaxFailures$1.evaluate(TestRuleIgnoreAfterMaxFailures.java:64)
	at org.apache.lucene.util.TestRuleMarkFailure$1.evaluate(TestRuleMarkFailure.java:47)
	at com.carrotsearch.randomizedtesting.rules.StatementAdapter.evaluate(StatementAdapter.java:36)
	at com.carrotsearch.randomizedtesting.ThreadLeakControl$StatementRunner.run(ThreadLeakControl.java:368)
	at com.carrotsearch.randomizedtesting.ThreadLeakControl.forkTimeoutingTask(ThreadLeakControl.java:817)
	at com.carrotsearch.randomizedtesting.ThreadLeakControl$3.evaluate(ThreadLeakControl.java:468)
	at com.carrotsearch.randomizedtesting.RandomizedRunner.runSingleTest(RandomizedRunner.java:943)
	at com.carrotsearch.randomizedtesting.RandomizedRunner$5.evaluate(RandomizedRunner.java:829)
	at com.carrotsearch.randomizedtesting.RandomizedRunner$6.evaluate(RandomizedRunner.java:879)
	at com.carrotsearch.randomizedtesting.RandomizedRunner$7.evaluate(RandomizedRunner.java:890)
	at com.carrotsearch.randomizedtesting.rules.StatementAdapter.evaluate(StatementAdapter.java:36)
	at com.carrotsearch.randomizedtesting.rules.SystemPropertiesRestoreRule$1.evaluate(SystemPropertiesRestoreRule.java:57)
	at org.apache.lucene.util.AbstractBeforeAfterRule$1.evaluate(AbstractBeforeAfterRule.java:45)
	at com.carrotsearch.randomizedtesting.rules.StatementAdapter.evaluate(StatementAdapter.java:36)
	at org.apache.lucene.util.TestRuleStoreClassName$1.evaluate(TestRuleStoreClassName.java:41)
	at com.carrotsearch.randomizedtesting.rules.NoShadowingOrOverridesOnMethodsRule$1.evaluate(NoShadowingOrOverridesOnMethodsRule.java:40)
	at com.carrotsearch.randomizedtesting.rules.NoShadowingOrOverridesOnMethodsRule$1.evaluate(NoShadowingOrOverridesOnMethodsRule.java:40)
	at com.carrotsearch.randomizedtesting.rules.StatementAdapter.evaluate(StatementAdapter.java:36)
	at com.carrotsearch.randomizedtesting.rules.StatementAdapter.evaluate(StatementAdapter.java:36)
	at com.carrotsearch.randomizedtesting.rules.StatementAdapter.evaluate(StatementAdapter.java:36)
	at org.apache.lucene.util.TestRuleAssertionsRequired$1.evaluate(TestRuleAssertionsRequired.java:53)
	at org.apache.lucene.util.TestRuleMarkFailure$1.evaluate(TestRuleMarkFailure.java:47)
	at org.apache.lucene.util.TestRuleIgnoreAfterMaxFailures$1.evaluate(TestRuleIgnoreAfterMaxFailures.java:64)
	at org.apache.lucene.util.TestRuleIgnoreTestSuites$1.evaluate(TestRuleIgnoreTestSuites.java:54)
	at com.carrotsearch.randomizedtesting.rules.StatementAdapter.evaluate(StatementAdapter.java:36)
	at com.carrotsearch.randomizedtesting.ThreadLeakControl$StatementRunner.run(ThreadLeakControl.java:368)
	at java.lang.Thread.run(Thread.java:748)
Caused by: java.util.concurrent.TimeoutException: Could not connect to ZooKeeper 127.0.0.1:44033 within 30000 ms
	at org.apache.solr.common.cloud.ConnectionManager.waitForConnected(ConnectionManager.java:233)
	at org.apache.solr.common.cloud.SolrZkClient.<init>(SolrZkClient.java:175)
	... 45 more


FAILED:  junit.framework.TestSuite.org.apache.solr.cloud.TestConfigSetsAPI

Error Message:
4 threads leaked from SUITE scope at org.apache.solr.cloud.TestConfigSetsAPI:     1) Thread[id=30111, name=NIOServerCxn.Factory:0.0.0.0/0.0.0.0:0, state=RUNNABLE, group=TGRP-TestConfigSetsAPI]         at sun.nio.ch.DevPollArrayWrapper.poll0(Native Method)         at sun.nio.ch.DevPollArrayWrapper.poll(DevPollArrayWrapper.java:223)         at sun.nio.ch.DevPollSelectorImpl.doSelect(DevPollSelectorImpl.java:98)         at sun.nio.ch.SelectorImpl.lockAndDoSelect(SelectorImpl.java:86)         at sun.nio.ch.SelectorImpl.select(SelectorImpl.java:97)         at org.apache.zookeeper.server.NIOServerCnxnFactory.run(NIOServerCnxnFactory.java:173)         at java.lang.Thread.run(Thread.java:748)    2) Thread[id=30110, name=Thread-7494, state=WAITING, group=TGRP-TestConfigSetsAPI]         at java.lang.Object.wait(Native Method)         at java.lang.Thread.join(Thread.java:1252)         at java.lang.Thread.join(Thread.java:1326)         at org.apache.zookeeper.server.NIOServerCnxnFactory.join(NIOServerCnxnFactory.java:297)         at org.apache.solr.cloud.ZkTestServer$ZKServerMain.runFromConfig(ZkTestServer.java:309)         at org.apache.solr.cloud.ZkTestServer$2.run(ZkTestServer.java:490)    3) Thread[id=30112, name=SessionTracker, state=TIMED_WAITING, group=TGRP-TestConfigSetsAPI]         at java.lang.Object.wait(Native Method)         at org.apache.zookeeper.server.SessionTrackerImpl.run(SessionTrackerImpl.java:146)    4) Thread[id=30114, name=ProcessThread(sid:0 cport:44033):, state=WAITING, group=TGRP-TestConfigSetsAPI]         at sun.misc.Unsafe.park(Native Method)         at java.util.concurrent.locks.LockSupport.park(LockSupport.java:175)         at java.util.concurrent.locks.AbstractQueuedSynchronizer$ConditionObject.await(AbstractQueuedSynchronizer.java:2039)         at java.util.concurrent.LinkedBlockingQueue.take(LinkedBlockingQueue.java:442)         at org.apache.zookeeper.server.PrepRequestProcessor.run(PrepRequestProcessor.java:122)

Stack Trace:
com.carrotsearch.randomizedtesting.ThreadLeakError: 4 threads leaked from SUITE scope at org.apache.solr.cloud.TestConfigSetsAPI: 
   1) Thread[id=30111, name=NIOServerCxn.Factory:0.0.0.0/0.0.0.0:0, state=RUNNABLE, group=TGRP-TestConfigSetsAPI]
        at sun.nio.ch.DevPollArrayWrapper.poll0(Native Method)
        at sun.nio.ch.DevPollArrayWrapper.poll(DevPollArrayWrapper.java:223)
        at sun.nio.ch.DevPollSelectorImpl.doSelect(DevPollSelectorImpl.java:98)
        at sun.nio.ch.SelectorImpl.lockAndDoSelect(SelectorImpl.java:86)
        at sun.nio.ch.SelectorImpl.select(SelectorImpl.java:97)
        at org.apache.zookeeper.server.NIOServerCnxnFactory.run(NIOServerCnxnFactory.java:173)
        at java.lang.Thread.run(Thread.java:748)
   2) Thread[id=30110, name=Thread-7494, state=WAITING, group=TGRP-TestConfigSetsAPI]
        at java.lang.Object.wait(Native Method)
        at java.lang.Thread.join(Thread.java:1252)
        at java.lang.Thread.join(Thread.java:1326)
        at org.apache.zookeeper.server.NIOServerCnxnFactory.join(NIOServerCnxnFactory.java:297)
        at org.apache.solr.cloud.ZkTestServer$ZKServerMain.runFromConfig(ZkTestServer.java:309)
        at org.apache.solr.cloud.ZkTestServer$2.run(ZkTestServer.java:490)
   3) Thread[id=30112, name=SessionTracker, state=TIMED_WAITING, group=TGRP-TestConfigSetsAPI]
        at java.lang.Object.wait(Native Method)
        at org.apache.zookeeper.server.SessionTrackerImpl.run(SessionTrackerImpl.java:146)
   4) Thread[id=30114, name=ProcessThread(sid:0 cport:44033):, state=WAITING, group=TGRP-TestConfigSetsAPI]
        at sun.misc.Unsafe.park(Native Method)
        at java.util.concurrent.locks.LockSupport.park(LockSupport.java:175)
        at java.util.concurrent.locks.AbstractQueuedSynchronizer$ConditionObject.await(AbstractQueuedSynchronizer.java:2039)
        at java.util.concurrent.LinkedBlockingQueue.take(LinkedBlockingQueue.java:442)
        at org.apache.zookeeper.server.PrepRequestProcessor.run(PrepRequestProcessor.java:122)
	at __randomizedtesting.SeedInfo.seed([A5066349EFD9C7A6]:0)


FAILED:  junit.framework.TestSuite.org.apache.solr.cloud.TestConfigSetsAPI

Error Message:
There are still zombie threads that couldn't be terminated:    1) Thread[id=30111, name=NIOServerCxn.Factory:0.0.0.0/0.0.0.0:0, state=RUNNABLE, group=TGRP-TestConfigSetsAPI]         at sun.nio.ch.IOUtil.drain(Native Method)         at sun.nio.ch.DevPollSelectorImpl.doSelect(DevPollSelectorImpl.java:109)         at sun.nio.ch.SelectorImpl.lockAndDoSelect(SelectorImpl.java:86)         at sun.nio.ch.SelectorImpl.select(SelectorImpl.java:97)         at org.apache.zookeeper.server.NIOServerCnxnFactory.run(NIOServerCnxnFactory.java:173)         at java.lang.Thread.run(Thread.java:748)

Stack Trace:
com.carrotsearch.randomizedtesting.ThreadLeakError: There are still zombie threads that couldn't be terminated:
   1) Thread[id=30111, name=NIOServerCxn.Factory:0.0.0.0/0.0.0.0:0, state=RUNNABLE, group=TGRP-TestConfigSetsAPI]
        at sun.nio.ch.IOUtil.drain(Native Method)
        at sun.nio.ch.DevPollSelectorImpl.doSelect(DevPollSelectorImpl.java:109)
        at sun.nio.ch.SelectorImpl.lockAndDoSelect(SelectorImpl.java:86)
        at sun.nio.ch.SelectorImpl.select(SelectorImpl.java:97)
        at org.apache.zookeeper.server.NIOServerCnxnFactory.run(NIOServerCnxnFactory.java:173)
        at java.lang.Thread.run(Thread.java:748)
	at __randomizedtesting.SeedInfo.seed([A5066349EFD9C7A6]:0)




Build Log:
[...truncated 13305 lines...]
   [junit4] Suite: org.apache.solr.cloud.TestConfigSetsAPI
   [junit4]   2> Creating dataDir: /export/home/jenkins/workspace/Lucene-Solr-7.x-Solaris/solr/build/solr-core/test/J0/temp/solr.cloud.TestConfigSetsAPI_A5066349EFD9C7A6-001/init-core-data-001
   [junit4]   2> 3478123 WARN  (SUITE-TestConfigSetsAPI-seed#[A5066349EFD9C7A6]-worker) [    ] o.a.s.SolrTestCaseJ4 startTrackingSearchers: numOpens=25 numCloses=25
   [junit4]   2> 3478123 INFO  (SUITE-TestConfigSetsAPI-seed#[A5066349EFD9C7A6]-worker) [    ] o.a.s.SolrTestCaseJ4 Using PointFields (NUMERIC_POINTS_SYSPROP=true) w/NUMERIC_DOCVALUES_SYSPROP=false
   [junit4]   2> 3478125 INFO  (SUITE-TestConfigSetsAPI-seed#[A5066349EFD9C7A6]-worker) [    ] o.a.s.SolrTestCaseJ4 Randomized ssl (false) and clientAuth (false) via: @org.apache.solr.util.RandomizeSSL(reason=, value=NaN, ssl=NaN, clientAuth=NaN)
   [junit4]   2> 3478125 INFO  (SUITE-TestConfigSetsAPI-seed#[A5066349EFD9C7A6]-worker) [    ] o.a.s.SolrTestCaseJ4 SecureRandom sanity checks: test.solr.allowed.securerandom=null & java.security.egd=file:/dev/./urandom
   [junit4]   2> 3478126 INFO  (TEST-TestConfigSetsAPI.testDelete-seed#[A5066349EFD9C7A6]) [    ] o.a.s.SolrTestCaseJ4 ###Starting testDelete
   [junit4]   2> 3478127 INFO  (TEST-TestConfigSetsAPI.testDelete-seed#[A5066349EFD9C7A6]) [    ] o.a.s.c.MiniSolrCloudCluster Starting cluster of 1 servers in /export/home/jenkins/workspace/Lucene-Solr-7.x-Solaris/solr/build/solr-core/test/J0/temp/solr.cloud.TestConfigSetsAPI_A5066349EFD9C7A6-001/tempDir-001
   [junit4]   2> 3478127 INFO  (TEST-TestConfigSetsAPI.testDelete-seed#[A5066349EFD9C7A6]) [    ] o.a.s.c.ZkTestServer STARTING ZK TEST SERVER
   [junit4]   2> 3478127 INFO  (Thread-7441) [    ] o.a.s.c.ZkTestServer client port:0.0.0.0/0.0.0.0:0
   [junit4]   2> 3478127 INFO  (Thread-7441) [    ] o.a.s.c.ZkTestServer Starting server
   [junit4]   2> 3478129 ERROR (Thread-7441) [    ] o.a.z.s.ZooKeeperServer ZKShutdownHandler is not registered, so ZooKeeper server won't take any action on ERROR or SHUTDOWN server state changes
   [junit4]   2> 3478227 INFO  (TEST-TestConfigSetsAPI.testDelete-seed#[A5066349EFD9C7A6]) [    ] o.a.s.c.ZkTestServer start zk server on port:45321
   [junit4]   2> 3478235 INFO  (jetty-launcher-4619-thread-1) [    ] o.e.j.s.Server jetty-9.3.20.v20170531
   [junit4]   2> 3478236 INFO  (jetty-launcher-4619-thread-1) [    ] o.e.j.s.h.ContextHandler Started o.e.j.s.ServletContextHandler@7b76b424{/solr,null,AVAILABLE}
   [junit4]   2> 3478238 INFO  (jetty-launcher-4619-thread-1) [    ] o.e.j.s.AbstractConnector Started ServerConnector@ebe651d{HTTP/1.1,[http/1.1]}{127.0.0.1:60309}
   [junit4]   2> 3478239 INFO  (jetty-launcher-4619-thread-1) [    ] o.e.j.s.Server Started @3481150ms
   [junit4]   2> 3478239 INFO  (jetty-launcher-4619-thread-1) [    ] o.a.s.c.s.e.JettySolrRunner Jetty properties: {hostContext=/solr, hostPort=60309}
   [junit4]   2> 3478239 ERROR (jetty-launcher-4619-thread-1) [    ] o.a.s.u.StartupLoggingUtils Missing Java Option solr.log.dir. Logging may be missing or incomplete.
   [junit4]   2> 3478239 INFO  (jetty-launcher-4619-thread-1) [    ] o.a.s.s.SolrDispatchFilter  ___      _       Welcome to Apache Solr? version 7.2.0
   [junit4]   2> 3478239 INFO  (jetty-launcher-4619-thread-1) [    ] o.a.s.s.SolrDispatchFilter / __| ___| |_ _   Starting in cloud mode on port null
   [junit4]   2> 3478239 INFO  (jetty-launcher-4619-thread-1) [    ] o.a.s.s.SolrDispatchFilter \__ \/ _ \ | '_|  Install dir: null, Default config dir: null
   [junit4]   2> 3478239 INFO  (jetty-launcher-4619-thread-1) [    ] o.a.s.s.SolrDispatchFilter |___/\___/_|_|    Start time: 2017-10-22T08:57:50.175Z
   [junit4]   2> 3478242 INFO  (jetty-launcher-4619-thread-1) [    ] o.a.s.s.SolrDispatchFilter solr.xml found in ZooKeeper. Loading...
   [junit4]   2> 3478249 INFO  (jetty-launcher-4619-thread-1) [    ] o.a.s.c.ZkContainer Zookeeper client=127.0.0.1:45321/solr
   [junit4]   2> 3478365 INFO  (jetty-launcher-4619-thread-1) [n:127.0.0.1:60309_solr    ] o.a.s.c.Overseer Overseer (id=null) closing
   [junit4]   2> 3478365 INFO  (jetty-launcher-4619-thread-1) [n:127.0.0.1:60309_solr    ] o.a.s.c.OverseerElectionContext I am going to be the leader 127.0.0.1:60309_solr
   [junit4]   2> 3478366 INFO  (jetty-launcher-4619-thread-1) [n:127.0.0.1:60309_solr    ] o.a.s.c.Overseer Overseer (id=98871716745314307-127.0.0.1:60309_solr-n_0000000000) starting
   [junit4]   2> 3478374 INFO  (jetty-launcher-4619-thread-1) [n:127.0.0.1:60309_solr    ] o.a.s.c.ZkController Register node as live in ZooKeeper:/live_nodes/127.0.0.1:60309_solr
   [junit4]   2> 3478377 INFO  (OverseerStateUpdate-98871716745314307-127.0.0.1:60309_solr-n_0000000000) [n:127.0.0.1:60309_solr    ] o.a.s.c.c.ZkStateReader Updated live nodes from ZooKeeper... (0) -> (1)
   [junit4]   2> 3478532 INFO  (jetty-launcher-4619-thread-1) [n:127.0.0.1:60309_solr    ] o.a.s.m.r.SolrJmxReporter JMX monitoring for 'solr_60309.solr.node' (registry 'solr.node') enabled at server: com.sun.jmx.mbeanserver.JmxMBeanServer@6ba65f6f
   [junit4]   2> 3478537 INFO  (jetty-launcher-4619-thread-1) [n:127.0.0.1:60309_solr    ] o.a.s.m.r.SolrJmxReporter JMX monitoring for 'solr_60309.solr.jvm' (registry 'solr.jvm') enabled at server: com.sun.jmx.mbeanserver.JmxMBeanServer@6ba65f6f
   [junit4]   2> 3478538 INFO  (jetty-launcher-4619-thread-1) [n:127.0.0.1:60309_solr    ] o.a.s.m.r.SolrJmxReporter JMX monitoring for 'solr_60309.solr.jetty' (registry 'solr.jetty') enabled at server: com.sun.jmx.mbeanserver.JmxMBeanServer@6ba65f6f
   [junit4]   2> 3478538 INFO  (jetty-launcher-4619-thread-1) [n:127.0.0.1:60309_solr    ] o.a.s.c.CorePropertiesLocator Found 0 core definitions underneath /export/home/jenkins/workspace/Lucene-Solr-7.x-Solaris/solr/build/solr-core/test/J0/temp/solr.cloud.TestConfigSetsAPI_A5066349EFD9C7A6-001/tempDir-001/node1/.
   [junit4]   2> 3478561 INFO  (qtp1902434678-29818) [n:127.0.0.1:60309_solr    ] o.a.s.h.a.ConfigSetsHandler Invoked ConfigSet Action :delete with params name=configSet&action=DELETE&wt=javabin&version=2 
   [junit4]   2> 3478564 INFO  (OverseerThreadFactory-10059-thread-1-processing-n:127.0.0.1:60309_solr) [n:127.0.0.1:60309_solr    ] o.a.s.c.OverseerConfigSetMessageHandler OverseerConfigSetMessageHandler.processMessage : delete , {
   [junit4]   2>   "name":"configSet",
   [junit4]   2>   "operation":"configsets:delete"}
   [junit4]   2> 3478564 INFO  (OverseerThreadFactory-10059-thread-1-processing-n:127.0.0.1:60309_solr) [n:127.0.0.1:60309_solr    ] o.a.s.c.OverseerConfigSetMessageHandler no existing ConfigSet properties found
   [junit4]   2> 3478567 INFO  (qtp1902434678-29818) [n:127.0.0.1:60309_solr    ] o.a.s.s.HttpSolrCall [admin] webapp=null path=/admin/configs params={name=configSet&action=DELETE&wt=javabin&version=2} status=0 QTime=6
   [junit4]   2> 3478570 INFO  (jetty-closer-4620-thread-1) [    ] o.e.j.s.AbstractConnector Stopped ServerConnector@ebe651d{HTTP/1.1,[http/1.1]}{127.0.0.1:0}
   [junit4]   2> 3478570 INFO  (jetty-closer-4620-thread-1) [    ] o.a.s.c.CoreContainer Shutting down CoreContainer instance=968862265
   [junit4]   2> 3478570 INFO  (jetty-closer-4620-thread-1) [    ] o.a.s.m.SolrMetricManager Closing metric reporters for registry=solr.node, tag=null
   [junit4]   2> 3478570 INFO  (jetty-closer-4620-thread-1) [    ] o.a.s.m.r.SolrJmxReporter Closing reporter [org.apache.solr.metrics.reporters.SolrJmxReporter@1f1a4c2: rootName = solr_60309, domain = solr.node, service url = null, agent id = null] for registry solr.node / com.codahale.metrics.MetricRegistry@516fa2b8
   [junit4]   2> 3478573 INFO  (jetty-closer-4620-thread-1) [    ] o.a.s.m.SolrMetricManager Closing metric reporters for registry=solr.jvm, tag=null
   [junit4]   2> 3478573 INFO  (jetty-closer-4620-thread-1) [    ] o.a.s.m.r.SolrJmxReporter Closing reporter [org.apache.solr.metrics.reporters.SolrJmxReporter@636a8e77: rootName = solr_60309, domain = solr.jvm, service url = null, agent id = null] for registry solr.jvm / com.codahale.metrics.MetricRegistry@173b0231
   [junit4]   2> 3478576 INFO  (jetty-closer-4620-thread-1) [    ] o.a.s.m.SolrMetricManager Closing metric reporters for registry=solr.jetty, tag=null
   [junit4]   2> 3478576 INFO  (jetty-closer-4620-thread-1) [    ] o.a.s.m.r.SolrJmxReporter Closing reporter [org.apache.solr.metrics.reporters.SolrJmxReporter@6b5b380f: rootName = solr_60309, domain = solr.jetty, service url = null, agent id = null] for registry solr.jetty / com.codahale.metrics.MetricRegistry@4f782b49
   [junit4]   2> 3478577 INFO  (jetty-closer-4620-thread-1) [    ] o.a.s.c.ZkController Remove node as live in ZooKeeper:/live_nodes/127.0.0.1:60309_solr
   [junit4]   2> 3478578 INFO  (jetty-closer-4620-thread-1) [    ] o.a.s.m.SolrMetricManager Closing metric reporters for registry=solr.cluster, tag=null
   [junit4]   2> 3478578 INFO  (zkCallback-4626-thread-1-processing-n:127.0.0.1:60309_solr) [n:127.0.0.1:60309_solr    ] o.a.s.c.c.ZkStateReader Updated live nodes from ZooKeeper... (1) -> (0)
   [junit4]   2> 3478578 INFO  (jetty-closer-4620-thread-1) [    ] o.a.s.c.TransientSolrCoreCacheDefault Allocating transient cache for 2147483647 transient cores
   [junit4]   2> 3478579 INFO  (jetty-closer-4620-thread-1) [    ] o.a.s.c.Overseer Overseer (id=98871716745314307-127.0.0.1:60309_solr-n_0000000000) closing
   [junit4]   2> 3478579 INFO  (OverseerStateUpdate-98871716745314307-127.0.0.1:60309_solr-n_0000000000) [n:127.0.0.1:60309_solr    ] o.a.s.c.Overseer Overseer Loop exiting : 127.0.0.1:60309_solr
   [junit4]   2> 3478580 WARN  (OverseerAutoScalingTriggerThread-98871716745314307-127.0.0.1:60309_solr-n_0000000000) [n:127.0.0.1:60309_solr    ] o.a.s.c.a.OverseerTriggerThread OverseerTriggerThread woken up but we are closed, exiting.
   [junit4]   2> 3478581 INFO  (jetty-closer-4620-thread-1) [    ] o.e.j.s.h.ContextHandler Stopped o.e.j.s.ServletContextHandler@7b76b424{/solr,null,UNAVAILABLE}
   [junit4]   2> 3478582 ERROR (TEST-TestConfigSetsAPI.testDelete-seed#[A5066349EFD9C7A6]) [    ] o.a.z.s.ZooKeeperServer ZKShutdownHandler is not registered, so ZooKeeper server won't take any action on ERROR or SHUTDOWN server state changes
   [junit4]   2> 3478585 INFO  (TEST-TestConfigSetsAPI.testDelete-seed#[A5066349EFD9C7A6]) [    ] o.a.s.c.ZkTestServer connecting to 127.0.0.1:45321 45321
   [junit4]   2> 3481121 INFO  (Thread-7441) [    ] o.a.s.c.ZkTestServer connecting to 127.0.0.1:45321 45321
   [junit4]   2> 3481123 INFO  (TEST-TestConfigSetsAPI.testDelete-seed#[A5066349EFD9C7A6]) [    ] o.a.s.SolrTestCaseJ4 ###Ending testDelete
   [junit4]   2> 3481127 INFO  (TEST-TestConfigSetsAPI.testUploadWithScriptUpdateProcessor-seed#[A5066349EFD9C7A6]) [    ] o.a.s.SolrTestCaseJ4 ###Starting testUploadWithScriptUpdateProcessor
   [junit4]   2> 3481127 INFO  (TEST-TestConfigSetsAPI.testUploadWithScriptUpdateProcessor-seed#[A5066349EFD9C7A6]) [    ] o.a.s.c.MiniSolrCloudCluster Starting cluster of 1 servers in /export/home/jenkins/workspace/Lucene-Solr-7.x-Solaris/solr/build/solr-core/test/J0/temp/solr.cloud.TestConfigSetsAPI_A5066349EFD9C7A6-001/tempDir-002
   [junit4]   2> 3481128 INFO  (TEST-TestConfigSetsAPI.testUploadWithScriptUpdateProcessor-seed#[A5066349EFD9C7A6]) [    ] o.a.s.c.ZkTestServer STARTING ZK TEST SERVER
   [junit4]   2> 3481128 INFO  (Thread-7452) [    ] o.a.s.c.ZkTestServer client port:0.0.0.0/0.0.0.0:0
   [junit4]   2> 3481128 INFO  (Thread-7452) [    ] o.a.s.c.ZkTestServer Starting server
   [junit4]   2> 3481132 ERROR (Thread-7452) [    ] o.a.z.s.ZooKeeperServer ZKShutdownHandler is not registered, so ZooKeeper server won't take any action on ERROR or SHUTDOWN server state changes
   [junit4]   2> 3481230 INFO  (TEST-TestConfigSetsAPI.testUploadWithScriptUpdateProcessor-seed#[A5066349EFD9C7A6]) [    ] o.a.s.c.ZkTestServer start zk server on port:43654
   [junit4]   2> 3481244 INFO  (jetty-launcher-4633-thread-1) [    ] o.e.j.s.Server jetty-9.3.20.v20170531
   [junit4]   2> 3481246 INFO  (jetty-launcher-4633-thread-1) [    ] o.e.j.s.h.ContextHandler Started o.e.j.s.ServletContextHandler@33a7056d{/solr,null,AVAILABLE}
   [junit4]   2> 3481247 INFO  (jetty-launcher-4633-thread-1) [    ] o.e.j.s.AbstractConnector Started ServerConnector@6f0ecbff{HTTP/1.1,[http/1.1]}{127.0.0.1:51650}
   [junit4]   2> 3481247 INFO  (jetty-launcher-4633-thread-1) [    ] o.e.j.s.Server Started @3484158ms
   [junit4]   2> 3481247 INFO  (jetty-launcher-4633-thread-1) [    ] o.a.s.c.s.e.JettySolrRunner Jetty properties: {hostContext=/solr, hostPort=51650}
   [junit4]   2> 3481248 ERROR (jetty-launcher-4633-thread-1) [    ] o.a.s.u.StartupLoggingUtils Missing Java Option solr.log.dir. Logging may be missing or incomplete.
   [junit4]   2> 3481248 INFO  (jetty-launcher-4633-thread-1) [    ] o.a.s.s.SolrDispatchFilter  ___      _       Welcome to Apache Solr? version 7.2.0
   [junit4]   2> 3481248 INFO  (jetty-launcher-4633-thread-1) [    ] o.a.s.s.SolrDispatchFilter / __| ___| |_ _   Starting in cloud mode on port null
   [junit4]   2> 3481248 INFO  (jetty-launcher-4633-thread-1) [    ] o.a.s.s.SolrDispatchFilter \__ \/ _ \ | '_|  Install dir: null, Default config dir: null
   [junit4]   2> 3481248 INFO  (jetty-launcher-4633-thread-1) [    ] o.a.s.s.SolrDispatchFilter |___/\___/_|_|    Start time: 2017-10-22T08:57:53.184Z
   [junit4]   2> 3481252 INFO  (jetty-launcher-4633-thread-1) [    ] o.a.s.s.SolrDispatchFilter solr.xml found in ZooKeeper. Loading...
   [junit4]   2> 3481265 INFO  (jetty-launcher-4633-thread-1) [    ] o.a.s.c.ZkContainer Zookeeper client=127.0.0.1:43654/solr
   [junit4]   2> 3481409 INFO  (jetty-launcher-4633-thread-1) [n:127.0.0.1:51650_solr    ] o.a.s.c.Overseer Overseer (id=null) closing
   [junit4]   2> 3481410 INFO  (jetty-launcher-4633-thread-1) [n:127.0.0.1:51650_solr    ] o.a.s.c.OverseerElectionContext I am going to be the leader 127.0.0.1:51650_solr
   [junit4]   2> 3481411 INFO  (jetty-launcher-4633-thread-1) [n:127.0.0.1:51650_solr    ] o.a.s.c.Overseer Overseer (id=98871716942118915-127.0.0.1:51650_solr-n_0000000000) starting
   [junit4]   2> 3481419 INFO  (jetty-launcher-4633-thread-1) [n:127.0.0.1:51650_solr    ] o.a.s.c.ZkController Register node as live in ZooKeeper:/live_nodes/127.0.0.1:51650_solr
   [junit4]   2> 3481422 INFO  (OverseerStateUpdate-98871716942118915-127.0.0.1:51650_solr-n_0000000000) [n:127.0.0.1:51650_solr    ] o.a.s.c.c.ZkStateReader Updated live nodes from ZooKeeper... (0) -> (1)
   [junit4]   2> 3481546 INFO  (jetty-launcher-4633-thread-1) [n:127.0.0.1:51650_solr    ] o.a.s.m.r.SolrJmxReporter JMX monitoring for 'solr_51650.solr.node' (registry 'solr.node') enabled at server: com.sun.jmx.mbeanserver.JmxMBeanServer@6ba65f6f
   [junit4]   2> 3481552 INFO  (jetty-launcher-4633-thread-1) [n:127.0.0.1:51650_solr    ] o.a.s.m.r.SolrJmxReporter JMX monitoring for 'solr_51650.solr.jvm' (registry 'solr.jvm') enabled at server: com.sun.jmx.mbeanserver.JmxMBeanServer@6ba65f6f
   [junit4]   2> 3481552 INFO  (jetty-launcher-4633-thread-1) [n:127.0.0.1:51650_solr    ] o.a.s.m.r.SolrJmxReporter JMX monitoring for 'solr_51650.solr.jetty' (registry 'solr.jetty') enabled at server: com.sun.jmx.mbeanserver.JmxMBeanServer@6ba65f6f
   [junit4]   2> 3481553 INFO  (jetty-launcher-4633-thread-1) [n:127.0.0.1:51650_solr    ] o.a.s.c.CorePropertiesLocator Found 0 core definitions underneath /export/home/jenkins/workspace/Lucene-Solr-7.x-Solaris/solr/build/solr-core/test/J0/temp/solr.cloud.TestConfigSetsAPI_A5066349EFD9C7A6-001/tempDir-002/node1/.
   [junit4]   2> 3481565 WARN  (NIOServerCxn.Factory:0.0.0.0/0.0.0.0:0) [    ] o.a.z.s.NIOServerCnxn caught end of stream exception
   [junit4]   2> EndOfStreamException: Unable to read additional data from client sessionid 0x15f434d7eab0004, likely client has closed socket
   [junit4]   2> 	at org.apache.zookeeper.server.NIOServerCnxn.doIO(NIOServerCnxn.java:239)
   [junit4]   2> 	at org.apache.zookeeper.server.NIOServerCnxnFactory.run(NIOServerCnxnFactory.java:203)
   [junit4]   2> 	at java.lang.Thread.run(Thread.java:748)
   [junit4]   2> 3481566 INFO  (TEST-TestConfigSetsAPI.testUploadWithScriptUpdateProcessor-seed#[A5066349EFD9C7A6]) [    ] o.a.s.c.TestConfigSetsAPI Directory: /export/home/jenkins/workspace/Lucene-Solr-7.x-Solaris/solr/core/src/test-files/solr/configsets/upload/with-script-processor
   [junit4]   2> 3481578 INFO  (TEST-TestConfigSetsAPI.testUploadWithScriptUpdateProcessor-seed#[A5066349EFD9C7A6]) [    ] o.a.s.c.TestConfigSetsAPI Zipfile: /export/home/jenkins/workspace/Lucene-Solr-7.x-Solaris/solr/build/solr-core/test/J0/temp/solr.cloud.TestConfigSetsAPI_A5066349EFD9C7A6-001/tempDir-002/fesqyuyb.zip
   [junit4]   2> 3481582 INFO  (qtp1650683447-29871) [n:127.0.0.1:51650_solr    ] o.a.s.h.a.ConfigSetsHandler Trying to upload a configset. authcPlugin: null, user principal: null
   [junit4]   2> 3481586 INFO  (qtp1650683447-29871) [n:127.0.0.1:51650_solr    ] o.a.s.s.HttpSolrCall [admin] webapp=null path=/admin/configs params={name=with-script-processor-untrusted&action=UPLOAD} status=0 QTime=4
   [junit4]   2> 3481589 WARN  (NIOServerCxn.Factory:0.0.0.0/0.0.0.0:0) [    ] o.a.z.s.NIOServerCnxn caught end of stream exception
   [junit4]   2> EndOfStreamException: Unable to read additional data from client sessionid 0x15f434d7eab0005, likely client has closed socket
   [junit4]   2> 	at org.apache.zookeeper.server.NIOServerCnxn.doIO(NIOServerCnxn.java:239)
   [junit4]   2> 	at org.apache.zookeeper.server.NIOServerCnxnFactory.run(NIOServerCnxnFactory.java:203)
   [junit4]   2> 	at java.lang.Thread.run(Thread.java:748)
   [junit4]   2> 3481592 INFO  (TEST-TestConfigSetsAPI.testUploadWithScriptUpdateProcessor-seed#[A5066349EFD9C7A6]) [    ] o.a.s.c.c.ZkStateReader Updated live nodes from ZooKeeper... (0) -> (1)
   [junit4]   2> 3481593 INFO  (TEST-TestConfigSetsAPI.testUploadWithScriptUpdateProcessor-seed#[A5066349EFD9C7A6]) [    ] o.a.s.c.s.i.ZkClientClusterStateProvider Cluster at 127.0.0.1:43654/solr ready
   [junit4]   2> 3481594 INFO  (qtp1650683447-29872) [n:127.0.0.1:51650_solr    ] o.a.s.h.a.CollectionsHandler Invoked Collection Action :create with params replicationFactor=1&collection.configName=with-script-processor-untrusted&name=newcollection2&action=CREATE&numShards=1&wt=javabin&version=2 and sendToOCPQueue=true
   [junit4]   2> 3481596 INFO  (OverseerThreadFactory-10070-thread-1-processing-n:127.0.0.1:51650_solr) [n:127.0.0.1:51650_solr    ] o.a.s.c.CreateCollectionCmd Create collection newcollection2
   [junit4]   2> 3481712 INFO  (OverseerStateUpdate-98871716942118915-127.0.0.1:51650_solr-n_0000000000) [n:127.0.0.1:51650_solr    ] o.a.s.c.o.SliceMutator createReplica() {
   [junit4]   2>   "operation":"ADDREPLICA",
   [junit4]   2>   "collection":"newcollection2",
   [junit4]   2>   "shard":"shard1",
   [junit4]   2>   "core":"newcollection2_shard1_replica_n1",
   [junit4]   2>   "state":"down",
   [junit4]   2>   "base_url":"http://127.0.0.1:51650/solr",
   [junit4]   2>   "type":"NRT",
   [junit4]   2>   "waitForFinalState":"false"} 
   [junit4]   2> 3481916 INFO  (qtp1650683447-29874) [n:127.0.0.1:51650_solr    ] o.a.s.h.a.CoreAdminOperation core create command qt=/admin/cores&coreNodeName=core_node2&collection.configName=with-script-processor-untrusted&newCollection=true&name=newcollection2_shard1_replica_n1&action=CREATE&numShards=1&collection=newcollection2&shard=shard1&wt=javabin&version=2&replicaType=NRT
   [junit4]   2> 3481916 INFO  (qtp1650683447-29874) [n:127.0.0.1:51650_solr    ] o.a.s.c.TransientSolrCoreCacheDefault Allocating transient cache for 2147483647 transient cores
   [junit4]   2> 3482025 INFO  (zkCallback-4640-thread-1-processing-n:127.0.0.1:51650_solr) [n:127.0.0.1:51650_solr    ] o.a.s.c.c.ZkStateReader A cluster state change: [WatchedEvent state:SyncConnected type:NodeDataChanged path:/collections/newcollection2/state.json] for collection [newcollection2] has occurred - updating... (live nodes size: [1])
   [junit4]   2> 3482025 INFO  (zkCallback-4640-thread-2-processing-n:127.0.0.1:51650_solr) [n:127.0.0.1:51650_solr    ] o.a.s.c.c.ZkStateReader A cluster state change: [WatchedEvent state:SyncConnected type:NodeDataChanged path:/collections/newcollection2/state.json] for collection [newcollection2] has occurred - updating... (live nodes size: [1])
   [junit4]   2> 3482944 INFO  (qtp1650683447-29874) [n:127.0.0.1:51650_solr c:newcollection2 s:shard1 r:core_node2 x:newcollection2_shard1_replica_n1] o.a.s.c.SolrConfig Using Lucene MatchVersion: 7.2.0
   [junit4]   2> 3482956 INFO  (qtp1650683447-29874) [n:127.0.0.1:51650_solr c:newcollection2 s:shard1 r:core_node2 x:newcollection2_shard1_replica_n1] o.a.s.s.IndexSchema [newcollection2_shard1_replica_n1] Schema name=minimal
   [junit4]   2> 3482959 WARN  (qtp1650683447-29874) [n:127.0.0.1:51650_solr c:newcollection2 s:shard1 r:core_node2 x:newcollection2_shard1_replica_n1] o.a.s.s.IndexSchema no uniqueKey specified in schema.
   [junit4]   2> 3482960 INFO  (qtp1650683447-29874) [n:127.0.0.1:51650_solr c:newcollection2 s:shard1 r:core_node2 x:newcollection2_shard1_replica_n1] o.a.s.s.IndexSchema Loaded schema minimal/1.1 with uniqueid field null
   [junit4]   2> 3482960 INFO  (qtp1650683447-29874) [n:127.0.0.1:51650_solr c:newcollection2 s:shard1 r:core_node2 x:newcollection2_shard1_replica_n1] o.a.s.c.CoreContainer Creating SolrCore 'newcollection2_shard1_replica_n1' using configuration from collection newcollection2, trusted=false
   [junit4]   2> 3482960 INFO  (qtp1650683447-29874) [n:127.0.0.1:51650_solr c:newcollection2 s:shard1 r:core_node2 x:newcollection2_shard1_replica_n1] o.a.s.m.r.SolrJmxReporter JMX monitoring for 'solr_51650.solr.core.newcollection2.shard1.replica_n1' (registry 'solr.core.newcollection2.shard1.replica_n1') enabled at server: com.sun.jmx.mbeanserver.JmxMBeanServer@6ba65f6f
   [junit4]   2> 3482961 INFO  (qtp1650683447-29874) [n:127.0.0.1:51650_solr c:newcollection2 s:shard1 r:core_node2 x:newcollection2_shard1_replica_n1] o.a.s.c.SolrCore solr.RecoveryStrategy.Builder
   [junit4]   2> 3482961 INFO  (qtp1650683447-29874) [n:127.0.0.1:51650_solr c:newcollection2 s:shard1 r:core_node2 x:newcollection2_shard1_replica_n1] o.a.s.c.SolrCore [[newcollection2_shard1_replica_n1] ] Opening new SolrCore at [/export/home/jenkins/workspace/Lucene-Solr-7.x-Solaris/solr/build/solr-core/test/J0/temp/solr.cloud.TestConfigSetsAPI_A5066349EFD9C7A6-001/tempDir-002/node1/newcollection2_shard1_replica_n1], dataDir=[/export/home/jenkins/workspace/Lucene-Solr-7.x-Solaris/solr/build/solr-core/test/J0/temp/solr.cloud.TestConfigSetsAPI_A5066349EFD9C7A6-001/tempDir-002/node1/./newcollection2_shard1_replica_n1/data/]
   [junit4]   2> 3483024 INFO  (qtp1650683447-29874) [n:127.0.0.1:51650_solr c:newcollection2 s:shard1 r:core_node2 x:newcollection2_shard1_replica_n1] o.a.s.u.CommitTracker Hard AutoCommit: disabled
   [junit4]   2> 3483024 INFO  (qtp1650683447-29874) [n:127.0.0.1:51650_solr c:newcollection2 s:shard1 r:core_node2 x:newcollection2_shard1_replica_n1] o.a.s.u.CommitTracker Soft AutoCommit: disabled
   [junit4]   2> 3483025 INFO  (qtp1650683447-29874) [n:127.0.0.1:51650_solr c:newcollection2 s:shard1 r:core_node2 x:newcollection2_shard1_replica_n1] o.a.s.s.SolrIndexSearcher Opening [Searcher@4c2da57c[newcollection2_shard1_replica_n1] main]
   [junit4]   2> 3483026 INFO  (qtp1650683447-29874) [n:127.0.0.1:51650_solr c:newcollection2 s:shard1 r:core_node2 x:newcollection2_shard1_replica_n1] o.a.s.r.ManagedResourceStorage Configured ZooKeeperStorageIO with znodeBase: /configs/with-script-processor-untrusted
   [junit4]   2> 3483027 INFO  (qtp1650683447-29874) [n:127.0.0.1:51650_solr c:newcollection2 s:shard1 r:core_node2 x:newcollection2_shard1_replica_n1] o.a.s.r.ManagedResourceStorage Loaded null at path _rest_managed.json using ZooKeeperStorageIO:path=/configs/with-script-processor-untrusted
   [junit4]   2> 3483027 INFO  (qtp1650683447-29874) [n:127.0.0.1:51650_solr c:newcollection2 s:shard1 r:core_node2 x:newcollection2_shard1_replica_n1] o.a.s.s.ZkIndexSchemaReader Creating ZooKeeper watch for the managed schema at /configs/with-script-processor-untrusted/managed-schema
   [junit4]   2> 3483027 INFO  (qtp1650683447-29874) [n:127.0.0.1:51650_solr c:newcollection2 s:shard1 r:core_node2 x:newcollection2_shard1_replica_n1] o.a.s.s.ZkIndexSchemaReader Current schema version 0 is already the latest
   [junit4]   2> 3483028 INFO  (qtp1650683447-29874) [n:127.0.0.1:51650_solr c:newcollection2 s:shard1 r:core_node2 x:newcollection2_shard1_replica_n1] o.a.s.c.SolrCore [newcollection2_shard1_replica_n1]  CLOSING SolrCore org.apache.solr.core.SolrCore@30078381
   [junit4]   2> 3483028 INFO  (qtp1650683447-29874) [n:127.0.0.1:51650_solr c:newcollection2 s:shard1 r:core_node2 x:newcollection2_shard1_replica_n1] o.a.s.m.SolrMetricManager Closing metric reporters for registry=solr.core.newcollection2.shard1.replica_n1, tag=805798785
   [junit4]   2> 3483028 INFO  (qtp1650683447-29874) [n:127.0.0.1:51650_solr c:newcollection2 s:shard1 r:core_node2 x:newcollection2_shard1_replica_n1] o.a.s.m.r.SolrJmxReporter Closing reporter [org.apache.solr.metrics.reporters.SolrJmxReporter@5c484fe: rootName = solr_51650, domain = solr.core.newcollection2.shard1.replica_n1, service url = null, agent id = null] for registry solr.core.newcollection2.shard1.replica_n1 / com.codahale.metrics.MetricRegistry@5190e5ec
   [junit4]   2> 3483028 INFO  (searcherExecutor-10073-thread-1-processing-n:127.0.0.1:51650_solr x:newcollection2_shard1_replica_n1 s:shard1 c:newcollection2 r:core_node2) [n:127.0.0.1:51650_solr c:newcollection2 s:shard1 r:core_node2 x:newcollection2_shard1_replica_n1] o.a.s.c.SolrCore [newcollection2_shard1_replica_n1] Registered new searcher Searcher@4c2da57c[newcollection2_shard1_replica_n1] main{ExitableDirectoryReader(UninvertingDirectoryReader())}
   [junit4]   2> 3483033 INFO  (qtp1650683447-29874) [n:127.0.0.1:51650_solr c:newcollection2 s:shard1 r:core_node2 x:newcollection2_shard1_replica_n1] o.a.s.m.SolrMetricManager Closing metric reporters for registry=solr.collection.newcollection2.shard1.leader, tag=805798785
   [junit4]   2> 3483038 ERROR (qtp1650683447-29874) [n:127.0.0.1:51650_solr c:newcollection2 s:shard1 r:core_node2 x:newcollection2_shard1_replica_n1] o.a.s.h.RequestHandlerBase org.apache.solr.common.SolrException: Error CREATEing SolrCore 'newcollection2_shard1_replica_n1': Unable to create core [newcollection2_shard1_replica_n1] Caused by: The configset for this collection was uploaded without any authentication in place, and this operation is not available for collections with untrusted configsets. To use this component, re-upload the configset after enabling authentication and authorization.
   [junit4]   2> 	at org.apache.solr.core.CoreContainer.create(CoreContainer.java:986)
   [junit4]   2> 	at org.apache.solr.handler.admin.CoreAdminOperation.lambda$static$0(CoreAdminOperation.java:91)
   [junit4]   2> 	at org.apache.solr.handler.admin.CoreAdminOperation.execute(CoreAdminOperation.java:384)
   [junit4]   2> 	at org.apache.solr.handler.admin.CoreAdminHandler$CallInfo.call(CoreAdminHandler.java:389)
   [junit4]   2> 	at org.apache.solr.handler.admin.CoreAdminHandler.handleRequestBody(CoreAdminHandler.java:174)
   [junit4]   2> 	at org.apache.solr.handler.RequestHandlerBase.handleRequest(RequestHandlerBase.java:177)
   [junit4]   2> 	at org.apache.solr.servlet.HttpSolrCall.handleAdmin(HttpSolrCall.java:735)
   [junit4]   2> 	at org.apache.solr.servlet.HttpSolrCall.handleAdminRequest(HttpSolrCall.java:716)
   [junit4]   2> 	at org.apache.solr.servlet.HttpSolrCall.call(HttpSolrCall.java:497)
   [junit4]   2> 	at org.apache.solr.servlet.SolrDispatchFilter.doFilter(SolrDispatchFilter.java:382)
   [junit4]   2> 	at org.apache.solr.servlet.SolrDispatchFilter.doFilter(SolrDispatchFilter.java:326)
   [junit4]   2> 	at org.eclipse.jetty.servlet.ServletHandler$CachedChain.doFilter(ServletHandler.java:1759)
   [junit4]   2> 	at org.apache.solr.client.solrj.embedded.JettySolrRunner$DebugFilter.doFilter(JettySolrRunner.java:139)
   [junit4]   2> 	at org.eclipse.jetty.servlet.ServletHandler$CachedChain.doFilter(ServletHandler.java:1759)
   [junit4]   2> 	at org.eclipse.jetty.servlet.ServletHandler.doHandle(ServletHandler.java:582)
   [junit4]   2> 	at org.eclipse.jetty.server.session.SessionHandler.doHandle(SessionHandler.java:224)
   [junit4]   2> 	at org.eclipse.jetty.server.handler.ContextHandler.doHandle(ContextHandler.java:1180)
   [junit4]   2> 	at org.eclipse.jetty.servlet.ServletHandler.doScope(ServletHandler.java:512)
   [junit4]   2> 	at org.eclipse.jetty.server.session.SessionHandler.doScope(SessionHandler.java:185)
   [junit4]   2> 	at org.eclipse.jetty.server.handler.ContextHandler.doScope(ContextHandler.java:1112)
   [junit4]   2> 	at org.eclipse.jetty.server.handler.ScopedHandler.handle(ScopedHandler.java:141)
   [junit4]   2> 	at org.eclipse.jetty.server.handler.gzip.GzipHandler.handle(GzipHandler.java:426)
   [junit4]   2> 	at org.eclipse.jetty.server.handler.HandlerWrapper.handle(HandlerWrapper.java:134)
   [junit4]   2> 	at org.eclipse.jetty.server.Server.handle(Server.java:534)
   [junit4]   2> 	at org.eclipse.jetty.server.HttpChannel.handle(HttpChannel.java:320)
   [junit4]   2> 	at org.eclipse.jetty.server.HttpConnection.onFillable(HttpConnection.java:251)
   [junit4]   2> 	at org.eclipse.jetty.io.AbstractConnection$ReadCallback.succeeded(AbstractConnection.java:283)
   [junit4]   2> 	at org.eclipse.jetty.io.FillInterest.fillable(FillInterest.java:108)
   [junit4]   2> 	at org.eclipse.jetty.io.SelectChannelEndPoint$2.run(SelectChannelEndPoint.java:93)
   [junit4]   2> 	at org.eclipse.jetty.util.thread.strategy.ExecuteProduceConsume.executeProduceConsume(ExecuteProduceConsume.java:303)
   [junit4]   2> 	at org.eclipse.jetty.util.thread.strategy.ExecuteProduceConsume.produceConsume(ExecuteProduceConsume.java:148)
   [junit4]   2> 	at org.eclipse.jetty.util.thread.strategy.ExecuteProduceConsume.run(ExecuteProduceConsume.java:136)
   [junit4]   2> 	at org.eclipse.jetty.util.thread.QueuedThreadPool.runJob(QueuedThreadPool.java:671)
   [junit4]   2> 	at org.eclipse.jetty.util.thread.QueuedThreadPool$2.run(QueuedThreadPool.java:589)
   [junit4]   2> 	at java.lang.Thread.run(Thread.java:748)
   [junit4]   2> Caused by: org.apache.solr.common.SolrException: Unable to create core [newcollection2_shard1_replica_n1]
   [junit4]   2> 	at org.apache.solr.core.CoreContainer.createFromDescriptor(CoreContainer.java:1052)
   [junit4]   2> 	at org.apache.solr.core.CoreContainer.create(CoreContainer.java:948)
   [junit4]   2> 	... 34 more
   [junit4]   2> Caused by: org.apache.solr.common.SolrException: The configset for this collection was uploaded without any authentication in place, and this operation is not available for collections with untrusted configsets. To use this component, re-upload the configset after enabling authentication and authorization.
   [junit4]   2> 	at org.apache.solr.core.SolrCore.<init>(SolrCore.java:989)
   [junit4]   2> 	at org.apache.solr.core.SolrCore.<init>(SolrCore.java:844)
   [junit4]   2> 	at org.apache.solr.core.CoreContainer.createFromDescriptor(CoreContainer.java:1036)
   [junit4]   2> 	... 35 more
   [junit4]   2> Caused by: org.apache.solr.common.SolrException: The configset for this collection was uploaded without any authentication in place, and this operation is not available for collections with untrusted configsets. To use this component, re-upload the configset after enabling authentication and authorization.
   [junit4]   2> 	at org.apache.solr.update.processor.StatelessScriptUpdateProcessorFactory.inform(StatelessScriptUpdateProcessorFactory.java:223)
   [junit4]   2> 	at org.apache.solr.core.SolrResourceLoader.inform(SolrResourceLoader.java:696)
   [junit4]   2> 	at org.apache.solr.core.SolrCore.<init>(SolrCore.java:968)
   [junit4]   2> 	... 37 more
   [junit4]   2> 
   [junit4]   2> 3483038 INFO  (qtp1650683447-29874) [n:127.0.0.1:51650_solr c:newcollection2 s:shard1 r:core_node2 x:newcollection2_shard1_replica_n1] o.a.s.s.HttpSolrCall [admin] webapp=null path=/admin/cores params={qt=/admin/cores&coreNodeName=core_node2&collection.configName=with-script-processor-untrusted&newCollection=true&name=newcollection2_shard1_replica_n1&action=CREATE&numShards=1&collection=newcollection2&shard=shard1&wt=javabin&version=2&replicaType=NRT} status=400 QTime=1123
   [junit4]   2> 3483039 ERROR (OverseerThreadFactory-10070-thread-1-processing-n:127.0.0.1:51650_solr) [n:127.0.0.1:51650_solr    ] o.a.s.c.OverseerCollectionMessageHandler Error from shard: http://127.0.0.1:51650/solr
   [junit4]   2> org.apache.solr.client.solrj.impl.HttpSolrClient$RemoteSolrException: Error from server at http://127.0.0.1:51650/solr: Error CREATEing SolrCore 'newcollection2_shard1_replica_n1': Unable to create core [newcollection2_shard1_replica_n1] Caused by: The configset for this collection was uploaded without any authentication in place, and this operation is not available for collections with untrusted configsets. To use this component, re-upload the configset after enabling authentication and authorization.
   [junit4]   2> 	at org.apache.solr.client.solrj.impl.HttpSolrClient.executeMethod(HttpSolrClient.java:626)
   [junit4]   2> 	at org.apache.solr.client.solrj.impl.HttpSolrClient.request(HttpSolrClient.java:253)
   [junit4]   2> 	at org.apache.solr.client.solrj.impl.HttpSolrClient.request(HttpSolrClient.java:242)
   [junit4]   2> 	at org.apache.solr.client.solrj.SolrClient.request(SolrClient.java:1219)
   [junit4]   2> 	at org.apache.solr.handler.component.HttpShardHandler.lambda$submit$0(HttpShardHandler.java:172)
   [junit4]   2> 	at java.util.concurrent.FutureTask.run(FutureTask.java:266)
   [junit4]   2> 	at java.util.concurrent.Executors$RunnableAdapter.call(Executors.java:511)
   [junit4]   2> 	at java.util.concurrent.FutureTask.run(FutureTask.java:266)
   [junit4]   2> 	at com.codahale.metrics.InstrumentedExecutorService$InstrumentedRunnable.run(InstrumentedExecutorService.java:176)
   [junit4]   2> 	at org.apache.solr.common.util.ExecutorUtil$MDCAwareThreadPoolExecutor.lambda$execute$0(ExecutorUtil.java:188)
   [junit4]   2> 	at java.util.concurrent.ThreadPoolExecutor.runWorker(ThreadPoolExecutor.java:1149)
   [junit4]   2> 	at java.util.concurrent.ThreadPoolExecutor$Worker.run(ThreadPoolExecutor.java:624)
   [junit4]   2> 	at java.lang.Thread.run(Thread.java:748)
   [junit4]   2> 3483039 ERROR (OverseerThreadFactory-10070-thread-1-processing-n:127.0.0.1:51650_solr) [n:127.0.0.1:51650_solr    ] o.a.s.c.OverseerCollectionMessageHandler Cleaning up collection [newcollection2].
   [junit4]   2> 3483039 INFO  (OverseerThreadFactory-10070-thread-1-processing-n:127.0.0.1:51650_solr) [n:127.0.0.1:51650_solr    ] o.a.s.c.OverseerCollectionMessageHandler Executing Collection Cmd : action=UNLOAD&deleteInstanceDir=true&deleteDataDir=true
   [junit4]   2> 3483040 INFO  (qtp1650683447-29875) [n:127.0.0.1:51650_solr    ] o.a.s.s.HttpSolrCall [admin] webapp=null path=/admin/cores params={deleteInstanceDir=true&core=newcollection2_shard1_replica_n1&qt=/admin/cores&deleteDataDir=true&action=UNLOAD&wt=javabin&version=2} status=0 QTime=0
   [junit4]   2> 3483145 INFO  (zkCallback-4640-thread-3-processing-n:127.0.0.1:51650_solr) [n:127.0.0.1:51650_solr    ] o.a.s.c.c.ZkStateReader A cluster state change: [WatchedEvent state:SyncConnected type:NodeDeleted path:/collections/newcollection2/state.json] for collection [newcollection2] has occurred - updating... (live nodes size: [1])
   [junit4]   2> 3483145 INFO  (zkCallback-4640-thread-2-processing-n:127.0.0.1:51650_solr) [n:127.0.0.1:51650_solr    ] o.a.s.c.c.ZkStateReader A cluster state change: [WatchedEvent state:SyncConnected type:NodeDeleted path:/collections/newcollection2/state.json] for collection [newcollection2] has occurred - updating... (live nodes size: [1])
   [junit4]   2> 3483747 INFO  (OverseerThreadFactory-10070-thread-1-processing-n:127.0.0.1:51650_solr) [n:127.0.0.1:51650_solr    ] o.a.s.c.CreateCollectionCmd Cleaned up artifacts for failed create collection for [newcollection2]
   [junit4]   2> 3483751 INFO  (qtp1650683447-29872) [n:127.0.0.1:51650_solr    ] o.a.s.h.a.CollectionsHandler Wait for new collection to be active for at most 30 seconds. Check all shard replicas
   [junit4]   2> 3485606 INFO  (OverseerCollectionConfigSetProcessor-98871716942118915-127.0.0.1:51650_solr-n_0000000000) [n:127.0.0.1:51650_solr    ] o.a.s.c.OverseerTaskQueue Response ZK path: /overseer/collection-queue-work/qnr-0000000000 doesn't exist.  Requestor may have disconnected from ZooKeeper
   [junit4]   2> 3513789 ERROR (qtp1650683447-29872) [n:127.0.0.1:51650_solr    ] o.a.s.h.a.CollectionsHandler Timed out waiting for new collection's replicas to become ACTIVE with timeout=30
   [junit4]   2> 3513790 INFO  (qtp1650683447-29872) [n:127.0.0.1:51650_solr    ] o.a.s.s.HttpSolrCall [admin] webapp=null path=/admin/collections params={replicationFactor=1&collection.configName=with-script-processor-untrusted&name=newcollection2&action=CREATE&numShards=1&wt=javabin&version=2} status=0 QTime=32202
   [junit4]   2> 3513790 INFO  (TEST-TestConfigSetsAPI.testUploadWithScriptUpdateProcessor-seed#[A5066349EFD9C7A6]) [    ] o.a.s.c.TestConfigSetsAPI Client saw errors: {127.0.0.1:51650_solr=org.apache.solr.client.solrj.impl.HttpSolrClient$RemoteSolrException:Error from server at http://127.0.0.1:51650/solr: Error CREATEing SolrCore 'newcollection2_shard1_replica_n1': Unable to create core [newcollection2_shard1_replica_n1] Caused by: The configset for this collection was uploaded without any authentication in place, and this operation is not available for collections with untrusted configsets. To use this component, re-upload the configset after enabling authentication and authorization.}
   [junit4]   2> 3513793 INFO  (zkCallback-4640-thread-2-processing-n:127.0.0.1:51650_solr) [n:127.0.0.1:51650_solr    ] o.a.s.c.CoreContainer Security node changed, reloading security.json
   [junit4]   2> 3513793 INFO  (zkCallback-4640-thread-2-processing-n:127.0.0.1:51650_solr) [n:127.0.0.1:51650_solr    ] o.a.s.c.CoreContainer Initializing authorization plugin: solr.RuleBasedAuthorizationPlugin
   [junit4]   2> 3513814 INFO  (qtp1650683447-29876) [n:127.0.0.1:51650_solr    ] o.a.s.s.HttpSolrCall [admin] webapp=null path=/admin/authentication params={} status=0 QTime=0
   [junit4]   2> 3513814 INFO  (qtp1650683447-29869) [n:127.0.0.1:51650_solr    ] o.a.s.s.HttpSolrCall [admin] webapp=null path=/admin/authorization params={} status=0 QTime=0
   [junit4]   2> 3513823 INFO  (zkCallback-4640-thread-2-processing-n:127.0.0.1:51650_solr) [n:127.0.0.1:51650_solr    ] o.a.s.c.CoreContainer Initializing authentication plugin: solr.BasicAuthPlugin
   [junit4]   2> 3513852 INFO  (zkCallback-4640-thread-2-processing-n:127.0.0.1:51650_solr) [n:127.0.0.1:51650_solr    ] o.a.s.c.CoreContainer PKIAuthenticationPlugin is managing internode requests
   [junit4]   2> 3518816 INFO  (TEST-TestConfigSetsAPI.testUploadWithScriptUpdateProcessor-seed#[A5066349EFD9C7A6]) [    ] o.a.s.c.TestConfigSetsAPI Directory: /export/home/jenkins/workspace/Lucene-Solr-7.x-Solaris/solr/core/src/test-files/solr/configsets/upload/with-script-processor
   [junit4]   2> 3518820 INFO  (TEST-TestConfigSetsAPI.testUploadWithScriptUpdateProcessor-seed#[A5066349EFD9C7A6]) [    ] o.a.s.c.TestConfigSetsAPI Zipfile: /export/home/jenkins/workspace/Lucene-Solr-7.x-Solaris/solr/build/solr-core/test/J0/temp/solr.cloud.TestConfigSetsAPI_A5066349EFD9C7A6-001/tempDir-002/byemvi.zip
   [junit4]   2> 3518827 INFO  (qtp1650683447-29873) [n:127.0.0.1:51650_solr    ] o.a.s.h.a.ConfigSetsHandler Trying to upload a configset. authcPlugin: org.apache.solr.security.BasicAuthPlugin@f011647, user principal: [principal: solr]
   [junit4]   2> 3518833 INFO  (qtp1650683447-29873) [n:127.0.0.1:51650_solr    ] o.a.s.s.HttpSolrCall [admin] webapp=null path=/admin/configs params={name=with-script-processor-trusted&action=UPLOAD} status=0 QTime=6
   [junit4]   2> 3518838 INFO  (qtp1650683447-29875) [n:127.0.0.1:51650_solr    ] o.a.s.h.a.CollectionsHandler Invoked Collection Action :create with params replicationFactor=1&collection.configName=with-script-processor-trusted&name=newcollection2&action=CREATE&numShards=1&wt=javabin&version=2 and sendToOCPQueue=true
   [junit4]   2> 3518844 INFO  (OverseerThreadFactory-10070-thread-2-processing-n:127.0.0.1:51650_solr) [n:127.0.0.1:51650_solr    ] o.a.s.c.CreateCollectionCmd Create collection newcollection2
   [junit4]   2> 3518855 INFO  (zkCallback-4640-thread-2-processing-n:127.0.0.1:51650_solr) [n:127.0.0.1:51650_solr    ] o.a.s.c.c.ZkStateReader A cluster state change: [WatchedEvent state:SyncConnected type:NodeCreated path:/collections/newcollection2/state.json] for collection [newcollection2] has occurred - updating... (live nodes size: [1])
   [junit4]   2> 3518855 INFO  (zkCallback-4640-thread-1-processing-n:127.0.0.1:51650_solr) [n:127.0.0.1:51650_solr    ] o.a.s.c.c.ZkStateReader A cluster state change: [WatchedEvent state:SyncConnected type:NodeCreated path:/collections/newcollection2/state.json] for collection [newcollection2] has occurred - updating... (live nodes size: [1])
   [junit4]   2> 3518957 INFO  (OverseerStateUpdate-98871716942118915-127.0.0.1:51650_solr-n_0000000000) [n:127.0.0.1:51650_solr    ] o.a.s.c.o.SliceMutator createReplica() {
   [junit4]   2>   "operation":"ADDREPLICA",
   [junit4]   2>   "collection":"newcollection2",
   [junit4]   2>   "shard":"shard1",
   [junit4]   2>   "core":"newcollection2_shard1_replica_n1",
   [junit4]   2>   "state":"down",
   [junit4]   2>   "base_url":"http://127.0.0.1:51650/solr",
   [junit4]   2>   "type":"NRT",
   [junit4]   2>   "waitForFinalState":"false"} 
   [junit4]   2> 3519063 INFO  (zkCallback-4640-thread-3-processing-n:127.0.0.1:51650_solr) [n:127.0.0.1:51650_solr    ] o.a.s.c.c.ZkStateReader A cluster state change: [WatchedEvent state:SyncConnected type:NodeDataChanged path:/collections/newcollection2/state.json] for collection [newcollection2] has occurred - updating... (live nodes size: [1])
   [junit4]   2> 3519063 INFO  (zkCallback-4640-thread-1-processing-n:127.0.0.1:51650_solr) [n:127.0.0.1:51650_solr    ] o.a.s.c.c.ZkStateReader A cluster state change: [WatchedEvent state:SyncConnected type:NodeDataChanged path:/collections/newcollection2/state.json] for collection [newcollection2] has occurred - updating... (live nodes size: [1])
   [junit4]   2> 3519170 INFO  (qtp1650683447-29876) [n:127.0.0.1:51650_solr    ] o.a.s.s.HttpSolrCall [admin] webapp=null path=/admin/info/key params={omitHeader=true&wt=json} status=0 QTime=0
   [junit4]   2> 3519170 INFO  (qtp1650683447-29872) [n:127.0.0.1:51650_solr    ] o.a.s.s.PKIAuthenticationPlugin New Key obtained from  node: 127.0.0.1:51650_solr / MIGfMA0GCSqGSIb3DQEBAQUAA4GNADCBiQKBgQC5yaAh2CwWWIv2AmxZqmfqx3GYxQJrVdMnT2p9mvZ6hwAKGyEnwVKUJTgoUufdynpYkYbhRTVONJwxUdHIkJvTUsdbRcv8+xQ+Z9UnnXHFy0bp46T6XCQpeAcg/aYSMhrktpZcjWZdEWpStDqMrT+qjCHfJY4nNu1cTAc1jD7U7QIDAQAB
   [junit4]   2> 3519175 INFO  (qtp1650683447-29872) [n:127.0.0.1:51650_solr    ] o.a.s.h.a.CoreAdminOperation core create command qt=/admin/cores&coreNodeName=core_node2&collection.configName=with-script-processor-trusted&newCollection=true&name=newcollection2_shard1_replica_n1&action=CREATE&numShards=1&collection=newcollection2&shard=shard1&wt=javabin&version=2&replicaType=NRT
   [junit4]   2> 3519283 INFO  (zkCallback-4640-thread-3-processing-n:127.0.0.1:51650_solr) [n:127.0.0.1:51650_solr    ] o.a.s.c.c.ZkStateReader A cluster state change: [WatchedEvent state:SyncConnected type:NodeDataChanged path:/collections/newcollection2/state.json] for collection [newcollection2] has occurred - updating... (live nodes size: [1])
   [junit4]   2> 3519283 INFO  (zkCallback-4640-thread-1-processing-n:127.0.0.1:51650_solr) [n:127.0.0.1:51650_solr    ] o.a.s.c.c.ZkStateReader A cluster state change: [WatchedEvent state:SyncConnected type:NodeDataChanged path:/collections/newcollection2/state.json] for collection [newcollection2] has occurred - updating... (live nodes size: [1])
   [junit4]   2> 3520188 INFO  (qtp1650683447-29872) [n:127.0.0.1:51650_solr c:newcollection2 s:shard1 r:core_node2 x:newcollection2_shard1_replica_n1] o.a.s.c.SolrConfig Using Lucene MatchVersion: 7.2.0
   [junit4]   2> 3520195 INFO  (qtp1650683447-29872) [n:127.0.0.1:51650_solr c:newcollection2 s:shard1 r:core_node2 x:newcollection2_shard1_replica_n1] o.a.s.s.IndexSchema [newcollection2_shard1_replica_n1] Schema name=minimal
   [junit4]   2> 3520197 WARN  (qtp1650683447-29872) [n:127.0.0.1:51650_solr c:newcollection2 s:shard1 r:core_node2 x:newcollection2_shard1_replica_n1] o.a.s.s.IndexSchema no uniqueKey specified in schema.
   [junit4]   2> 3520197 INFO  (qtp1650683447-29872) [n:127.0.0.1:51650_solr c:newcollection2 s:shard1 r:core_node2 x:newcollection2_shard1_replica_n1] o.a.s.s.IndexSchema Loaded schema minimal/1.1 with uniqueid field null
   [junit4]   2> 3520197 INFO  (qtp1650683447-29872) [n:127.0.0.1:51650_solr c:newcollection2 s:shard1 r:core_node2 x:newcollection2_shard1_replica_n1] o.a.s.c.CoreContainer Creating SolrCore 'newcollection2_shard1_replica_n1' using configuration from collection newcollection2, trusted=true
   [junit4]   2> 3520223 INFO  (qtp1650683447-29872) [n:127.0.0.1:51650_solr c:newcollection2 s:shard1 r:core_node2 x:newcollection2_shard1_replica_n1] o.a.s.m.r.SolrJmxReporter JMX monitoring for 'solr_51650.solr.core.newcollection2.shard1.replica_n1' (registry 'solr.core.newcollection2.shard1.replica_n1') enabled at server: com.sun.jmx.mbeanserver.JmxMBeanServer@6ba65f6f
   [junit4]   2> 3520223 INFO  (qtp1650683447-29872) [n:127.0.0.1:51650_solr c:newcollection2 s:shard1 r:core_node2 x:newcollection2_shard1_replica_n1] o.a.s.c.SolrCore solr.RecoveryStrategy.Builder
   [junit4]   2> 3520223 INFO  (qtp1650683447-29872) [n:127.0.0.1:51650_solr c:newcollection2 s:shard1 r:core_node2 x:newcollection2_shard1_replica_n1] o.a.s.c.SolrCore [[newcollection2_shard1_replica_n1] ] Opening new SolrCore at [/export/home/jenkins/workspace/Lucene-Solr-7.x-Solaris/solr/build/solr-core/test/J0/temp/solr.cloud.TestConfigSetsAPI_A5066349EFD9C7A6-001/tempDir-002/node1/newcollection2_shard1_replica_n1], dataDir=[/export/home/jenkins/workspace/Lucene-Solr-7.x-Solaris/solr/build/solr-core/test/J0/temp/solr.cloud.TestConfigSetsAPI_A5066349EFD9C7A6-001/tempDir-002/node1/./newcollection2_shard1_replica_n1/data/]
   [junit4]   2> 3520275 INFO  (qtp1650683447-29872) [n:127.0.0.1:51650_solr c:newcollection2 s:shard1 r:core_node2 x:newcollection2_shard1_replica_n1] o.a.s.u.CommitTracker Hard AutoCommit: disabled
   [junit4]   2> 3520275 INFO  (qtp1650683447-29872) [n:127.0.0.1:51650_solr c:newcollection2 s:shard1 r:core_node2 x:newcollection2_shard1_replica_n1] o.a.s.u.CommitTracker Soft AutoCommit: disabled
   [junit4]   2> 3520275 INFO  (qtp1650683447-29872) [n:127.0.0.1:51650_solr c:newcollection2 s:shard1 r:core_node2 x:newcollection2_shard1_replica_n1] o.a.s.s.SolrIndexSearcher Opening [Searcher@1b496e7f[newcollection2_shard1_replica_n1] main]
   [junit4]   2> 3520277 INFO  (qtp1650683447-29872) [n:127.0.0.1:51650_solr c:newcollection2 s:shard1 r:core_node2 x:newcollection2_shard1_replica_n1] o.a.s.r.ManagedResourceStorage Configured ZooKeeperStorageIO with znodeBase: /configs/with-script-processor-trusted
   [junit4]   2> 3520278 INFO  (qtp1650683447-29872) [n:127.0.0.1:51650_solr c:newcollection2 s:shard1 r:core_node2 x:newcollection2_shard1_replica_n1] o.a.s.r.ManagedResourceStorage Loaded null at path _rest_managed.json using ZooKeeperStorageIO:path=/configs/with-script-processor-trusted
   [junit4]   2> 3520278 INFO  (qtp1650683447-29872) [n:127.0.0.1:51650_solr c:newcollection2 s:shard1 r:core_node2 x:newcollection2_shard1_replica_n1] o.a.s.s.ZkIndexSchemaReader Creating ZooKeeper watch for the managed schema at /configs/with-script-processor-trusted/managed-schema
   [junit4]   2> 3520282 INFO  (qtp1650683447-29872) [n:127.0.0.1:51650_solr c:newcollection2 s:shard1 r:core_node2 x:newcollection2_shard1_replica_n1] o.a.s.s.ZkIndexSchemaReader Current schema version 0 is already the latest
   [junit4]   2> 3520317 INFO  (qtp1650683447-29872) [n:127.0.0.1:51650_solr c:newcollection2 s:shard1 r:core_node2 x:newcollection2_shard1_replica_n1] o.a.s.h.ReplicationHandler Commits will be reserved for 10000ms.
   [junit4]   2> 3520319 INFO  (searcherExecutor-10077-thread-1-processing-n:127.0.0.1:51650_solr x:newcollection2_shard1_replica_n1 s:shard1 c:newcollection2 r:core_node2) [n:127.0.0.1:51650_solr c:newcollection2 s:shard1 r:core_node2 x:newcollection2_shard1_replica_n1] o.a.s.c.SolrCore [newcollection2_shard1_replica_n1] Registered new searcher Searcher@1b496e7f[newcollection2_shard1_replica_n1] main{ExitableDirectoryReader(UninvertingDirectoryReader())}
   [junit4]   2> 3520324 INFO  (qtp1650683447-29872) [n:127.0.0.1:51650_solr c:newcollection2 s:shard1 r:core_node2 x:newcollection2_shard1_replica_n1] o.a.s.c.ShardLeaderElectionContext Enough replicas found to continue.
   [junit4]   2> 3520324 INFO  (qtp1650683447-29872) [n:127.0.0.1:51650_solr c:newcollection2 s:shard1 r:core_node2 x:newcollection2_shard1_replica_n1] o.a.s.c.ShardLeaderElectionContext I may be the new leader - try and sync
   [junit4]   2> 3520324 INFO  (qtp1650683447-29872) [n:127.0.0.1:51650_solr c:newcollection2 s:shard1 r:core_node2 x:newcollection2_shard1_replica_n1] o.a.s.c.SyncStrategy Sync replicas to http://127.0.0.1:51650/solr/newcollection2_shard1_replica_n1/
   [junit4]   2> 3520324 ERROR (qtp1650683447-29872) [n:127.0.0.1:51650_solr c:newcollection2 s:shard1 r:core_node2 x:newcollection2_shard1_replica_n1] o.a.s.c.SyncStrategy No UpdateLog found - cannot sync
   [junit4]   2> 3520324 INFO  (qtp1650683447-29872) [n:127.0.0.1:51650_solr c:newcollection2 s:shard1 r:core_node2 x:newcollection2_shard1_replica_n1] o.a.s.c.ShardLeaderElectionContext We failed sync, but we have no versions - we can't sync in that case - we were active before, so become leader anyway
   [junit4]   2> 3520324 INFO  (qtp1650683447-29872) [n:127.0.0.1:51650_solr c:newcollection2 s:shard1 r:core_node2 x:newcollection2_shard1_replica_n1] o.a.s.c.ShardLeaderElectionContext Found all replicas participating in election, clear LIR
   [junit4]   2> 3520333 INFO  (qtp1650683447-29872) [n:127.0.0.1:51650_solr c:newcollection2 s:shard1 r:core_node2 x:newcollection2_shard1_replica_n1] o.a.s.c.ShardLeaderElectionContext I am the new leader: http://127.0.0.1:51650/solr/newcollection2_shard1_replica_n1/ shard1
   [junit4]   2> 3520437 INFO  (zkCallback-4640-thread-1-processing-n:127.0.0.1:51650_solr) [n:127.0.0.1:51650_solr    ] o.a.s.c.c.ZkStateReader A cluster state change: [WatchedEvent state:SyncConnected type:NodeDataChanged path:/collections/newcollection2/state.json] for collection [newcollection2] has occurred - updating... (live nodes size: [1])
   [junit4]   2> 3520437 INFO  (zkCallback-4640-thread-2-processing-n:127.0.0.1:51650_solr) [n:127.0.0.1:51650_solr    ] o.a.s.c.c.ZkStateReader A cluster state change: [WatchedEvent state:SyncConnected type:NodeDataChanged path:/collections/newcollection2/state.json] for collection [newcollection2] has occurred - updating... (live nodes size: [1])
   [junit4]   2> 3520486 INFO  (qtp1650683447-29872) [n:127.0.0.1:51650_solr c:newcollection2 s:shard1 r:core_node2 x:newcollection2_shard1_replica_n1] o.a.s.c.ZkController I am the leader, no recovery necessary
   [junit4]   2> 3520488 INFO  (qtp1650683447-29872) [n:127.0.0.1:51650_solr c:newcollection2 s:shard1 r:core_node2 x:newcollection2_shard1_replica_n1] o.a.s.s.HttpSolrCall [admin] webapp=null path=/admin/cores params={qt=/admin/cores&coreNodeName=core_node2&collection.configName=with-script-processor-trusted&newCollection=true&name=newcollection2_shard1_replica_n1&action=CREATE&numShards=1&collection=newcollection2&shard=shard1&wt=javabin&version=2&replicaType=NRT} status=0 QTime=1313
   [junit4]   2> 3520490 INFO  (qtp1650683447-29875) [n:127.0.0.1:51650_solr    ] o.a.s.h.a.CollectionsHandler Wait for new collection to be active for at most 30 seconds. Check all shard replicas
   [junit4]   2> 3520589 INFO  (zkCallback-4640-thread-2-processing-n:127.0.0.1:51650_solr) [n:127.0.0.1:51650_solr    ] o.a.s.c.c.ZkStateReader A cluster state change: [WatchedEvent state:SyncConnected type:NodeDataChanged path:/collections/newcollection2/state.json] for collection [newcollection2] has occurred - updating... (live nodes size: [1])
   [junit4]   2> 3520589 INFO  (zkCallback-4640-thread-1-processing-n:127.0.0.1:51650_solr) [n:127.0.0.1:51650_solr    ] o.a.s.c.c.ZkStateReader A cluster state change: [WatchedEvent state:SyncConnected type:NodeDataChanged path:/collections/newcollection2/state.json] for collection [newcollection2] has occurred - updating... (live nodes size: [1])
   [junit4]   2> 3520850 INFO  (OverseerCollectionConfigSetProcessor-98871716942118915-127.0.0.1:51650_solr-n_0000000000) [n:127.0.0.1:51650_solr    ] o.a.s.c.OverseerTaskQueue Response ZK path: /overseer/collection-queue-work/qnr-0000000002 doesn't exist.  Requestor may have disconnected from ZooKeeper
   [junit4]   2> 3521491 INFO  (qtp1650683447-29875) [n:127.0.0.1:51650_solr    ] o.a.s.s.HttpSolrCall [admin] webapp=null path=/admin/collections params={replicationFactor=1&collection.configName=with-script-processor-trusted&name=newcollection2&action=CREATE&numShards=1&wt=javabin&version=2} status=0 QTime=2653
   [junit4]   2> 3521600 INFO  (qtp1650683447-29869) [n:127.0.0.1:51650_solr c:newcollection2 s:shard1 r:core_node2 x:newcollection2_shard1_replica_n1] o.a.s.c.S.Request [newcollection2_shard1_replica_n1]  webapp=/solr path=/update params={wt=javabin&version=2} status=0 QTime=106
   [junit4]   2> 3521613 INFO  (qtp1650683447-29871) [n:127.0.0.1:51650_solr c:newcollection2 s:shard1 r:core_node2 x:newcollection2_shard1_replica_n1] o.a.s.u.DirectUpdateHandler2 start commit{,optimize=false,openSearcher=true,waitSearcher=true,expungeDeletes=false,softCommit=false,prepareCommit=false}
   [junit4]   2> 3521613 INFO  (qtp1650683447-29871) [n:127.0.0.1:51650_solr c:newcollection2 s:shard1 r:core_node2 x:newcollection2_shard1_replica_n1] o.a.s.u.SolrIndexWriter Calling setCommitData with IW:org.apache.solr.update.SolrIndexWriter@38a73113 commitCommandVersion:0
   [junit4]   2> 3521613 INFO  (qtp1650683447-29871) [n:127.0.0.1:51650_solr c:newcollection2 s:shard1 r:core_node2 x:newcollection2_shard1_replica_n1] o.a.s.s.SolrIndexSearcher Opening [Searcher@21975d1a[newcollection2_shard1_replica_n1] main]
   [junit4]   2> 3521613 INFO  (qtp1650683447-29871) [n:127.0.0.1:51650_solr c:newcollection2 s:shard1 r:core_node2 x:newcollection2_shard1_replica_n1] o.a.s.u.DirectUpdateHandler2 end_commit_flush
   [junit4]   2> 3521617 INFO  (searcherExecutor-10077-thread-1-processing-n:127.0.0.1:51650_solr x:newcollection2_shard1_replica_n1 s:shard1 c:newcollection2 r:core_node2) [n:127.0.0.1:51650_solr c:newcollection2 s:shard1 r:core_node2 x:newcollection2_shard1_replica_n1] o.a.s.c.SolrCore [newcollection2_shard1_replica_n1] Registered new searcher Searcher@21975d1a[newcollection2_shard1_replica_n1] main{ExitableDirectoryReader(UninvertingDirectoryReader(Uninverting(_0(7.2.0):C1)))}
   [junit4]   2> 3521620 INFO  (qtp1650683447-29871) [n:127.0.0.1:51650_solr c:newcollection2 s:shard1 r:core_node2 x:newcollection2_shard1_replica_n1] o.a.s.c.S.Request [newcollection2_shard1_replica_n1]  webapp=/solr path=/update params={_stateVer_=newcollection2:4&waitSearcher=true&commit=true&softCommit=false&wt=javabin&version=2} status=0 QTime=18
   [junit4]   2> 3521620 INFO  (qtp1650683447-29874) [n:127.0.0.1:51650_solr c:newcollection2 s:shard1 r:core_node2 x:newcollection2_shard1_replica_n1] o.a.s.c.S.Request [newcollection2_shard1_replica_n1]  webapp=/solr path=/select params={q=*:*&_stateVer_=newcollection2:4&wt=javabin&version=2} hits=1 status=0 QTime=0
   [junit4]   2> 3521623 INFO  (jetty-closer-4634-thread-1) [    ] o.e.j.s.AbstractConnector Stopped ServerConnector@6f0ecbff{HTTP/1.1,[http/1.1]}{127.0.0.1:0}
   [junit4]   2> 3521623 INFO  (jetty-closer-4634-thread-1) [    ] o.a.s.c.CoreContainer Shutting down CoreContainer instance=1134448535
   [junit4]   2> 3521624 INFO  (jetty-closer-4634-thread-1) [    ] o.a.s.m.SolrMetricManager Closing metric reporters for registry=solr.node, tag=null
   [junit4]   2> 3521624 INFO  (jetty-closer-4634-thread-1) [    ] o.a.s.m.r.SolrJmxReporter Closing reporter [org.apache.solr.metrics.reporters.SolrJmxReporter@684d48cb: rootName = solr_51650, domain = solr.node, service url = null, agent id = null] for registry solr.node / com.codahale.metrics.MetricRegistry@ec19de9
   [junit4]   2> 3521629 INFO  (jetty-closer-4634-thread-1) [    ] o.a.s.m.SolrMetricManager Closing metric reporters for registry=solr.jvm, tag=null
   [junit4]   2> 3521629 INFO  (jetty-closer-4634-thread-1) [    ] o.a.s.m.r.SolrJmxReporter Closing reporter [org.apache.solr.metrics.reporters.SolrJmxReporter@316ec2e1: rootName = solr_51650, domain = solr.jvm, service url = null, agent id = null] for registry solr.jvm / com.codahale.metrics.MetricRegistry@173b0231
   [junit4]   2> 3521633 INFO  (jetty-closer-4634-thread-1) [    ] o.a.s.m.SolrMetricManager Closing metric reporters for registry=solr.jetty, tag=null
   [junit4]   2> 3521633 INFO  (jetty-closer-4634-thread-1) [    ] o.a.s.m.r.SolrJmxReporter Closing reporter [org.apache.solr.metrics.reporters.SolrJmxReporter@57212225: rootName = solr_51650, domain = solr.jetty, service url = null, agent id = null] for registry solr.jetty / com.codahale.metrics.MetricRegistry@4f782b49
   [junit4]   2> 3521634 INFO  (jetty-closer-4634-thread-1) [    ] o.a.s.c.ZkController Remove node as live in ZooKeeper:/live_nodes/127.0.0.1:51650_solr
   [junit4]   2> 3521635 INFO  (jetty-closer-4634-thread-1) [    ] o.a.s.m.SolrMetricManager Closing metric reporters for registry=solr.cluster, tag=null
   [junit4]   2> 3521636 INFO  (zkCallback-4640-thread-2-processing-n:127.0.0.1:51650_solr) [n:127.0.0.1:51650_solr    ] o.a.s.c.c.ZkStateReader Updated live nodes from ZooKeeper... (1) -> (0)
   [junit4]   2> 3521636 INFO  (coreCloseExecutor-10081-thread-1) [n:127.0.0.1:51650_solr c:newcollection2 s:shard1 r:core_node2 x:newcollection2_shard1_replica_n1] o.a.s.c.SolrCore [newcollection2_shard1_replica_n1]  CLOSING SolrCore org.apache.solr.core.SolrCore@4576dd50
   [junit4]   2> 3521636 INFO  (coreCloseExecutor-10081-thread-1) [n:127.0.0.1:51650_solr c:newcollection2 s:shard1 r:core_node2 x:newcollection2_shard1_replica_n1] o.a.s.m.SolrMetricManager Closing metric reporters for registry=solr.core.newcollection2.shard1.replica_n1, tag=1165417808
   [junit4]   2> 3521636 INFO  (coreCloseExecutor-10081-thread-1) [n:127.0.0.1:51650_solr c:newcollection2 s:shard1 r:core_node2 x:newcollection2_shard1_replica_n1] o.a.s.m.r.SolrJmxReporter Closing reporter [org.apache.solr.metrics.reporters.SolrJmxReporter@120b5e8d: rootName = solr_51650, domain = solr.core.newcollection2.shard1.replica_n1, service url = null, agent id = null] for registry solr.core.newcollection2.shard1.replica_n1 / com.codahale.metrics.MetricRegistry@5190e5ec
   [junit4]   2> 3521644 INFO  (coreCloseExecutor-10081-thread-1) [n:127.0.0.1:51650_solr c:newcollection2 s:shard1 r:core_node2 x:newcollection2_shard1_replica_n1] o.a.s.m.SolrMetricManager Closing metric reporters for registry=solr.collection.newcollection2.shard1.leader, tag=1165417808
   [junit4]   2> 3521646 INFO  (jetty-closer-4634-thread-1) [    ] o.a.s.c.Overseer Overseer (id=98871716942118915-127.0.0.1:51650_solr-n_0000000000) closing
   [junit4]   2> 3521648 INFO  (OverseerStateUpdate-98871716942118915-127.0.0.1:51650_solr-n_0000000000) [n:127.0.0.1:51650_solr    ] o.a.s.c.Overseer Overseer Loop exiting : 127.0.0.1:51650_solr
   [junit4]   2> 3521648 WARN  (OverseerAutoScalingTriggerThread-98871716942118915-127.0.0.1:51650_solr-n_0000000000) [n:127.0.0.1:51650_solr    ] o.a.s.c.a.OverseerTriggerThread OverseerTriggerThread woken up but we are closed, exiting.
   [junit4]   2> 3521651 INFO  (jetty-closer-4634-thread-1) [    ] o.e.j.s.h.ContextHandler Stopped o.e.j.s.ServletContextHandler@33a7056d{/solr,null,UNAVAILABLE}
   [junit4]   2> 3521652 ERROR (TEST-TestConfigSetsAPI.testUploadWithScriptUpdateProcessor-seed#[A5066349EFD9C7A6]) [    ] o.a.z.s.ZooKeeperServer ZKShutdownHandler is not registered, so ZooKeeper server won't take any action on ERROR or SHUTDOWN server state changes
   [junit4]   2> 3521654 INFO  (TEST-TestConfigSetsAPI.testUploadWithScriptUpdateProcessor-seed#[A5066349EFD9C7A6]) [    ] o.a.s.c.ZkTestServer connecting to 127.0.0.1:43654 43654
   [junit4]   2> 3530107 INFO  (Thread-7452) [    ] o.a.s.c.ZkTestServer connecting to 127.0.0.1:43654 43654
   [junit4]   2> 3530108 WARN  (Thread-7452) [    ] o.a.s.c.ZkTestServer Watch limit violations: 
   [junit4]   2> Maximum concurrent create/delete watches above limit:
   [junit4]   2> 
   [junit4]   2> 	2	/solr/aliases.json
   [junit4]   2> 	2	/solr/clusterprops.json
   [junit4]   2> 
   [junit4]   2> Maximum concurrent data watches above limit:
   [junit4]   2> 
   [junit4]   2> 	9	/solr/collections/newcollection2/state.json
   [junit4]   2> 	2	/solr/clusterstate.json
   [junit4]   2> 
   [junit4]   2> Maximum concurrent children watches above limit:
   [junit4]   2> 
   [junit4]   2> 	2	/solr/live_nodes
   [junit4]   2> 	2	/solr/collections
   [junit4]   2> 
   [junit4]   2> 3530109 INFO  (TEST-TestConfigSetsAPI.testUploadWithScriptUpdateProcessor-seed#[A5066349EFD9C7A6]) [    ] o.a.s.SolrTestCaseJ4 ###Ending testUploadWithScriptUpdateProcessor
   [junit4]   2> 3530111 INFO  (TEST-TestConfigSetsAPI.testUpload-seed#[A5066349EFD9C7A6]) [    ] o.a.s.SolrTestCaseJ4 ###Starting testUpload
   [junit4]   2> 3530111 INFO  (TEST-TestConfigSetsAPI.testUpload-seed#[A5066349EFD9C7A6]) [    ] o.a.s.c.MiniSolrCloudCluster Starting cluster of 1 servers in /export/home/jenkins/workspace/Lucene-Solr-7.x-Solaris/solr/build/solr-core/test/J0/temp/solr.cloud.TestConfigSetsAPI_A5066349EFD9C7A6-001/tempDir-003
   [junit4]   2> 3530112 INFO  (TEST-TestConfigSetsAPI.testUpload-seed#[A5066349EFD9C7A6]) [    ] o.a.s.c.ZkTestServer STARTING ZK TEST SERVER
   [junit4]   2> 3530112 INFO  (Thread-7462) [    ] o.a.s.c.ZkTestServer client port:0.0.0.0/0.0.0.0:0
   [junit4]   2> 3530112 INFO  (Thread-7462) [    ] o.a.s.c.ZkTestServer Starting server
   [junit4]   2> 3530113 ERROR (Thread-7462) [    ] o.a.z.s.ZooKeeperServer ZKShutdownHandler is not registered, so ZooKeeper server won't take any action on ERROR or SHUTDOWN server state changes
   [junit4]   2> 3530212 INFO  (TEST-TestConfigSetsAPI.testUpload-seed#[A5066349EFD9C7A6]) [    ] o.a.s.c.ZkTestServer start zk server on port:53046
   [junit4]   2> 3530218 INFO  (jetty-launcher-4649-thread-1) [    ] o.e.j.s.Server jetty-9.3.20.v20170531
   [junit4]   2> 3530219 INFO  (jetty-launcher-4649-thread-1) [    ] o.e.j.s.h.ContextHandler Started o.e.j.s.ServletContextHandler@55efc1c8{/solr,null,AVAILABLE}
   [junit4]   2> 3530219 INFO  (jetty-launcher-4649-thread-1) [    ] o.e.j.s.AbstractConnector Started ServerConnector@4a8d834a{HTTP/1.1,[http/1.1]}{127.0.0.1:39071}
   [junit4]   2> 3530219 INFO  (jetty-launcher-4649-thread-1) [    ] o.e.j.s.Server Started @3533140ms
   [junit4]   2> 3530219 INFO  (jetty-launcher-4649-thread-1) [    ] o.a.s.c.s.e.JettySolrRunner Jetty properties: {hostContext=/solr, hostPort=39071}
   [junit4]   2> 3530219 ERROR (jetty-launcher-4649-thread-1) [    ] o.a.s.u.StartupLoggingUtils Missing Java Option solr.log.dir. Logging may be missing or incomplete.
   [junit4]   2> 3530220 INFO  (jetty-launcher-4649-thread-1) [    ] o.a.s.s.SolrDispatchFilter  ___      _       Welcome to Apache Solr? version 7.2.0
   [junit4]   2> 3530220 INFO  (jetty-launcher-4649-thread-1) [    ] o.a.s.s.SolrDispatchFilter / __| ___| |_ _   Starting in cloud mode on port null
   [junit4]   2> 3530220 INFO  (jetty-launcher-4649-thread-1) [    ] o.a.s.s.SolrDispatchFilter \__ \/ _ \ | '_|  Install dir: null, Default config dir: null
   [junit4]   2> 3530220 INFO  (jetty-launcher-4649-thread-1) [    ] o.a.s.s.SolrDispatchFilter |___/\___/_|_|    Start time: 2017-10-22T08:58:42.156Z
   [junit4]   2> 3530222 INFO  (jetty-launcher-4649-thread-1) [    ] o.a.s.s.SolrDispatchFilter solr.xml found in ZooKeeper. Loading...
   [junit4]   2> 3530228 INFO  (jetty-launcher-4649-thread-1) [    ] o.a.s.c.ZkContainer Zookeeper client=127.0.0.1:53046/solr
   [junit4]   2> 3530355 INFO  (jetty-launcher-4649-thread-1) [n:127.0.0.1:39071_solr    ] o.a.s.c.Overseer Overseer (id=null) closing
   [junit4]   2> 3530356 INFO  (jetty-launcher-4649-thread-1) [n:127.0.0.1:39071_solr    ] o.a.s.c.OverseerElectionContext I am going to be the leader 127.0.0.1:39071_solr
   [junit4]   2> 3530358 INFO  (jetty-launcher-4649-thread-1) [n:127.0.0.1:39071_solr    ] o.a.s.c.Overseer Overseer (id=98871720152203267-127.0.0.1:39071_solr-n_0000000000) starting
   [junit4]   2> 3530368 INFO  (jetty-launcher-4649-thread-1) [n:127.0.0.1:39071_solr    ] o.a.s.c.ZkController Register node as live in ZooKeeper:/live_nodes/127.0.0.1:39071_solr
   [junit4]   2> 3530370 INFO  (zkCallback-4656-thread-1-processing-n:127.0.0.1:39071_solr) [n:127.0.0.1:39071_solr    ] o.a.s.c.c.ZkStateReader Updated live nodes from ZooKeeper... (0) -> (1)
   [junit4]   2> 3530437 INFO  (jetty-launcher-4649-thread-1) [n:127.0.0.1:39071_solr    ] o.a.s.m.r.SolrJmxReporter JMX monitoring for 'solr_39071.solr.node' (registry 'solr.node') enabled at server: com.sun.jmx.mbeanserver.JmxMBeanServer@6ba65f6f
   [junit4]   2> 3530442 INFO  (jetty-launcher-4649-thread-1) [n:127.0.0.1:39071_solr    ] o.a.s.m.r.SolrJmxReporter JMX monitoring for 'solr_39071.solr.jvm' (registry 'solr.jvm') enabled at server: com.sun.jmx.mbeanserver.JmxMBeanServer@6ba65f6f
   [junit4]   2> 3530442 INFO  (jetty-launcher-4649-thread-1) [n:127.0.0.1:39071_solr    ] o.a.s.m.r.SolrJmxReporter JMX monitoring for 'solr_39071.solr.jetty' (registry 'solr.jetty') enabled at server: com.sun.jmx.mbeanserver.JmxMBeanServer@6ba65f6f
   [junit4]   2> 3530443 INFO  (jetty-launcher-4649-thread-1) [n:127.0.0.1:39071_solr    ] o.a.s.c.CorePropertiesLocator Found 0 core definitions underneath /export/home/jenkins/workspace/Lucene-Solr-7.x-Solaris/solr/build/solr-core/test/J0/temp/solr.cloud.TestConfigSetsAPI_A5066349EFD9C7A6-001/tempDir-003/node1/.
   [junit4]   2> 3530456 INFO  (TEST-TestConfigSetsAPI.testUpload-seed#[A5066349EFD9C7A6]) [    ] o.a.s.c.TestConfigSetsAPI Directory: /export/home/jenkins/workspace/Lucene-Solr-7.x-Solaris/solr/core/src/test-files/solr/configsets/upload/regular
   [junit4]   2> 3530460 INFO  (TEST-TestConfigSetsAPI.testUpload-seed#[A5066349EFD9C7A6]) [    ] o.a.s.c.TestConfigSetsAPI Zipfile: /export/home/jenkins/workspace/Lucene-Solr-7.x-Solaris/solr/build/solr-core/test/J0/temp/solr.cloud.TestConfigSetsAPI_A5066349EFD9C7A6-001/tempDir-003/odyfnrtd.zip
   [junit4]   2> 3530464 INFO  (qtp1039930074-29944) [n:127.0.0.1:39071_solr    ] o.a.s.h.a.ConfigSetsHandler Trying to upload a configset. authcPlugin: null, user principal: null
   [junit4]   2> 3530469 INFO  (qtp1039930074-29944) [n:127.0.0.1:39071_solr    ] o.a.s.s.HttpSolrCall [admin] webapp=null path=/admin/configs params={name=regular-untrusted&action=UPLOAD} status=0 QTime=5
   [junit4]   2> 3530474 INFO  (TEST-TestConfigSetsAPI.testUpload-seed#[A5066349EFD9C7A6]) [    ] o.a.s.c.c.ZkStateReader Updated live nodes from ZooKeeper... (0) -> (1)
   [junit4]   2> 3530475 INFO  (TEST-TestConfigSetsAPI.testUpload-seed#[A5066349EFD9C7A6]) [    ] o.a.s.c.s.i.ZkClientClusterStateProvider Cluster at 127.0.0.1:53046/solr ready
   [junit4]   2> 3530476 INFO  (qtp1039930074-29945) [n:127.0.0.1:39071_solr    ] o.a.s.h.a.CollectionsHandler Invoked Collection Action :create with params replicationFactor=1&collection.configName=regular-untrusted&name=newcollection&action=CREATE&numShards=1&wt=javabin&version=2 and sendToOCPQueue=true
   [junit4]   2> 3530479 INFO  (OverseerThreadFactory-10090-thread-1-processing-n:127.0.0.1:39071_solr) [n:127.0.0.1:39071_solr    ] o.a.s.c.CreateCollectionCmd Create collection newcollection
   [junit4]   2> 3530589 INFO  (OverseerStateUpdate-98871720152203267-127.0.0.1:39071_solr-n_0000000000) [n:127.0.0.1:39071_solr    ] o.a.s.c.o.SliceMutator createReplica() {
   [junit4]   2>   "operation":"ADDREPLICA",
   [junit4]   2>   "collection":"newcollection",
   [junit4]   2>   "shard":"shard1",
   [junit4]   2>   "core":"newcollection_shard1_replica_n1",
   [junit4]   2>   "state":"down",
   [junit4]   2>   "base_url":"http://127.0.0.1:39071/solr",
   [junit4]   2>   "type":"NRT",
   [junit4]   2>   "waitForFinalState":"false"} 
   [junit4]   2> 3530791 INFO  (qtp1039930074-29947) [n:127.0.0.1:39071_solr    ] o.a.s.h.a.CoreAdminOperation core create command qt=/admin/cores&coreNodeName=core_node2&collection.configName=regular-untrusted&newCollection=true&name=newcollection_shard1_replica_n1&action=CREATE&numShards=1&collection=newcollection&shard=shard1&wt=javabin&version=2&replicaType=NRT
   [junit4]   2> 3530791 INFO  (qtp1039930074-29947) [n:127.0.0.1:39071_solr    ] o.a.s.c.TransientSolrCoreCacheDefault Allocating transient cache for 2147483647 transient cores
   [junit4]   2> 3530895 INFO  (zkCallback-4656-thread-1-processing-n:127.0.0.1:39071_solr) [n:127.0.0.1:39071_solr    ] o.a.s.c.c.ZkStateReader A cluster state change: [WatchedEvent state:SyncConnected type:NodeDataChanged path:/collections/newcollection/state.json] for collection [newcollection] has occurred - updating... (live nodes size: [1])
   [junit4]   2> 3530895 INFO  (zkCallback-4656-thread-2-processing-n:127.0.0.1:39071_solr) [n:127.0.0.1:39071_solr    ] o.a.s.c.c.ZkStateReader A cluster state change: [WatchedEvent state:SyncConnected type:NodeDataChanged path:/collections/newcollection/state.json] for collection [newcollection] has occurred - updating... (live nodes size: [1])
   [junit4]   2> 3531804 INFO  (qtp1039930074-29947) [n:127.0.0.1:39071_solr c:newcollection s:shard1 r:core_node2 x:newcollection_shard1_replica_n1] o.a.s.c.SolrConfig Using Lucene MatchVersion: 7.2.0
   [junit4]   2> 3531820 INFO  (qtp1039930074-29947) [n:127.0.0.1:39071_solr c:newcollection s:shard1 r:core_node2 x:newcollection_shard1_replica_n1] o.a.s.s.IndexSchema [newcollection_shard1_replica_n1] Schema name=minimal
   [junit4]   2> 3531822 WARN  (qtp1039930074-29947) [n:127.0.0.1:39071_solr c:newcollection s:shard1 r:core_node2 x:newcollection_shard1_replica_n1] o.a.s.s.IndexSchema no uniqueKey specified in schema.
   [junit4]   2> 3531822 INFO  (qtp1039930074-29947) [n:127.0.0.1:39071_solr c:newcollection s:shard1 r:core_node2 x:newcollection_shard1_replica_n1] o.a.s.s.IndexSchema Loaded schema minimal/1.1 with uniqueid field null
   [junit4]   2> 3531822 INFO  (qtp1039930074-29947) [n:127.0.0.1:39071_solr c:newcollection s:shard1 r:core_node2 x:newcollection_shard1_replica_n1] o.a.s.c.CoreContainer Creating SolrCore 'newcollection_shard1_replica_n1' using configuration from collection newcollection, trusted=false
   [junit4]   2> 3531822 INFO  (qtp1039930074-29947) [n:127.0.0.1:39071_solr c:newcollection s:shard1 r:core_node2 x:newcollection_shard1_replica_n1] o.a.s.m.r.SolrJmxReporter JMX monitoring for 'solr_39071.solr.core.newcollection.shard1.replica_n1' (registry 'solr.core.newcollection.shard1.replica_n1') enabled at server: com.sun.jmx.mbeanserver.JmxMBeanServer@6ba65f6f
   [junit4]   2> 3531823 INFO  (qtp1039930074-29947) [n:127.0.0.1:39071_solr c:newcollection s:shard1 r:core_node2 x:newcollection_shard1_replica_n1] o.a.s.c.SolrCore solr.RecoveryStrategy.Builder
   [junit4]   2> 3531823 INFO  (qtp1039930074-29947) [n:127.0.0.1:39071_solr c:newcollection s:shard1 r:core_node2 x:newcollection_shard1_replica_n1] o.a.s.c.SolrCore [[newcollection_shard1_replica_n1] ] Opening new SolrCore at [/export/home/jenkins/workspace/Lucene-Solr-7.x-Solaris/solr/build/solr-core/test/J0/temp/solr.cloud.TestConfigSetsAPI_A5066349EFD9C7A6-001/tempDir-003/node1/newcollection_shard1_replica_n1], dataDir=[/export/home/jenkins/workspace/Lucene-Solr-7.x-Solaris/solr/build/solr-core/test/J0/temp/solr.cloud.TestConfigSetsAPI_A5066349EFD9C7A6-001/tempDir-003/node1/./newcollection_shard1_replica_n1/data/]
   [junit4]   2> 3531876 INFO  (qtp1039930074-29947) [n:127.0.0.1:39071_solr c:newcollection s:shard1 r:core_node2 x:newcollection_shard1_replica_n1] o.a.s.u.CommitTracker Hard AutoCommit: disabled
   [junit4]   2> 3531876 INFO  (qtp1039930074-29947) [n:127.0.0.1:39071_solr c:newcollection s:shard1 r:core_node2 x:newcollection_shard1_replica_n1] o.a.s.u.CommitTracker Soft AutoCommit: disabled
   [junit4]   2> 3531878 INFO  (qtp1039930074-29947) [n:127.0.0.1:39071_solr c:newcollection s:shard1 r:core_node2 x:newcollection_shard1_replica_n1] o.a.s.s.SolrIndexSearcher Opening [Searcher@1d20ac93[newcollection_shard1_replica_n1] main]
   [junit4]   2> 3531879 INFO  (qtp1039930074-29947) [n:127.0.0.1:39071_solr c:newcollection s:shard1 r:core_node2 x:newcollection_shard1_replica_n1] o.a.s.r.ManagedResourceStorage Configured ZooKeeperStorageIO with znodeBase: /configs/regular-untrusted
   [junit4]   2> 3531880 INFO  (qtp1039930074-29947) [n:127.0.0.1:39071_solr c:newcollection s:shard1 r:core_node2 x:newcollection_shard1_replica_n1] o.a.s.r.ManagedResourceStorage Loaded null at path _rest_managed.json using ZooKeeperStorageIO:path=/configs/regular-untrusted
   [junit4]   2> 3531880 INFO  (qtp1039930074-29947) [n:127.0.0.1:39071_solr c:newcollection s:shard1 r:core_node2 x:newcollection_shard1_replica_n1] o.a.s.s.ZkIndexSchemaReader Creating ZooKeeper watch for the managed schema at /configs/regular-untrusted/managed-schema
   [junit4]   2> 3531881 INFO  (qtp1039930074-29947) [n:127.0.0.1:39071_solr c:newcollection s:shard1 r:core_node2 x:newcollection_shard1_replica_n1] o.a.s.s.ZkIndexSchemaReader Current schema version 0 is already the latest
   [junit4]   2> 3531881 INFO  (qtp1039930074-29947) [n:127.0.0.1:39071_solr c:newcollection s:shard1 r:core_node2 x:newcollection_shard1_replica_n1] o.a.s.h.ReplicationHandler Commits will be reserved for 10000ms.
   [junit4]   2> 3531883 INFO  (searcherExecutor-10093-thread-1-processing-n:127.0.0.1:39071_solr x:newcollection_shard1_replica_n1 s:shard1 c:newcollection r:core_node2) [n:127.0.0.1:39071_solr c:newcollection s:shard1 r:core_node2 x:newcollection_shard1_replica_n1] o.a.s.c.SolrCore [newcollection_shard1_replica_n1] Registered new searcher Searcher@1d20ac93[newcollection_shard1_replica_n1] main{ExitableDirectoryReader(UninvertingDirectoryReader())}
   [junit4]   2> 3531892 INFO  (qtp1039930074-29947) [n:127.0.0.1:39071_solr c:newcollection s:shard1 r:core_node2 x:newcollection_shard1_replica_n1] o.a.s.c.ShardLeaderElectionContext Enough replicas found to continue.
   [junit4]   2> 3531892 INFO  (qtp1039930074-29947) [n:127.0.0.1:39071_solr c:newcollection s:shard1 r:core_node2 x:newcollection_shard1_replica_n1] o.a.s.c.ShardLeaderElectionContext I may be the new leader - try and sync
   [junit4]   2> 3531892 INFO  (qtp1039930074-29947) [n:127.0.0.1:39071_solr c:newcollection s:shard1 r:core_node2 x:newcollection_shard1_replica_n1] o.a.s.c.SyncStrategy Sync replicas to http://127.0.0.1:39071/solr/newcollection_shard1_replica_n1/
   [junit4]   2> 3531892 ERROR (qtp1039930074-29947) [n:127.0.0.1:39071_solr c:newcollection s:shard1 r:core_node2 x:newcollection_shard1_replica_n1] o.a.s.c.SyncStrategy No UpdateLog found - cannot sync
   [junit4]   2> 3531892 INFO  (qtp1039930074-29947) [n:127.0.0.1:39071_solr c:newcollection s:shard1 r:core_node2 x:newcollection_shard1_replica_n1] o.a.s.c.ShardLeaderElectionContext We failed sync, but we have no versions - we can't sync in that case - we were active before, so become leader anyway
   [junit4]   2> 3531892 INFO  (qtp1039930074-29947) [n:127.0.0.1:39071_solr c:newcollection s:shard1 r:core_node2 x:newcollection_shard1_replica_n1] o.a.s.c.ShardLeaderElectionContext Found all replicas participating in election, clear LIR
   [junit4]   2> 3531896 INFO  (qtp1039930074-29947) [n:127.0.0.1:39071_solr c:newcollection s:shard1 r:core_node2 x:newcollection_shard1_replica_n1] o.a.s.c.ShardLeaderElectionContext I am the new leader: http://127.0.0.1:39071/solr/newcollection_shard1_replica_n1/ shard1
   [junit4]   2> 3531998 INFO  (zkCallback-4656-thread-2-processing-n:127.0.0.1:39071_solr) [n:127.0.0.1:39071_solr    ] o.a.s.c.c.ZkStateReader A cluster state change: [WatchedEvent state:SyncConnected type:NodeDataChanged path:/collections/newcollection/state.json] for collection [newcollection] has occurred - updating... (live nodes size: [1])
   [junit4]   2> 3531998 INFO  (zkCallback-4656-thread-1-processing-n:127.0.0.1:39071_solr) [n:127.0.0.1:39071_solr    ] o.a.s.c.c.ZkStateReader A cluster state change: [WatchedEvent state:SyncConnected type:NodeDataChanged path:/collections/newcollection/state.json] for collection [newcollection] has occurred - updating... (live nodes size: [1])
   [junit4]   2> 3532002 INFO  (qtp1039930074-29947) [n:127.0.0.1:39071_solr c:newcollection s:shard1 r:core_node2 x:newcollection_shard1_replica_n1] o.a.s.c.ZkController I am the leader, no recovery necessary
   [junit4]   2> 3532004 INFO  (qtp1039930074-29947) [n:127.0.0.1:39071_solr c:newcollection s:shard1 r:core_node2 x:newcollection_shard1_replica_n1] o.a.s.s.HttpSolrCall [admin] webapp=null path=/admin/cores params={qt=/admin/cores&coreNodeName=core_node2&collection.configName=regular-untrusted&newCollection=true&name=newcollection_shard1_replica_n1&action=CREATE&numShards=1&collection=newcollection&shard=shard1&wt=javabin&version=2&replicaType=NRT} status=0 QTime=1214
   [junit4]   2> 3532008 INFO  (qtp1039930074-29945) [n:127.0.0.1:39071_solr    ] o.a.s.h.a.CollectionsHandler Wait for new collection to be active for at most 30 seconds. Check all shard replicas
   [junit4]   2> 3532106 INFO  (zkCallback-4656-thread-2-processing-n:127.0.0.1:39071_solr) [n:127.0.0.1:39071_solr    ] o.a.s.c.c.ZkStateReader A cluster state change: [WatchedEvent state:SyncConnected type:NodeDataChanged path:/collections/newcollection/state.json] for collection [newcollection] has occurred - updating... (live nodes size: [1])
   [junit4]   2> 3532106 INFO  (zkCallback-4656-thread-1-processing-n:127.0.0.1:39071_solr) [n:127.0.0.1:39071_solr    ] o.a.s.c.c.ZkStateReader A cluster state change: [WatchedEvent state:SyncConnected type:NodeDataChanged path:/collections/newcollection/state.json] for collection [newcollection] has occurred - updating... (live nodes size: [1])
   [junit4]   2> 3532484 INFO  (OverseerCollectionConfigSetProcessor-98871720152203267-127.0.0.1:39071_solr-n_0000000000) [n:127.0.0.1:39071_solr    ] o.a.s.c.OverseerTaskQueue Response ZK path: /overseer/collection-queue-work/qnr-0000000000 doesn't exist.  Requestor may have disconnected from ZooKeeper
   [junit4]   2> 3533009 INFO  (qtp1039930074-29945) [n:127.0.0.1:39071_solr    ] o.a.s.s.HttpSolrCall [admin] webapp=nul

[...truncated too long message...]

  2>         at java.lang.Thread.run(Thread.java:748)
   [junit4]   2> NOTE: test params are: codec=FastCompressingStoredFields(storedFieldsFormat=CompressingStoredFieldsFormat(compressionMode=FAST, chunkSize=2, maxDocsPerChunk=815, blockSize=264), termVectorsFormat=CompressingTermVectorsFormat(compressionMode=FAST, chunkSize=2, blockSize=264)), sim=RandomSimilarity(queryNorm=false): {}, locale=sl-SI, timezone=America/Belem
   [junit4]   2> NOTE: SunOS 5.11 amd64/Oracle Corporation 1.8.0_141 (64-bit)/cpus=3,threads=3,free=37691936,total=526385152
   [junit4]   2> NOTE: All tests run in this JVM: [LeaderInitiatedRecoveryOnShardRestartTest, NodeLostTriggerTest, ReplaceNodeTest, TestReRankQParserPlugin, ConnectionReuseTest, TestDocTermOrds, BinaryUpdateRequestHandlerTest, TestIBSimilarityFactory, TestShortCircuitedRequests, TestCloudManagedSchema, IndexBasedSpellCheckerTest, HttpSolrCallGetCoreTest, TestEmbeddedSolrServerAdminHandler, TestPayloadScoreQParserPlugin, BlockJoinFacetSimpleTest, CursorPagingTest, TestRecovery, TestRawResponseWriter, TestAtomicUpdateErrorCases, TestSchemaVersionResource, HttpTriggerListenerTest, AnalyticsMergeStrategyTest, TestRandomDVFaceting, DataDrivenBlockJoinTest, SuggesterWFSTTest, TestPullReplica, BasicDistributedZkTest, CursorMarkTest, TestExclusionRuleCollectionAccess, DistributedTermsComponentTest, SolrCloudExampleTest, ClusterStateUpdateTest, DeleteShardTest, BigEndianAscendingWordDeserializerTest, IndexSchemaTest, TestCustomDocTransformer, TestExpandComponent, PreAnalyzedFieldManagedSchemaCloudTest, ConvertedLegacyTest, TestRuleBasedAuthorizationPlugin, TestJmxIntegration, TestXIncludeConfig, ZkControllerTest, TestMacros, ZkStateWriterTest, ZkCLITest, TestPivotHelperCode, HighlighterConfigTest, TestBinaryField, OverseerCollectionConfigSetProcessorTest, SolrSlf4jReporterTest, TestSSLRandomization, UninvertDocValuesMergePolicyTest, MoveReplicaHDFSTest, SolrCmdDistributorTest, TestManagedResource, TestConfigSetProperties, DirectUpdateHandlerOptimizeTest, CollectionReloadTest, TestExceedMaxTermLength, TestFieldTypeResource, MultiThreadedOCPTest, SyncSliceTest, TestAnalyzeInfixSuggestions, TestSurroundQueryParser, RuleEngineTest, CdcrVersionReplicationTest, TestFiltering, DistribCursorPagingTest, TestSortByMinMaxFunction, FastVectorHighlighterTest, RequestHandlersTest, DeleteNodeTest, ReplicaListTransformerTest, SolrShardReporterTest, DirectUpdateHandlerTest, TestShardHandlerFactory, NumericFieldsTest, TestJoin, TestSolrCloudWithKerberosAlt, HLLUtilTest, AddSchemaFieldsUpdateProcessorFactoryTest, UnloadDistributedZkTest, TestCloudNestedDocsSort, StatsReloadRaceTest, SSLMigrationTest, RecoveryZkTest, BlockJoinFacetDistribTest, HdfsSyncSliceTest, RestartWhileUpdatingTest, DateRangeFieldTest, DateFieldTest, HdfsChaosMonkeySafeLeaderTest, FullHLLTest, TestCorePropertiesReload, TestRandomCollapseQParserPlugin, TestGraphTermsQParserPlugin, TestReloadDeadlock, TestSimpleQParserPlugin, OverseerTaskQueueTest, XsltUpdateRequestHandlerTest, SpellCheckComponentTest, TestQuerySenderListener, TestReversedWildcardFilterFactory, TestSolrDeletionPolicy2, TestStressCloudBlindAtomicUpdates, TestDynamicLoading, SmileWriterTest, SliceStateTest, TestAuthorizationFramework, DistanceUnitsTest, SimpleCollectionCreateDeleteTest, TestLMDirichletSimilarityFactory, NotRequiredUniqueKeyTest, SolrJmxReporterCloudTest, DistributedFacetPivotWhiteBoxTest, SortByFunctionTest, TestSolr4Spatial2, TestCollationFieldDocValues, TestRebalanceLeaders, V2StandaloneTest, BadIndexSchemaTest, TestSolrConfigHandlerCloud, TestLRUStatsCache, TestCloudInspectUtil, MetricUtilsTest, HdfsTlogReplayBufferedWhileIndexingTest, HdfsWriteToMultipleCollectionsTest, ExitableDirectoryReaderTest, TestManagedSchemaThreadSafety, RAMDirectoryFactoryTest, CreateCollectionCleanupTest, EnumFieldTest, LeaderFailureAfterFreshStartTest, TestGeoJSONResponseWriter, BlockDirectoryTest, TestUseDocValuesAsStored, TestSubQueryTransformerCrossCore, TestFuzzyAnalyzedSuggestions, TestUnifiedSolrHighlighter, TestRealTimeGet, StatsComponentTest, DisMaxRequestHandlerTest, TestSolrFieldCacheBean, TestSolrCloudSnapshots, TestCollectionsAPIViaSolrCloudCluster, TestScoreJoinQPNoScore, SolrMetricReporterTest, TestComplexPhraseQParserPlugin, BitVectorTest, IgnoreCommitOptimizeUpdateProcessorFactoryTest, TestSkipOverseerOperations, HdfsRecoveryZkTest, SignatureUpdateProcessorFactoryTest, TestFieldCacheReopen, CheckHdfsIndexTest, TestQuerySenderNoQuery, DirectSolrConnectionTest, ScriptEngineTest, TestLockTree, RecoveryAfterSoftCommitTest, LeaderElectionTest, FieldAnalysisRequestHandlerTest, ShardRoutingTest, OverseerTest, TestReqParamsAPI, PathHierarchyTokenizerFactoryTest, TestNumericTokenStream, ResourceLoaderTest, TestAuthenticationFramework, PrimUtilsTest, TestSolrCLIRunExample, AutoAddReplicasIntegrationTest, QueryParsingTest, TestBlobHandler, MetricsHandlerTest, TestUpdate, TestHighFrequencyDictionaryFactory, TestEmbeddedSolrServerSchemaAPI, OverseerRolesTest, ForceLeaderTest, TestManagedSchema, TestInPlaceUpdatesDistrib, TestCopyFieldCollectionResource, TestFaceting, TestHashPartitioner, TestReload, TestStressVersions, TestSolr4Spatial, TestGroupingSearch, TestSort, TestFunctionQuery, TestBadConfig, TestIndexSearcher, HighlighterTest, SoftAutoCommitTest, TestSystemIdResolver, TestSuggestSpellingConverter, DOMUtilTest, ClusterStateTest, TestLRUCache, TestUtils, TestDocumentBuilder, ZkNodePropsTest, UUIDFieldTest, FileUtilsTest, CircularListTest, DistributedMLTComponentTest, SolrTestCaseJ4Test, TestCrossCoreJoin, TestCursorMarkWithoutUniqueKey, TestDistributedMissingSort, TestHighlightDedupGrouping, TestTolerantSearch, ActionThrottleTest, AddReplicaTest, AliasIntegrationTest, AssignBackwardCompatibilityTest, CdcrBootstrapTest, ChaosMonkeySafeLeaderWithPullReplicasTest, CollectionsAPIAsyncDistributedZkTest, ConcurrentDeleteAndCreateCollectionTest, ConfigSetsAPITest, CustomCollectionTest, DeleteInactiveReplicaTest, DistribJoinFromCollectionTest, DistributedQueueTest, MissingSegmentRecoveryTest, MoveReplicaTest, SharedFSAutoReplicaFailoverTest, TestCloudPivotFacet, TestCloudRecovery, TestClusterProperties, TestCollectionAPI, TestConfigSetsAPI]
   [junit4]   2> NOTE: reproduce with: ant test  -Dtestcase=TestConfigSetsAPI -Dtests.seed=A5066349EFD9C7A6 -Dtests.slow=true -Dtests.locale=sl-SI -Dtests.timezone=America/Belem -Dtests.asserts=true -Dtests.file.encoding=ISO-8859-1
   [junit4] ERROR   0.00s J0 | TestConfigSetsAPI (suite) <<<
   [junit4]    > Throwable #1: com.carrotsearch.randomizedtesting.ThreadLeakError: 4 threads leaked from SUITE scope at org.apache.solr.cloud.TestConfigSetsAPI: 
   [junit4]    >    1) Thread[id=30111, name=NIOServerCxn.Factory:0.0.0.0/0.0.0.0:0, state=RUNNABLE, group=TGRP-TestConfigSetsAPI]
   [junit4]    >         at sun.nio.ch.DevPollArrayWrapper.poll0(Native Method)
   [junit4]    >         at sun.nio.ch.DevPollArrayWrapper.poll(DevPollArrayWrapper.java:223)
   [junit4]    >         at sun.nio.ch.DevPollSelectorImpl.doSelect(DevPollSelectorImpl.java:98)
   [junit4]    >         at sun.nio.ch.SelectorImpl.lockAndDoSelect(SelectorImpl.java:86)
   [junit4]    >         at sun.nio.ch.SelectorImpl.select(SelectorImpl.java:97)
   [junit4]    >         at org.apache.zookeeper.server.NIOServerCnxnFactory.run(NIOServerCnxnFactory.java:173)
   [junit4]    >         at java.lang.Thread.run(Thread.java:748)
   [junit4]    >    2) Thread[id=30110, name=Thread-7494, state=WAITING, group=TGRP-TestConfigSetsAPI]
   [junit4]    >         at java.lang.Object.wait(Native Method)
   [junit4]    >         at java.lang.Thread.join(Thread.java:1252)
   [junit4]    >         at java.lang.Thread.join(Thread.java:1326)
   [junit4]    >         at org.apache.zookeeper.server.NIOServerCnxnFactory.join(NIOServerCnxnFactory.java:297)
   [junit4]    >         at org.apache.solr.cloud.ZkTestServer$ZKServerMain.runFromConfig(ZkTestServer.java:309)
   [junit4]    >         at org.apache.solr.cloud.ZkTestServer$2.run(ZkTestServer.java:490)
   [junit4]    >    3) Thread[id=30112, name=SessionTracker, state=TIMED_WAITING, group=TGRP-TestConfigSetsAPI]
   [junit4]    >         at java.lang.Object.wait(Native Method)
   [junit4]    >         at org.apache.zookeeper.server.SessionTrackerImpl.run(SessionTrackerImpl.java:146)
   [junit4]    >    4) Thread[id=30114, name=ProcessThread(sid:0 cport:44033):, state=WAITING, group=TGRP-TestConfigSetsAPI]
   [junit4]    >         at sun.misc.Unsafe.park(Native Method)
   [junit4]    >         at java.util.concurrent.locks.LockSupport.park(LockSupport.java:175)
   [junit4]    >         at java.util.concurrent.locks.AbstractQueuedSynchronizer$ConditionObject.await(AbstractQueuedSynchronizer.java:2039)
   [junit4]    >         at java.util.concurrent.LinkedBlockingQueue.take(LinkedBlockingQueue.java:442)
   [junit4]    >         at org.apache.zookeeper.server.PrepRequestProcessor.run(PrepRequestProcessor.java:122)
   [junit4]    > 	at __randomizedtesting.SeedInfo.seed([A5066349EFD9C7A6]:0)Throwable #2: com.carrotsearch.randomizedtesting.ThreadLeakError: There are still zombie threads that couldn't be terminated:
   [junit4]    >    1) Thread[id=30111, name=NIOServerCxn.Factory:0.0.0.0/0.0.0.0:0, state=RUNNABLE, group=TGRP-TestConfigSetsAPI]
   [junit4]    >         at sun.nio.ch.IOUtil.drain(Native Method)
   [junit4]    >         at sun.nio.ch.DevPollSelectorImpl.doSelect(DevPollSelectorImpl.java:109)
   [junit4]    >         at sun.nio.ch.SelectorImpl.lockAndDoSelect(SelectorImpl.java:86)
   [junit4]    >         at sun.nio.ch.SelectorImpl.select(SelectorImpl.java:97)
   [junit4]    >         at org.apache.zookeeper.server.NIOServerCnxnFactory.run(NIOServerCnxnFactory.java:173)
   [junit4]    >         at java.lang.Thread.run(Thread.java:748)
   [junit4]    > 	at __randomizedtesting.SeedInfo.seed([A5066349EFD9C7A6]:0)
   [junit4] Completed [535/744 (1!)] on J0 in 170.18s, 9 tests, 3 errors <<< FAILURES!

[...truncated 47917 lines...]

Mime
View raw message