lucene-dev mailing list archives

Site index · List index
Message view « Date » · « Thread »
Top « Date » · « Thread »
From Policeman Jenkins Server <jenk...@thetaphi.de>
Subject [JENKINS] Lucene-Solr-7.x-Linux (32bit/jdk1.8.0_144) - Build # 530 - Unstable!
Date Sun, 01 Oct 2017 22:01:43 GMT
Build: https://jenkins.thetaphi.de/job/Lucene-Solr-7.x-Linux/530/
Java: 32bit/jdk1.8.0_144 -client -XX:+UseConcMarkSweepGC

3 tests failed.
FAILED:  org.apache.solr.cloud.CdcrBootstrapTest.testBootstrapWithContinousIndexingOnSourceCluster

Error Message:
Document mismatch on target after sync expected:<2000> but was:<1901>

Stack Trace:
java.lang.AssertionError: Document mismatch on target after sync expected:<2000> but was:<1901>
	at __randomizedtesting.SeedInfo.seed([24D14BCDAEAFDDAA:F094009449F96E51]:0)
	at org.junit.Assert.fail(Assert.java:93)
	at org.junit.Assert.failNotEquals(Assert.java:647)
	at org.junit.Assert.assertEquals(Assert.java:128)
	at org.junit.Assert.assertEquals(Assert.java:472)
	at org.apache.solr.cloud.CdcrBootstrapTest.testBootstrapWithContinousIndexingOnSourceCluster(CdcrBootstrapTest.java:309)
	at sun.reflect.NativeMethodAccessorImpl.invoke0(Native Method)
	at sun.reflect.NativeMethodAccessorImpl.invoke(NativeMethodAccessorImpl.java:62)
	at sun.reflect.DelegatingMethodAccessorImpl.invoke(DelegatingMethodAccessorImpl.java:43)
	at java.lang.reflect.Method.invoke(Method.java:498)
	at com.carrotsearch.randomizedtesting.RandomizedRunner.invoke(RandomizedRunner.java:1737)
	at com.carrotsearch.randomizedtesting.RandomizedRunner$8.evaluate(RandomizedRunner.java:934)
	at com.carrotsearch.randomizedtesting.RandomizedRunner$9.evaluate(RandomizedRunner.java:970)
	at com.carrotsearch.randomizedtesting.RandomizedRunner$10.evaluate(RandomizedRunner.java:984)
	at com.carrotsearch.randomizedtesting.rules.SystemPropertiesRestoreRule$1.evaluate(SystemPropertiesRestoreRule.java:57)
	at org.apache.lucene.util.TestRuleSetupTeardownChained$1.evaluate(TestRuleSetupTeardownChained.java:49)
	at org.apache.lucene.util.AbstractBeforeAfterRule$1.evaluate(AbstractBeforeAfterRule.java:45)
	at org.apache.lucene.util.TestRuleThreadAndTestName$1.evaluate(TestRuleThreadAndTestName.java:48)
	at org.apache.lucene.util.TestRuleIgnoreAfterMaxFailures$1.evaluate(TestRuleIgnoreAfterMaxFailures.java:64)
	at org.apache.lucene.util.TestRuleMarkFailure$1.evaluate(TestRuleMarkFailure.java:47)
	at com.carrotsearch.randomizedtesting.rules.StatementAdapter.evaluate(StatementAdapter.java:36)
	at com.carrotsearch.randomizedtesting.ThreadLeakControl$StatementRunner.run(ThreadLeakControl.java:368)
	at com.carrotsearch.randomizedtesting.ThreadLeakControl.forkTimeoutingTask(ThreadLeakControl.java:817)
	at com.carrotsearch.randomizedtesting.ThreadLeakControl$3.evaluate(ThreadLeakControl.java:468)
	at com.carrotsearch.randomizedtesting.RandomizedRunner.runSingleTest(RandomizedRunner.java:943)
	at com.carrotsearch.randomizedtesting.RandomizedRunner$5.evaluate(RandomizedRunner.java:829)
	at com.carrotsearch.randomizedtesting.RandomizedRunner$6.evaluate(RandomizedRunner.java:879)
	at com.carrotsearch.randomizedtesting.RandomizedRunner$7.evaluate(RandomizedRunner.java:890)
	at com.carrotsearch.randomizedtesting.rules.StatementAdapter.evaluate(StatementAdapter.java:36)
	at com.carrotsearch.randomizedtesting.rules.SystemPropertiesRestoreRule$1.evaluate(SystemPropertiesRestoreRule.java:57)
	at org.apache.lucene.util.AbstractBeforeAfterRule$1.evaluate(AbstractBeforeAfterRule.java:45)
	at com.carrotsearch.randomizedtesting.rules.StatementAdapter.evaluate(StatementAdapter.java:36)
	at org.apache.lucene.util.TestRuleStoreClassName$1.evaluate(TestRuleStoreClassName.java:41)
	at com.carrotsearch.randomizedtesting.rules.NoShadowingOrOverridesOnMethodsRule$1.evaluate(NoShadowingOrOverridesOnMethodsRule.java:40)
	at com.carrotsearch.randomizedtesting.rules.NoShadowingOrOverridesOnMethodsRule$1.evaluate(NoShadowingOrOverridesOnMethodsRule.java:40)
	at com.carrotsearch.randomizedtesting.rules.StatementAdapter.evaluate(StatementAdapter.java:36)
	at com.carrotsearch.randomizedtesting.rules.StatementAdapter.evaluate(StatementAdapter.java:36)
	at com.carrotsearch.randomizedtesting.rules.StatementAdapter.evaluate(StatementAdapter.java:36)
	at org.apache.lucene.util.TestRuleAssertionsRequired$1.evaluate(TestRuleAssertionsRequired.java:53)
	at org.apache.lucene.util.TestRuleMarkFailure$1.evaluate(TestRuleMarkFailure.java:47)
	at org.apache.lucene.util.TestRuleIgnoreAfterMaxFailures$1.evaluate(TestRuleIgnoreAfterMaxFailures.java:64)
	at org.apache.lucene.util.TestRuleIgnoreTestSuites$1.evaluate(TestRuleIgnoreTestSuites.java:54)
	at com.carrotsearch.randomizedtesting.rules.StatementAdapter.evaluate(StatementAdapter.java:36)
	at com.carrotsearch.randomizedtesting.ThreadLeakControl$StatementRunner.run(ThreadLeakControl.java:368)
	at java.lang.Thread.run(Thread.java:748)


FAILED:  org.apache.solr.cloud.TestCloudSearcherWarming.testRepFactor1LeaderStartup

Error Message:
 null Live Nodes: [127.0.0.1:33613_solr] Last available state: DocCollection(testRepFactor1LeaderStartup//collections/testRepFactor1LeaderStartup/state.json/4)={   "pullReplicas":"0",   "replicationFactor":"1",   "shards":{"shard1":{       "range":"80000000-7fffffff",       "state":"active",       "replicas":{"core_node2":{           "core":"testRepFactor1LeaderStartup_shard1_replica_n1",           "base_url":"https://127.0.0.1:33613/solr",           "node_name":"127.0.0.1:33613_solr",           "state":"active",           "type":"NRT",           "leader":"true"}}}},   "router":{"name":"compositeId"},   "maxShardsPerNode":"1",   "autoAddReplicas":"false",   "nrtReplicas":"1",   "tlogReplicas":"0"}

Stack Trace:
java.lang.AssertionError: 
null
Live Nodes: [127.0.0.1:33613_solr]
Last available state: DocCollection(testRepFactor1LeaderStartup//collections/testRepFactor1LeaderStartup/state.json/4)={
  "pullReplicas":"0",
  "replicationFactor":"1",
  "shards":{"shard1":{
      "range":"80000000-7fffffff",
      "state":"active",
      "replicas":{"core_node2":{
          "core":"testRepFactor1LeaderStartup_shard1_replica_n1",
          "base_url":"https://127.0.0.1:33613/solr",
          "node_name":"127.0.0.1:33613_solr",
          "state":"active",
          "type":"NRT",
          "leader":"true"}}}},
  "router":{"name":"compositeId"},
  "maxShardsPerNode":"1",
  "autoAddReplicas":"false",
  "nrtReplicas":"1",
  "tlogReplicas":"0"}
	at __randomizedtesting.SeedInfo.seed([24D14BCDAEAFDDAA:F3F90615BF4F9444]:0)
	at org.junit.Assert.fail(Assert.java:93)
	at org.apache.solr.cloud.SolrCloudTestCase.waitForState(SolrCloudTestCase.java:269)
	at org.apache.solr.cloud.TestCloudSearcherWarming.testRepFactor1LeaderStartup(TestCloudSearcherWarming.java:126)
	at sun.reflect.NativeMethodAccessorImpl.invoke0(Native Method)
	at sun.reflect.NativeMethodAccessorImpl.invoke(NativeMethodAccessorImpl.java:62)
	at sun.reflect.DelegatingMethodAccessorImpl.invoke(DelegatingMethodAccessorImpl.java:43)
	at java.lang.reflect.Method.invoke(Method.java:498)
	at com.carrotsearch.randomizedtesting.RandomizedRunner.invoke(RandomizedRunner.java:1737)
	at com.carrotsearch.randomizedtesting.RandomizedRunner$8.evaluate(RandomizedRunner.java:934)
	at com.carrotsearch.randomizedtesting.RandomizedRunner$9.evaluate(RandomizedRunner.java:970)
	at com.carrotsearch.randomizedtesting.RandomizedRunner$10.evaluate(RandomizedRunner.java:984)
	at com.carrotsearch.randomizedtesting.rules.SystemPropertiesRestoreRule$1.evaluate(SystemPropertiesRestoreRule.java:57)
	at org.apache.lucene.util.TestRuleSetupTeardownChained$1.evaluate(TestRuleSetupTeardownChained.java:49)
	at org.apache.lucene.util.AbstractBeforeAfterRule$1.evaluate(AbstractBeforeAfterRule.java:45)
	at org.apache.lucene.util.TestRuleThreadAndTestName$1.evaluate(TestRuleThreadAndTestName.java:48)
	at org.apache.lucene.util.TestRuleIgnoreAfterMaxFailures$1.evaluate(TestRuleIgnoreAfterMaxFailures.java:64)
	at org.apache.lucene.util.TestRuleMarkFailure$1.evaluate(TestRuleMarkFailure.java:47)
	at com.carrotsearch.randomizedtesting.rules.StatementAdapter.evaluate(StatementAdapter.java:36)
	at com.carrotsearch.randomizedtesting.ThreadLeakControl$StatementRunner.run(ThreadLeakControl.java:368)
	at com.carrotsearch.randomizedtesting.ThreadLeakControl.forkTimeoutingTask(ThreadLeakControl.java:817)
	at com.carrotsearch.randomizedtesting.ThreadLeakControl$3.evaluate(ThreadLeakControl.java:468)
	at com.carrotsearch.randomizedtesting.RandomizedRunner.runSingleTest(RandomizedRunner.java:943)
	at com.carrotsearch.randomizedtesting.RandomizedRunner$5.evaluate(RandomizedRunner.java:829)
	at com.carrotsearch.randomizedtesting.RandomizedRunner$6.evaluate(RandomizedRunner.java:879)
	at com.carrotsearch.randomizedtesting.RandomizedRunner$7.evaluate(RandomizedRunner.java:890)
	at com.carrotsearch.randomizedtesting.rules.StatementAdapter.evaluate(StatementAdapter.java:36)
	at com.carrotsearch.randomizedtesting.rules.SystemPropertiesRestoreRule$1.evaluate(SystemPropertiesRestoreRule.java:57)
	at org.apache.lucene.util.AbstractBeforeAfterRule$1.evaluate(AbstractBeforeAfterRule.java:45)
	at com.carrotsearch.randomizedtesting.rules.StatementAdapter.evaluate(StatementAdapter.java:36)
	at org.apache.lucene.util.TestRuleStoreClassName$1.evaluate(TestRuleStoreClassName.java:41)
	at com.carrotsearch.randomizedtesting.rules.NoShadowingOrOverridesOnMethodsRule$1.evaluate(NoShadowingOrOverridesOnMethodsRule.java:40)
	at com.carrotsearch.randomizedtesting.rules.NoShadowingOrOverridesOnMethodsRule$1.evaluate(NoShadowingOrOverridesOnMethodsRule.java:40)
	at com.carrotsearch.randomizedtesting.rules.StatementAdapter.evaluate(StatementAdapter.java:36)
	at com.carrotsearch.randomizedtesting.rules.StatementAdapter.evaluate(StatementAdapter.java:36)
	at com.carrotsearch.randomizedtesting.rules.StatementAdapter.evaluate(StatementAdapter.java:36)
	at org.apache.lucene.util.TestRuleAssertionsRequired$1.evaluate(TestRuleAssertionsRequired.java:53)
	at org.apache.lucene.util.TestRuleMarkFailure$1.evaluate(TestRuleMarkFailure.java:47)
	at org.apache.lucene.util.TestRuleIgnoreAfterMaxFailures$1.evaluate(TestRuleIgnoreAfterMaxFailures.java:64)
	at org.apache.lucene.util.TestRuleIgnoreTestSuites$1.evaluate(TestRuleIgnoreTestSuites.java:54)
	at com.carrotsearch.randomizedtesting.rules.StatementAdapter.evaluate(StatementAdapter.java:36)
	at com.carrotsearch.randomizedtesting.ThreadLeakControl$StatementRunner.run(ThreadLeakControl.java:368)
	at java.lang.Thread.run(Thread.java:748)


FAILED:  org.apache.solr.cloud.TestCloudSearcherWarming.testPeersyncFailureReplicationSuccess

Error Message:
0

Stack Trace:
java.lang.ArrayIndexOutOfBoundsException: 0
	at __randomizedtesting.SeedInfo.seed([24D14BCDAEAFDDAA:F08028827F11EAC9]:0)
	at java.util.concurrent.CopyOnWriteArrayList.get(CopyOnWriteArrayList.java:387)
	at java.util.concurrent.CopyOnWriteArrayList.get(CopyOnWriteArrayList.java:396)
	at org.apache.solr.cloud.MiniSolrCloudCluster.getJettySolrRunner(MiniSolrCloudCluster.java:367)
	at org.apache.solr.cloud.TestCloudSearcherWarming.testPeersyncFailureReplicationSuccess(TestCloudSearcherWarming.java:141)
	at sun.reflect.NativeMethodAccessorImpl.invoke0(Native Method)
	at sun.reflect.NativeMethodAccessorImpl.invoke(NativeMethodAccessorImpl.java:62)
	at sun.reflect.DelegatingMethodAccessorImpl.invoke(DelegatingMethodAccessorImpl.java:43)
	at java.lang.reflect.Method.invoke(Method.java:498)
	at com.carrotsearch.randomizedtesting.RandomizedRunner.invoke(RandomizedRunner.java:1737)
	at com.carrotsearch.randomizedtesting.RandomizedRunner$8.evaluate(RandomizedRunner.java:934)
	at com.carrotsearch.randomizedtesting.RandomizedRunner$9.evaluate(RandomizedRunner.java:970)
	at com.carrotsearch.randomizedtesting.RandomizedRunner$10.evaluate(RandomizedRunner.java:984)
	at com.carrotsearch.randomizedtesting.rules.SystemPropertiesRestoreRule$1.evaluate(SystemPropertiesRestoreRule.java:57)
	at org.apache.lucene.util.TestRuleSetupTeardownChained$1.evaluate(TestRuleSetupTeardownChained.java:49)
	at org.apache.lucene.util.AbstractBeforeAfterRule$1.evaluate(AbstractBeforeAfterRule.java:45)
	at org.apache.lucene.util.TestRuleThreadAndTestName$1.evaluate(TestRuleThreadAndTestName.java:48)
	at org.apache.lucene.util.TestRuleIgnoreAfterMaxFailures$1.evaluate(TestRuleIgnoreAfterMaxFailures.java:64)
	at org.apache.lucene.util.TestRuleMarkFailure$1.evaluate(TestRuleMarkFailure.java:47)
	at com.carrotsearch.randomizedtesting.rules.StatementAdapter.evaluate(StatementAdapter.java:36)
	at com.carrotsearch.randomizedtesting.ThreadLeakControl$StatementRunner.run(ThreadLeakControl.java:368)
	at com.carrotsearch.randomizedtesting.ThreadLeakControl.forkTimeoutingTask(ThreadLeakControl.java:817)
	at com.carrotsearch.randomizedtesting.ThreadLeakControl$3.evaluate(ThreadLeakControl.java:468)
	at com.carrotsearch.randomizedtesting.RandomizedRunner.runSingleTest(RandomizedRunner.java:943)
	at com.carrotsearch.randomizedtesting.RandomizedRunner$5.evaluate(RandomizedRunner.java:829)
	at com.carrotsearch.randomizedtesting.RandomizedRunner$6.evaluate(RandomizedRunner.java:879)
	at com.carrotsearch.randomizedtesting.RandomizedRunner$7.evaluate(RandomizedRunner.java:890)
	at com.carrotsearch.randomizedtesting.rules.StatementAdapter.evaluate(StatementAdapter.java:36)
	at com.carrotsearch.randomizedtesting.rules.SystemPropertiesRestoreRule$1.evaluate(SystemPropertiesRestoreRule.java:57)
	at org.apache.lucene.util.AbstractBeforeAfterRule$1.evaluate(AbstractBeforeAfterRule.java:45)
	at com.carrotsearch.randomizedtesting.rules.StatementAdapter.evaluate(StatementAdapter.java:36)
	at org.apache.lucene.util.TestRuleStoreClassName$1.evaluate(TestRuleStoreClassName.java:41)
	at com.carrotsearch.randomizedtesting.rules.NoShadowingOrOverridesOnMethodsRule$1.evaluate(NoShadowingOrOverridesOnMethodsRule.java:40)
	at com.carrotsearch.randomizedtesting.rules.NoShadowingOrOverridesOnMethodsRule$1.evaluate(NoShadowingOrOverridesOnMethodsRule.java:40)
	at com.carrotsearch.randomizedtesting.rules.StatementAdapter.evaluate(StatementAdapter.java:36)
	at com.carrotsearch.randomizedtesting.rules.StatementAdapter.evaluate(StatementAdapter.java:36)
	at com.carrotsearch.randomizedtesting.rules.StatementAdapter.evaluate(StatementAdapter.java:36)
	at org.apache.lucene.util.TestRuleAssertionsRequired$1.evaluate(TestRuleAssertionsRequired.java:53)
	at org.apache.lucene.util.TestRuleMarkFailure$1.evaluate(TestRuleMarkFailure.java:47)
	at org.apache.lucene.util.TestRuleIgnoreAfterMaxFailures$1.evaluate(TestRuleIgnoreAfterMaxFailures.java:64)
	at org.apache.lucene.util.TestRuleIgnoreTestSuites$1.evaluate(TestRuleIgnoreTestSuites.java:54)
	at com.carrotsearch.randomizedtesting.rules.StatementAdapter.evaluate(StatementAdapter.java:36)
	at com.carrotsearch.randomizedtesting.ThreadLeakControl$StatementRunner.run(ThreadLeakControl.java:368)
	at java.lang.Thread.run(Thread.java:748)




Build Log:
[...truncated 12390 lines...]
   [junit4] Suite: org.apache.solr.cloud.TestCloudSearcherWarming
   [junit4]   2> 1098772 INFO  (SUITE-TestCloudSearcherWarming-seed#[24D14BCDAEAFDDAA]-worker) [    ] o.a.s.SolrTestCaseJ4 SecureRandom sanity checks: test.solr.allowed.securerandom=null & java.security.egd=file:/dev/./urandom
   [junit4]   2> Creating dataDir: /home/jenkins/workspace/Lucene-Solr-7.x-Linux/solr/build/solr-core/test/J1/temp/solr.cloud.TestCloudSearcherWarming_24D14BCDAEAFDDAA-001/init-core-data-001
   [junit4]   2> 1098774 INFO  (SUITE-TestCloudSearcherWarming-seed#[24D14BCDAEAFDDAA]-worker) [    ] o.a.s.SolrTestCaseJ4 Using PointFields (NUMERIC_POINTS_SYSPROP=true) w/NUMERIC_DOCVALUES_SYSPROP=false
   [junit4]   2> 1098775 INFO  (SUITE-TestCloudSearcherWarming-seed#[24D14BCDAEAFDDAA]-worker) [    ] o.a.s.SolrTestCaseJ4 Randomized ssl (true) and clientAuth (true) via: @org.apache.solr.util.RandomizeSSL(reason=, ssl=NaN, value=NaN, clientAuth=NaN)
   [junit4]   2> 1098777 INFO  (SUITE-TestCloudSearcherWarming-seed#[24D14BCDAEAFDDAA]-worker) [    ] o.a.s.c.MiniSolrCloudCluster Starting cluster of 1 servers in /home/jenkins/workspace/Lucene-Solr-7.x-Linux/solr/build/solr-core/test/J1/temp/solr.cloud.TestCloudSearcherWarming_24D14BCDAEAFDDAA-001/tempDir-001
   [junit4]   2> 1098777 INFO  (SUITE-TestCloudSearcherWarming-seed#[24D14BCDAEAFDDAA]-worker) [    ] o.a.s.c.ZkTestServer STARTING ZK TEST SERVER
   [junit4]   2> 1098777 INFO  (Thread-3609) [    ] o.a.s.c.ZkTestServer client port:0.0.0.0/0.0.0.0:0
   [junit4]   2> 1098777 INFO  (Thread-3609) [    ] o.a.s.c.ZkTestServer Starting server
   [junit4]   2> 1098780 ERROR (Thread-3609) [    ] o.a.z.s.ZooKeeperServer ZKShutdownHandler is not registered, so ZooKeeper server won't take any action on ERROR or SHUTDOWN server state changes
   [junit4]   2> 1098877 INFO  (SUITE-TestCloudSearcherWarming-seed#[24D14BCDAEAFDDAA]-worker) [    ] o.a.s.c.ZkTestServer start zk server on port:41825
   [junit4]   2> 1098887 INFO  (jetty-launcher-2649-thread-1) [    ] o.e.j.s.Server jetty-9.3.20.v20170531
   [junit4]   2> 1098888 INFO  (jetty-launcher-2649-thread-1) [    ] o.e.j.s.h.ContextHandler Started o.e.j.s.ServletContextHandler@16a5bde{/solr,null,AVAILABLE}
   [junit4]   2> 1098889 INFO  (jetty-launcher-2649-thread-1) [    ] o.e.j.s.AbstractConnector Started ServerConnector@52c459{SSL,[ssl, http/1.1]}{127.0.0.1:33613}
   [junit4]   2> 1098889 INFO  (jetty-launcher-2649-thread-1) [    ] o.e.j.s.Server Started @1100011ms
   [junit4]   2> 1098889 INFO  (jetty-launcher-2649-thread-1) [    ] o.a.s.c.s.e.JettySolrRunner Jetty properties: {hostContext=/solr, hostPort=33613}
   [junit4]   2> 1098889 ERROR (jetty-launcher-2649-thread-1) [    ] o.a.s.u.StartupLoggingUtils Missing Java Option solr.log.dir. Logging may be missing or incomplete.
   [junit4]   2> 1098889 INFO  (jetty-launcher-2649-thread-1) [    ] o.a.s.s.SolrDispatchFilter  ___      _       Welcome to Apache Solr? version 7.1.0
   [junit4]   2> 1098889 INFO  (jetty-launcher-2649-thread-1) [    ] o.a.s.s.SolrDispatchFilter / __| ___| |_ _   Starting in cloud mode on port null
   [junit4]   2> 1098889 INFO  (jetty-launcher-2649-thread-1) [    ] o.a.s.s.SolrDispatchFilter \__ \/ _ \ | '_|  Install dir: null, Default config dir: null
   [junit4]   2> 1098890 INFO  (jetty-launcher-2649-thread-1) [    ] o.a.s.s.SolrDispatchFilter |___/\___/_|_|    Start time: 2017-10-01T21:16:52.365Z
   [junit4]   2> 1098892 INFO  (jetty-launcher-2649-thread-1) [    ] o.a.s.s.SolrDispatchFilter solr.xml found in ZooKeeper. Loading...
   [junit4]   2> 1098909 INFO  (jetty-launcher-2649-thread-1) [    ] o.a.s.c.ZkContainer Zookeeper client=127.0.0.1:41825/solr
   [junit4]   2> 1098992 INFO  (jetty-launcher-2649-thread-1) [n:127.0.0.1:33613_solr    ] o.a.s.c.Overseer Overseer (id=null) closing
   [junit4]   2> 1098993 INFO  (jetty-launcher-2649-thread-1) [n:127.0.0.1:33613_solr    ] o.a.s.c.OverseerElectionContext I am going to be the leader 127.0.0.1:33613_solr
   [junit4]   2> 1098993 INFO  (jetty-launcher-2649-thread-1) [n:127.0.0.1:33613_solr    ] o.a.s.c.Overseer Overseer (id=98755714236678147-127.0.0.1:33613_solr-n_0000000000) starting
   [junit4]   2> 1098998 INFO  (jetty-launcher-2649-thread-1) [n:127.0.0.1:33613_solr    ] o.a.s.c.ZkController Register node as live in ZooKeeper:/live_nodes/127.0.0.1:33613_solr
   [junit4]   2> 1099003 INFO  (OverseerStateUpdate-98755714236678147-127.0.0.1:33613_solr-n_0000000000) [n:127.0.0.1:33613_solr    ] o.a.s.c.c.ZkStateReader Updated live nodes from ZooKeeper... (0) -> (1)
   [junit4]   2> 1099194 INFO  (jetty-launcher-2649-thread-1) [n:127.0.0.1:33613_solr    ] o.a.s.m.r.SolrJmxReporter JMX monitoring for 'solr_33613.solr.node' (registry 'solr.node') enabled at server: com.sun.jmx.mbeanserver.JmxMBeanServer@15a9ac
   [junit4]   2> 1099207 INFO  (jetty-launcher-2649-thread-1) [n:127.0.0.1:33613_solr    ] o.a.s.m.r.SolrJmxReporter JMX monitoring for 'solr_33613.solr.jvm' (registry 'solr.jvm') enabled at server: com.sun.jmx.mbeanserver.JmxMBeanServer@15a9ac
   [junit4]   2> 1099208 INFO  (jetty-launcher-2649-thread-1) [n:127.0.0.1:33613_solr    ] o.a.s.m.r.SolrJmxReporter JMX monitoring for 'solr_33613.solr.jetty' (registry 'solr.jetty') enabled at server: com.sun.jmx.mbeanserver.JmxMBeanServer@15a9ac
   [junit4]   2> 1099209 INFO  (jetty-launcher-2649-thread-1) [n:127.0.0.1:33613_solr    ] o.a.s.c.CorePropertiesLocator Found 0 core definitions underneath /home/jenkins/workspace/Lucene-Solr-7.x-Linux/solr/build/solr-core/test/J1/temp/solr.cloud.TestCloudSearcherWarming_24D14BCDAEAFDDAA-001/tempDir-001/node1/.
   [junit4]   2> 1099232 INFO  (SUITE-TestCloudSearcherWarming-seed#[24D14BCDAEAFDDAA]-worker) [    ] o.a.s.c.c.ZkStateReader Updated live nodes from ZooKeeper... (0) -> (1)
   [junit4]   2> 1099233 INFO  (SUITE-TestCloudSearcherWarming-seed#[24D14BCDAEAFDDAA]-worker) [    ] o.a.s.c.s.i.ZkClientClusterStateProvider Cluster at 127.0.0.1:41825/solr ready
   [junit4]   2> 1099243 INFO  (TEST-TestCloudSearcherWarming.testRepFactor1LeaderStartup-seed#[24D14BCDAEAFDDAA]) [    ] o.a.s.SolrTestCaseJ4 ###Starting testRepFactor1LeaderStartup
   [junit4]   2> 1099356 INFO  (qtp20412362-10187) [n:127.0.0.1:33613_solr    ] o.a.s.h.a.CollectionsHandler Invoked Collection Action :delete with params name=testRepFactor1LeaderStartup&action=DELETE&wt=javabin&version=2 and sendToOCPQueue=true
   [junit4]   2> 1099358 INFO  (OverseerThreadFactory-2178-thread-1-processing-n:127.0.0.1:33613_solr) [n:127.0.0.1:33613_solr    ] o.a.s.c.OverseerCollectionMessageHandler Executing Collection Cmd : action=UNLOAD&deleteInstanceDir=true&deleteDataDir=true
   [junit4]   2> 1099359 ERROR (OverseerThreadFactory-2178-thread-1-processing-n:127.0.0.1:33613_solr) [n:127.0.0.1:33613_solr    ] o.a.s.c.OverseerCollectionMessageHandler Collection: testRepFactor1LeaderStartup operation: delete failed:org.apache.solr.common.SolrException: Could not find collection : testRepFactor1LeaderStartup
   [junit4]   2> 	at org.apache.solr.common.cloud.ClusterState.getCollection(ClusterState.java:109)
   [junit4]   2> 	at org.apache.solr.cloud.OverseerCollectionMessageHandler.collectionCmd(OverseerCollectionMessageHandler.java:796)
   [junit4]   2> 	at org.apache.solr.cloud.DeleteCollectionCmd.call(DeleteCollectionCmd.java:88)
   [junit4]   2> 	at org.apache.solr.cloud.OverseerCollectionMessageHandler.processMessage(OverseerCollectionMessageHandler.java:228)
   [junit4]   2> 	at org.apache.solr.cloud.OverseerTaskProcessor$Runner.run(OverseerTaskProcessor.java:464)
   [junit4]   2> 	at org.apache.solr.common.util.ExecutorUtil$MDCAwareThreadPoolExecutor.lambda$execute$0(ExecutorUtil.java:188)
   [junit4]   2> 	at java.util.concurrent.ThreadPoolExecutor.runWorker(ThreadPoolExecutor.java:1149)
   [junit4]   2> 	at java.util.concurrent.ThreadPoolExecutor$Worker.run(ThreadPoolExecutor.java:624)
   [junit4]   2> 	at java.lang.Thread.run(Thread.java:748)
   [junit4]   2> 
   [junit4]   2> 1099368 INFO  (qtp20412362-10187) [n:127.0.0.1:33613_solr    ] o.a.s.s.HttpSolrCall [admin] webapp=null path=/admin/collections params={name=testRepFactor1LeaderStartup&action=DELETE&wt=javabin&version=2} status=400 QTime=12
   [junit4]   2> 1099370 INFO  (qtp20412362-10192) [n:127.0.0.1:33613_solr    ] o.a.s.h.a.CollectionsHandler Invoked Collection Action :delete with params name=testPeersyncFailureReplicationSuccess&action=DELETE&wt=javabin&version=2 and sendToOCPQueue=true
   [junit4]   2> 1099372 INFO  (OverseerCollectionConfigSetProcessor-98755714236678147-127.0.0.1:33613_solr-n_0000000000) [n:127.0.0.1:33613_solr    ] o.a.s.c.OverseerTaskQueue Response ZK path: /overseer/collection-queue-work/qnr-0000000000 doesn't exist.  Requestor may have disconnected from ZooKeeper
   [junit4]   2> 1099373 INFO  (OverseerThreadFactory-2178-thread-2-processing-n:127.0.0.1:33613_solr) [n:127.0.0.1:33613_solr    ] o.a.s.c.OverseerCollectionMessageHandler Executing Collection Cmd : action=UNLOAD&deleteInstanceDir=true&deleteDataDir=true
   [junit4]   2> 1099373 ERROR (OverseerThreadFactory-2178-thread-2-processing-n:127.0.0.1:33613_solr) [n:127.0.0.1:33613_solr    ] o.a.s.c.OverseerCollectionMessageHandler Collection: testPeersyncFailureReplicationSuccess operation: delete failed:org.apache.solr.common.SolrException: Could not find collection : testPeersyncFailureReplicationSuccess
   [junit4]   2> 	at org.apache.solr.common.cloud.ClusterState.getCollection(ClusterState.java:109)
   [junit4]   2> 	at org.apache.solr.cloud.OverseerCollectionMessageHandler.collectionCmd(OverseerCollectionMessageHandler.java:796)
   [junit4]   2> 	at org.apache.solr.cloud.DeleteCollectionCmd.call(DeleteCollectionCmd.java:88)
   [junit4]   2> 	at org.apache.solr.cloud.OverseerCollectionMessageHandler.processMessage(OverseerCollectionMessageHandler.java:228)
   [junit4]   2> 	at org.apache.solr.cloud.OverseerTaskProcessor$Runner.run(OverseerTaskProcessor.java:464)
   [junit4]   2> 	at org.apache.solr.common.util.ExecutorUtil$MDCAwareThreadPoolExecutor.lambda$execute$0(ExecutorUtil.java:188)
   [junit4]   2> 	at java.util.concurrent.ThreadPoolExecutor.runWorker(ThreadPoolExecutor.java:1149)
   [junit4]   2> 	at java.util.concurrent.ThreadPoolExecutor$Worker.run(ThreadPoolExecutor.java:624)
   [junit4]   2> 	at java.lang.Thread.run(Thread.java:748)
   [junit4]   2> 
   [junit4]   2> 1099376 INFO  (qtp20412362-10192) [n:127.0.0.1:33613_solr    ] o.a.s.s.HttpSolrCall [admin] webapp=null path=/admin/collections params={name=testPeersyncFailureReplicationSuccess&action=DELETE&wt=javabin&version=2} status=400 QTime=5
   [junit4]   2> 1099378 INFO  (qtp20412362-10193) [n:127.0.0.1:33613_solr    ] o.a.s.h.a.CollectionsHandler Invoked Collection Action :create with params pullReplicas=0&replicationFactor=1&name=testRepFactor1LeaderStartup&nrtReplicas=1&action=CREATE&numShards=1&tlogReplicas=0&createNodeSet=127.0.0.1:33613_solr&wt=javabin&version=2 and sendToOCPQueue=true
   [junit4]   2> 1099382 INFO  (OverseerThreadFactory-2178-thread-3-processing-n:127.0.0.1:33613_solr) [n:127.0.0.1:33613_solr    ] o.a.s.c.CreateCollectionCmd Create collection testRepFactor1LeaderStartup
   [junit4]   2> 1099382 INFO  (OverseerCollectionConfigSetProcessor-98755714236678147-127.0.0.1:33613_solr-n_0000000000) [n:127.0.0.1:33613_solr    ] o.a.s.c.OverseerTaskQueue Response ZK path: /overseer/collection-queue-work/qnr-0000000002 doesn't exist.  Requestor may have disconnected from ZooKeeper
   [junit4]   2> 1099382 INFO  (OverseerThreadFactory-2178-thread-3-processing-n:127.0.0.1:33613_solr) [n:127.0.0.1:33613_solr    ] o.a.s.c.CreateCollectionCmd Only _default config set found, using it.
   [junit4]   2> 1099383 INFO  (OverseerThreadFactory-2178-thread-3-processing-n:127.0.0.1:33613_solr) [n:127.0.0.1:33613_solr    ] o.a.s.c.c.ZkConfigManager Copying zk node /configs/_default/protwords.txt to /configs/testRepFactor1LeaderStartup/protwords.txt
   [junit4]   2> 1099384 INFO  (OverseerThreadFactory-2178-thread-3-processing-n:127.0.0.1:33613_solr) [n:127.0.0.1:33613_solr    ] o.a.s.c.c.ZkConfigManager Copying zk node /configs/_default/managed-schema to /configs/testRepFactor1LeaderStartup/managed-schema
   [junit4]   2> 1099385 INFO  (OverseerThreadFactory-2178-thread-3-processing-n:127.0.0.1:33613_solr) [n:127.0.0.1:33613_solr    ] o.a.s.c.c.ZkConfigManager Copying zk node /configs/_default/solrconfig.xml to /configs/testRepFactor1LeaderStartup/solrconfig.xml
   [junit4]   2> 1099386 INFO  (OverseerThreadFactory-2178-thread-3-processing-n:127.0.0.1:33613_solr) [n:127.0.0.1:33613_solr    ] o.a.s.c.c.ZkConfigManager Copying zk node /configs/_default/synonyms.txt to /configs/testRepFactor1LeaderStartup/synonyms.txt
   [junit4]   2> 1099387 INFO  (OverseerThreadFactory-2178-thread-3-processing-n:127.0.0.1:33613_solr) [n:127.0.0.1:33613_solr    ] o.a.s.c.c.ZkConfigManager Copying zk node /configs/_default/stopwords.txt to /configs/testRepFactor1LeaderStartup/stopwords.txt
   [junit4]   2> 1099388 INFO  (OverseerThreadFactory-2178-thread-3-processing-n:127.0.0.1:33613_solr) [n:127.0.0.1:33613_solr    ] o.a.s.c.c.ZkConfigManager Copying zk node /configs/_default/lang/contractions_it.txt to /configs/testRepFactor1LeaderStartup/lang/contractions_it.txt
   [junit4]   2> 1099390 INFO  (OverseerThreadFactory-2178-thread-3-processing-n:127.0.0.1:33613_solr) [n:127.0.0.1:33613_solr    ] o.a.s.c.c.ZkConfigManager Copying zk node /configs/_default/lang/stemdict_nl.txt to /configs/testRepFactor1LeaderStartup/lang/stemdict_nl.txt
   [junit4]   2> 1099390 INFO  (OverseerThreadFactory-2178-thread-3-processing-n:127.0.0.1:33613_solr) [n:127.0.0.1:33613_solr    ] o.a.s.c.c.ZkConfigManager Copying zk node /configs/_default/lang/stopwords_hy.txt to /configs/testRepFactor1LeaderStartup/lang/stopwords_hy.txt
   [junit4]   2> 1099392 INFO  (OverseerThreadFactory-2178-thread-3-processing-n:127.0.0.1:33613_solr) [n:127.0.0.1:33613_solr    ] o.a.s.c.c.ZkConfigManager Copying zk node /configs/_default/lang/stopwords_no.txt to /configs/testRepFactor1LeaderStartup/lang/stopwords_no.txt
   [junit4]   2> 1099393 INFO  (OverseerThreadFactory-2178-thread-3-processing-n:127.0.0.1:33613_solr) [n:127.0.0.1:33613_solr    ] o.a.s.c.c.ZkConfigManager Copying zk node /configs/_default/lang/contractions_ca.txt to /configs/testRepFactor1LeaderStartup/lang/contractions_ca.txt
   [junit4]   2> 1099394 INFO  (OverseerThreadFactory-2178-thread-3-processing-n:127.0.0.1:33613_solr) [n:127.0.0.1:33613_solr    ] o.a.s.c.c.ZkConfigManager Copying zk node /configs/_default/lang/stopwords_id.txt to /configs/testRepFactor1LeaderStartup/lang/stopwords_id.txt
   [junit4]   2> 1099395 INFO  (OverseerThreadFactory-2178-thread-3-processing-n:127.0.0.1:33613_solr) [n:127.0.0.1:33613_solr    ] o.a.s.c.c.ZkConfigManager Copying zk node /configs/_default/lang/stopwords_ga.txt to /configs/testRepFactor1LeaderStartup/lang/stopwords_ga.txt
   [junit4]   2> 1099396 INFO  (OverseerThreadFactory-2178-thread-3-processing-n:127.0.0.1:33613_solr) [n:127.0.0.1:33613_solr    ] o.a.s.c.c.ZkConfigManager Copying zk node /configs/_default/lang/stopwords_hi.txt to /configs/testRepFactor1LeaderStartup/lang/stopwords_hi.txt
   [junit4]   2> 1099397 INFO  (OverseerThreadFactory-2178-thread-3-processing-n:127.0.0.1:33613_solr) [n:127.0.0.1:33613_solr    ] o.a.s.c.c.ZkConfigManager Copying zk node /configs/_default/lang/stopwords_da.txt to /configs/testRepFactor1LeaderStartup/lang/stopwords_da.txt
   [junit4]   2> 1099398 INFO  (OverseerThreadFactory-2178-thread-3-processing-n:127.0.0.1:33613_solr) [n:127.0.0.1:33613_solr    ] o.a.s.c.c.ZkConfigManager Copying zk node /configs/_default/lang/stopwords_ja.txt to /configs/testRepFactor1LeaderStartup/lang/stopwords_ja.txt
   [junit4]   2> 1099399 INFO  (OverseerThreadFactory-2178-thread-3-processing-n:127.0.0.1:33613_solr) [n:127.0.0.1:33613_solr    ] o.a.s.c.c.ZkConfigManager Copying zk node /configs/_default/lang/stopwords_pt.txt to /configs/testRepFactor1LeaderStartup/lang/stopwords_pt.txt
   [junit4]   2> 1099400 INFO  (OverseerThreadFactory-2178-thread-3-processing-n:127.0.0.1:33613_solr) [n:127.0.0.1:33613_solr    ] o.a.s.c.c.ZkConfigManager Copying zk node /configs/_default/lang/stopwords_hu.txt to /configs/testRepFactor1LeaderStartup/lang/stopwords_hu.txt
   [junit4]   2> 1099401 INFO  (OverseerThreadFactory-2178-thread-3-processing-n:127.0.0.1:33613_solr) [n:127.0.0.1:33613_solr    ] o.a.s.c.c.ZkConfigManager Copying zk node /configs/_default/lang/stopwords_el.txt to /configs/testRepFactor1LeaderStartup/lang/stopwords_el.txt
   [junit4]   2> 1099402 INFO  (OverseerThreadFactory-2178-thread-3-processing-n:127.0.0.1:33613_solr) [n:127.0.0.1:33613_solr    ] o.a.s.c.c.ZkConfigManager Copying zk node /configs/_default/lang/stopwords_ru.txt to /configs/testRepFactor1LeaderStartup/lang/stopwords_ru.txt
   [junit4]   2> 1099403 INFO  (OverseerThreadFactory-2178-thread-3-processing-n:127.0.0.1:33613_solr) [n:127.0.0.1:33613_solr    ] o.a.s.c.c.ZkConfigManager Copying zk node /configs/_default/lang/stopwords_tr.txt to /configs/testRepFactor1LeaderStartup/lang/stopwords_tr.txt
   [junit4]   2> 1099404 INFO  (OverseerThreadFactory-2178-thread-3-processing-n:127.0.0.1:33613_solr) [n:127.0.0.1:33613_solr    ] o.a.s.c.c.ZkConfigManager Copying zk node /configs/_default/lang/stopwords_ar.txt to /configs/testRepFactor1LeaderStartup/lang/stopwords_ar.txt
   [junit4]   2> 1099405 INFO  (OverseerThreadFactory-2178-thread-3-processing-n:127.0.0.1:33613_solr) [n:127.0.0.1:33613_solr    ] o.a.s.c.c.ZkConfigManager Copying zk node /configs/_default/lang/userdict_ja.txt to /configs/testRepFactor1LeaderStartup/lang/userdict_ja.txt
   [junit4]   2> 1099406 INFO  (OverseerThreadFactory-2178-thread-3-processing-n:127.0.0.1:33613_solr) [n:127.0.0.1:33613_solr    ] o.a.s.c.c.ZkConfigManager Copying zk node /configs/_default/lang/stopwords_eu.txt to /configs/testRepFactor1LeaderStartup/lang/stopwords_eu.txt
   [junit4]   2> 1099407 INFO  (OverseerThreadFactory-2178-thread-3-processing-n:127.0.0.1:33613_solr) [n:127.0.0.1:33613_solr    ] o.a.s.c.c.ZkConfigManager Copying zk node /configs/_default/lang/stopwords_it.txt to /configs/testRepFactor1LeaderStartup/lang/stopwords_it.txt
   [junit4]   2> 1099408 INFO  (OverseerThreadFactory-2178-thread-3-processing-n:127.0.0.1:33613_solr) [n:127.0.0.1:33613_solr    ] o.a.s.c.c.ZkConfigManager Copying zk node /configs/_default/lang/stopwords_cz.txt to /configs/testRepFactor1LeaderStartup/lang/stopwords_cz.txt
   [junit4]   2> 1099409 INFO  (OverseerThreadFactory-2178-thread-3-processing-n:127.0.0.1:33613_solr) [n:127.0.0.1:33613_solr    ] o.a.s.c.c.ZkConfigManager Copying zk node /configs/_default/lang/stoptags_ja.txt to /configs/testRepFactor1LeaderStartup/lang/stoptags_ja.txt
   [junit4]   2> 1099409 INFO  (OverseerThreadFactory-2178-thread-3-processing-n:127.0.0.1:33613_solr) [n:127.0.0.1:33613_solr    ] o.a.s.c.c.ZkConfigManager Copying zk node /configs/_default/lang/contractions_fr.txt to /configs/testRepFactor1LeaderStartup/lang/contractions_fr.txt
   [junit4]   2> 1099410 INFO  (OverseerThreadFactory-2178-thread-3-processing-n:127.0.0.1:33613_solr) [n:127.0.0.1:33613_solr    ] o.a.s.c.c.ZkConfigManager Copying zk node /configs/_default/lang/stopwords_de.txt to /configs/testRepFactor1LeaderStartup/lang/stopwords_de.txt
   [junit4]   2> 1099411 INFO  (OverseerThreadFactory-2178-thread-3-processing-n:127.0.0.1:33613_solr) [n:127.0.0.1:33613_solr    ] o.a.s.c.c.ZkConfigManager Copying zk node /configs/_default/lang/stopwords_fa.txt to /configs/testRepFactor1LeaderStartup/lang/stopwords_fa.txt
   [junit4]   2> 1099412 INFO  (OverseerThreadFactory-2178-thread-3-processing-n:127.0.0.1:33613_solr) [n:127.0.0.1:33613_solr    ] o.a.s.c.c.ZkConfigManager Copying zk node /configs/_default/lang/contractions_ga.txt to /configs/testRepFactor1LeaderStartup/lang/contractions_ga.txt
   [junit4]   2> 1099413 INFO  (OverseerThreadFactory-2178-thread-3-processing-n:127.0.0.1:33613_solr) [n:127.0.0.1:33613_solr    ] o.a.s.c.c.ZkConfigManager Copying zk node /configs/_default/lang/stopwords_ca.txt to /configs/testRepFactor1LeaderStartup/lang/stopwords_ca.txt
   [junit4]   2> 1099414 INFO  (OverseerThreadFactory-2178-thread-3-processing-n:127.0.0.1:33613_solr) [n:127.0.0.1:33613_solr    ] o.a.s.c.c.ZkConfigManager Copying zk node /configs/_default/lang/stopwords_nl.txt to /configs/testRepFactor1LeaderStartup/lang/stopwords_nl.txt
   [junit4]   2> 1099415 INFO  (OverseerThreadFactory-2178-thread-3-processing-n:127.0.0.1:33613_solr) [n:127.0.0.1:33613_solr    ] o.a.s.c.c.ZkConfigManager Copying zk node /configs/_default/lang/stopwords_bg.txt to /configs/testRepFactor1LeaderStartup/lang/stopwords_bg.txt
   [junit4]   2> 1099416 INFO  (OverseerThreadFactory-2178-thread-3-processing-n:127.0.0.1:33613_solr) [n:127.0.0.1:33613_solr    ] o.a.s.c.c.ZkConfigManager Copying zk node /configs/_default/lang/stopwords_lv.txt to /configs/testRepFactor1LeaderStartup/lang/stopwords_lv.txt
   [junit4]   2> 1099417 INFO  (OverseerThreadFactory-2178-thread-3-processing-n:127.0.0.1:33613_solr) [n:127.0.0.1:33613_solr    ] o.a.s.c.c.ZkConfigManager Copying zk node /configs/_default/lang/stopwords_en.txt to /configs/testRepFactor1LeaderStartup/lang/stopwords_en.txt
   [junit4]   2> 1099418 INFO  (OverseerThreadFactory-2178-thread-3-processing-n:127.0.0.1:33613_solr) [n:127.0.0.1:33613_solr    ] o.a.s.c.c.ZkConfigManager Copying zk node /configs/_default/lang/stopwords_es.txt to /configs/testRepFactor1LeaderStartup/lang/stopwords_es.txt
   [junit4]   2> 1099419 INFO  (OverseerThreadFactory-2178-thread-3-processing-n:127.0.0.1:33613_solr) [n:127.0.0.1:33613_solr    ] o.a.s.c.c.ZkConfigManager Copying zk node /configs/_default/lang/stopwords_th.txt to /configs/testRepFactor1LeaderStartup/lang/stopwords_th.txt
   [junit4]   2> 1099420 INFO  (OverseerThreadFactory-2178-thread-3-processing-n:127.0.0.1:33613_solr) [n:127.0.0.1:33613_solr    ] o.a.s.c.c.ZkConfigManager Copying zk node /configs/_default/lang/stopwords_ro.txt to /configs/testRepFactor1LeaderStartup/lang/stopwords_ro.txt
   [junit4]   2> 1099421 INFO  (OverseerThreadFactory-2178-thread-3-processing-n:127.0.0.1:33613_solr) [n:127.0.0.1:33613_solr    ] o.a.s.c.c.ZkConfigManager Copying zk node /configs/_default/lang/stopwords_fr.txt to /configs/testRepFactor1LeaderStartup/lang/stopwords_fr.txt
   [junit4]   2> 1099422 INFO  (OverseerThreadFactory-2178-thread-3-processing-n:127.0.0.1:33613_solr) [n:127.0.0.1:33613_solr    ] o.a.s.c.c.ZkConfigManager Copying zk node /configs/_default/lang/stopwords_sv.txt to /configs/testRepFactor1LeaderStartup/lang/stopwords_sv.txt
   [junit4]   2> 1099423 INFO  (OverseerThreadFactory-2178-thread-3-processing-n:127.0.0.1:33613_solr) [n:127.0.0.1:33613_solr    ] o.a.s.c.c.ZkConfigManager Copying zk node /configs/_default/lang/stopwords_fi.txt to /configs/testRepFactor1LeaderStartup/lang/stopwords_fi.txt
   [junit4]   2> 1099425 INFO  (OverseerThreadFactory-2178-thread-3-processing-n:127.0.0.1:33613_solr) [n:127.0.0.1:33613_solr    ] o.a.s.c.c.ZkConfigManager Copying zk node /configs/_default/lang/hyphenations_ga.txt to /configs/testRepFactor1LeaderStartup/lang/hyphenations_ga.txt
   [junit4]   2> 1099425 INFO  (OverseerThreadFactory-2178-thread-3-processing-n:127.0.0.1:33613_solr) [n:127.0.0.1:33613_solr    ] o.a.s.c.c.ZkConfigManager Copying zk node /configs/_default/lang/stopwords_gl.txt to /configs/testRepFactor1LeaderStartup/lang/stopwords_gl.txt
   [junit4]   2> 1099426 INFO  (OverseerThreadFactory-2178-thread-3-processing-n:127.0.0.1:33613_solr) [n:127.0.0.1:33613_solr    ] o.a.s.c.c.ZkConfigManager Copying zk node /configs/_default/params.json to /configs/testRepFactor1LeaderStartup/params.json
   [junit4]   2> 1099532 INFO  (OverseerStateUpdate-98755714236678147-127.0.0.1:33613_solr-n_0000000000) [n:127.0.0.1:33613_solr    ] o.a.s.c.o.SliceMutator createReplica() {
   [junit4]   2>   "operation":"ADDREPLICA",
   [junit4]   2>   "collection":"testRepFactor1LeaderStartup",
   [junit4]   2>   "shard":"shard1",
   [junit4]   2>   "core":"testRepFactor1LeaderStartup_shard1_replica_n1",
   [junit4]   2>   "state":"down",
   [junit4]   2>   "base_url":"https://127.0.0.1:33613/solr",
   [junit4]   2>   "type":"NRT"} 
   [junit4]   2> 1099739 INFO  (qtp20412362-10192) [n:127.0.0.1:33613_solr    ] o.a.s.h.a.CoreAdminOperation core create command qt=/admin/cores&coreNodeName=core_node2&collection.configName=testRepFactor1LeaderStartup&newCollection=true&name=testRepFactor1LeaderStartup_shard1_replica_n1&action=CREATE&numShards=1&collection=testRepFactor1LeaderStartup&shard=shard1&wt=javabin&version=2&replicaType=NRT
   [junit4]   2> 1099740 INFO  (qtp20412362-10192) [n:127.0.0.1:33613_solr    ] o.a.s.c.TransientSolrCoreCacheDefault Allocating transient cache for 2147483647 transient cores
   [junit4]   2> 1099844 INFO  (zkCallback-2656-thread-1-processing-n:127.0.0.1:33613_solr) [n:127.0.0.1:33613_solr    ] o.a.s.c.c.ZkStateReader A cluster state change: [WatchedEvent state:SyncConnected type:NodeDataChanged path:/collections/testRepFactor1LeaderStartup/state.json] for collection [testRepFactor1LeaderStartup] has occurred - updating... (live nodes size: [1])
   [junit4]   2> 1099844 INFO  (zkCallback-2656-thread-2-processing-n:127.0.0.1:33613_solr) [n:127.0.0.1:33613_solr    ] o.a.s.c.c.ZkStateReader A cluster state change: [WatchedEvent state:SyncConnected type:NodeDataChanged path:/collections/testRepFactor1LeaderStartup/state.json] for collection [testRepFactor1LeaderStartup] has occurred - updating... (live nodes size: [1])
   [junit4]   2> 1100759 INFO  (qtp20412362-10192) [n:127.0.0.1:33613_solr c:testRepFactor1LeaderStartup s:shard1 r:core_node2 x:testRepFactor1LeaderStartup_shard1_replica_n1] o.a.s.c.RequestParams conf resource params.json loaded . version : 0 
   [junit4]   2> 1100759 INFO  (qtp20412362-10192) [n:127.0.0.1:33613_solr c:testRepFactor1LeaderStartup s:shard1 r:core_node2 x:testRepFactor1LeaderStartup_shard1_replica_n1] o.a.s.c.RequestParams request params refreshed to version 0
   [junit4]   2> 1100760 WARN  (qtp20412362-10192) [n:127.0.0.1:33613_solr c:testRepFactor1LeaderStartup s:shard1 r:core_node2 x:testRepFactor1LeaderStartup_shard1_replica_n1] o.a.s.c.SolrConfig Couldn't add files from /home/jenkins/workspace/Lucene-Solr-7.x-Linux/solr/build/solr-core/test/J1/temp/solr.cloud.TestCloudSearcherWarming_24D14BCDAEAFDDAA-001/tempDir-001/node1/testRepFactor1LeaderStartup_shard1_replica_n1/../../../../contrib/extraction/lib filtered by .*\.jar to classpath: /home/jenkins/workspace/Lucene-Solr-7.x-Linux/solr/build/solr-core/test/J1/temp/solr.cloud.TestCloudSearcherWarming_24D14BCDAEAFDDAA-001/tempDir-001/node1/testRepFactor1LeaderStartup_shard1_replica_n1/../../../../contrib/extraction/lib
   [junit4]   2> 1100760 WARN  (qtp20412362-10192) [n:127.0.0.1:33613_solr c:testRepFactor1LeaderStartup s:shard1 r:core_node2 x:testRepFactor1LeaderStartup_shard1_replica_n1] o.a.s.c.SolrConfig Couldn't add files from /home/jenkins/workspace/Lucene-Solr-7.x-Linux/solr/build/solr-core/test/J1/temp/solr.cloud.TestCloudSearcherWarming_24D14BCDAEAFDDAA-001/tempDir-001/node1/testRepFactor1LeaderStartup_shard1_replica_n1/../../../../dist filtered by solr-cell-\d.*\.jar to classpath: /home/jenkins/workspace/Lucene-Solr-7.x-Linux/solr/build/solr-core/test/J1/temp/solr.cloud.TestCloudSearcherWarming_24D14BCDAEAFDDAA-001/tempDir-001/node1/testRepFactor1LeaderStartup_shard1_replica_n1/../../../../dist
   [junit4]   2> 1100761 WARN  (qtp20412362-10192) [n:127.0.0.1:33613_solr c:testRepFactor1LeaderStartup s:shard1 r:core_node2 x:testRepFactor1LeaderStartup_shard1_replica_n1] o.a.s.c.SolrConfig Couldn't add files from /home/jenkins/workspace/Lucene-Solr-7.x-Linux/solr/build/solr-core/test/J1/temp/solr.cloud.TestCloudSearcherWarming_24D14BCDAEAFDDAA-001/tempDir-001/node1/testRepFactor1LeaderStartup_shard1_replica_n1/../../../../contrib/clustering/lib filtered by .*\.jar to classpath: /home/jenkins/workspace/Lucene-Solr-7.x-Linux/solr/build/solr-core/test/J1/temp/solr.cloud.TestCloudSearcherWarming_24D14BCDAEAFDDAA-001/tempDir-001/node1/testRepFactor1LeaderStartup_shard1_replica_n1/../../../../contrib/clustering/lib
   [junit4]   2> 1100761 WARN  (qtp20412362-10192) [n:127.0.0.1:33613_solr c:testRepFactor1LeaderStartup s:shard1 r:core_node2 x:testRepFactor1LeaderStartup_shard1_replica_n1] o.a.s.c.SolrConfig Couldn't add files from /home/jenkins/workspace/Lucene-Solr-7.x-Linux/solr/build/solr-core/test/J1/temp/solr.cloud.TestCloudSearcherWarming_24D14BCDAEAFDDAA-001/tempDir-001/node1/testRepFactor1LeaderStartup_shard1_replica_n1/../../../../dist filtered by solr-clustering-\d.*\.jar to classpath: /home/jenkins/workspace/Lucene-Solr-7.x-Linux/solr/build/solr-core/test/J1/temp/solr.cloud.TestCloudSearcherWarming_24D14BCDAEAFDDAA-001/tempDir-001/node1/testRepFactor1LeaderStartup_shard1_replica_n1/../../../../dist
   [junit4]   2> 1100761 WARN  (qtp20412362-10192) [n:127.0.0.1:33613_solr c:testRepFactor1LeaderStartup s:shard1 r:core_node2 x:testRepFactor1LeaderStartup_shard1_replica_n1] o.a.s.c.SolrConfig Couldn't add files from /home/jenkins/workspace/Lucene-Solr-7.x-Linux/solr/build/solr-core/test/J1/temp/solr.cloud.TestCloudSearcherWarming_24D14BCDAEAFDDAA-001/tempDir-001/node1/testRepFactor1LeaderStartup_shard1_replica_n1/../../../../contrib/langid/lib filtered by .*\.jar to classpath: /home/jenkins/workspace/Lucene-Solr-7.x-Linux/solr/build/solr-core/test/J1/temp/solr.cloud.TestCloudSearcherWarming_24D14BCDAEAFDDAA-001/tempDir-001/node1/testRepFactor1LeaderStartup_shard1_replica_n1/../../../../contrib/langid/lib
   [junit4]   2> 1100761 WARN  (qtp20412362-10192) [n:127.0.0.1:33613_solr c:testRepFactor1LeaderStartup s:shard1 r:core_node2 x:testRepFactor1LeaderStartup_shard1_replica_n1] o.a.s.c.SolrConfig Couldn't add files from /home/jenkins/workspace/Lucene-Solr-7.x-Linux/solr/build/solr-core/test/J1/temp/solr.cloud.TestCloudSearcherWarming_24D14BCDAEAFDDAA-001/tempDir-001/node1/testRepFactor1LeaderStartup_shard1_replica_n1/../../../../dist filtered by solr-langid-\d.*\.jar to classpath: /home/jenkins/workspace/Lucene-Solr-7.x-Linux/solr/build/solr-core/test/J1/temp/solr.cloud.TestCloudSearcherWarming_24D14BCDAEAFDDAA-001/tempDir-001/node1/testRepFactor1LeaderStartup_shard1_replica_n1/../../../../dist
   [junit4]   2> 1100761 WARN  (qtp20412362-10192) [n:127.0.0.1:33613_solr c:testRepFactor1LeaderStartup s:shard1 r:core_node2 x:testRepFactor1LeaderStartup_shard1_replica_n1] o.a.s.c.SolrConfig Couldn't add files from /home/jenkins/workspace/Lucene-Solr-7.x-Linux/solr/build/solr-core/test/J1/temp/solr.cloud.TestCloudSearcherWarming_24D14BCDAEAFDDAA-001/tempDir-001/node1/testRepFactor1LeaderStartup_shard1_replica_n1/../../../../contrib/velocity/lib filtered by .*\.jar to classpath: /home/jenkins/workspace/Lucene-Solr-7.x-Linux/solr/build/solr-core/test/J1/temp/solr.cloud.TestCloudSearcherWarming_24D14BCDAEAFDDAA-001/tempDir-001/node1/testRepFactor1LeaderStartup_shard1_replica_n1/../../../../contrib/velocity/lib
   [junit4]   2> 1100761 WARN  (qtp20412362-10192) [n:127.0.0.1:33613_solr c:testRepFactor1LeaderStartup s:shard1 r:core_node2 x:testRepFactor1LeaderStartup_shard1_replica_n1] o.a.s.c.SolrConfig Couldn't add files from /home/jenkins/workspace/Lucene-Solr-7.x-Linux/solr/build/solr-core/test/J1/temp/solr.cloud.TestCloudSearcherWarming_24D14BCDAEAFDDAA-001/tempDir-001/node1/testRepFactor1LeaderStartup_shard1_replica_n1/../../../../dist filtered by solr-velocity-\d.*\.jar to classpath: /home/jenkins/workspace/Lucene-Solr-7.x-Linux/solr/build/solr-core/test/J1/temp/solr.cloud.TestCloudSearcherWarming_24D14BCDAEAFDDAA-001/tempDir-001/node1/testRepFactor1LeaderStartup_shard1_replica_n1/../../../../dist
   [junit4]   2> 1100787 INFO  (qtp20412362-10192) [n:127.0.0.1:33613_solr c:testRepFactor1LeaderStartup s:shard1 r:core_node2 x:testRepFactor1LeaderStartup_shard1_replica_n1] o.a.s.c.SolrConfig Using Lucene MatchVersion: 7.1.0
   [junit4]   2> 1100822 INFO  (qtp20412362-10192) [n:127.0.0.1:33613_solr c:testRepFactor1LeaderStartup s:shard1 r:core_node2 x:testRepFactor1LeaderStartup_shard1_replica_n1] o.a.s.s.IndexSchema [testRepFactor1LeaderStartup_shard1_replica_n1] Schema name=default-config
   [junit4]   2> 1100982 INFO  (qtp20412362-10192) [n:127.0.0.1:33613_solr c:testRepFactor1LeaderStartup s:shard1 r:core_node2 x:testRepFactor1LeaderStartup_shard1_replica_n1] o.a.s.s.IndexSchema Loaded schema default-config/1.6 with uniqueid field id
   [junit4]   2> 1101012 INFO  (qtp20412362-10192) [n:127.0.0.1:33613_solr c:testRepFactor1LeaderStartup s:shard1 r:core_node2 x:testRepFactor1LeaderStartup_shard1_replica_n1] o.a.s.c.CoreContainer Creating SolrCore 'testRepFactor1LeaderStartup_shard1_replica_n1' using configuration from collection testRepFactor1LeaderStartup, trusted=true
   [junit4]   2> 1101013 INFO  (qtp20412362-10192) [n:127.0.0.1:33613_solr c:testRepFactor1LeaderStartup s:shard1 r:core_node2 x:testRepFactor1LeaderStartup_shard1_replica_n1] o.a.s.m.r.SolrJmxReporter JMX monitoring for 'solr_33613.solr.core.testRepFactor1LeaderStartup.shard1.replica_n1' (registry 'solr.core.testRepFactor1LeaderStartup.shard1.replica_n1') enabled at server: com.sun.jmx.mbeanserver.JmxMBeanServer@15a9ac
   [junit4]   2> 1101014 INFO  (qtp20412362-10192) [n:127.0.0.1:33613_solr c:testRepFactor1LeaderStartup s:shard1 r:core_node2 x:testRepFactor1LeaderStartup_shard1_replica_n1] o.a.s.c.SolrCore solr.RecoveryStrategy.Builder
   [junit4]   2> 1101014 INFO  (qtp20412362-10192) [n:127.0.0.1:33613_solr c:testRepFactor1LeaderStartup s:shard1 r:core_node2 x:testRepFactor1LeaderStartup_shard1_replica_n1] o.a.s.c.SolrCore [[testRepFactor1LeaderStartup_shard1_replica_n1] ] Opening new SolrCore at [/home/jenkins/workspace/Lucene-Solr-7.x-Linux/solr/build/solr-core/test/J1/temp/solr.cloud.TestCloudSearcherWarming_24D14BCDAEAFDDAA-001/tempDir-001/node1/testRepFactor1LeaderStartup_shard1_replica_n1], dataDir=[/home/jenkins/workspace/Lucene-Solr-7.x-Linux/solr/build/solr-core/test/J1/temp/solr.cloud.TestCloudSearcherWarming_24D14BCDAEAFDDAA-001/tempDir-001/node1/./testRepFactor1LeaderStartup_shard1_replica_n1/data/]
   [junit4]   2> 1101039 INFO  (qtp20412362-10192) [n:127.0.0.1:33613_solr c:testRepFactor1LeaderStartup s:shard1 r:core_node2 x:testRepFactor1LeaderStartup_shard1_replica_n1] o.a.s.r.XSLTResponseWriter xsltCacheLifetimeSeconds=5
   [junit4]   2> 1101094 INFO  (qtp20412362-10192) [n:127.0.0.1:33613_solr c:testRepFactor1LeaderStartup s:shard1 r:core_node2 x:testRepFactor1LeaderStartup_shard1_replica_n1] o.a.s.u.UpdateHandler Using UpdateLog implementation: org.apache.solr.update.UpdateLog
   [junit4]   2> 1101094 INFO  (qtp20412362-10192) [n:127.0.0.1:33613_solr c:testRepFactor1LeaderStartup s:shard1 r:core_node2 x:testRepFactor1LeaderStartup_shard1_replica_n1] o.a.s.u.UpdateLog Initializing UpdateLog: dataDir= defaultSyncLevel=FLUSH numRecordsToKeep=100 maxNumLogsToKeep=10 numVersionBuckets=65536
   [junit4]   2> 1101095 INFO  (qtp20412362-10192) [n:127.0.0.1:33613_solr c:testRepFactor1LeaderStartup s:shard1 r:core_node2 x:testRepFactor1LeaderStartup_shard1_replica_n1] o.a.s.u.CommitTracker Hard AutoCommit: if uncommited for 15000ms; 
   [junit4]   2> 1101095 INFO  (qtp20412362-10192) [n:127.0.0.1:33613_solr c:testRepFactor1LeaderStartup s:shard1 r:core_node2 x:testRepFactor1LeaderStartup_shard1_replica_n1] o.a.s.u.CommitTracker Soft AutoCommit: disabled
   [junit4]   2> 1101098 INFO  (qtp20412362-10192) [n:127.0.0.1:33613_solr c:testRepFactor1LeaderStartup s:shard1 r:core_node2 x:testRepFactor1LeaderStartup_shard1_replica_n1] o.a.s.s.SolrIndexSearcher Opening [Searcher@1748c4a[testRepFactor1LeaderStartup_shard1_replica_n1] main]
   [junit4]   2> 1101099 INFO  (qtp20412362-10192) [n:127.0.0.1:33613_solr c:testRepFactor1LeaderStartup s:shard1 r:core_node2 x:testRepFactor1LeaderStartup_shard1_replica_n1] o.a.s.r.ManagedResourceStorage Configured ZooKeeperStorageIO with znodeBase: /configs/testRepFactor1LeaderStartup
   [junit4]   2> 1101099 INFO  (qtp20412362-10192) [n:127.0.0.1:33613_solr c:testRepFactor1LeaderStartup s:shard1 r:core_node2 x:testRepFactor1LeaderStartup_shard1_replica_n1] o.a.s.r.ManagedResourceStorage Loaded null at path _rest_managed.json using ZooKeeperStorageIO:path=/configs/testRepFactor1LeaderStartup
   [junit4]   2> 1101099 INFO  (qtp20412362-10192) [n:127.0.0.1:33613_solr c:testRepFactor1LeaderStartup s:shard1 r:core_node2 x:testRepFactor1LeaderStartup_shard1_replica_n1] o.a.s.s.ZkIndexSchemaReader Creating ZooKeeper watch for the managed schema at /configs/testRepFactor1LeaderStartup/managed-schema
   [junit4]   2> 1101100 INFO  (qtp20412362-10192) [n:127.0.0.1:33613_solr c:testRepFactor1LeaderStartup s:shard1 r:core_node2 x:testRepFactor1LeaderStartup_shard1_replica_n1] o.a.s.s.ZkIndexSchemaReader Current schema version 0 is already the latest
   [junit4]   2> 1101100 INFO  (qtp20412362-10192) [n:127.0.0.1:33613_solr c:testRepFactor1LeaderStartup s:shard1 r:core_node2 x:testRepFactor1LeaderStartup_shard1_replica_n1] o.a.s.h.c.SpellCheckComponent Initializing spell checkers
   [junit4]   2> 1101101 INFO  (qtp20412362-10192) [n:127.0.0.1:33613_solr c:testRepFactor1LeaderStartup s:shard1 r:core_node2 x:testRepFactor1LeaderStartup_shard1_replica_n1] o.a.s.s.DirectSolrSpellChecker init: {name=default,field=_text_,classname=solr.DirectSolrSpellChecker,distanceMeasure=internal,accuracy=0.5,maxEdits=2,minPrefix=1,maxInspections=5,minQueryLength=4,maxQueryFrequency=0.01}
   [junit4]   2> 1101103 INFO  (qtp20412362-10192) [n:127.0.0.1:33613_solr c:testRepFactor1LeaderStartup s:shard1 r:core_node2 x:testRepFactor1LeaderStartup_shard1_replica_n1] o.a.s.h.ReplicationHandler Commits will be reserved for 10000ms.
   [junit4]   2> 1101103 INFO  (searcherExecutor-2181-thread-1-processing-n:127.0.0.1:33613_solr x:testRepFactor1LeaderStartup_shard1_replica_n1 s:shard1 c:testRepFactor1LeaderStartup r:core_node2) [n:127.0.0.1:33613_solr c:testRepFactor1LeaderStartup s:shard1 r:core_node2 x:testRepFactor1LeaderStartup_shard1_replica_n1] o.a.s.c.QuerySenderListener QuerySenderListener sending requests to Searcher@1748c4a[testRepFactor1LeaderStartup_shard1_replica_n1] main{ExitableDirectoryReader(UninvertingDirectoryReader())}
   [junit4]   2> 1101103 INFO  (searcherExecutor-2181-thread-1-processing-n:127.0.0.1:33613_solr x:testRepFactor1LeaderStartup_shard1_replica_n1 s:shard1 c:testRepFactor1LeaderStartup r:core_node2) [n:127.0.0.1:33613_solr c:testRepFactor1LeaderStartup s:shard1 r:core_node2 x:testRepFactor1LeaderStartup_shard1_replica_n1] o.a.s.c.QuerySenderListener QuerySenderListener done.
   [junit4]   2> 1101103 INFO  (searcherExecutor-2181-thread-1-processing-n:127.0.0.1:33613_solr x:testRepFactor1LeaderStartup_shard1_replica_n1 s:shard1 c:testRepFactor1LeaderStartup r:core_node2) [n:127.0.0.1:33613_solr c:testRepFactor1LeaderStartup s:shard1 r:core_node2 x:testRepFactor1LeaderStartup_shard1_replica_n1] o.a.s.h.c.SpellCheckComponent Loading spell index for spellchecker: default
   [junit4]   2> 1101103 INFO  (qtp20412362-10192) [n:127.0.0.1:33613_solr c:testRepFactor1LeaderStartup s:shard1 r:core_node2 x:testRepFactor1LeaderStartup_shard1_replica_n1] o.a.s.u.UpdateLog Could not find max version in index or recent updates, using new clock 1580091430223740928
   [junit4]   2> 1101106 INFO  (searcherExecutor-2181-thread-1-processing-n:127.0.0.1:33613_solr x:testRepFactor1LeaderStartup_shard1_replica_n1 s:shard1 c:testRepFactor1LeaderStartup r:core_node2) [n:127.0.0.1:33613_solr c:testRepFactor1LeaderStartup s:shard1 r:core_node2 x:testRepFactor1LeaderStartup_shard1_replica_n1] o.a.s.c.SolrCore [testRepFactor1LeaderStartup_shard1_replica_n1] Registered new searcher Searcher@1748c4a[testRepFactor1LeaderStartup_shard1_replica_n1] main{ExitableDirectoryReader(UninvertingDirectoryReader())}
   [junit4]   2> 1101108 INFO  (qtp20412362-10192) [n:127.0.0.1:33613_solr c:testRepFactor1LeaderStartup s:shard1 r:core_node2 x:testRepFactor1LeaderStartup_shard1_replica_n1] o.a.s.c.ShardLeaderElectionContext Enough replicas found to continue.
   [junit4]   2> 1101108 INFO  (qtp20412362-10192) [n:127.0.0.1:33613_solr c:testRepFactor1LeaderStartup s:shard1 r:core_node2 x:testRepFactor1LeaderStartup_shard1_replica_n1] o.a.s.c.ShardLeaderElectionContext I may be the new leader - try and sync
   [junit4]   2> 1101108 INFO  (qtp20412362-10192) [n:127.0.0.1:33613_solr c:testRepFactor1LeaderStartup s:shard1 r:core_node2 x:testRepFactor1LeaderStartup_shard1_replica_n1] o.a.s.c.SyncStrategy Sync replicas to https://127.0.0.1:33613/solr/testRepFactor1LeaderStartup_shard1_replica_n1/
   [junit4]   2> 1101108 INFO  (qtp20412362-10192) [n:127.0.0.1:33613_solr c:testRepFactor1LeaderStartup s:shard1 r:core_node2 x:testRepFactor1LeaderStartup_shard1_replica_n1] o.a.s.c.SyncStrategy Sync Success - now sync replicas to me
   [junit4]   2> 1101108 INFO  (qtp20412362-10192) [n:127.0.0.1:33613_solr c:testRepFactor1LeaderStartup s:shard1 r:core_node2 x:testRepFactor1LeaderStartup_shard1_replica_n1] o.a.s.c.SyncStrategy https://127.0.0.1:33613/solr/testRepFactor1LeaderStartup_shard1_replica_n1/ has no replicas
   [junit4]   2> 1101108 INFO  (qtp20412362-10192) [n:127.0.0.1:33613_solr c:testRepFactor1LeaderStartup s:shard1 r:core_node2 x:testRepFactor1LeaderStartup_shard1_replica_n1] o.a.s.c.ShardLeaderElectionContext Found all replicas participating in election, clear LIR
   [junit4]   2> 1101110 INFO  (qtp20412362-10192) [n:127.0.0.1:33613_solr c:testRepFactor1LeaderStartup s:shard1 r:core_node2 x:testRepFactor1LeaderStartup_shard1_replica_n1] o.a.s.c.ShardLeaderElectionContext I am the new leader: https://127.0.0.1:33613/solr/testRepFactor1LeaderStartup_shard1_replica_n1/ shard1
   [junit4]   2> 1101217 INFO  (zkCallback-2656-thread-2-processing-n:127.0.0.1:33613_solr) [n:127.0.0.1:33613_solr    ] o.a.s.c.c.ZkStateReader A cluster state change: [WatchedEvent state:SyncConnected type:NodeDataChanged path:/collections/testRepFactor1LeaderStartup/state.json] for collection [testRepFactor1LeaderStartup] has occurred - updating... (live nodes size: [1])
   [junit4]   2> 1101217 INFO  (zkCallback-2656-thread-1-processing-n:127.0.0.1:33613_solr) [n:127.0.0.1:33613_solr    ] o.a.s.c.c.ZkStateReader A cluster state change: [WatchedEvent state:SyncConnected type:NodeDataChanged path:/collections/testRepFactor1LeaderStartup/state.json] for collection [testRepFactor1LeaderStartup] has occurred - updating... (live nodes size: [1])
   [junit4]   2> 1101261 INFO  (qtp20412362-10192) [n:127.0.0.1:33613_solr c:testRepFactor1LeaderStartup s:shard1 r:core_node2 x:testRepFactor1LeaderStartup_shard1_replica_n1] o.a.s.c.ZkController I am the leader, no recovery necessary
   [junit4]   2> 1101262 INFO  (qtp20412362-10192) [n:127.0.0.1:33613_solr c:testRepFactor1LeaderStartup s:shard1 r:core_node2 x:testRepFactor1LeaderStartup_shard1_replica_n1] o.a.s.s.HttpSolrCall [admin] webapp=null path=/admin/cores params={qt=/admin/cores&coreNodeName=core_node2&collection.configName=testRepFactor1LeaderStartup&newCollection=true&name=testRepFactor1LeaderStartup_shard1_replica_n1&action=CREATE&numShards=1&collection=testRepFactor1LeaderStartup&shard=shard1&wt=javabin&version=2&replicaType=NRT} status=0 QTime=1523
   [junit4]   2> 1101265 INFO  (qtp20412362-10193) [n:127.0.0.1:33613_solr    ] o.a.s.h.a.CollectionsHandler Wait for new collection to be active for at most 30 seconds. Check all shard replicas
   [junit4]   2> 1101364 INFO  (zkCallback-2656-thread-1-processing-n:127.0.0.1:33613_solr) [n:127.0.0.1:33613_solr    ] o.a.s.c.c.ZkStateReader A cluster state change: [WatchedEvent state:SyncConnected type:NodeDataChanged path:/collections/testRepFactor1LeaderStartup/state.json] for collection [testRepFactor1LeaderStartup] has occurred - updating... (live nodes size: [1])
   [junit4]   2> 1101365 INFO  (zkCallback-2656-thread-2-processing-n:127.0.0.1:33613_solr) [n:127.0.0.1:33613_solr    ] o.a.s.c.c.ZkStateReader A cluster state change: [WatchedEvent state:SyncConnected type:NodeDataChanged path:/collections/testRepFactor1LeaderStartup/state.json] for collection [testRepFactor1LeaderStartup] has occurred - updating... (live nodes size: [1])
   [junit4]   2> 1101383 INFO  (OverseerCollectionConfigSetProcessor-98755714236678147-127.0.0.1:33613_solr-n_0000000000) [n:127.0.0.1:33613_solr    ] o.a.s.c.OverseerTaskQueue Response ZK path: /overseer/collection-queue-work/qnr-0000000004 doesn't exist.  Requestor may have disconnected from ZooKeeper
   [junit4]   2> 1102265 INFO  (qtp20412362-10193) [n:127.0.0.1:33613_solr    ] o.a.s.s.HttpSolrCall [admin] webapp=null path=/admin/collections params={pullReplicas=0&replicationFactor=1&name=testRepFactor1LeaderStartup&nrtReplicas=1&action=CREATE&numShards=1&tlogReplicas=0&createNodeSet=127.0.0.1:33613_solr&wt=javabin&version=2} status=0 QTime=2887
   [junit4]   2> java.lang.RuntimeException
   [junit4]   2> 	at org.apache.solr.cloud.TestCloudSearcherWarming$SleepingSolrEventListener.init(TestCloudSearcherWarming.java:306)
   [junit4]   2> 	at org.apache.solr.core.SolrCore.createInitInstance(SolrCore.java:826)
   [junit4]   2> 	at org.apache.solr.handler.SolrConfigHandler$Command.verifyClass(SolrConfigHandler.java:562)
   [junit4]   2> 	at org.apache.solr.handler.SolrConfigHandler$Command.updateNamedPlugin(SolrConfigHandler.java:533)
   [junit4]   2> 	at org.apache.solr.handler.SolrConfigHandler$Command.handleCommands(SolrConfigHandler.java:482)
   [junit4]   2> 	at org.apache.solr.handler.SolrConfigHandler$Command.handlePOST(SolrConfigHandler.java:346)
   [junit4]   2> 	at org.apache.solr.handler.SolrConfigHandler$Command.access$100(SolrConfigHandler.java:159)
   [junit4]   2> 	at org.apache.solr.handler.SolrConfigHandler.handleRequestBody(SolrConfigHandler.java:137)
   [junit4]   2> 	at org.apache.solr.handler.RequestHandlerBase.handleRequest(RequestHandlerBase.java:177)
   [junit4]   2> 	at org.apache.solr.core.SolrCore.execute(SolrCore.java:2483)
   [junit4]   2> 	at org.apache.solr.servlet.HttpSolrCall.execute(HttpSolrCall.java:720)
   [junit4]   2> 	at org.apache.solr.servlet.HttpSolrCall.call(HttpSolrCall.java:526)
   [junit4]   2> 	at org.apache.solr.servlet.SolrDispatchFilter.doFilter(SolrDispatchFilter.java:382)
   [junit4]   2> 	at org.apache.solr.servlet.SolrDispatchFilter.doFilter(SolrDispatchFilter.java:326)
   [junit4]   2> 	at org.eclipse.jetty.servlet.ServletHandler$CachedChain.doFilter(ServletHandler.java:1759)
   [junit4]   2> 	at org.apache.solr.client.solrj.embedded.JettySolrRunner$DebugFilter.doFilter(JettySolrRunner.java:139)
   [junit4]   2> 	at org.eclipse.jetty.servlet.ServletHandler$CachedChain.doFilter(ServletHandler.java:1759)
   [junit4]   2> 	at org.eclipse.jetty.servlet.ServletHandler.doHandle(ServletHandler.java:582)
   [junit4]   2> 	at org.eclipse.jetty.server.session.SessionHandler.doHandle(SessionHandler.java:224)
   [junit4]   2> 	at org.eclipse.jetty.server.handler.ContextHandler.doHandle(ContextHandler.java:1180)
   [junit4]   2> 	at org.eclipse.jetty.servlet.ServletHandler.doScope(ServletHandler.java:512)
   [junit4]   2> 	at org.eclipse.jetty.server.session.SessionHandler.doScope(SessionHandler.java:185)
   [junit4]   2> 	at org.eclipse.jetty.server.handler.ContextHandler.doScope(ContextHandler.java:1112)
   [junit4]   2> 	at org.eclipse.jetty.server.handler.ScopedHandler.handle(ScopedHandler.java:141)
   [junit4]   2> 	at org.eclipse.jetty.server.handler.gzip.GzipHandler.handle(GzipHandler.java:426)
   [junit4]   2> 	at org.eclipse.jetty.server.handler.HandlerWrapper.handle(HandlerWrapper.java:134)
   [junit4]   2> 	at org.eclipse.jetty.server.Server.handle(Server.java:534)
   [junit4]   2> 	at org.eclipse.jetty.server.HttpChannel.handle(HttpChannel.java:320)
   [junit4]   2> 	at org.eclipse.jetty.server.HttpConnection.onFillable(HttpConnection.java:251)
   [junit4]   2> 	at org.eclipse.jetty.io.AbstractConnection$ReadCallback.succeeded(AbstractConnection.java:283)
   [junit4]   2> 	at org.eclipse.jetty.io.FillInterest.fillable(FillInterest.java:108)
   [junit4]   2> 	at org.eclipse.jetty.io.ssl.SslConnection.onFillable(SslConnection.java:251)
   [junit4]   2> 	at org.eclipse.jetty.io.AbstractConnection$ReadCallback.succeeded(AbstractConnection.java:283)
   [junit4]   2> 	at org.eclipse.jetty.io.FillInterest.fillable(FillInterest.java:108)
   [junit4]   2> 	at org.eclipse.jetty.io.SelectChannelEndPoint$2.run(SelectChannelEndPoint.java:93)
   [junit4]   2> 	at org.eclipse.jetty.util.thread.strategy.ExecuteProduceConsume.executeProduceConsume(ExecuteProduceConsume.java:303)
   [junit4]   2> 	at org.eclipse.jetty.util.thread.strategy.ExecuteProduceConsume.produceConsume(ExecuteProduceConsume.java:148)
   [junit4]   2> 	at org.eclipse.jetty.util.thread.strategy.ExecuteProduceConsume.run(ExecuteProduceConsume.java:136)
   [junit4]   2> 	at org.eclipse.jetty.util.thread.QueuedThreadPool.runJob(QueuedThreadPool.java:671)
   [junit4]   2> 	at org.eclipse.jetty.util.thread.QueuedThreadPool$2.run(QueuedThreadPool.java:589)
   [junit4]   2> 	at java.lang.Thread.run(Thread.java:748)
   [junit4]   1> {event=newSearcher}
   [junit4]   2> java.lang.RuntimeException
   [junit4]   2> 	at org.apache.solr.cloud.TestCloudSearcherWarming$SleepingSolrEventListener.init(TestCloudSearcherWarming.java:306)
   [junit4]   2> 	at org.apache.solr.core.SolrCore.createInitInstance(SolrCore.java:826)
   [junit4]   2> 	at org.apache.solr.handler.SolrConfigHandler$Command.verifyClass(SolrConfigHandler.java:562)
   [junit4]   2> 	at org.apache.solr.handler.SolrConfigHandler$Command.updateNamedPlugin(SolrConfigHandler.java:533)
   [junit4]   2> 	at org.apache.solr.handler.SolrConfigHandler$Command.handleCommands(SolrConfigHandler.java:482)
   [junit4]   2> 	at org.apache.solr.handler.SolrConfigHandler$Command.handlePOST(SolrConfigHandler.java:346)
   [junit4]   2> 	at org.apache.solr.handler.SolrConfigHandler$Command.access$100(SolrConfigHandler.java:159)
   [junit4]   2> 	at org.apache.solr.handler.SolrConfigHandler.handleRequestBody(SolrConfigHandler.java:137)
   [junit4]   2> 	at org.apache.solr.handler.RequestHandlerBase.handleRequest(RequestHandlerBase.java:177)
   [junit4]   2> 	at org.apache.solr.core.SolrCore.execute(SolrCore.java:2483)
   [junit4]   2> 	at org.apache.solr.servlet.HttpSolrCall.execute(HttpSolrCall.java:720)
   [junit4]   2> 	at org.apache.solr.servlet.HttpSolrCall.call(HttpSolrCall.java:526)
   [junit4]   2> 	at org.apache.solr.servlet.SolrDispatchFilter.doFilter(SolrDispatchFilter.java:382)
   [junit4]   2> 	at org.apache.solr.servlet.SolrDispatchFilter.doFilter(SolrDispatchFilter.java:326)
   [junit4]   2> 	at org.eclipse.jetty.servlet.ServletHandler$CachedChain.doFilter(ServletHandler.java:1759)
   [junit4]   2> 	at org.apache.solr.client.solrj.embedded.JettySolrRunner$DebugFilter.doFilter(JettySolrRunner.java:139)
   [junit4]   2> 	at org.eclipse.jetty.servlet.ServletHandler$CachedChain.doFilter(ServletHandler.java:1759)
   [junit4]   2> 	at org.eclipse.jetty.servlet.ServletHandler.doHandle(ServletHandler.java:582)
   [junit4]   2> 	at org.eclipse.jetty.server.session.SessionHandler.doHandle(SessionHandler.java:224)
   [junit4]   2> 	at org.eclipse.jetty.server.handler.ContextHandler.doHandle(ContextHandler.java:1180)
   [junit4]   2> 	at org.eclipse.jetty.servlet.ServletHandler.doScope(ServletHandler.java:512)
   [junit4]   2> 	at org.eclipse.jetty.server.session.SessionHandler.doScope(SessionHandler.java:185)
   [junit4]   2> 	at org.eclipse.jetty.server.handler.ContextHandler.doScope(ContextHandler.java:1112)
   [junit4]   2> 	at org.eclipse.jetty.server.handler.ScopedHandler.handle(ScopedHandler.java:141)
   [junit4]   2> 	at org.eclipse.jetty.server.handler.gzip.GzipHandler.handle(GzipHandler.java:426)
   [junit4]   2> 	at org.eclipse.jetty.server.handler.HandlerWrapper.handle(HandlerWrapper.java:134)
   [junit4]   2> 	at org.eclipse.jetty.server.Server.handle(Server.java:534)
   [junit4]   2> 	at org.eclipse.jetty.server.HttpChannel.handle(HttpChannel.java:320)
   [junit4]   2> 	at org.eclipse.jetty.server.HttpConnection.onFillable(HttpConnection.java:251)
   [junit4]   2> 	at org.eclipse.jetty.io.AbstractConnection$ReadCallback.succeeded(AbstractConnection.java:283)
   [junit4]   2> 	at org.eclipse.jetty.io.FillInterest.fillable(FillInterest.java:108)
   [junit4]   2> 	at org.eclipse.jetty.io.ssl.SslConnection.onFillable(SslConnection.java:251)
   [junit4]   2> 	at org.eclipse.jetty.io.AbstractConnection$ReadCallback.succeeded(AbstractConnection.java:283)
   [junit4]   2> 	at org.eclipse.jetty.io.FillInterest.fillable(FillInterest.java:108)
   [junit4]   2> 	at org.eclipse.jetty.io.SelectChannelEndPoint$2.run(SelectChannelEndPoint.java:93)
   [junit4]   2> 	at org.eclipse.jetty.util.thread.strategy.ExecuteProduceConsume.executeProduceConsume(ExecuteProduceConsume.java:303)
   [junit4]   2> 	at org.eclipse.jetty.util.thread.strategy.ExecuteProduceConsume.produceConsume(ExecuteProduceConsume.java:148)
   [junit4]   2> 	at org.eclipse.jetty.util.thread.strategy.ExecuteProduceConsume.run(ExecuteProduceConsume.java:136)
   [junit4]   2> 	at org.eclipse.jetty.util.thread.QueuedThreadPool.runJob(QueuedThreadPool.java:671)
   [junit4]   2> 	at org.eclipse.jetty.util.thread.QueuedThreadPool$2.run(QueuedThreadPool.java:589)
   [junit4]   2> 	at java.lang.Thread.run(Thread.java:748)
   [junit4]   1> {event=firstSearcher}
   [junit4]   2> 1102273 INFO  (qtp20412362-10194) [n:127.0.0.1:33613_solr c:testRepFactor1LeaderStartup s:shard1 r:core_node2 x:testRepFactor1LeaderStartup_shard1_replica_n1] o.a.s.h.SolrConfigHandler Executed config commands successfully and persisted to ZK [{"add-listener":{
   [junit4]   2>     "name":"newSearcherListener",
   [junit4]   2>     "event":"newSearcher",
   [junit4]   2>     "class":"org.apache.solr.cloud.TestCloudSearcherWarming$SleepingSolrEventListener"}}, {"add-listener":{
   [junit4]   2>     "name":"firstSearcherListener",
   [junit4]   2>     "event":"firstSearcher",
   [junit4]   2>     "class":"org.apache.solr.cloud.TestCloudSearcherWarming$SleepingSolrEventListener"}}]
   [junit4]   2> 1102273 INFO  (qtp20412362-10194) [n:127.0.0.1:33613_solr c:testRepFactor1LeaderStartup s:shard1 r:core_node2 x:testRepFactor1LeaderStartup_shard1_replica_n1] o.a.s.h.SolrConfigHandler Waiting up to 30 secs for 1 replicas to set the property overlay to be of version 0 for collection testRepFactor1LeaderStartup
   [junit4]   2> 1102275 INFO  (solrHandlerExecutor-2186-thread-1-processing-n:127.0.0.1:33613_solr x:testRepFactor1LeaderStartup_shard1_replica_n1 s:shard1 c:testRepFactor1LeaderStartup r:core_node2) [n:127.0.0.1:33613_solr c:testRepFactor1LeaderStartup s:shard1 r:core_node2 x:testRepFactor1LeaderStartup_shard1_replica_n1] o.a.s.h.SolrConfigHandler Time elapsed : 0 secs, maxWait 30
   [junit4]   2> 1102275 INFO  (Thread-3619) [n:127.0.0.1:33613_solr    ] o.a.s.c.SolrCore config update listener called for core testRepFactor1LeaderStartup_shard1_replica_n1
   [junit4]   2> 1102276 INFO  (Thread-3619) [n:127.0.0.1:33613_solr    ] o.a.s.c.SolrCore core reload testRepFactor1LeaderStartup_shard1_replica_n1
   [junit4]   2> 1102284 INFO  (Thread-3619) [n:127.0.0.1:33613_solr    ] o.a.s.c.RequestParams conf resource params.json loaded . version : 0 
   [junit4]   2> 1102284 INFO  (Thread-3619) [n:127.0.0.1:33613_solr    ] o.a.s.c.RequestParams request params refreshed to version 0
   [junit4]   2> 1102285 WARN  (Thread-3619) [n:127.0.0.1:33613_solr    ] o.a.s.c.SolrConfig Couldn't add files from /home/jenkins/workspace/Lucene-Solr-7.x-Linux/solr/build/solr-core/test/J1/temp/solr.cloud.TestCloudSearcherWarming_24D14BCDAEAFDDAA-001/tempDir-001/node1/testRepFactor1LeaderStartup_shard1_replica_n1/../../../../contrib/extraction/lib filtered by .*\.jar to classpath: /home/jenkins/workspace/Lucene-Solr-7.x-Linux/solr/build/solr-core/test/J1/temp/solr.cloud.TestCloudSearcherWarming_24D14BCDAEAFDDAA-001/tempDir-001/node1/testRepFactor1LeaderStartup_shard1_replica_n1/../../../../contrib/extraction/lib
   [junit4]   2> 1102285 WARN  (Thread-3619) [n:127.0.0.1:33613_solr    ] o.a.s.c.SolrConfig Couldn't add files from /home/jenkins/workspace/Lucene-Solr-7.x-Linux/solr/build/solr-core/test/J1/temp/solr.cloud.TestCloudSearcherWarming_24D14BCDAEAFDDAA-001/tempDir-001/node1/testRepFactor1LeaderStartup_shard1_replica_n1/../../../../dist filtered by solr-cell-\d.*\.jar to classpath: /home/jenkins/workspace/Lucene-Solr-7.x-Linux/solr/build/solr-core/test/J1/temp/solr.cloud.TestCloudSearcherWarming_24D14BCDAEAFDDAA-001/tempDir-001/node1/testRepFactor1LeaderStartup_shard1_replica_n1/../../../../dist
   [junit4]   2> 1102285 WARN  (Thread-3619) [n:127.0.0.1:33613_solr    ] o.a.s.c.SolrConfig Couldn't add files from /home/jenkins/workspace/Lucene-Solr-7.x-Linux/solr/build/solr-core/test/J1/temp/solr.cloud.TestCloudSearcherWarming_24D14BCDAEAFDDAA-001/tempDir-001/node1/testRepFactor1LeaderStartup_shard1_replica_n1/../../../../contrib/clustering/lib filtered by .*\.jar to classpath: /home/jenkins/workspace/Lucene-Solr-7.x-Linux/solr/build/solr-core/test/J1/temp/solr.cloud.TestCloudSearcherWarming_24D14BCDAEAFDDAA-001/tempDir-001/node1/testRepFactor1LeaderStartup_shard1_replica_n1/../../../../contrib/clustering/lib
   [junit4]   2> 1102285 WARN  (Thread-3619) [n:127.0.0.1:33613_solr    ] o.a.s.c.SolrConfig Couldn't add files from /home/jenkins/workspace/Lucene-Solr-7.x-Linux/solr/build/solr-core/test/J1/temp/solr.cloud.TestCloudSearcherWarming_24D14BCDAEAFDDAA-001/tempDir-001/node1/testRepFactor1LeaderStartup_shard1_replica_n1/../../../../dist filtered by solr-clustering-\d.*\.jar to classpath: /home/jenkins/workspace/Lucene-Solr-7.x-Linux/solr/build/solr-core/test/J1/temp/solr.cloud.TestCloudSearcherWarming_24D14BCDAEAFDDAA-001/tempDir-001/node1/testRepFactor1LeaderStartup_shard1_replica_n1/../../../../dist
   [junit4]   2> 1102285 WARN  (Thread-3619) [n:127.0.0.1:33613_solr    ] o.a.s.c.SolrConfig Couldn't add files from /home/jenkins/workspace/Lucene-Solr-7.x-Linux/solr/build/solr-core/test/J1/temp/solr.cloud.TestCloudSearcherWarming_24D14BCDAEAFDDAA-001/tempDir-001/node1/testRepFactor1LeaderStartup_shard1_replica_n1/../../../../contrib/langid/lib filtered by .*\.jar to classpath: /home/jenkins/workspace/Lucene-Solr-7.x-Linux/solr/build/solr-core/test/J1/temp/solr.cloud.TestCloudSearcherWarming_24D14BCDAEAFDDAA-001/tempDir-001/node1/testRepFactor1LeaderStartup_shard1_replica_n1/../../../../contrib/langid/lib
   [junit4]   2> 1102286 WARN  (Thread-3619) [n:127.0.0.1:33613_solr    ] o.a.s.c.SolrConfig Couldn't add files from /home/jenkins/workspace/Lucene-Solr-7.x-Linux/solr/build/solr-core/test/J1/temp/solr.cloud.TestCloudSearcherWarming_24D14BCDAEAFDDAA-001/tempDir-001/node1/testRepFactor1LeaderStartup_shard1_replica_n1/../../../../dist filtered by solr-langid-\d.*\.jar to classpath: /home/jenkins/workspace/Lucene-Solr-7.x-Linux/solr/build/solr-core/test/J1/temp/solr.cloud.TestCloudSearcherWarming_24D14BCDAEAFDDAA-001/tempDir-001/node1/testRepFactor1LeaderStartup_shard1_replica_n1/../../../../dist
   [junit4]   2> 1102286 WARN  (Thread-3619) [n:127.0.0.1:33613_solr    ] o.a.s.c.SolrConfig Couldn't add files from /home/jenkins/workspace/Lucene-Solr-7.x-Linux/solr/build/solr-core/test/J1/temp/solr.cloud.TestCloudSearcherWarming_24D14BCDAEAFDDAA-001/tempDir-001/node1/testRepFactor1LeaderStartup_shard1_replica_n1/../../../../contrib/velocity/lib filtered by .*\.jar to classpath: /home/jenkins/workspace/Lucene-Solr-7.x-Linux/solr/build/solr-core/test/J1/temp/solr.cloud.TestCloudSearcherWarming_24D14BCDAEAFDDAA-001/tempDir-001/node1/testRepFactor1LeaderStartup_shard1_replica_n1/../../../../contrib/velocity/lib
   [junit4]   2> 1102286 WARN  (Thread-3619) [n:127.0.0.1:33613_solr    ] o.a.s.c.SolrConfig Couldn't add files from /home/jenkins/workspace/Lucene-Solr-7.x-Linux/solr/build/solr-core/test/J1/temp/solr.cloud.TestCloudSearcherWarming_24D14BCDAEAFDDAA-001/tempDir-001/node1/testRepFactor1LeaderStartup_shard1_replica_n1/../../../../dist filtered by solr-velocity-\d.*\.jar to classpath: /home/jenkins/workspace/Lucene-Solr-7.x-Linux/solr/build/solr-core/test/J1/temp/solr.cloud.TestCloudSearcherWarming_24D14BCDAEAFDDAA-001/tempDir-001/node1/testRepFactor1LeaderStartup_shard1_replica_n1/../../../../dist
   [junit4]   2> 1102293 INFO  (Thread-3619) [n:127.0.0.1:33613_solr    ] o.a.s.c.SolrConfig Using Lucene MatchVersion: 7.1.0
   [junit4]   2> 1102315 INFO  (Thread-3619) [n:127.0.0.1:33613_solr    ] o.a.s.s.IndexSchema [testRepFactor1LeaderStartup_shard1_replica_n1] Schema name=default-config
   [junit4]   2> 1102379 INFO  (qtp20412362-10189) [n:127.0.0.1:33613_solr c:testRepFactor1LeaderStartup s:shard1 r:core_node2 x:testRepFactor1LeaderStartup_shard1_replica_n1] o.a.s.h.SolrConfigHandler expecting overlay version 0 but my version is -1
   [junit4]   2> 1102379 INFO  (SolrConfigHandler-refreshconf) [n:127.0.0.1:33613_solr c:testRepFactor1LeaderStartup s:shard1 r:core_node2 x:testRepFactor1LeaderStartup_shard1_replica_n1] o.a.s.h.SolrConfigHandler Another reload is in progress . Not doing anything
   [junit4]   2> 1102379 INFO  (qtp20412362-10189) [n:127.0.0.1:33613_solr c:testRepFactor1LeaderStartup s:shard1 r:core_node2 x:testRepFactor1LeaderStartup_shard1_replica_n1] o.a.s.c.S.Request [testRepFactor1LeaderStartup_shard1_replica_n1]  webapp=/solr path=/config/znodeVersion params={overlay=0&wt=javabin&version=2} status=0 QTime=0
   [junit4]   2> 1102380 INFO  (solrHandlerExecutor-2186-thread-1-processing-n:127.0.0.1:33613_solr x:testRepFactor1LeaderStartup_shard1_replica_n1 s:shard1 c:testRepFactor1LeaderStartup r:core_node2) [n:127.0.0.1:33613_solr c:testRepFactor1LeaderStartup s:shard1 r:core_node2 x:testRepFactor1LeaderStartup_shard1_replica_n1] o.a.s.h.SolrConfigHandler Could not get expectedVersion 0 from https://127.0.0.1:33613/solr/testRepFactor1LeaderStartup_shard1_replica_n1/ for prop overlay   after 1 attempts
   [junit4]   2> 1102380 INFO  (solrHandlerExecutor-2186-thread-1-processing-n:127.0.0.1:33613_solr x:testRepFactor1LeaderStartup_shard1_replica_n1 s:shard1 c:testRepFactor1LeaderStartup r:core_node2) [n:127.0.0.1:33613_solr c:testRepFactor1LeaderStartup s:shard1 r:core_node2 x:testRepFactor1LeaderStartup_shard1_replica_n1] o.a.s.h.SolrConfigHandler Time elapsed : 0 secs, maxWait 30
   [junit4]   2> 1102437 INFO  (Thread-3619) [n:127.0.0.1:33613_solr    ] o.a.s.s.IndexSchema Loaded schema default-config/1.6 with uniqueid field id
   [junit4]   2> 1102457 INFO  (Thread-3619) [n:127.0.0.1:33613_solr    ] o.a.s.c.CoreContainer Reloading SolrCore 'testRepFactor1LeaderStartup_shard1_replica_n1' using configuration from collection testRepFactor1LeaderStartup
   [junit4]   2> 1102484 INFO  (qtp20412362-10192) [n:127.0.0.1:33613_solr c:testRepFactor1LeaderStartup s:shard1 r:core_node2 x:testRepFactor1LeaderStartup_shard1_replica_n1] o.a.s.h.SolrConfigHandler expecting overlay version 0 but my version is -1
   [junit4]   2> 1102487 INFO  (qtp20412362-10192) [n:127.0.0.1:33613_solr c:testRepFactor1LeaderStartup s:shard1 r:core_node2 x:testRepFactor1LeaderStartup_shard1_replica_n1] o.a.s.c.S.Request [testRepFactor1LeaderStartup_shard1_replica_n1]  webapp=/solr path=/config/znodeVersion params={overlay=0&wt=javabin&version=2} status=0 QTime=2
   [junit4]   2> 1102488 INFO  (SolrConfigHandler-refreshconf) [n:127.0.0.1:33613_solr c:testRepFactor1LeaderStartup s:shard1 r:core_node2 x:testRepFactor1LeaderStartup_shard1_replica_n1] o.a.s.h.SolrConfigHandler Another reload is in progress . Not doing anything
   [junit4]   2> 1102488 INFO  (solrHandlerExecutor-2186-thread-1-processing-n:127.0.0.1:33613_solr x:testRepFactor1LeaderStartup_shard1_replica_n1 s:shard1 c:testRepFactor1LeaderStartup r:core_node2) [n:127.0.0.1:33613_solr c:testRepFactor1LeaderStartup s:shard1 r:core_node2 x:testRepFactor1LeaderStartup_shard1_replica_n1] o.a.s.h.SolrConfigHandler Could not get expectedVersion 0 from https://127.0.0.1:33613/solr/testRepFactor1LeaderStartup_shard1_replica_n1/ for prop overlay   after 2 attempts
   [junit4]   2> 1102488 INFO  (solrHandlerExecutor-2186-thread-1-processing-n:127.0.0.1:33613_solr x:testRepFactor1LeaderStartup_shard1_replica_n1 s:shard1 c:testRepFactor1LeaderStartup r:core_node2) [n:127.0.0.1:33613_solr c:testRepFactor1LeaderStartup s:shard1 r:core_node2 x:testRepFactor1LeaderStartup_shard1_replica_n1] o.a.s.h.SolrConfigHandler Time elapsed : 0 secs, maxWait 30
   [junit4]   2> 1102519 INFO  (Thread-3619) [n:127.0.0.1:33613_solr c:testRepFactor1LeaderStartup s:shard1 r:core_node2 x:testRepFactor1LeaderStartup_shard1_replica_n1] o.a.s.m.r.SolrJmxReporter JMX monitoring for 'solr_33613.solr.core.testRepFactor1LeaderStartup.shard1.replica_n1' (registry 'solr.core.testRepFactor1LeaderStartup.shard1.replica_n1') enabled at server: com.sun.jmx.mbeanserver.JmxMBeanServer@15a9ac
   [junit4]   2> 1102519 INFO  (Thread-3619) [n:127.0.0.1:33613_solr c:testRepFactor1LeaderStartup s:shard1 r:core_node2 x:testRepFactor1LeaderStartup_shard1_replica_n1] o.a.s.c.SolrCore [[testRepFactor1LeaderStartup_shard1_replica_n1] ] Opening new SolrCore at [/home/jenkins/workspace/Lucene-Solr-7.x-Linux/solr/build/solr-core/test/J1/temp/solr.cloud.TestCloudSearcherWarming_24D14BCDAEAFDDAA-001/tempDir-001/node1/testRepFactor1LeaderStartup_shard1_replica_n1], dataDir=[/home/jenkins/workspace/Lucene-Solr-7.x-Linux/solr/build/solr-core/test/J1/temp/solr.cloud.TestCloudSearcherWarming_24D14BCDAEAFDDAA-001/tempDir-001/node1/./testRepFactor1LeaderStartup_shard1_replica_n1/data/]
   [junit4]   2> java.lang.RuntimeException
   [junit4]   2> 	at org.apache.solr.cloud.TestCloudSearcherWarming$SleepingSolrEventListener.init(TestCloudSearcherWarming.java:306)
   [junit4]   2> 	at org.apache.solr.core.SolrCore.createInitInstance(SolrCore.java:826)
   [junit4]   2> 	at org.apache.solr.core.SolrCore.initListeners(SolrCore.java:573)
   [junit4]   2> 	at org.apache.solr.core.SolrCore.<init>(SolrCore.java:926)
   [junit4]   2> 	at org.apache.solr.core.SolrCore.reload(SolrCore.java:636)
   [junit4]   2> 	at org.apache.solr.core.CoreContainer.reload(CoreContainer.java:1257)
   [junit4]   2> 	at org.apache.solr.core.SolrCore.lambda$getConfListener$20(SolrCore.java:2949)
   [junit4]   2> 	at org.apache.solr.cloud.ZkController.lambda$fireEventListeners$4(ZkController.java:2434)
   [junit4]   2> 	at java.lang.Thread.run(Thread.java:748)
   [junit4]   1> {event=newSearcher}
   [junit4]   2> java.lang.RuntimeException
   [junit4]   2> 	at org.apache.solr.cloud.TestCloudSearcherWarming$SleepingSolrEventListener.init(TestCloudSearcherWarming.java:306)
   [junit4]   2> 	at org.apache.solr.core.SolrCore.createInitInstance(SolrCore.java:826)
   [junit4]   2> 	at org.apache.solr.core.SolrCore.initListeners(SolrCore.java:569)
   [junit4]   2> 	at org.apache.solr.core.SolrCore.<init>(SolrCore.java:926)
   [junit4]   2> 	at org.apache.solr.core.SolrCore.reload(SolrCore.java:636)
   [junit4]   2> 	at org.apache.solr.core.CoreContainer.reload(CoreContainer.java:1257)
   [junit4]   2> 	at org.apache.solr.core.SolrCore.lambda$getConfListener$20(SolrCore.java:2949)
   [junit4]   2> 	at org.apache.solr.cloud.ZkController.lambda$fireEventListeners$4(ZkController.java:2434)
   [junit4]   2> 	at java.lang.Thread.run(Thread.java:748)
   [junit4]   1> {event=firstSearcher}
   [junit4]   2> 1102526 INFO  (Thread-3619) [n:127.0.0.1:33613_solr c:testRepFactor1LeaderStartup s:shard1 r:core_node2 x:testRepFactor1LeaderStartup_shard1_replica_n1] o.a.s.r.XSLTResponseWriter xsltCacheLifetimeSeconds=5
   [junit4]   2> 1102576 INFO  (Thread-3619) [n:127.0.0.1:33613_solr c:testRepFactor1LeaderStartup s:shard1 r:core_node2 x:testRepFactor1LeaderStartup_shard1_replica_n1] o.a.s.u.CommitTracker Hard AutoCommit: if uncommited for 15000ms; 
   [junit4]   2> 1102576 INFO  (Thread-3619) [n:127.0.0.1:33613_solr c:testRepFactor1LeaderStartup s:shard1 r:core_node2 x:testRepFactor1LeaderStartup_shard1_replica_n1] o.a.s.u.CommitTracker Soft AutoCommit: disabled
   [junit4]   2> 1102580 INFO  (Thread-3619) [n:127.0.0.1:33613_solr c:testRepFactor1LeaderStartup s:shard1 r:core_node2 x:testRepFactor1LeaderStartup_shard1_replica_n1] o.a.s.s.SolrIndexSearcher Opening [Searcher@ad91a5[testRepFactor1LeaderStartup_shard1_replica_n1] main]
   [junit4]   2> 1102581 INFO  (Thread-3619) [n:127.0.0.1:33613_solr c:testRepFactor1LeaderStartup s:shard1 r:core_node2 x:testRepFactor1LeaderStartup_shard1_replica_n1] o.a.s.r.ManagedResourceStorage Configured ZooKeeperStorageIO with znodeBase: /configs/testRepFactor1LeaderStartup
   [junit4]   2> 1102581 INFO  (Thread-3619) [n:127.0.0.1:33613_solr c:testRepFactor1LeaderStartup s:shard1 r:core_node2 x:testRepFactor1LeaderStartup_shard1_replica_n1] o.a.s.r.ManagedResourceStorage Loaded null at path _rest_managed.json using ZooKeeperStorageIO:path=/configs/testRepFactor1LeaderStartup
   [junit4]   2> 1102581 INFO  (Thread-3619) [n:127.0.0.1:33613_solr c:testRepFactor1LeaderStartup s:shard1 r:core_node2 x:testRepFactor1LeaderStartup_shard1_replica_n1] o.a.s.s.ZkIndexSchemaReader Creating ZooKeeper watch for the managed schema at /configs/testRepFactor1LeaderStartup/managed-schema
   [junit4]   2> 1102582 INFO  (Thread-3619) [n:127.0.0.1:33613_solr c:testRepFactor1LeaderStartup s:shard1 r:core_node2 x:testRepFactor1LeaderStartup_shard1_replica_n1] o.a.s.s.ZkIndexSchemaReader Current schema version 0 is already the latest
   [junit4]   2> 1102582 INFO  (Thread-3619) [n:127.0.0.1:33613_solr c:testRepFactor1LeaderStartup s:shard1 r:core_node2 x:testRepFactor1LeaderStartup_shard1_replica_n1] o.a.s.h.c.SpellCheckComponent Initializing spell checkers
   [junit4]   2> 1102582 INFO  (Thread-3619) [n:127.0.0.1:33613_solr c:testRepFactor1LeaderStartup s:shard1 r:core_node2 x:testRepFactor1LeaderStartup_shard1_replica_n1] o.a.s.s.DirectSolrSpellChecker init: {name=default,field=_text_,classname=solr.DirectSolrSpellChecker,distanceMeasure=internal,accuracy=0.5,maxEdits=2,minPrefix=1,maxInspections=5,minQueryLength=4,maxQueryFrequency=0.01}
   [junit4]   2> 1102584 INFO  (Thread-3619) [n:127.0.0.1:33613_solr c:testRepFactor1LeaderStartup s:shard1 r:core_node2 x:testRepFactor1LeaderStartup_shard1_replica_n1] o.a.s.h.ReplicationHandler Commits will be reserved for 10000ms.
   [junit4]   2> 1102585 INFO  (Thread-3619) [n:127.0.0.1:33613_solr c:testRepFactor1LeaderStartup s:shard1 r:core_node2 x:testRepFactor1LeaderStartup_shard1_replica_n1] o.a.s.u.UpdateLog Could not find max version in index or recent updates, using new clock 1580091431777730560
   [junit4]   2> 1102585 INFO  (searcherExecutor-2187-thread-1-processing-n:127.0.0.1:33613_solr x:testRepFactor1LeaderStartup_shard1_replica_n1 s:shard1 c:testRepFactor1LeaderStartup r:core_node2) [n:127.0.0.1:33613_solr c:testRepFactor1LeaderStartup s:shard1 r:core_node2 x:testRepFactor1LeaderStartup_shard1_replica_n1] o.a.s.c.QuerySenderListener QuerySenderListener sending requests to Searcher@ad91a5[testRepFactor1LeaderStartup_shard1_replica_n1] main{ExitableDirectoryReader(UninvertingDirectoryReader())}
   [junit4]   2> 1102585 INFO  (searcherExecutor-2187-thread-1-processing-n:127.0.0.1:33613_solr x:testRepFactor1LeaderStartup_shard1_replica_n1 s:shard1 c:testRepFactor1LeaderStartup r:core_node2) [n:127.0.0.1:33613_solr c:testRepFactor1LeaderStartup s:shard1 r:core_node2 x:testRepFactor1LeaderStartup_shard1_replica_n1] o.a.s.c.QuerySenderListener QuerySenderListener done.
   [junit4]   2> 1102585 INFO  (searcherExecutor-2187-thread-1-processing-n:127.0.0.1:33613_solr x:testRepFactor1LeaderStartup_shard1_replica_n1 s:shard1 c:testRepFactor1LeaderStartup r:core_node2) [n:127.0.0.1:33613_solr c:testRepFactor1LeaderStartup s:shard1 r:core_node2 x:testRepFactor1LeaderStartup_shard1_replica_n1] o.a.s.h.c.SpellCheckComponent Loading spell index for spellchecker: default
   [junit4]   2> 1102591 INFO  (Thread-3619) [n:127.0.0.1:33613_solr c:testRepFactor1LeaderStartup s:shard1 r:core_node2 x:testRepFactor1LeaderStartup_shard1_replica_n1] o.a.s.u.DefaultSolrCoreState New IndexWriter is ready to be used.
   [junit4]   2> 1102593 INFO  (qtp20412362-10193) [n:127.0.0.1:33613_solr c:testRepFactor1LeaderStartup s:shard1 r:core_node2 x:testRepFactor1LeaderStartup_shard1_replica_n1] o.a.s.h.SolrConfigHandler expecting overlay version 0 but my version is -1
   [junit4]   2> 1102593 INFO  (qtp20412362-10193) [n:127.0.0.1:33613_solr c:testRepFactor1LeaderStartup s:shard1 r:core_node2 x:testRepFactor1LeaderStartup_shard1_replica_n1] o.a.s.c.S.Request [testRepFactor1LeaderStartup_shard1_replica_n1]  webapp=/solr path=/config/znodeVersion params={overlay=0&wt=javabin&version=2} status=0 QTime=0
   [junit4]   2> 1102594 INFO  (SolrConfigHandler-refreshconf) [n:127.0.0.1:33613_solr c:testRepFactor1LeaderStartup s:shard1 r:core_node2 x:testRepFactor1LeaderStartup_shard1_replica_n1] o.a.s.h.SolrConfigHandler Another reload is in progress . Not doing anything
   [junit4]   2> 1102594 INFO  (solrHandlerExecutor-2186-thread-1-processing-n:127.0.0.1:33613_solr x:testRepFactor1LeaderStartup_shard1_replica_n1 s:shard1 c:testRepFactor1LeaderStartup r:core_node2) [n:127.0.0.1:33613_solr c:testRepFactor1LeaderStartup s:shard1 r:core_node2 x:testRepFactor1LeaderStartup_shard1_replica_n1] o.a.s.h.SolrConfigHandler Could not get expectedVersion 0 from https://127.0.0.1:33613/solr/testRepFactor1LeaderStartup_shard1_replica_n1/ for prop overlay   after 3 attempts
   [junit4]   2> 1102594 INFO  (solrHandlerExecutor-2186-thread-1-processing-n:127.0.0.1:33613_solr x:testRepFactor1LeaderStartup_shard1_replica_n1 s:shard1 c:testRepFactor1LeaderStartup r:core_node2) [n:127.0.0.1:33613_solr c:testRepFactor1LeaderStartup s:shard1 r:core_node2 x:testRepFactor1LeaderStartup_shard1_replica_n1] o.a.s.h.SolrConfigHandler Time elapsed : 0 secs, maxWait 30
   [junit4]   2> 1102596 INFO  (searcherExecutor-2187-thread-1-processing-n:127.0.0.1:33613_solr x:testRepFactor1LeaderStartup_shard1_replica_n1 s:shard1 c:testRepFactor1LeaderStartup r:core_node2) [n:127.0.0.1:33613_solr c:testRepFactor1LeaderStartup s:shard1 r:core_node2 x:testRepFactor1LeaderStartup_shard1_replica_n1] o.a.s.c.SolrCore [testRepFactor1LeaderStartup_shard1_replica_n1] Registered new searcher Searcher@ad91a5[testRepFactor1LeaderStartup_shard1_replica_n1] main{ExitableDirectoryReader(UninvertingDirectoryReader())}
   [junit4]   2> 1102596 INFO  (Thread-3619) [n:127.0.0.1:33613_solr c:testRepFactor1LeaderStartup s:shard1 r:core_node2 x:testRepFactor1LeaderStartup_shard1_replica_n1] o.a.s.s.SolrIndexSearcher Opening [Searcher@cbd6e6[testRepFactor1LeaderStartup_shard1_replica_n1] main]
   [junit4]   2> 1102597 INFO  (searcherExecutor-2187-thread-1-processing-n:127.0.0.1:33613_solr x:testRepFactor1LeaderStartup_shard1_replica_n1 s:shard1 c:testRepFactor1LeaderStartup r:core_node2) [n:127.0.0.1:33613_solr c:testRepFactor1LeaderStartup s:shard1 r:core_node2 x:testRepFactor1LeaderStartup_shard1_replica_n1] o.a.s.c.QuerySenderListener QuerySenderListener sending requests to Searcher@cbd6e6[testRepFactor1LeaderStartup_shard1_replica_n1] main{ExitableDirectoryReader(UninvertingDirectoryReader())}
   [junit4]   2> 1102

[...truncated too long message...]

m.SolrMetricManager Closing metric reporters for registry=solr.jetty, tag=null
   [junit4]   2> 2199861 INFO  (jetty-closer-3766-thread-1) [    ] o.a.s.m.r.SolrJmxReporter Closing reporter [org.apache.solr.metrics.reporters.SolrJmxReporter@172d221: rootName = solr_46715, domain = solr.jetty, service url = null, agent id = null] for registry solr.jetty / com.codahale.metrics.MetricRegistry@45c32d
   [junit4]   2> 2199862 INFO  (jetty-closer-3766-thread-1) [    ] o.a.s.m.SolrMetricManager Closing metric reporters for registry=solr.cluster, tag=null
   [junit4]   2> 2199863 INFO  (coreCloseExecutor-4926-thread-1) [n:127.0.0.1:46715_solr c:cdcr-target s:shard1 r:core_node2 x:cdcr-target_shard1_replica_n1] o.a.s.c.SolrCore [cdcr-target_shard1_replica_n1]  CLOSING SolrCore org.apache.solr.core.SolrCore@14a038c
   [junit4]   2> 2199863 INFO  (coreCloseExecutor-4926-thread-1) [n:127.0.0.1:46715_solr c:cdcr-target s:shard1 r:core_node2 x:cdcr-target_shard1_replica_n1] o.a.s.m.SolrMetricManager Closing metric reporters for registry=solr.core.cdcr-target.shard1.replica_n1, tag=21627788
   [junit4]   2> 2199864 INFO  (coreCloseExecutor-4926-thread-1) [n:127.0.0.1:46715_solr c:cdcr-target s:shard1 r:core_node2 x:cdcr-target_shard1_replica_n1] o.a.s.m.r.SolrJmxReporter Closing reporter [org.apache.solr.metrics.reporters.SolrJmxReporter@c359cd: rootName = solr_46715, domain = solr.core.cdcr-target.shard1.replica_n1, service url = null, agent id = null] for registry solr.core.cdcr-target.shard1.replica_n1 / com.codahale.metrics.MetricRegistry@3ed2ad
   [junit4]   2> 2199865 INFO  (zkCallback-3772-thread-2-processing-n:127.0.0.1:46715_solr) [n:127.0.0.1:46715_solr    ] o.a.s.c.c.ZkStateReader A cluster state change: [WatchedEvent state:SyncConnected type:NodeDataChanged path:/collections/cdcr-target/state.json] for collection [cdcr-target] has occurred - updating... (live nodes size: [1])
   [junit4]   2> 2199867 INFO  (zkCallback-3772-thread-1-processing-n:127.0.0.1:46715_solr) [n:127.0.0.1:46715_solr    ] o.a.s.c.c.ZkStateReader A cluster state change: [WatchedEvent state:SyncConnected type:NodeDataChanged path:/collections/cdcr-target/state.json] for collection [cdcr-target] has occurred - updating... (live nodes size: [1])
   [junit4]   2> 2199875 INFO  (coreCloseExecutor-4926-thread-1) [n:127.0.0.1:46715_solr c:cdcr-target s:shard1 r:core_node2 x:cdcr-target_shard1_replica_n1] o.a.s.m.SolrMetricManager Closing metric reporters for registry=solr.collection.cdcr-target.shard1.leader, tag=21627788
   [junit4]   2> 2199875 INFO  (coreCloseExecutor-4926-thread-1) [n:127.0.0.1:46715_solr c:cdcr-target s:shard1 r:core_node2 x:cdcr-target_shard1_replica_n1] o.a.s.h.CdcrRequestHandler Solr core is being closed - shutting down CDCR handler @ cdcr-target:shard1
   [junit4]   2> 2199877 INFO  (jetty-closer-3766-thread-1) [    ] o.a.s.c.Overseer Overseer (id=98755785145712643-127.0.0.1:46715_solr-n_0000000000) closing
   [junit4]   2> 2199878 INFO  (OverseerStateUpdate-98755785145712643-127.0.0.1:46715_solr-n_0000000000) [n:127.0.0.1:46715_solr    ] o.a.s.c.Overseer Overseer Loop exiting : 127.0.0.1:46715_solr
   [junit4]   2> 2199879 WARN  (zkCallback-3772-thread-1-processing-n:127.0.0.1:46715_solr) [n:127.0.0.1:46715_solr    ] o.a.s.c.c.ZkStateReader ZooKeeper watch triggered, but Solr cannot talk to ZK: [KeeperErrorCode = Session expired for /live_nodes]
   [junit4]   2> 2199880 INFO  (jetty-closer-3766-thread-1) [    ] o.e.j.s.h.ContextHandler Stopped o.e.j.s.ServletContextHandler@16b96db{/solr,null,UNAVAILABLE}
   [junit4]   2> 2199880 ERROR (TEST-CdcrBootstrapTest.testConvertClusterToCdcrAndBootstrap-seed#[24D14BCDAEAFDDAA]) [    ] o.a.z.s.ZooKeeperServer ZKShutdownHandler is not registered, so ZooKeeper server won't take any action on ERROR or SHUTDOWN server state changes
   [junit4]   2> 2199881 INFO  (TEST-CdcrBootstrapTest.testConvertClusterToCdcrAndBootstrap-seed#[24D14BCDAEAFDDAA]) [    ] o.a.s.c.ZkTestServer connecting to 127.0.0.1:40967 40967
   [junit4]   2> 2204906 INFO  (Thread-4873) [    ] o.a.s.c.ZkTestServer connecting to 127.0.0.1:40967 40967
   [junit4]   2> 2204908 WARN  (Thread-4873) [    ] o.a.s.c.ZkTestServer Watch limit violations: 
   [junit4]   2> Maximum concurrent create/delete watches above limit:
   [junit4]   2> 
   [junit4]   2> 	3	/solr/aliases.json
   [junit4]   2> 	3	/solr/clusterprops.json
   [junit4]   2> 	2	/solr/configs/cdcr-target/managed-schema
   [junit4]   2> 	2	/solr/collections/cdcr-target/leaders/shard1/leader
   [junit4]   2> 
   [junit4]   2> Maximum concurrent data watches above limit:
   [junit4]   2> 
   [junit4]   2> 	6	/solr/collections/cdcr-target/state.json
   [junit4]   2> 	3	/solr/collections/cdcr-target/cdcr/state/process
   [junit4]   2> 	3	/solr/clusterstate.json
   [junit4]   2> 	2	/solr/collections/cdcr-target/cdcr/state/buffer
   [junit4]   2> 
   [junit4]   2> Maximum concurrent children watches above limit:
   [junit4]   2> 
   [junit4]   2> 	3	/solr/live_nodes
   [junit4]   2> 	3	/solr/collections
   [junit4]   2> 
   [junit4]   2> 2204908 INFO  (TEST-CdcrBootstrapTest.testConvertClusterToCdcrAndBootstrap-seed#[24D14BCDAEAFDDAA]) [    ] o.a.s.SolrTestCaseJ4 ###Ending testConvertClusterToCdcrAndBootstrap
   [junit4]   2> NOTE: leaving temporary files on disk at: /home/jenkins/workspace/Lucene-Solr-7.x-Linux/solr/build/solr-core/test/J1/temp/solr.cloud.CdcrBootstrapTest_24D14BCDAEAFDDAA-001
   [junit4]   2> NOTE: test params are: codec=CheapBastard, sim=RandomSimilarity(queryNorm=true): {}, locale=es-GT, timezone=Asia/Kuching
   [junit4]   2> NOTE: Linux 4.10.0-33-generic i386/Oracle Corporation 1.8.0_144 (32-bit)/cpus=8,threads=1,free=140896440,total=494985216
   [junit4]   2> NOTE: All tests run in this JVM: [TestCollationFieldDocValues, DirectSolrConnectionTest, ScriptEngineTest, AsyncCallRequestStatusResponseTest, TestRecoveryHdfs, ConvertedLegacyTest, CdcrReplicationDistributedZkTest, IndexSchemaTest, TestSQLHandler, PrimUtilsTest, LeaderInitiatedRecoveryOnCommitTest, CdcrVersionReplicationTest, CdcrUpdateLogTest, SubstringBytesRefFilterTest, TestBlobHandler, FileBasedSpellCheckerTest, SolrMetricReporterTest, HttpSolrCallGetCoreTest, CollectionsAPIAsyncDistributedZkTest, ChangedSchemaMergeTest, TestImpersonationWithHadoopAuth, DocValuesTest, FileUtilsTest, TestManagedResourceStorage, TestPartialUpdateDeduplication, SparseHLLTest, TestNestedDocsSort, UpdateLogTest, TermVectorComponentTest, ZkFailoverTest, TestReplicationHandlerBackup, TestCustomSort, TestRandomCollapseQParserPlugin, TestFastLRUCache, TestExpandComponent, TestElisionMultitermQuery, TestLegacyNumericRangeQueryBuilder, FullHLLTest, LoggingHandlerTest, TestNamedUpdateProcessors, TestStressRecovery, TestXIncludeConfig, TestBackupRepositoryFactory, JSONWriterTest, TestInfoStreamLogging, DirectSolrSpellCheckerTest, SystemInfoHandlerTest, TestRTGBase, TestSolrConfigHandlerConcurrent, TestAtomicUpdateErrorCases, TestStressVersions, TestSolrCoreSnapshots, TestUniqueKeyFieldResource, DocValuesNotIndexedTest, TestSimpleQParserPlugin, TestSystemIdResolver, PropertiesRequestHandlerTest, ResourceLoaderTest, TestBM25SimilarityFactory, TestFiltering, RemoteQueryErrorTest, TestBulkSchemaConcurrent, DistanceFunctionTest, TestFileDictionaryLookup, TestCloudPivotFacet, TestGraphTermsQParserPlugin, LukeRequestHandlerTest, TestCoreContainer, DeleteNodeTest, TestReloadAndDeleteDocs, TestUseDocValuesAsStored2, CoreMergeIndexesAdminHandlerTest, ReplicaListTransformerTest, DocValuesMissingTest, HdfsDirectoryTest, TestCloudSearcherWarming, CoreAdminHandlerTest, SpellCheckComponentTest, TestSubQueryTransformerCrossCore, WrapperMergePolicyFactoryTest, SOLR749Test, NoCacheHeaderTest, TestUpdate, StatsReloadRaceTest, IndexSchemaRuntimeFieldTest, HdfsChaosMonkeySafeLeaderTest, TestDistributedGrouping, TestLegacyFieldCache, TestMiniSolrCloudClusterSSL, TestSolrIndexConfig, TestStressCloudBlindAtomicUpdates, BasicFunctionalityTest, TestCursorMarkWithoutUniqueKey, DistributedExpandComponentTest, StatelessScriptUpdateProcessorFactoryTest, OverseerTaskQueueTest, TestDistribDocBasedVersion, TestHashPartitioner, TestMultiValuedNumericRangeQuery, SharedFSAutoReplicaFailoverUtilsTest, TestSolrQueryResponse, TestLRUStatsCache, ImplicitSnitchTest, TestConfigSetsAPIZkFailure, SolrGraphiteReporterTest, TestJsonRequest, TestPostingsSolrHighlighter, TestLegacyFieldReuse, CollectionsAPIDistributedZkTest, TestFieldCacheSortRandom, SpatialFilterTest, TestRawResponseWriter, ClassificationUpdateProcessorIntegrationTest, PreAnalyzedFieldManagedSchemaCloudTest, ChaosMonkeySafeLeaderTest, DistanceUnitsTest, TestPayloadCheckQParserPlugin, TestFieldCache, ZkSolrClientTest, HdfsUnloadDistributedZkTest, TestRTimerTree, UnloadDistributedZkTest, OverseerTest, ClusterStateUpdateTest, ZkCLITest, HardAutoCommitTest, DistributedTermsComponentTest, TestSolr4Spatial, SolrCoreTest, DirectUpdateHandlerTest, HighlighterTest, SoftAutoCommitTest, HighlighterConfigTest, AlternateDirectoryTest, TestQuerySenderNoQuery, CopyFieldTest, ResponseLogComponentTest, BadComponentTest, TestSolrDeletionPolicy2, SampleTest, TestBinaryField, TestSearchPerf, NumericFieldsTest, MinimalSchemaTest, TestFuzzyAnalyzedSuggestions, TestSolrCoreProperties, TestLuceneMatchVersion, SpellPossibilityIteratorTest, TestCharFilters, TestCodecSupport, TestSweetSpotSimilarityFactory, TestPerFieldSimilarity, TestLMJelinekMercerSimilarityFactory, TestIBSimilarityFactory, OpenExchangeRatesOrgProviderTest, PluginInfoTest, PreAnalyzedFieldTest, DateFieldTest, DOMUtilTest, RAMDirectoryFactoryTest, ClusterStateTest, TestSolrJ, TestLRUCache, TestDocumentBuilder, ZkNodePropsTest, SliceStateTest, UUIDFieldTest, CircularListTest, DistributedMLTComponentTest, CursorPagingTest, DistributedIntervalFacetingTest, ActionThrottleTest, AliasIntegrationTest, BaseCdcrDistributedZkTest, CdcrBootstrapTest]
   [junit4] Completed [497/733 (2!)] on J1 in 191.93s, 3 tests, 1 failure <<< FAILURES!

[...truncated 43541 lines...]

Mime
View raw message