lucene-dev mailing list archives

Site index · List index
Message view « Date » · « Thread »
Top « Date » · « Thread »
From Apache Jenkins Server <jenk...@builds.apache.org>
Subject [JENKINS] Lucene-Solr-Tests-master - Build # 2118 - Still Unstable
Date Wed, 11 Oct 2017 08:30:59 GMT
Build: https://builds.apache.org/job/Lucene-Solr-Tests-master/2118/

8 tests failed.
FAILED:  junit.framework.TestSuite.org.apache.solr.cloud.BasicDistributedZkTest

Error Message:
1 thread leaked from SUITE scope at org.apache.solr.cloud.BasicDistributedZkTest:     1) Thread[id=21591, name=zkCallback-3203-thread-1, state=TIMED_WAITING, group=TGRP-BasicDistributedZkTest]         at sun.misc.Unsafe.park(Native Method)         at java.util.concurrent.locks.LockSupport.parkNanos(LockSupport.java:215)         at java.util.concurrent.SynchronousQueue$TransferStack.awaitFulfill(SynchronousQueue.java:460)         at java.util.concurrent.SynchronousQueue$TransferStack.transfer(SynchronousQueue.java:362)         at java.util.concurrent.SynchronousQueue.poll(SynchronousQueue.java:941)         at java.util.concurrent.ThreadPoolExecutor.getTask(ThreadPoolExecutor.java:1073)         at java.util.concurrent.ThreadPoolExecutor.runWorker(ThreadPoolExecutor.java:1134)         at java.util.concurrent.ThreadPoolExecutor$Worker.run(ThreadPoolExecutor.java:624)         at java.lang.Thread.run(Thread.java:748)

Stack Trace:
com.carrotsearch.randomizedtesting.ThreadLeakError: 1 thread leaked from SUITE scope at org.apache.solr.cloud.BasicDistributedZkTest: 
   1) Thread[id=21591, name=zkCallback-3203-thread-1, state=TIMED_WAITING, group=TGRP-BasicDistributedZkTest]
        at sun.misc.Unsafe.park(Native Method)
        at java.util.concurrent.locks.LockSupport.parkNanos(LockSupport.java:215)
        at java.util.concurrent.SynchronousQueue$TransferStack.awaitFulfill(SynchronousQueue.java:460)
        at java.util.concurrent.SynchronousQueue$TransferStack.transfer(SynchronousQueue.java:362)
        at java.util.concurrent.SynchronousQueue.poll(SynchronousQueue.java:941)
        at java.util.concurrent.ThreadPoolExecutor.getTask(ThreadPoolExecutor.java:1073)
        at java.util.concurrent.ThreadPoolExecutor.runWorker(ThreadPoolExecutor.java:1134)
        at java.util.concurrent.ThreadPoolExecutor$Worker.run(ThreadPoolExecutor.java:624)
        at java.lang.Thread.run(Thread.java:748)
	at __randomizedtesting.SeedInfo.seed([5612910F7A42394A]:0)


FAILED:  junit.framework.TestSuite.org.apache.solr.cloud.BasicDistributedZkTest

Error Message:
There are still zombie threads that couldn't be terminated:    1) Thread[id=21591, name=zkCallback-3203-thread-1, state=TIMED_WAITING, group=TGRP-BasicDistributedZkTest]         at sun.misc.Unsafe.park(Native Method)         at java.util.concurrent.locks.LockSupport.parkNanos(LockSupport.java:215)         at java.util.concurrent.SynchronousQueue$TransferStack.awaitFulfill(SynchronousQueue.java:460)         at java.util.concurrent.SynchronousQueue$TransferStack.transfer(SynchronousQueue.java:362)         at java.util.concurrent.SynchronousQueue.poll(SynchronousQueue.java:941)         at java.util.concurrent.ThreadPoolExecutor.getTask(ThreadPoolExecutor.java:1073)         at java.util.concurrent.ThreadPoolExecutor.runWorker(ThreadPoolExecutor.java:1134)         at java.util.concurrent.ThreadPoolExecutor$Worker.run(ThreadPoolExecutor.java:624)         at java.lang.Thread.run(Thread.java:748)

Stack Trace:
com.carrotsearch.randomizedtesting.ThreadLeakError: There are still zombie threads that couldn't be terminated:
   1) Thread[id=21591, name=zkCallback-3203-thread-1, state=TIMED_WAITING, group=TGRP-BasicDistributedZkTest]
        at sun.misc.Unsafe.park(Native Method)
        at java.util.concurrent.locks.LockSupport.parkNanos(LockSupport.java:215)
        at java.util.concurrent.SynchronousQueue$TransferStack.awaitFulfill(SynchronousQueue.java:460)
        at java.util.concurrent.SynchronousQueue$TransferStack.transfer(SynchronousQueue.java:362)
        at java.util.concurrent.SynchronousQueue.poll(SynchronousQueue.java:941)
        at java.util.concurrent.ThreadPoolExecutor.getTask(ThreadPoolExecutor.java:1073)
        at java.util.concurrent.ThreadPoolExecutor.runWorker(ThreadPoolExecutor.java:1134)
        at java.util.concurrent.ThreadPoolExecutor$Worker.run(ThreadPoolExecutor.java:624)
        at java.lang.Thread.run(Thread.java:748)
	at __randomizedtesting.SeedInfo.seed([5612910F7A42394A]:0)


FAILED:  org.apache.solr.cloud.TestHdfsCloudBackupRestore.test

Error Message:
expected:<COMPLETED> but was:<RUNNING>

Stack Trace:
java.lang.AssertionError: expected:<COMPLETED> but was:<RUNNING>
	at __randomizedtesting.SeedInfo.seed([5612910F7A42394A:DE46AED5D4BE54B2]:0)
	at org.junit.Assert.fail(Assert.java:93)
	at org.junit.Assert.failNotEquals(Assert.java:647)
	at org.junit.Assert.assertEquals(Assert.java:128)
	at org.junit.Assert.assertEquals(Assert.java:147)
	at org.apache.solr.cloud.AbstractCloudBackupRestoreTestCase.testBackupAndRestore(AbstractCloudBackupRestoreTestCase.java:231)
	at org.apache.solr.cloud.AbstractCloudBackupRestoreTestCase.test(AbstractCloudBackupRestoreTestCase.java:136)
	at sun.reflect.NativeMethodAccessorImpl.invoke0(Native Method)
	at sun.reflect.NativeMethodAccessorImpl.invoke(NativeMethodAccessorImpl.java:62)
	at sun.reflect.DelegatingMethodAccessorImpl.invoke(DelegatingMethodAccessorImpl.java:43)
	at java.lang.reflect.Method.invoke(Method.java:498)
	at com.carrotsearch.randomizedtesting.RandomizedRunner.invoke(RandomizedRunner.java:1737)
	at com.carrotsearch.randomizedtesting.RandomizedRunner$8.evaluate(RandomizedRunner.java:934)
	at com.carrotsearch.randomizedtesting.RandomizedRunner$9.evaluate(RandomizedRunner.java:970)
	at com.carrotsearch.randomizedtesting.RandomizedRunner$10.evaluate(RandomizedRunner.java:984)
	at com.carrotsearch.randomizedtesting.rules.SystemPropertiesRestoreRule$1.evaluate(SystemPropertiesRestoreRule.java:57)
	at org.apache.lucene.util.TestRuleSetupTeardownChained$1.evaluate(TestRuleSetupTeardownChained.java:49)
	at org.apache.lucene.util.AbstractBeforeAfterRule$1.evaluate(AbstractBeforeAfterRule.java:45)
	at org.apache.lucene.util.TestRuleThreadAndTestName$1.evaluate(TestRuleThreadAndTestName.java:48)
	at org.apache.lucene.util.TestRuleIgnoreAfterMaxFailures$1.evaluate(TestRuleIgnoreAfterMaxFailures.java:64)
	at org.apache.lucene.util.TestRuleMarkFailure$1.evaluate(TestRuleMarkFailure.java:47)
	at com.carrotsearch.randomizedtesting.rules.StatementAdapter.evaluate(StatementAdapter.java:36)
	at com.carrotsearch.randomizedtesting.ThreadLeakControl$StatementRunner.run(ThreadLeakControl.java:368)
	at com.carrotsearch.randomizedtesting.ThreadLeakControl.forkTimeoutingTask(ThreadLeakControl.java:817)
	at com.carrotsearch.randomizedtesting.ThreadLeakControl$3.evaluate(ThreadLeakControl.java:468)
	at com.carrotsearch.randomizedtesting.RandomizedRunner.runSingleTest(RandomizedRunner.java:943)
	at com.carrotsearch.randomizedtesting.RandomizedRunner$5.evaluate(RandomizedRunner.java:829)
	at com.carrotsearch.randomizedtesting.RandomizedRunner$6.evaluate(RandomizedRunner.java:879)
	at com.carrotsearch.randomizedtesting.RandomizedRunner$7.evaluate(RandomizedRunner.java:890)
	at com.carrotsearch.randomizedtesting.rules.StatementAdapter.evaluate(StatementAdapter.java:36)
	at com.carrotsearch.randomizedtesting.rules.SystemPropertiesRestoreRule$1.evaluate(SystemPropertiesRestoreRule.java:57)
	at org.apache.lucene.util.AbstractBeforeAfterRule$1.evaluate(AbstractBeforeAfterRule.java:45)
	at com.carrotsearch.randomizedtesting.rules.StatementAdapter.evaluate(StatementAdapter.java:36)
	at org.apache.lucene.util.TestRuleStoreClassName$1.evaluate(TestRuleStoreClassName.java:41)
	at com.carrotsearch.randomizedtesting.rules.NoShadowingOrOverridesOnMethodsRule$1.evaluate(NoShadowingOrOverridesOnMethodsRule.java:40)
	at com.carrotsearch.randomizedtesting.rules.NoShadowingOrOverridesOnMethodsRule$1.evaluate(NoShadowingOrOverridesOnMethodsRule.java:40)
	at com.carrotsearch.randomizedtesting.rules.StatementAdapter.evaluate(StatementAdapter.java:36)
	at com.carrotsearch.randomizedtesting.rules.StatementAdapter.evaluate(StatementAdapter.java:36)
	at com.carrotsearch.randomizedtesting.rules.StatementAdapter.evaluate(StatementAdapter.java:36)
	at org.apache.lucene.util.TestRuleAssertionsRequired$1.evaluate(TestRuleAssertionsRequired.java:53)
	at org.apache.lucene.util.TestRuleMarkFailure$1.evaluate(TestRuleMarkFailure.java:47)
	at org.apache.lucene.util.TestRuleIgnoreAfterMaxFailures$1.evaluate(TestRuleIgnoreAfterMaxFailures.java:64)
	at org.apache.lucene.util.TestRuleIgnoreTestSuites$1.evaluate(TestRuleIgnoreTestSuites.java:54)
	at com.carrotsearch.randomizedtesting.rules.StatementAdapter.evaluate(StatementAdapter.java:36)
	at com.carrotsearch.randomizedtesting.ThreadLeakControl$StatementRunner.run(ThreadLeakControl.java:368)
	at java.lang.Thread.run(Thread.java:748)


FAILED:  org.apache.solr.cloud.ZkSolrClientTest.testMultipleWatchesAsync

Error Message:


Stack Trace:
java.lang.AssertionError
	at __randomizedtesting.SeedInfo.seed([5612910F7A42394A:3EA442ADEFA638D4]:0)
	at org.junit.Assert.fail(Assert.java:92)
	at org.junit.Assert.assertTrue(Assert.java:43)
	at org.junit.Assert.assertTrue(Assert.java:54)
	at org.apache.solr.cloud.ZkSolrClientTest.testMultipleWatchesAsync(ZkSolrClientTest.java:257)
	at sun.reflect.NativeMethodAccessorImpl.invoke0(Native Method)
	at sun.reflect.NativeMethodAccessorImpl.invoke(NativeMethodAccessorImpl.java:62)
	at sun.reflect.DelegatingMethodAccessorImpl.invoke(DelegatingMethodAccessorImpl.java:43)
	at java.lang.reflect.Method.invoke(Method.java:498)
	at com.carrotsearch.randomizedtesting.RandomizedRunner.invoke(RandomizedRunner.java:1737)
	at com.carrotsearch.randomizedtesting.RandomizedRunner$8.evaluate(RandomizedRunner.java:934)
	at com.carrotsearch.randomizedtesting.RandomizedRunner$9.evaluate(RandomizedRunner.java:970)
	at com.carrotsearch.randomizedtesting.RandomizedRunner$10.evaluate(RandomizedRunner.java:984)
	at com.carrotsearch.randomizedtesting.rules.SystemPropertiesRestoreRule$1.evaluate(SystemPropertiesRestoreRule.java:57)
	at org.apache.lucene.util.TestRuleSetupTeardownChained$1.evaluate(TestRuleSetupTeardownChained.java:49)
	at org.apache.lucene.util.AbstractBeforeAfterRule$1.evaluate(AbstractBeforeAfterRule.java:45)
	at org.apache.lucene.util.TestRuleThreadAndTestName$1.evaluate(TestRuleThreadAndTestName.java:48)
	at org.apache.lucene.util.TestRuleIgnoreAfterMaxFailures$1.evaluate(TestRuleIgnoreAfterMaxFailures.java:64)
	at org.apache.lucene.util.TestRuleMarkFailure$1.evaluate(TestRuleMarkFailure.java:47)
	at com.carrotsearch.randomizedtesting.rules.StatementAdapter.evaluate(StatementAdapter.java:36)
	at com.carrotsearch.randomizedtesting.ThreadLeakControl$StatementRunner.run(ThreadLeakControl.java:368)
	at com.carrotsearch.randomizedtesting.ThreadLeakControl.forkTimeoutingTask(ThreadLeakControl.java:817)
	at com.carrotsearch.randomizedtesting.ThreadLeakControl$3.evaluate(ThreadLeakControl.java:468)
	at com.carrotsearch.randomizedtesting.RandomizedRunner.runSingleTest(RandomizedRunner.java:943)
	at com.carrotsearch.randomizedtesting.RandomizedRunner$5.evaluate(RandomizedRunner.java:829)
	at com.carrotsearch.randomizedtesting.RandomizedRunner$6.evaluate(RandomizedRunner.java:879)
	at com.carrotsearch.randomizedtesting.RandomizedRunner$7.evaluate(RandomizedRunner.java:890)
	at com.carrotsearch.randomizedtesting.rules.StatementAdapter.evaluate(StatementAdapter.java:36)
	at com.carrotsearch.randomizedtesting.rules.SystemPropertiesRestoreRule$1.evaluate(SystemPropertiesRestoreRule.java:57)
	at org.apache.lucene.util.AbstractBeforeAfterRule$1.evaluate(AbstractBeforeAfterRule.java:45)
	at com.carrotsearch.randomizedtesting.rules.StatementAdapter.evaluate(StatementAdapter.java:36)
	at org.apache.lucene.util.TestRuleStoreClassName$1.evaluate(TestRuleStoreClassName.java:41)
	at com.carrotsearch.randomizedtesting.rules.NoShadowingOrOverridesOnMethodsRule$1.evaluate(NoShadowingOrOverridesOnMethodsRule.java:40)
	at com.carrotsearch.randomizedtesting.rules.NoShadowingOrOverridesOnMethodsRule$1.evaluate(NoShadowingOrOverridesOnMethodsRule.java:40)
	at com.carrotsearch.randomizedtesting.rules.StatementAdapter.evaluate(StatementAdapter.java:36)
	at com.carrotsearch.randomizedtesting.rules.StatementAdapter.evaluate(StatementAdapter.java:36)
	at com.carrotsearch.randomizedtesting.rules.StatementAdapter.evaluate(StatementAdapter.java:36)
	at org.apache.lucene.util.TestRuleAssertionsRequired$1.evaluate(TestRuleAssertionsRequired.java:53)
	at org.apache.lucene.util.TestRuleMarkFailure$1.evaluate(TestRuleMarkFailure.java:47)
	at org.apache.lucene.util.TestRuleIgnoreAfterMaxFailures$1.evaluate(TestRuleIgnoreAfterMaxFailures.java:64)
	at org.apache.lucene.util.TestRuleIgnoreTestSuites$1.evaluate(TestRuleIgnoreTestSuites.java:54)
	at com.carrotsearch.randomizedtesting.rules.StatementAdapter.evaluate(StatementAdapter.java:36)
	at com.carrotsearch.randomizedtesting.ThreadLeakControl$StatementRunner.run(ThreadLeakControl.java:368)
	at java.lang.Thread.run(Thread.java:748)


FAILED:  org.apache.solr.cloud.autoscaling.AutoAddReplicasIntegrationTest.testSimple

Error Message:
Could not load collection from ZK: testSimple1

Stack Trace:
org.apache.solr.common.SolrException: Could not load collection from ZK: testSimple1
	at __randomizedtesting.SeedInfo.seed([5612910F7A42394A:6EA1B5F15DB1ED9B]:0)
	at org.apache.solr.common.cloud.ZkStateReader.getCollectionLive(ZkStateReader.java:1170)
	at org.apache.solr.common.cloud.ZkStateReader$LazyCollectionRef.get(ZkStateReader.java:690)
	at org.apache.solr.common.cloud.ClusterState.getCollectionOrNull(ClusterState.java:130)
	at org.apache.solr.common.cloud.ClusterState.getCollection(ClusterState.java:110)
	at org.apache.solr.cloud.autoscaling.AutoAddReplicasIntegrationTest.getReplacedSharedFsReplicas(AutoAddReplicasIntegrationTest.java:164)
	at org.apache.solr.cloud.autoscaling.AutoAddReplicasIntegrationTest.testSimple(AutoAddReplicasIntegrationTest.java:85)
	at sun.reflect.NativeMethodAccessorImpl.invoke0(Native Method)
	at sun.reflect.NativeMethodAccessorImpl.invoke(NativeMethodAccessorImpl.java:62)
	at sun.reflect.DelegatingMethodAccessorImpl.invoke(DelegatingMethodAccessorImpl.java:43)
	at java.lang.reflect.Method.invoke(Method.java:498)
	at com.carrotsearch.randomizedtesting.RandomizedRunner.invoke(RandomizedRunner.java:1737)
	at com.carrotsearch.randomizedtesting.RandomizedRunner$8.evaluate(RandomizedRunner.java:934)
	at com.carrotsearch.randomizedtesting.RandomizedRunner$9.evaluate(RandomizedRunner.java:970)
	at com.carrotsearch.randomizedtesting.RandomizedRunner$10.evaluate(RandomizedRunner.java:984)
	at com.carrotsearch.randomizedtesting.rules.SystemPropertiesRestoreRule$1.evaluate(SystemPropertiesRestoreRule.java:57)
	at org.apache.lucene.util.TestRuleSetupTeardownChained$1.evaluate(TestRuleSetupTeardownChained.java:49)
	at org.apache.lucene.util.AbstractBeforeAfterRule$1.evaluate(AbstractBeforeAfterRule.java:45)
	at org.apache.lucene.util.TestRuleThreadAndTestName$1.evaluate(TestRuleThreadAndTestName.java:48)
	at org.apache.lucene.util.TestRuleIgnoreAfterMaxFailures$1.evaluate(TestRuleIgnoreAfterMaxFailures.java:64)
	at org.apache.lucene.util.TestRuleMarkFailure$1.evaluate(TestRuleMarkFailure.java:47)
	at com.carrotsearch.randomizedtesting.rules.StatementAdapter.evaluate(StatementAdapter.java:36)
	at com.carrotsearch.randomizedtesting.ThreadLeakControl$StatementRunner.run(ThreadLeakControl.java:368)
	at com.carrotsearch.randomizedtesting.ThreadLeakControl.forkTimeoutingTask(ThreadLeakControl.java:817)
	at com.carrotsearch.randomizedtesting.ThreadLeakControl$3.evaluate(ThreadLeakControl.java:468)
	at com.carrotsearch.randomizedtesting.RandomizedRunner.runSingleTest(RandomizedRunner.java:943)
	at com.carrotsearch.randomizedtesting.RandomizedRunner$5.evaluate(RandomizedRunner.java:829)
	at com.carrotsearch.randomizedtesting.RandomizedRunner$6.evaluate(RandomizedRunner.java:879)
	at com.carrotsearch.randomizedtesting.RandomizedRunner$7.evaluate(RandomizedRunner.java:890)
	at com.carrotsearch.randomizedtesting.rules.StatementAdapter.evaluate(StatementAdapter.java:36)
	at com.carrotsearch.randomizedtesting.rules.SystemPropertiesRestoreRule$1.evaluate(SystemPropertiesRestoreRule.java:57)
	at org.apache.lucene.util.AbstractBeforeAfterRule$1.evaluate(AbstractBeforeAfterRule.java:45)
	at com.carrotsearch.randomizedtesting.rules.StatementAdapter.evaluate(StatementAdapter.java:36)
	at org.apache.lucene.util.TestRuleStoreClassName$1.evaluate(TestRuleStoreClassName.java:41)
	at com.carrotsearch.randomizedtesting.rules.NoShadowingOrOverridesOnMethodsRule$1.evaluate(NoShadowingOrOverridesOnMethodsRule.java:40)
	at com.carrotsearch.randomizedtesting.rules.NoShadowingOrOverridesOnMethodsRule$1.evaluate(NoShadowingOrOverridesOnMethodsRule.java:40)
	at com.carrotsearch.randomizedtesting.rules.StatementAdapter.evaluate(StatementAdapter.java:36)
	at com.carrotsearch.randomizedtesting.rules.StatementAdapter.evaluate(StatementAdapter.java:36)
	at com.carrotsearch.randomizedtesting.rules.StatementAdapter.evaluate(StatementAdapter.java:36)
	at org.apache.lucene.util.TestRuleAssertionsRequired$1.evaluate(TestRuleAssertionsRequired.java:53)
	at org.apache.lucene.util.TestRuleMarkFailure$1.evaluate(TestRuleMarkFailure.java:47)
	at org.apache.lucene.util.TestRuleIgnoreAfterMaxFailures$1.evaluate(TestRuleIgnoreAfterMaxFailures.java:64)
	at org.apache.lucene.util.TestRuleIgnoreTestSuites$1.evaluate(TestRuleIgnoreTestSuites.java:54)
	at com.carrotsearch.randomizedtesting.rules.StatementAdapter.evaluate(StatementAdapter.java:36)
	at com.carrotsearch.randomizedtesting.ThreadLeakControl$StatementRunner.run(ThreadLeakControl.java:368)
	at java.lang.Thread.run(Thread.java:748)
Caused by: org.apache.zookeeper.KeeperException$SessionExpiredException: KeeperErrorCode = Session expired for /collections/testSimple1/state.json
	at org.apache.zookeeper.KeeperException.create(KeeperException.java:127)
	at org.apache.zookeeper.KeeperException.create(KeeperException.java:51)
	at org.apache.zookeeper.ZooKeeper.getData(ZooKeeper.java:1212)
	at org.apache.solr.common.cloud.SolrZkClient$7.execute(SolrZkClient.java:357)
	at org.apache.solr.common.cloud.SolrZkClient$7.execute(SolrZkClient.java:354)
	at org.apache.solr.common.cloud.ZkCmdExecutor.retryOperation(ZkCmdExecutor.java:60)
	at org.apache.solr.common.cloud.SolrZkClient.getData(SolrZkClient.java:354)
	at org.apache.solr.common.cloud.ZkStateReader.fetchCollectionState(ZkStateReader.java:1182)
	at org.apache.solr.common.cloud.ZkStateReader.getCollectionLive(ZkStateReader.java:1168)
	... 44 more


FAILED:  org.apache.solr.cloud.autoscaling.TriggerIntegrationTest.testNodeMarkersRegistration

Error Message:
Path /autoscaling/nodeAdded/127.0.0.1:42635_solr wasn't created

Stack Trace:
java.lang.AssertionError: Path /autoscaling/nodeAdded/127.0.0.1:42635_solr wasn't created
	at __randomizedtesting.SeedInfo.seed([5612910F7A42394A:4EA819037477F4A5]:0)
	at org.junit.Assert.fail(Assert.java:93)
	at org.junit.Assert.assertTrue(Assert.java:43)
	at org.apache.solr.cloud.autoscaling.TriggerIntegrationTest.testNodeMarkersRegistration(TriggerIntegrationTest.java:909)
	at sun.reflect.NativeMethodAccessorImpl.invoke0(Native Method)
	at sun.reflect.NativeMethodAccessorImpl.invoke(NativeMethodAccessorImpl.java:62)
	at sun.reflect.DelegatingMethodAccessorImpl.invoke(DelegatingMethodAccessorImpl.java:43)
	at java.lang.reflect.Method.invoke(Method.java:498)
	at com.carrotsearch.randomizedtesting.RandomizedRunner.invoke(RandomizedRunner.java:1737)
	at com.carrotsearch.randomizedtesting.RandomizedRunner$8.evaluate(RandomizedRunner.java:934)
	at com.carrotsearch.randomizedtesting.RandomizedRunner$9.evaluate(RandomizedRunner.java:970)
	at com.carrotsearch.randomizedtesting.RandomizedRunner$10.evaluate(RandomizedRunner.java:984)
	at com.carrotsearch.randomizedtesting.rules.SystemPropertiesRestoreRule$1.evaluate(SystemPropertiesRestoreRule.java:57)
	at org.apache.lucene.util.TestRuleSetupTeardownChained$1.evaluate(TestRuleSetupTeardownChained.java:49)
	at org.apache.lucene.util.AbstractBeforeAfterRule$1.evaluate(AbstractBeforeAfterRule.java:45)
	at org.apache.lucene.util.TestRuleThreadAndTestName$1.evaluate(TestRuleThreadAndTestName.java:48)
	at org.apache.lucene.util.TestRuleIgnoreAfterMaxFailures$1.evaluate(TestRuleIgnoreAfterMaxFailures.java:64)
	at org.apache.lucene.util.TestRuleMarkFailure$1.evaluate(TestRuleMarkFailure.java:47)
	at com.carrotsearch.randomizedtesting.rules.StatementAdapter.evaluate(StatementAdapter.java:36)
	at com.carrotsearch.randomizedtesting.ThreadLeakControl$StatementRunner.run(ThreadLeakControl.java:368)
	at com.carrotsearch.randomizedtesting.ThreadLeakControl.forkTimeoutingTask(ThreadLeakControl.java:817)
	at com.carrotsearch.randomizedtesting.ThreadLeakControl$3.evaluate(ThreadLeakControl.java:468)
	at com.carrotsearch.randomizedtesting.RandomizedRunner.runSingleTest(RandomizedRunner.java:943)
	at com.carrotsearch.randomizedtesting.RandomizedRunner$5.evaluate(RandomizedRunner.java:829)
	at com.carrotsearch.randomizedtesting.RandomizedRunner$6.evaluate(RandomizedRunner.java:879)
	at com.carrotsearch.randomizedtesting.RandomizedRunner$7.evaluate(RandomizedRunner.java:890)
	at com.carrotsearch.randomizedtesting.rules.StatementAdapter.evaluate(StatementAdapter.java:36)
	at com.carrotsearch.randomizedtesting.rules.SystemPropertiesRestoreRule$1.evaluate(SystemPropertiesRestoreRule.java:57)
	at org.apache.lucene.util.AbstractBeforeAfterRule$1.evaluate(AbstractBeforeAfterRule.java:45)
	at com.carrotsearch.randomizedtesting.rules.StatementAdapter.evaluate(StatementAdapter.java:36)
	at org.apache.lucene.util.TestRuleStoreClassName$1.evaluate(TestRuleStoreClassName.java:41)
	at com.carrotsearch.randomizedtesting.rules.NoShadowingOrOverridesOnMethodsRule$1.evaluate(NoShadowingOrOverridesOnMethodsRule.java:40)
	at com.carrotsearch.randomizedtesting.rules.NoShadowingOrOverridesOnMethodsRule$1.evaluate(NoShadowingOrOverridesOnMethodsRule.java:40)
	at com.carrotsearch.randomizedtesting.rules.StatementAdapter.evaluate(StatementAdapter.java:36)
	at com.carrotsearch.randomizedtesting.rules.StatementAdapter.evaluate(StatementAdapter.java:36)
	at com.carrotsearch.randomizedtesting.rules.StatementAdapter.evaluate(StatementAdapter.java:36)
	at org.apache.lucene.util.TestRuleAssertionsRequired$1.evaluate(TestRuleAssertionsRequired.java:53)
	at org.apache.lucene.util.TestRuleMarkFailure$1.evaluate(TestRuleMarkFailure.java:47)
	at org.apache.lucene.util.TestRuleIgnoreAfterMaxFailures$1.evaluate(TestRuleIgnoreAfterMaxFailures.java:64)
	at org.apache.lucene.util.TestRuleIgnoreTestSuites$1.evaluate(TestRuleIgnoreTestSuites.java:54)
	at com.carrotsearch.randomizedtesting.rules.StatementAdapter.evaluate(StatementAdapter.java:36)
	at com.carrotsearch.randomizedtesting.ThreadLeakControl$StatementRunner.run(ThreadLeakControl.java:368)
	at java.lang.Thread.run(Thread.java:748)


FAILED:  org.apache.solr.handler.TestSolrConfigHandlerCloud.test

Error Message:
{   "responseHeader":{     "status":500,     "QTime":30102},   "errorMessages":["4 out of 5 the property overlay to be of version 8 within 30 seconds! Failed cores: [https://127.0.0.1:53315/collection1_shard2_replica_n41/, https://127.0.0.1:37929/collection1_shard2_replica_n45/, https://127.0.0.1:45579/collection1_shard1_replica_n43/, https://127.0.0.1:45858/collection1_shard1_replica_n47/]\n"],   "WARNING":"This response format is experimental.  It is likely to change in the future.",   "error":{     "metadata":[       "error-class","org.apache.solr.common.SolrException",       "root-error-class","org.apache.solr.common.SolrException"],     "msg":"4 out of 5 the property overlay to be of version 8 within 30 seconds! Failed cores: [https://127.0.0.1:53315/collection1_shard2_replica_n41/, https://127.0.0.1:37929/collection1_shard2_replica_n45/, https://127.0.0.1:45579/collection1_shard1_replica_n43/, https://127.0.0.1:45858/collection1_shard1_replica_n47/]",     "trace":"org.apache.solr.common.SolrException: 4 out of 5 the property overlay to be of version 8 within 30 seconds! Failed cores: [https://127.0.0.1:53315/collection1_shard2_replica_n41/, https://127.0.0.1:37929/collection1_shard2_replica_n45/, https://127.0.0.1:45579/collection1_shard1_replica_n43/, https://127.0.0.1:45858/collection1_shard1_replica_n47/]\n\tat org.apache.solr.handler.SolrConfigHandler.waitForAllReplicasState(SolrConfigHandler.java:772)\n\tat org.apache.solr.handler.SolrConfigHandler.access$400(SolrConfigHandler.java:102)\n\tat org.apache.solr.handler.SolrConfigHandler$Command.handleCommands(SolrConfigHandler.java:503)\n\tat org.apache.solr.handler.SolrConfigHandler$Command.handlePOST(SolrConfigHandler.java:346)\n\tat org.apache.solr.handler.SolrConfigHandler$Command.access$100(SolrConfigHandler.java:159)\n\tat org.apache.solr.handler.SolrConfigHandler.handleRequestBody(SolrConfigHandler.java:137)\n\tat org.apache.solr.handler.RequestHandlerBase.handleRequest(RequestHandlerBase.java:177)\n\tat org.apache.solr.core.SolrCore.execute(SolrCore.java:2484)\n\tat org.apache.solr.servlet.HttpSolrCall.execute(HttpSolrCall.java:720)\n\tat org.apache.solr.servlet.HttpSolrCall.call(HttpSolrCall.java:526)\n\tat org.apache.solr.servlet.SolrDispatchFilter.doFilter(SolrDispatchFilter.java:382)\n\tat org.apache.solr.servlet.SolrDispatchFilter.doFilter(SolrDispatchFilter.java:326)\n\tat org.eclipse.jetty.servlet.ServletHandler$CachedChain.doFilter(ServletHandler.java:1759)\n\tat org.apache.solr.client.solrj.embedded.JettySolrRunner$DebugFilter.doFilter(JettySolrRunner.java:139)\n\tat org.eclipse.jetty.servlet.ServletHandler$CachedChain.doFilter(ServletHandler.java:1759)\n\tat org.eclipse.jetty.servlet.ServletHandler.doHandle(ServletHandler.java:582)\n\tat org.eclipse.jetty.server.session.SessionHandler.doHandle(SessionHandler.java:224)\n\tat org.eclipse.jetty.server.handler.ContextHandler.doHandle(ContextHandler.java:1180)\n\tat org.eclipse.jetty.servlet.ServletHandler.doScope(ServletHandler.java:512)\n\tat org.eclipse.jetty.server.session.SessionHandler.doScope(SessionHandler.java:185)\n\tat org.eclipse.jetty.server.handler.ContextHandler.doScope(ContextHandler.java:1112)\n\tat org.eclipse.jetty.server.handler.ScopedHandler.handle(ScopedHandler.java:141)\n\tat org.eclipse.jetty.server.handler.gzip.GzipHandler.handle(GzipHandler.java:426)\n\tat org.eclipse.jetty.server.handler.HandlerWrapper.handle(HandlerWrapper.java:134)\n\tat org.eclipse.jetty.server.Server.handle(Server.java:534)\n\tat org.eclipse.jetty.server.HttpChannel.handle(HttpChannel.java:320)\n\tat org.eclipse.jetty.server.HttpConnection.onFillable(HttpConnection.java:251)\n\tat org.eclipse.jetty.io.AbstractConnection$ReadCallback.succeeded(AbstractConnection.java:283)\n\tat org.eclipse.jetty.io.FillInterest.fillable(FillInterest.java:108)\n\tat org.eclipse.jetty.io.ssl.SslConnection.onFillable(SslConnection.java:251)\n\tat org.eclipse.jetty.io.AbstractConnection$ReadCallback.succeeded(AbstractConnection.java:283)\n\tat org.eclipse.jetty.io.FillInterest.fillable(FillInterest.java:108)\n\tat org.eclipse.jetty.io.SelectChannelEndPoint$2.run(SelectChannelEndPoint.java:93)\n\tat org.eclipse.jetty.util.thread.strategy.ExecuteProduceConsume.executeProduceConsume(ExecuteProduceConsume.java:303)\n\tat org.eclipse.jetty.util.thread.strategy.ExecuteProduceConsume.produceConsume(ExecuteProduceConsume.java:148)\n\tat org.eclipse.jetty.util.thread.strategy.ExecuteProduceConsume.run(ExecuteProduceConsume.java:136)\n\tat org.eclipse.jetty.util.thread.QueuedThreadPool.runJob(QueuedThreadPool.java:671)\n\tat org.eclipse.jetty.util.thread.QueuedThreadPool$2.run(QueuedThreadPool.java:589)\n\tat java.lang.Thread.run(Thread.java:748)\n",     "code":500}} 

Stack Trace:
java.lang.AssertionError: {
  "responseHeader":{
    "status":500,
    "QTime":30102},
  "errorMessages":["4 out of 5 the property overlay to be of version 8 within 30 seconds! Failed cores: [https://127.0.0.1:53315/collection1_shard2_replica_n41/, https://127.0.0.1:37929/collection1_shard2_replica_n45/, https://127.0.0.1:45579/collection1_shard1_replica_n43/, https://127.0.0.1:45858/collection1_shard1_replica_n47/]\n"],
  "WARNING":"This response format is experimental.  It is likely to change in the future.",
  "error":{
    "metadata":[
      "error-class","org.apache.solr.common.SolrException",
      "root-error-class","org.apache.solr.common.SolrException"],
    "msg":"4 out of 5 the property overlay to be of version 8 within 30 seconds! Failed cores: [https://127.0.0.1:53315/collection1_shard2_replica_n41/, https://127.0.0.1:37929/collection1_shard2_replica_n45/, https://127.0.0.1:45579/collection1_shard1_replica_n43/, https://127.0.0.1:45858/collection1_shard1_replica_n47/]",
    "trace":"org.apache.solr.common.SolrException: 4 out of 5 the property overlay to be of version 8 within 30 seconds! Failed cores: [https://127.0.0.1:53315/collection1_shard2_replica_n41/, https://127.0.0.1:37929/collection1_shard2_replica_n45/, https://127.0.0.1:45579/collection1_shard1_replica_n43/, https://127.0.0.1:45858/collection1_shard1_replica_n47/]\n\tat org.apache.solr.handler.SolrConfigHandler.waitForAllReplicasState(SolrConfigHandler.java:772)\n\tat org.apache.solr.handler.SolrConfigHandler.access$400(SolrConfigHandler.java:102)\n\tat org.apache.solr.handler.SolrConfigHandler$Command.handleCommands(SolrConfigHandler.java:503)\n\tat org.apache.solr.handler.SolrConfigHandler$Command.handlePOST(SolrConfigHandler.java:346)\n\tat org.apache.solr.handler.SolrConfigHandler$Command.access$100(SolrConfigHandler.java:159)\n\tat org.apache.solr.handler.SolrConfigHandler.handleRequestBody(SolrConfigHandler.java:137)\n\tat org.apache.solr.handler.RequestHandlerBase.handleRequest(RequestHandlerBase.java:177)\n\tat org.apache.solr.core.SolrCore.execute(SolrCore.java:2484)\n\tat org.apache.solr.servlet.HttpSolrCall.execute(HttpSolrCall.java:720)\n\tat org.apache.solr.servlet.HttpSolrCall.call(HttpSolrCall.java:526)\n\tat org.apache.solr.servlet.SolrDispatchFilter.doFilter(SolrDispatchFilter.java:382)\n\tat org.apache.solr.servlet.SolrDispatchFilter.doFilter(SolrDispatchFilter.java:326)\n\tat org.eclipse.jetty.servlet.ServletHandler$CachedChain.doFilter(ServletHandler.java:1759)\n\tat org.apache.solr.client.solrj.embedded.JettySolrRunner$DebugFilter.doFilter(JettySolrRunner.java:139)\n\tat org.eclipse.jetty.servlet.ServletHandler$CachedChain.doFilter(ServletHandler.java:1759)\n\tat org.eclipse.jetty.servlet.ServletHandler.doHandle(ServletHandler.java:582)\n\tat org.eclipse.jetty.server.session.SessionHandler.doHandle(SessionHandler.java:224)\n\tat org.eclipse.jetty.server.handler.ContextHandler.doHandle(ContextHandler.java:1180)\n\tat org.eclipse.jetty.servlet.ServletHandler.doScope(ServletHandler.java:512)\n\tat org.eclipse.jetty.server.session.SessionHandler.doScope(SessionHandler.java:185)\n\tat org.eclipse.jetty.server.handler.ContextHandler.doScope(ContextHandler.java:1112)\n\tat org.eclipse.jetty.server.handler.ScopedHandler.handle(ScopedHandler.java:141)\n\tat org.eclipse.jetty.server.handler.gzip.GzipHandler.handle(GzipHandler.java:426)\n\tat org.eclipse.jetty.server.handler.HandlerWrapper.handle(HandlerWrapper.java:134)\n\tat org.eclipse.jetty.server.Server.handle(Server.java:534)\n\tat org.eclipse.jetty.server.HttpChannel.handle(HttpChannel.java:320)\n\tat org.eclipse.jetty.server.HttpConnection.onFillable(HttpConnection.java:251)\n\tat org.eclipse.jetty.io.AbstractConnection$ReadCallback.succeeded(AbstractConnection.java:283)\n\tat org.eclipse.jetty.io.FillInterest.fillable(FillInterest.java:108)\n\tat org.eclipse.jetty.io.ssl.SslConnection.onFillable(SslConnection.java:251)\n\tat org.eclipse.jetty.io.AbstractConnection$ReadCallback.succeeded(AbstractConnection.java:283)\n\tat org.eclipse.jetty.io.FillInterest.fillable(FillInterest.java:108)\n\tat org.eclipse.jetty.io.SelectChannelEndPoint$2.run(SelectChannelEndPoint.java:93)\n\tat org.eclipse.jetty.util.thread.strategy.ExecuteProduceConsume.executeProduceConsume(ExecuteProduceConsume.java:303)\n\tat org.eclipse.jetty.util.thread.strategy.ExecuteProduceConsume.produceConsume(ExecuteProduceConsume.java:148)\n\tat org.eclipse.jetty.util.thread.strategy.ExecuteProduceConsume.run(ExecuteProduceConsume.java:136)\n\tat org.eclipse.jetty.util.thread.QueuedThreadPool.runJob(QueuedThreadPool.java:671)\n\tat org.eclipse.jetty.util.thread.QueuedThreadPool$2.run(QueuedThreadPool.java:589)\n\tat java.lang.Thread.run(Thread.java:748)\n",
    "code":500}}

	at __randomizedtesting.SeedInfo.seed([5612910F7A42394A:DE46AED5D4BE54B2]:0)
	at org.junit.Assert.fail(Assert.java:93)
	at org.junit.Assert.assertTrue(Assert.java:43)
	at org.junit.Assert.assertNull(Assert.java:551)
	at org.apache.solr.core.TestSolrConfigHandler.runConfigCommand(TestSolrConfigHandler.java:185)
	at org.apache.solr.core.TestSolrConfigHandler.reqhandlertests(TestSolrConfigHandler.java:318)
	at org.apache.solr.handler.TestSolrConfigHandlerCloud.testReqHandlerAPIs(TestSolrConfigHandlerCloud.java:97)
	at org.apache.solr.handler.TestSolrConfigHandlerCloud.test(TestSolrConfigHandlerCloud.java:67)
	at sun.reflect.NativeMethodAccessorImpl.invoke0(Native Method)
	at sun.reflect.NativeMethodAccessorImpl.invoke(NativeMethodAccessorImpl.java:62)
	at sun.reflect.DelegatingMethodAccessorImpl.invoke(DelegatingMethodAccessorImpl.java:43)
	at java.lang.reflect.Method.invoke(Method.java:498)
	at com.carrotsearch.randomizedtesting.RandomizedRunner.invoke(RandomizedRunner.java:1737)
	at com.carrotsearch.randomizedtesting.RandomizedRunner$8.evaluate(RandomizedRunner.java:934)
	at com.carrotsearch.randomizedtesting.RandomizedRunner$9.evaluate(RandomizedRunner.java:970)
	at com.carrotsearch.randomizedtesting.RandomizedRunner$10.evaluate(RandomizedRunner.java:984)
	at org.apache.solr.BaseDistributedSearchTestCase$ShardsRepeatRule$ShardsFixedStatement.callStatement(BaseDistributedSearchTestCase.java:993)
	at org.apache.solr.BaseDistributedSearchTestCase$ShardsRepeatRule$ShardsStatement.evaluate(BaseDistributedSearchTestCase.java:968)
	at com.carrotsearch.randomizedtesting.rules.SystemPropertiesRestoreRule$1.evaluate(SystemPropertiesRestoreRule.java:57)
	at org.apache.lucene.util.TestRuleSetupTeardownChained$1.evaluate(TestRuleSetupTeardownChained.java:49)
	at org.apache.lucene.util.AbstractBeforeAfterRule$1.evaluate(AbstractBeforeAfterRule.java:45)
	at org.apache.lucene.util.TestRuleThreadAndTestName$1.evaluate(TestRuleThreadAndTestName.java:48)
	at org.apache.lucene.util.TestRuleIgnoreAfterMaxFailures$1.evaluate(TestRuleIgnoreAfterMaxFailures.java:64)
	at org.apache.lucene.util.TestRuleMarkFailure$1.evaluate(TestRuleMarkFailure.java:47)
	at com.carrotsearch.randomizedtesting.rules.StatementAdapter.evaluate(StatementAdapter.java:36)
	at com.carrotsearch.randomizedtesting.ThreadLeakControl$StatementRunner.run(ThreadLeakControl.java:368)
	at com.carrotsearch.randomizedtesting.ThreadLeakControl.forkTimeoutingTask(ThreadLeakControl.java:817)
	at com.carrotsearch.randomizedtesting.ThreadLeakControl$3.evaluate(ThreadLeakControl.java:468)
	at com.carrotsearch.randomizedtesting.RandomizedRunner.runSingleTest(RandomizedRunner.java:943)
	at com.carrotsearch.randomizedtesting.RandomizedRunner$5.evaluate(RandomizedRunner.java:829)
	at com.carrotsearch.randomizedtesting.RandomizedRunner$6.evaluate(RandomizedRunner.java:879)
	at com.carrotsearch.randomizedtesting.RandomizedRunner$7.evaluate(RandomizedRunner.java:890)
	at com.carrotsearch.randomizedtesting.rules.StatementAdapter.evaluate(StatementAdapter.java:36)
	at com.carrotsearch.randomizedtesting.rules.SystemPropertiesRestoreRule$1.evaluate(SystemPropertiesRestoreRule.java:57)
	at org.apache.lucene.util.AbstractBeforeAfterRule$1.evaluate(AbstractBeforeAfterRule.java:45)
	at com.carrotsearch.randomizedtesting.rules.StatementAdapter.evaluate(StatementAdapter.java:36)
	at org.apache.lucene.util.TestRuleStoreClassName$1.evaluate(TestRuleStoreClassName.java:41)
	at com.carrotsearch.randomizedtesting.rules.NoShadowingOrOverridesOnMethodsRule$1.evaluate(NoShadowingOrOverridesOnMethodsRule.java:40)
	at com.carrotsearch.randomizedtesting.rules.NoShadowingOrOverridesOnMethodsRule$1.evaluate(NoShadowingOrOverridesOnMethodsRule.java:40)
	at com.carrotsearch.randomizedtesting.rules.StatementAdapter.evaluate(StatementAdapter.java:36)
	at com.carrotsearch.randomizedtesting.rules.StatementAdapter.evaluate(StatementAdapter.java:36)
	at com.carrotsearch.randomizedtesting.rules.StatementAdapter.evaluate(StatementAdapter.java:36)
	at org.apache.lucene.util.TestRuleAssertionsRequired$1.evaluate(TestRuleAssertionsRequired.java:53)
	at org.apache.lucene.util.TestRuleMarkFailure$1.evaluate(TestRuleMarkFailure.java:47)
	at org.apache.lucene.util.TestRuleIgnoreAfterMaxFailures$1.evaluate(TestRuleIgnoreAfterMaxFailures.java:64)
	at org.apache.lucene.util.TestRuleIgnoreTestSuites$1.evaluate(TestRuleIgnoreTestSuites.java:54)
	at com.carrotsearch.randomizedtesting.rules.StatementAdapter.evaluate(StatementAdapter.java:36)
	at com.carrotsearch.randomizedtesting.ThreadLeakControl$StatementRunner.run(ThreadLeakControl.java:368)
	at java.lang.Thread.run(Thread.java:748)


FAILED:  org.apache.solr.common.cloud.TestCollectionStateWatchers.testWaitForStateWatcherIsRetainedOnPredicateFailure

Error Message:
Did not see a fully active cluster after 30 seconds

Stack Trace:
java.lang.AssertionError: Did not see a fully active cluster after 30 seconds
	at __randomizedtesting.SeedInfo.seed([AD638E0B3870CED8:25552C58E0DF26CA]:0)
	at org.junit.Assert.fail(Assert.java:93)
	at org.junit.Assert.assertTrue(Assert.java:43)
	at org.apache.solr.common.cloud.TestCollectionStateWatchers.testWaitForStateWatcherIsRetainedOnPredicateFailure(TestCollectionStateWatchers.java:250)
	at sun.reflect.NativeMethodAccessorImpl.invoke0(Native Method)
	at sun.reflect.NativeMethodAccessorImpl.invoke(NativeMethodAccessorImpl.java:62)
	at sun.reflect.DelegatingMethodAccessorImpl.invoke(DelegatingMethodAccessorImpl.java:43)
	at java.lang.reflect.Method.invoke(Method.java:498)
	at com.carrotsearch.randomizedtesting.RandomizedRunner.invoke(RandomizedRunner.java:1737)
	at com.carrotsearch.randomizedtesting.RandomizedRunner$8.evaluate(RandomizedRunner.java:934)
	at com.carrotsearch.randomizedtesting.RandomizedRunner$9.evaluate(RandomizedRunner.java:970)
	at com.carrotsearch.randomizedtesting.RandomizedRunner$10.evaluate(RandomizedRunner.java:984)
	at com.carrotsearch.randomizedtesting.rules.SystemPropertiesRestoreRule$1.evaluate(SystemPropertiesRestoreRule.java:57)
	at org.apache.lucene.util.TestRuleSetupTeardownChained$1.evaluate(TestRuleSetupTeardownChained.java:49)
	at org.apache.lucene.util.AbstractBeforeAfterRule$1.evaluate(AbstractBeforeAfterRule.java:45)
	at org.apache.lucene.util.TestRuleThreadAndTestName$1.evaluate(TestRuleThreadAndTestName.java:48)
	at org.apache.lucene.util.TestRuleIgnoreAfterMaxFailures$1.evaluate(TestRuleIgnoreAfterMaxFailures.java:64)
	at org.apache.lucene.util.TestRuleMarkFailure$1.evaluate(TestRuleMarkFailure.java:47)
	at com.carrotsearch.randomizedtesting.rules.StatementAdapter.evaluate(StatementAdapter.java:36)
	at com.carrotsearch.randomizedtesting.ThreadLeakControl$StatementRunner.run(ThreadLeakControl.java:368)
	at com.carrotsearch.randomizedtesting.ThreadLeakControl.forkTimeoutingTask(ThreadLeakControl.java:817)
	at com.carrotsearch.randomizedtesting.ThreadLeakControl$3.evaluate(ThreadLeakControl.java:468)
	at com.carrotsearch.randomizedtesting.RandomizedRunner.runSingleTest(RandomizedRunner.java:943)
	at com.carrotsearch.randomizedtesting.RandomizedRunner$5.evaluate(RandomizedRunner.java:829)
	at com.carrotsearch.randomizedtesting.RandomizedRunner$6.evaluate(RandomizedRunner.java:879)
	at com.carrotsearch.randomizedtesting.RandomizedRunner$7.evaluate(RandomizedRunner.java:890)
	at com.carrotsearch.randomizedtesting.rules.StatementAdapter.evaluate(StatementAdapter.java:36)
	at com.carrotsearch.randomizedtesting.rules.SystemPropertiesRestoreRule$1.evaluate(SystemPropertiesRestoreRule.java:57)
	at org.apache.lucene.util.AbstractBeforeAfterRule$1.evaluate(AbstractBeforeAfterRule.java:45)
	at com.carrotsearch.randomizedtesting.rules.StatementAdapter.evaluate(StatementAdapter.java:36)
	at org.apache.lucene.util.TestRuleStoreClassName$1.evaluate(TestRuleStoreClassName.java:41)
	at com.carrotsearch.randomizedtesting.rules.NoShadowingOrOverridesOnMethodsRule$1.evaluate(NoShadowingOrOverridesOnMethodsRule.java:40)
	at com.carrotsearch.randomizedtesting.rules.NoShadowingOrOverridesOnMethodsRule$1.evaluate(NoShadowingOrOverridesOnMethodsRule.java:40)
	at com.carrotsearch.randomizedtesting.rules.StatementAdapter.evaluate(StatementAdapter.java:36)
	at com.carrotsearch.randomizedtesting.rules.StatementAdapter.evaluate(StatementAdapter.java:36)
	at com.carrotsearch.randomizedtesting.rules.StatementAdapter.evaluate(StatementAdapter.java:36)
	at org.apache.lucene.util.TestRuleAssertionsRequired$1.evaluate(TestRuleAssertionsRequired.java:53)
	at org.apache.lucene.util.TestRuleMarkFailure$1.evaluate(TestRuleMarkFailure.java:47)
	at org.apache.lucene.util.TestRuleIgnoreAfterMaxFailures$1.evaluate(TestRuleIgnoreAfterMaxFailures.java:64)
	at org.apache.lucene.util.TestRuleIgnoreTestSuites$1.evaluate(TestRuleIgnoreTestSuites.java:54)
	at com.carrotsearch.randomizedtesting.rules.StatementAdapter.evaluate(StatementAdapter.java:36)
	at com.carrotsearch.randomizedtesting.ThreadLeakControl$StatementRunner.run(ThreadLeakControl.java:368)
	at java.lang.Thread.run(Thread.java:748)




Build Log:
[...truncated 11895 lines...]
   [junit4] Suite: org.apache.solr.cloud.autoscaling.TriggerIntegrationTest
   [junit4]   2> 1798805 INFO  (SUITE-TriggerIntegrationTest-seed#[5612910F7A42394A]-worker) [    ] o.a.s.SolrTestCaseJ4 SecureRandom sanity checks: test.solr.allowed.securerandom=null & java.security.egd=file:/dev/./urandom
   [junit4]   2> Creating dataDir: /x1/jenkins/jenkins-slave/workspace/Lucene-Solr-Tests-master/solr/build/solr-core/test/J2/temp/solr.cloud.autoscaling.TriggerIntegrationTest_5612910F7A42394A-001/init-core-data-001
   [junit4]   2> 1798805 WARN  (SUITE-TriggerIntegrationTest-seed#[5612910F7A42394A]-worker) [    ] o.a.s.SolrTestCaseJ4 startTrackingSearchers: numOpens=11 numCloses=11
   [junit4]   2> 1798805 INFO  (SUITE-TriggerIntegrationTest-seed#[5612910F7A42394A]-worker) [    ] o.a.s.SolrTestCaseJ4 Using PointFields (NUMERIC_POINTS_SYSPROP=true) w/NUMERIC_DOCVALUES_SYSPROP=false
   [junit4]   2> 1798832 INFO  (SUITE-TriggerIntegrationTest-seed#[5612910F7A42394A]-worker) [    ] o.a.s.SolrTestCaseJ4 Randomized ssl (false) and clientAuth (true) via: @org.apache.solr.util.RandomizeSSL(reason=, ssl=NaN, value=NaN, clientAuth=NaN)
   [junit4]   2> 1798833 INFO  (SUITE-TriggerIntegrationTest-seed#[5612910F7A42394A]-worker) [    ] o.a.s.c.MiniSolrCloudCluster Starting cluster of 2 servers in /x1/jenkins/jenkins-slave/workspace/Lucene-Solr-Tests-master/solr/build/solr-core/test/J2/temp/solr.cloud.autoscaling.TriggerIntegrationTest_5612910F7A42394A-001/tempDir-001
   [junit4]   2> 1798833 INFO  (SUITE-TriggerIntegrationTest-seed#[5612910F7A42394A]-worker) [    ] o.a.s.c.ZkTestServer STARTING ZK TEST SERVER
   [junit4]   2> 1798851 INFO  (Thread-956) [    ] o.a.s.c.ZkTestServer client port:0.0.0.0/0.0.0.0:0
   [junit4]   2> 1798851 INFO  (Thread-956) [    ] o.a.s.c.ZkTestServer Starting server
   [junit4]   2> 1798971 ERROR (Thread-956) [    ] o.a.z.s.ZooKeeperServer ZKShutdownHandler is not registered, so ZooKeeper server won't take any action on ERROR or SHUTDOWN server state changes
   [junit4]   2> 1799066 INFO  (SUITE-TriggerIntegrationTest-seed#[5612910F7A42394A]-worker) [    ] o.a.s.c.ZkTestServer start zk server on port:46826
   [junit4]   2> 1801191 INFO  (jetty-launcher-586-thread-1) [    ] o.e.j.s.Server jetty-9.3.20.v20170531
   [junit4]   2> 1801215 INFO  (jetty-launcher-586-thread-2) [    ] o.e.j.s.Server jetty-9.3.20.v20170531
   [junit4]   2> 1801288 INFO  (jetty-launcher-586-thread-1) [    ] o.e.j.s.h.ContextHandler Started o.e.j.s.ServletContextHandler@4a36866c{/solr,null,AVAILABLE}
   [junit4]   2> 1801289 INFO  (jetty-launcher-586-thread-1) [    ] o.e.j.s.AbstractConnector Started ServerConnector@712592f0{HTTP/1.1,[http/1.1]}{127.0.0.1:51836}
   [junit4]   2> 1801289 INFO  (jetty-launcher-586-thread-1) [    ] o.e.j.s.Server Started @1819311ms
   [junit4]   2> 1801289 INFO  (jetty-launcher-586-thread-1) [    ] o.a.s.c.s.e.JettySolrRunner Jetty properties: {hostContext=/solr, hostPort=51836}
   [junit4]   2> 1801289 ERROR (jetty-launcher-586-thread-1) [    ] o.a.s.u.StartupLoggingUtils Missing Java Option solr.log.dir. Logging may be missing or incomplete.
   [junit4]   2> 1801289 INFO  (jetty-launcher-586-thread-1) [    ] o.a.s.s.SolrDispatchFilter  ___      _       Welcome to Apache Solr? version 8.0.0
   [junit4]   2> 1801289 INFO  (jetty-launcher-586-thread-1) [    ] o.a.s.s.SolrDispatchFilter / __| ___| |_ _   Starting in cloud mode on port null
   [junit4]   2> 1801289 INFO  (jetty-launcher-586-thread-1) [    ] o.a.s.s.SolrDispatchFilter \__ \/ _ \ | '_|  Install dir: null, Default config dir: null
   [junit4]   2> 1801289 INFO  (jetty-launcher-586-thread-1) [    ] o.a.s.s.SolrDispatchFilter |___/\___/_|_|    Start time: 2017-10-11T06:01:32.743Z
   [junit4]   2> 1801515 INFO  (jetty-launcher-586-thread-2) [    ] o.e.j.s.h.ContextHandler Started o.e.j.s.ServletContextHandler@135e9c97{/solr,null,AVAILABLE}
   [junit4]   2> 1801516 INFO  (jetty-launcher-586-thread-2) [    ] o.e.j.s.AbstractConnector Started ServerConnector@31df004f{HTTP/1.1,[http/1.1]}{127.0.0.1:59440}
   [junit4]   2> 1801516 INFO  (jetty-launcher-586-thread-2) [    ] o.e.j.s.Server Started @1819538ms
   [junit4]   2> 1801516 INFO  (jetty-launcher-586-thread-2) [    ] o.a.s.c.s.e.JettySolrRunner Jetty properties: {hostContext=/solr, hostPort=59440}
   [junit4]   2> 1801516 ERROR (jetty-launcher-586-thread-2) [    ] o.a.s.u.StartupLoggingUtils Missing Java Option solr.log.dir. Logging may be missing or incomplete.
   [junit4]   2> 1801516 INFO  (jetty-launcher-586-thread-2) [    ] o.a.s.s.SolrDispatchFilter  ___      _       Welcome to Apache Solr? version 8.0.0
   [junit4]   2> 1801516 INFO  (jetty-launcher-586-thread-2) [    ] o.a.s.s.SolrDispatchFilter / __| ___| |_ _   Starting in cloud mode on port null
   [junit4]   2> 1801516 INFO  (jetty-launcher-586-thread-2) [    ] o.a.s.s.SolrDispatchFilter \__ \/ _ \ | '_|  Install dir: null, Default config dir: null
   [junit4]   2> 1801516 INFO  (jetty-launcher-586-thread-2) [    ] o.a.s.s.SolrDispatchFilter |___/\___/_|_|    Start time: 2017-10-11T06:01:32.970Z
   [junit4]   2> 1801806 INFO  (jetty-launcher-586-thread-2) [    ] o.a.s.s.SolrDispatchFilter solr.xml found in ZooKeeper. Loading...
   [junit4]   2> 1801810 INFO  (jetty-launcher-586-thread-1) [    ] o.a.s.s.SolrDispatchFilter solr.xml found in ZooKeeper. Loading...
   [junit4]   2> 1801826 INFO  (jetty-launcher-586-thread-1) [    ] o.a.s.c.ZkContainer Zookeeper client=127.0.0.1:46826/solr
   [junit4]   2> 1801845 WARN  (NIOServerCxn.Factory:0.0.0.0/0.0.0.0:0) [    ] o.a.z.s.NIOServerCnxn caught end of stream exception
   [junit4]   2> EndOfStreamException: Unable to read additional data from client sessionid 0x15f0a060fc10001, likely client has closed socket
   [junit4]   2> 	at org.apache.zookeeper.server.NIOServerCnxn.doIO(NIOServerCnxn.java:239)
   [junit4]   2> 	at org.apache.zookeeper.server.NIOServerCnxnFactory.run(NIOServerCnxnFactory.java:203)
   [junit4]   2> 	at java.lang.Thread.run(Thread.java:748)
   [junit4]   2> 1802079 INFO  (jetty-launcher-586-thread-2) [    ] o.a.s.c.ZkContainer Zookeeper client=127.0.0.1:46826/solr
   [junit4]   2> 1803561 INFO  (jetty-launcher-586-thread-2) [n:127.0.0.1:59440_solr    ] o.a.s.c.Overseer Overseer (id=null) closing
   [junit4]   2> 1803577 INFO  (jetty-launcher-586-thread-2) [n:127.0.0.1:59440_solr    ] o.a.s.c.OverseerElectionContext I am going to be the leader 127.0.0.1:59440_solr
   [junit4]   2> 1803577 INFO  (jetty-launcher-586-thread-2) [n:127.0.0.1:59440_solr    ] o.a.s.c.Overseer Overseer (id=98808737975828486-127.0.0.1:59440_solr-n_0000000000) starting
   [junit4]   2> 1803581 INFO  (jetty-launcher-586-thread-2) [n:127.0.0.1:59440_solr    ] o.a.s.c.ZkController Register node as live in ZooKeeper:/live_nodes/127.0.0.1:59440_solr
   [junit4]   2> 1803608 DEBUG (OverseerAutoScalingTriggerThread-98808737975828486-127.0.0.1:59440_solr-n_0000000000) [n:127.0.0.1:59440_solr    ] o.a.s.c.a.OverseerTriggerThread Adding .autoAddReplicas trigger
   [junit4]   2> 1804343 INFO  (OverseerStateUpdate-98808737975828486-127.0.0.1:59440_solr-n_0000000000) [n:127.0.0.1:59440_solr    ] o.a.s.c.c.ZkStateReader Updated live nodes from ZooKeeper... (0) -> (1)
   [junit4]   2> 1804343 DEBUG (OverseerAutoScalingTriggerThread-98808737975828486-127.0.0.1:59440_solr-n_0000000000) [n:127.0.0.1:59440_solr    ] o.a.s.c.a.OverseerTriggerThread Refreshing /autoscaling.json with znode version 1
   [junit4]   2> 1804344 DEBUG (OverseerAutoScalingTriggerThread-98808737975828486-127.0.0.1:59440_solr-n_0000000000) [n:127.0.0.1:59440_solr    ] o.a.s.c.a.NodeLostTrigger Initial livenodes: [127.0.0.1:59440_solr]
   [junit4]   2> 1804345 DEBUG (OverseerAutoScalingTriggerThread-98808737975828486-127.0.0.1:59440_solr-n_0000000000) [n:127.0.0.1:59440_solr    ] o.a.s.c.a.OverseerTriggerThread Current znodeVersion 1, lastZnodeVersion -1
   [junit4]   2> 1804345 DEBUG (OverseerAutoScalingTriggerThread-98808737975828486-127.0.0.1:59440_solr-n_0000000000) [n:127.0.0.1:59440_solr    ] o.a.s.c.a.OverseerTriggerThread Processed trigger updates upto znodeVersion 1
   [junit4]   2> 1804379 DEBUG (OverseerAutoScalingTriggerThread-98808737975828486-127.0.0.1:59440_solr-n_0000000000) [n:127.0.0.1:59440_solr    ] o.a.s.c.a.OverseerTriggerThread -- clean old nodeAdded markers
   [junit4]   2> 1804379 DEBUG (OverseerAutoScalingTriggerThread-98808737975828486-127.0.0.1:59440_solr-n_0000000000) [n:127.0.0.1:59440_solr    ] o.a.s.c.a.OverseerTriggerThread Current znodeVersion 1, lastZnodeVersion 1
   [junit4]   2> 1804380 DEBUG (ScheduledTrigger-1787-thread-1) [n:127.0.0.1:59440_solr    ] o.a.s.c.a.NodeLostTrigger Running NodeLostTrigger: .auto_add_replicas with currently live nodes: [127.0.0.1:59440_solr]
   [junit4]   2> 1804892 INFO  (jetty-launcher-586-thread-1) [n:127.0.0.1:51836_solr    ] o.a.s.c.c.ZkStateReader Updated live nodes from ZooKeeper... (0) -> (1)
   [junit4]   2> 1804910 INFO  (jetty-launcher-586-thread-1) [n:127.0.0.1:51836_solr    ] o.a.s.c.Overseer Overseer (id=null) closing
   [junit4]   2> 1804911 INFO  (jetty-launcher-586-thread-1) [n:127.0.0.1:51836_solr    ] o.a.s.c.ZkController Register node as live in ZooKeeper:/live_nodes/127.0.0.1:51836_solr
   [junit4]   2> 1805127 INFO  (zkCallback-597-thread-1-processing-n:127.0.0.1:51836_solr) [n:127.0.0.1:51836_solr    ] o.a.s.c.c.ZkStateReader Updated live nodes from ZooKeeper... (1) -> (2)
   [junit4]   2> 1805332 INFO  (zkCallback-598-thread-2-processing-n:127.0.0.1:59440_solr) [n:127.0.0.1:59440_solr    ] o.a.s.c.c.ZkStateReader Updated live nodes from ZooKeeper... (1) -> (2)
   [junit4]   2> 1805438 DEBUG (ScheduledTrigger-1787-thread-1) [n:127.0.0.1:59440_solr    ] o.a.s.c.a.NodeLostTrigger Running NodeLostTrigger: .auto_add_replicas with currently live nodes: [127.0.0.1:51836_solr, 127.0.0.1:59440_solr]
   [junit4]   2> 1805621 INFO  (jetty-launcher-586-thread-2) [n:127.0.0.1:59440_solr    ] o.a.s.m.r.SolrJmxReporter JMX monitoring for 'solr_59440.solr.node' (registry 'solr.node') enabled at server: com.sun.jmx.mbeanserver.JmxMBeanServer@4f9b4b52
   [junit4]   2> 1805804 INFO  (jetty-launcher-586-thread-2) [n:127.0.0.1:59440_solr    ] o.a.s.m.r.SolrJmxReporter JMX monitoring for 'solr_59440.solr.jvm' (registry 'solr.jvm') enabled at server: com.sun.jmx.mbeanserver.JmxMBeanServer@4f9b4b52
   [junit4]   2> 1805805 INFO  (jetty-launcher-586-thread-2) [n:127.0.0.1:59440_solr    ] o.a.s.m.r.SolrJmxReporter JMX monitoring for 'solr_59440.solr.jetty' (registry 'solr.jetty') enabled at server: com.sun.jmx.mbeanserver.JmxMBeanServer@4f9b4b52
   [junit4]   2> 1805873 INFO  (jetty-launcher-586-thread-2) [n:127.0.0.1:59440_solr    ] o.a.s.c.CorePropertiesLocator Found 0 core definitions underneath /x1/jenkins/jenkins-slave/workspace/Lucene-Solr-Tests-master/solr/build/solr-core/test/J2/temp/solr.cloud.autoscaling.TriggerIntegrationTest_5612910F7A42394A-001/tempDir-001/node2/.
   [junit4]   2> 1806457 INFO  (jetty-launcher-586-thread-1) [n:127.0.0.1:51836_solr    ] o.a.s.m.r.SolrJmxReporter JMX monitoring for 'solr_51836.solr.node' (registry 'solr.node') enabled at server: com.sun.jmx.mbeanserver.JmxMBeanServer@4f9b4b52
   [junit4]   2> 1806535 DEBUG (ScheduledTrigger-1787-thread-2) [n:127.0.0.1:59440_solr    ] o.a.s.c.a.NodeLostTrigger Running NodeLostTrigger: .auto_add_replicas with currently live nodes: [127.0.0.1:51836_solr, 127.0.0.1:59440_solr]
   [junit4]   2> 1806574 INFO  (jetty-launcher-586-thread-1) [n:127.0.0.1:51836_solr    ] o.a.s.m.r.SolrJmxReporter JMX monitoring for 'solr_51836.solr.jvm' (registry 'solr.jvm') enabled at server: com.sun.jmx.mbeanserver.JmxMBeanServer@4f9b4b52
   [junit4]   2> 1806574 INFO  (jetty-launcher-586-thread-1) [n:127.0.0.1:51836_solr    ] o.a.s.m.r.SolrJmxReporter JMX monitoring for 'solr_51836.solr.jetty' (registry 'solr.jetty') enabled at server: com.sun.jmx.mbeanserver.JmxMBeanServer@4f9b4b52
   [junit4]   2> 1806586 INFO  (jetty-launcher-586-thread-1) [n:127.0.0.1:51836_solr    ] o.a.s.c.CorePropertiesLocator Found 0 core definitions underneath /x1/jenkins/jenkins-slave/workspace/Lucene-Solr-Tests-master/solr/build/solr-core/test/J2/temp/solr.cloud.autoscaling.TriggerIntegrationTest_5612910F7A42394A-001/tempDir-001/node1/.
   [junit4]   2> 1807163 INFO  (SUITE-TriggerIntegrationTest-seed#[5612910F7A42394A]-worker) [    ] o.a.s.c.c.ZkStateReader Updated live nodes from ZooKeeper... (0) -> (2)
   [junit4]   2> 1807164 INFO  (SUITE-TriggerIntegrationTest-seed#[5612910F7A42394A]-worker) [    ] o.a.s.c.s.i.ZkClientClusterStateProvider Cluster at 127.0.0.1:46826/solr ready
   [junit4]   2> 1807376 INFO  (TEST-TriggerIntegrationTest.testEventFromRestoredState-seed#[5612910F7A42394A]) [    ] o.a.s.SolrTestCaseJ4 ###Starting testEventFromRestoredState
   [junit4]   2> 1807376 DEBUG (zkCallback-598-thread-2-processing-n:127.0.0.1:59440_solr) [n:127.0.0.1:59440_solr    ] o.a.s.c.a.OverseerTriggerThread Refreshing /autoscaling.json with znode version 2
   [junit4]   2> 1807376 INFO  (TEST-TriggerIntegrationTest.testEventFromRestoredState-seed#[5612910F7A42394A]) [    ] o.a.s.c.a.TriggerIntegrationTest /autoscaling.json reset, new znode version 2
   [junit4]   2> 1807388 DEBUG (OverseerAutoScalingTriggerThread-98808737975828486-127.0.0.1:59440_solr-n_0000000000) [n:127.0.0.1:59440_solr    ] o.a.s.c.a.OverseerTriggerThread Processed trigger updates upto znodeVersion 2
   [junit4]   2> 1807393 DEBUG (OverseerAutoScalingTriggerThread-98808737975828486-127.0.0.1:59440_solr-n_0000000000) [n:127.0.0.1:59440_solr    ] o.a.s.c.a.OverseerTriggerThread -- clean old nodeLost markers
   [junit4]   2> 1807409 DEBUG (OverseerAutoScalingTriggerThread-98808737975828486-127.0.0.1:59440_solr-n_0000000000) [n:127.0.0.1:59440_solr    ] o.a.s.c.a.OverseerTriggerThread -- clean old nodeAdded markers
   [junit4]   2> 1807409 DEBUG (OverseerAutoScalingTriggerThread-98808737975828486-127.0.0.1:59440_solr-n_0000000000) [n:127.0.0.1:59440_solr    ] o.a.s.c.a.OverseerTriggerThread Current znodeVersion 2, lastZnodeVersion 2
   [junit4]   2> 1807924 INFO  (qtp1601938787-4293) [n:127.0.0.1:59440_solr    ] o.a.s.c.c.ZkStateReader Updated live nodes from ZooKeeper... (0) -> (2)
   [junit4]   2> 1807924 INFO  (qtp1601938787-4293) [n:127.0.0.1:59440_solr    ] o.a.s.c.s.i.ZkClientClusterStateProvider Cluster at 127.0.0.1:46826/solr ready
   [junit4]   2> 1808016 INFO  (qtp99498140-4284) [n:127.0.0.1:51836_solr    ] o.a.s.s.HttpSolrCall [admin] webapp=null path=/admin/metrics params={prefix=CORE.coreName&wt=javabin&version=2&group=solr.core} status=0 QTime=0
   [junit4]   2> 1808017 INFO  (qtp1601938787-4291) [n:127.0.0.1:59440_solr    ] o.a.s.s.HttpSolrCall [admin] webapp=null path=/admin/metrics params={prefix=CORE.coreName&wt=javabin&version=2&group=solr.core} status=0 QTime=0
   [junit4]   2> 1808017 DEBUG (qtp1601938787-4293) [n:127.0.0.1:59440_solr    ] o.a.s.c.a.AutoScalingHandler Verified autoscaling configuration
   [junit4]   2> 1808020 INFO  (qtp1601938787-4293) [n:127.0.0.1:59440_solr    ] o.a.s.s.HttpSolrCall [admin] webapp=null path=/cluster/autoscaling params={wt=javabin&version=2} status=0 QTime=378
   [junit4]   2> 1808020 DEBUG (zkCallback-598-thread-2-processing-n:127.0.0.1:59440_solr) [n:127.0.0.1:59440_solr    ] o.a.s.c.a.OverseerTriggerThread Refreshing /autoscaling.json with znode version 3
   [junit4]   2> 1808079 DEBUG (zkCallback-598-thread-2-processing-n:127.0.0.1:59440_solr) [n:127.0.0.1:59440_solr    ] o.a.s.c.a.NodeAddedTrigger Initial livenodes: [127.0.0.1:59440_solr, 127.0.0.1:51836_solr]
   [junit4]   2> 1808079 DEBUG (zkCallback-598-thread-2-processing-n:127.0.0.1:59440_solr) [n:127.0.0.1:59440_solr    ] o.a.s.c.a.NodeAddedTrigger NodeAddedTrigger node_added_trigger instantiated with properties: {event=nodeAdded, waitFor=10, actions=[{name=test, class=org.apache.solr.cloud.autoscaling.TriggerIntegrationTest$TestTriggerAction}], enabled=true}
   [junit4]   2> 1808090 DEBUG (OverseerAutoScalingTriggerThread-98808737975828486-127.0.0.1:59440_solr-n_0000000000) [n:127.0.0.1:59440_solr    ] o.a.s.c.a.OverseerTriggerThread Processed trigger updates upto znodeVersion 3
   [junit4]   2> 1808091 INFO  (OverseerAutoScalingTriggerThread-98808737975828486-127.0.0.1:59440_solr-n_0000000000) [n:127.0.0.1:59440_solr    ] o.a.s.c.a.TriggerIntegrationTest TestTriggerAction init
   [junit4]   2> 1808093 DEBUG (OverseerAutoScalingTriggerThread-98808737975828486-127.0.0.1:59440_solr-n_0000000000) [n:127.0.0.1:59440_solr    ] o.a.s.c.a.OverseerTriggerThread -- clean old nodeLost markers
   [junit4]   2> 1808093 DEBUG (OverseerAutoScalingTriggerThread-98808737975828486-127.0.0.1:59440_solr-n_0000000000) [n:127.0.0.1:59440_solr    ] o.a.s.c.a.OverseerTriggerThread Current znodeVersion 3, lastZnodeVersion 3
   [junit4]   2> 1808111 INFO  (qtp99498140-4282) [n:127.0.0.1:51836_solr    ] o.a.s.h.a.CollectionsHandler Invoked Collection Action :overseerstatus with params action=OVERSEERSTATUS&wt=javabin&version=2 and sendToOCPQueue=true
   [junit4]   2> 1808094 DEBUG (ScheduledTrigger-1787-thread-3) [n:127.0.0.1:59440_solr    ] o.a.s.c.a.NodeAddedTrigger Running NodeAddedTrigger node_added_trigger
   [junit4]   2> 1808111 DEBUG (ScheduledTrigger-1787-thread-3) [n:127.0.0.1:59440_solr    ] o.a.s.c.a.NodeAddedTrigger Found livenodes: [127.0.0.1:51836_solr, 127.0.0.1:59440_solr]
   [junit4]   2> 1808132 INFO  (qtp99498140-4282) [n:127.0.0.1:51836_solr    ] o.a.s.s.HttpSolrCall [admin] webapp=null path=/admin/collections params={action=OVERSEERSTATUS&wt=javabin&version=2} status=0 QTime=20
   [junit4]   2> 1808139 INFO  (TEST-TriggerIntegrationTest.testEventFromRestoredState-seed#[5612910F7A42394A]) [    ] o.e.j.s.Server jetty-9.3.20.v20170531
   [junit4]   2> 1808143 INFO  (OverseerCollectionConfigSetProcessor-98808737975828486-127.0.0.1:59440_solr-n_0000000000) [n:127.0.0.1:59440_solr    ] o.a.s.c.OverseerTaskQueue Response ZK path: /overseer/collection-queue-work/qnr-0000000000 doesn't exist.  Requestor may have disconnected from ZooKeeper
   [junit4]   2> 1808147 INFO  (TEST-TriggerIntegrationTest.testEventFromRestoredState-seed#[5612910F7A42394A]) [    ] o.e.j.s.h.ContextHandler Started o.e.j.s.ServletContextHandler@3d71f718{/solr,null,AVAILABLE}
   [junit4]   2> 1808148 INFO  (TEST-TriggerIntegrationTest.testEventFromRestoredState-seed#[5612910F7A42394A]) [    ] o.e.j.s.AbstractConnector Started ServerConnector@669d7a5b{HTTP/1.1,[http/1.1]}{127.0.0.1:60506}
   [junit4]   2> 1808148 INFO  (TEST-TriggerIntegrationTest.testEventFromRestoredState-seed#[5612910F7A42394A]) [    ] o.e.j.s.Server Started @1826170ms
   [junit4]   2> 1808148 INFO  (TEST-TriggerIntegrationTest.testEventFromRestoredState-seed#[5612910F7A42394A]) [    ] o.a.s.c.s.e.JettySolrRunner Jetty properties: {hostContext=/solr, hostPort=60506}
   [junit4]   2> 1808148 ERROR (TEST-TriggerIntegrationTest.testEventFromRestoredState-seed#[5612910F7A42394A]) [    ] o.a.s.u.StartupLoggingUtils Missing Java Option solr.log.dir. Logging may be missing or incomplete.
   [junit4]   2> 1808170 INFO  (TEST-TriggerIntegrationTest.testEventFromRestoredState-seed#[5612910F7A42394A]) [    ] o.a.s.s.SolrDispatchFilter  ___      _       Welcome to Apache Solr? version 8.0.0
   [junit4]   2> 1808170 INFO  (TEST-TriggerIntegrationTest.testEventFromRestoredState-seed#[5612910F7A42394A]) [    ] o.a.s.s.SolrDispatchFilter / __| ___| |_ _   Starting in cloud mode on port null
   [junit4]   2> 1808170 INFO  (TEST-TriggerIntegrationTest.testEventFromRestoredState-seed#[5612910F7A42394A]) [    ] o.a.s.s.SolrDispatchFilter \__ \/ _ \ | '_|  Install dir: null, Default config dir: null
   [junit4]   2> 1808170 INFO  (TEST-TriggerIntegrationTest.testEventFromRestoredState-seed#[5612910F7A42394A]) [    ] o.a.s.s.SolrDispatchFilter |___/\___/_|_|    Start time: 2017-10-11T06:01:39.624Z
   [junit4]   2> 1808215 INFO  (TEST-TriggerIntegrationTest.testEventFromRestoredState-seed#[5612910F7A42394A]) [    ] o.a.s.s.SolrDispatchFilter solr.xml found in ZooKeeper. Loading...
   [junit4]   2> 1808254 INFO  (TEST-TriggerIntegrationTest.testEventFromRestoredState-seed#[5612910F7A42394A]) [    ] o.a.s.c.ZkContainer Zookeeper client=127.0.0.1:46826/solr
   [junit4]   2> 1808835 INFO  (TEST-TriggerIntegrationTest.testEventFromRestoredState-seed#[5612910F7A42394A]) [n:127.0.0.1:60506_solr    ] o.a.s.c.c.ZkStateReader Updated live nodes from ZooKeeper... (0) -> (2)
   [junit4]   2> 1808905 INFO  (TEST-TriggerIntegrationTest.testEventFromRestoredState-seed#[5612910F7A42394A]) [n:127.0.0.1:60506_solr    ] o.a.s.c.Overseer Overseer (id=null) closing
   [junit4]   2> 1808931 INFO  (TEST-TriggerIntegrationTest.testEventFromRestoredState-seed#[5612910F7A42394A]) [n:127.0.0.1:60506_solr    ] o.a.s.c.ZkController Register node as live in ZooKeeper:/live_nodes/127.0.0.1:60506_solr
   [junit4]   2> 1808935 INFO  (zkCallback-598-thread-2-processing-n:127.0.0.1:59440_solr) [n:127.0.0.1:59440_solr    ] o.a.s.c.c.ZkStateReader Updated live nodes from ZooKeeper... (2) -> (3)
   [junit4]   2> 1808935 INFO  (zkCallback-597-thread-1-processing-n:127.0.0.1:51836_solr) [n:127.0.0.1:51836_solr    ] o.a.s.c.c.ZkStateReader Updated live nodes from ZooKeeper... (2) -> (3)
   [junit4]   2> 1808973 INFO  (zkCallback-604-thread-1) [    ] o.a.s.c.c.ZkStateReader Updated live nodes from ZooKeeper... (2) -> (3)
   [junit4]   2> 1809017 INFO  (zkCallback-612-thread-1-processing-n:127.0.0.1:60506_solr) [n:127.0.0.1:60506_solr    ] o.a.s.c.c.ZkStateReader Updated live nodes from ZooKeeper... (2) -> (3)
   [junit4]   2> 1809113 DEBUG (ScheduledTrigger-1787-thread-3) [n:127.0.0.1:59440_solr    ] o.a.s.c.a.NodeAddedTrigger Running NodeAddedTrigger node_added_trigger
   [junit4]   2> 1809114 DEBUG (ScheduledTrigger-1787-thread-3) [n:127.0.0.1:59440_solr    ] o.a.s.c.a.NodeAddedTrigger Found livenodes: [127.0.0.1:51836_solr, 127.0.0.1:59440_solr, 127.0.0.1:60506_solr]
   [junit4]   2> 1809114 DEBUG (ScheduledTrigger-1787-thread-3) [n:127.0.0.1:59440_solr    ] o.a.s.c.a.NodeAddedTrigger Tracking new node: 127.0.0.1:60506_solr at time 1507701700568000000
   [junit4]   2> 1809322 INFO  (TEST-TriggerIntegrationTest.testEventFromRestoredState-seed#[5612910F7A42394A]) [n:127.0.0.1:60506_solr    ] o.a.s.m.r.SolrJmxReporter JMX monitoring for 'solr_60506.solr.node' (registry 'solr.node') enabled at server: com.sun.jmx.mbeanserver.JmxMBeanServer@4f9b4b52
   [junit4]   2> 1809427 INFO  (TEST-TriggerIntegrationTest.testEventFromRestoredState-seed#[5612910F7A42394A]) [n:127.0.0.1:60506_solr    ] o.a.s.m.r.SolrJmxReporter JMX monitoring for 'solr_60506.solr.jvm' (registry 'solr.jvm') enabled at server: com.sun.jmx.mbeanserver.JmxMBeanServer@4f9b4b52
   [junit4]   2> 1809427 INFO  (TEST-TriggerIntegrationTest.testEventFromRestoredState-seed#[5612910F7A42394A]) [n:127.0.0.1:60506_solr    ] o.a.s.m.r.SolrJmxReporter JMX monitoring for 'solr_60506.solr.jetty' (registry 'solr.jetty') enabled at server: com.sun.jmx.mbeanserver.JmxMBeanServer@4f9b4b52
   [junit4]   2> 1809448 INFO  (TEST-TriggerIntegrationTest.testEventFromRestoredState-seed#[5612910F7A42394A]) [n:127.0.0.1:60506_solr    ] o.a.s.c.CorePropertiesLocator Found 0 core definitions underneath /x1/jenkins/jenkins-slave/workspace/Lucene-Solr-Tests-master/solr/build/solr-core/test/J2/temp/solr.cloud.autoscaling.TriggerIntegrationTest_5612910F7A42394A-001/tempDir-001/node3/.
   [junit4]   2> 1810122 DEBUG (ScheduledTrigger-1787-thread-3) [n:127.0.0.1:59440_solr    ] o.a.s.c.a.NodeAddedTrigger Running NodeAddedTrigger node_added_trigger
   [junit4]   2> 1810123 DEBUG (ScheduledTrigger-1787-thread-3) [n:127.0.0.1:59440_solr    ] o.a.s.c.a.NodeAddedTrigger Found livenodes: [127.0.0.1:51836_solr, 127.0.0.1:59440_solr, 127.0.0.1:60506_solr]
   [junit4]   2> 1811130 DEBUG (ScheduledTrigger-1787-thread-3) [n:127.0.0.1:59440_solr    ] o.a.s.c.a.NodeAddedTrigger Running NodeAddedTrigger node_added_trigger
   [junit4]   2> 1811131 DEBUG (ScheduledTrigger-1787-thread-3) [n:127.0.0.1:59440_solr    ] o.a.s.c.a.NodeAddedTrigger Found livenodes: [127.0.0.1:51836_solr, 127.0.0.1:59440_solr, 127.0.0.1:60506_solr]
   [junit4]   2> 1812203 DEBUG (ScheduledTrigger-1787-thread-3) [n:127.0.0.1:59440_solr    ] o.a.s.c.a.NodeAddedTrigger Running NodeAddedTrigger node_added_trigger
   [junit4]   2> 1812203 DEBUG (ScheduledTrigger-1787-thread-3) [n:127.0.0.1:59440_solr    ] o.a.s.c.a.NodeAddedTrigger Found livenodes: [127.0.0.1:51836_solr, 127.0.0.1:59440_solr, 127.0.0.1:60506_solr]
   [junit4]   2> 1813372 DEBUG (ScheduledTrigger-1787-thread-3) [n:127.0.0.1:59440_solr    ] o.a.s.c.a.NodeAddedTrigger Running NodeAddedTrigger node_added_trigger
   [junit4]   2> 1813372 DEBUG (ScheduledTrigger-1787-thread-3) [n:127.0.0.1:59440_solr    ] o.a.s.c.a.NodeAddedTrigger Found livenodes: [127.0.0.1:51836_solr, 127.0.0.1:59440_solr, 127.0.0.1:60506_solr]
   [junit4]   2> 1814378 DEBUG (ScheduledTrigger-1787-thread-3) [n:127.0.0.1:59440_solr    ] o.a.s.c.a.NodeAddedTrigger Running NodeAddedTrigger node_added_trigger
   [junit4]   2> 1814379 DEBUG (ScheduledTrigger-1787-thread-3) [n:127.0.0.1:59440_solr    ] o.a.s.c.a.NodeAddedTrigger Found livenodes: [127.0.0.1:51836_solr, 127.0.0.1:59440_solr, 127.0.0.1:60506_solr]
   [junit4]   2> 1815649 DEBUG (ScheduledTrigger-1787-thread-3) [n:127.0.0.1:59440_solr    ] o.a.s.c.a.NodeAddedTrigger Running NodeAddedTrigger node_added_trigger
   [junit4]   2> 1815649 DEBUG (ScheduledTrigger-1787-thread-3) [n:127.0.0.1:59440_solr    ] o.a.s.c.a.NodeAddedTrigger Found livenodes: [127.0.0.1:51836_solr, 127.0.0.1:59440_solr, 127.0.0.1:60506_solr]
   [junit4]   2> 1816658 DEBUG (ScheduledTrigger-1787-thread-3) [n:127.0.0.1:59440_solr    ] o.a.s.c.a.NodeAddedTrigger Running NodeAddedTrigger node_added_trigger
   [junit4]   2> 1816659 DEBUG (ScheduledTrigger-1787-thread-3) [n:127.0.0.1:59440_solr    ] o.a.s.c.a.NodeAddedTrigger Found livenodes: [127.0.0.1:51836_solr, 127.0.0.1:59440_solr, 127.0.0.1:60506_solr]
   [junit4]   2> 1817666 DEBUG (ScheduledTrigger-1787-thread-3) [n:127.0.0.1:59440_solr    ] o.a.s.c.a.NodeAddedTrigger Running NodeAddedTrigger node_added_trigger
   [junit4]   2> 1817667 DEBUG (ScheduledTrigger-1787-thread-3) [n:127.0.0.1:59440_solr    ] o.a.s.c.a.NodeAddedTrigger Found livenodes: [127.0.0.1:51836_solr, 127.0.0.1:59440_solr, 127.0.0.1:60506_solr]
   [junit4]   2> 1818671 DEBUG (ScheduledTrigger-1787-thread-3) [n:127.0.0.1:59440_solr    ] o.a.s.c.a.NodeAddedTrigger Running NodeAddedTrigger node_added_trigger
   [junit4]   2> 1818671 DEBUG (ScheduledTrigger-1787-thread-3) [n:127.0.0.1:59440_solr    ] o.a.s.c.a.NodeAddedTrigger Found livenodes: [127.0.0.1:51836_solr, 127.0.0.1:59440_solr, 127.0.0.1:60506_solr]
   [junit4]   2> 1819673 DEBUG (ScheduledTrigger-1787-thread-3) [n:127.0.0.1:59440_solr    ] o.a.s.c.a.NodeAddedTrigger Running NodeAddedTrigger node_added_trigger
   [junit4]   2> 1819673 DEBUG (ScheduledTrigger-1787-thread-3) [n:127.0.0.1:59440_solr    ] o.a.s.c.a.NodeAddedTrigger Found livenodes: [127.0.0.1:51836_solr, 127.0.0.1:59440_solr, 127.0.0.1:60506_solr]
   [junit4]   2> 1819674 DEBUG (ScheduledTrigger-1787-thread-3) [n:127.0.0.1:59440_solr    ] o.a.s.c.a.NodeAddedTrigger NodeAddedTrigger node_added_trigger firing registered processor for nodes: [127.0.0.1:60506_solr] added at times [1507701700568000000]
   [junit4]   2> 1820940 INFO  (ScheduledTrigger-1787-thread-3) [n:127.0.0.1:59440_solr    ] o.a.s.c.c.ZkStateReader Updated live nodes from ZooKeeper... (0) -> (3)
   [junit4]   2> 1820941 INFO  (ScheduledTrigger-1787-thread-3) [n:127.0.0.1:59440_solr    ] o.a.s.c.s.i.ZkClientClusterStateProvider Cluster at 127.0.0.1:46826/solr ready
   [junit4]   2> 1820959 INFO  (ScheduledTrigger-1787-thread-3) [n:127.0.0.1:59440_solr    ] o.a.s.c.a.SystemLogListener Collection .system does not exist, disabling logging.
   [junit4]   2> 1820988 DEBUG (AutoscalingActionExecutor-1788-thread-1-processing-n:127.0.0.1:59440_solr) [n:127.0.0.1:59440_solr    ] o.a.s.c.a.ScheduledTriggers -- processing actions for NodeAddedEvent{id='14ec6eb5619ba600Td5p33ddsu9iq1h6gxaxj98k8b', source='node_added_trigger', eventTime=1507701700568000000, properties={eventTimes=[1507701700568000000], _enqueue_time_=1507701711128000000, nodeNames=[127.0.0.1:60506_solr]}}
   [junit4]   2> 1820990 INFO  (TEST-TriggerIntegrationTest.testEventFromRestoredState-seed#[5612910F7A42394A]) [    ] o.e.j.s.Server jetty-9.3.20.v20170531
   [junit4]   2> 1821035 INFO  (TEST-TriggerIntegrationTest.testEventFromRestoredState-seed#[5612910F7A42394A]) [    ] o.e.j.s.h.ContextHandler Started o.e.j.s.ServletContextHandler@418e61fe{/solr,null,AVAILABLE}
   [junit4]   2> 1821035 INFO  (TEST-TriggerIntegrationTest.testEventFromRestoredState-seed#[5612910F7A42394A]) [    ] o.e.j.s.AbstractConnector Started ServerConnector@6627e311{HTTP/1.1,[http/1.1]}{127.0.0.1:47242}
   [junit4]   2> 1821035 INFO  (TEST-TriggerIntegrationTest.testEventFromRestoredState-seed#[5612910F7A42394A]) [    ] o.e.j.s.Server Started @1839057ms
   [junit4]   2> 1821035 INFO  (TEST-TriggerIntegrationTest.testEventFromRestoredState-seed#[5612910F7A42394A]) [    ] o.a.s.c.s.e.JettySolrRunner Jetty properties: {hostContext=/solr, hostPort=47242}
   [junit4]   2> 1821036 ERROR (TEST-TriggerIntegrationTest.testEventFromRestoredState-seed#[5612910F7A42394A]) [    ] o.a.s.u.StartupLoggingUtils Missing Java Option solr.log.dir. Logging may be missing or incomplete.
   [junit4]   2> 1821036 INFO  (TEST-TriggerIntegrationTest.testEventFromRestoredState-seed#[5612910F7A42394A]) [    ] o.a.s.s.SolrDispatchFilter  ___      _       Welcome to Apache Solr? version 8.0.0
   [junit4]   2> 1821036 INFO  (TEST-TriggerIntegrationTest.testEventFromRestoredState-seed#[5612910F7A42394A]) [    ] o.a.s.s.SolrDispatchFilter / __| ___| |_ _   Starting in cloud mode on port null
   [junit4]   2> 1821036 INFO  (TEST-TriggerIntegrationTest.testEventFromRestoredState-seed#[5612910F7A42394A]) [    ] o.a.s.s.SolrDispatchFilter \__ \/ _ \ | '_|  Install dir: null, Default config dir: null
   [junit4]   2> 1821036 INFO  (TEST-TriggerIntegrationTest.testEventFromRestoredState-seed#[5612910F7A42394A]) [    ] o.a.s.s.SolrDispatchFilter |___/\___/_|_|    Start time: 2017-10-11T06:01:52.490Z
   [junit4]   2> 1821223 INFO  (TEST-TriggerIntegrationTest.testEventFromRestoredState-seed#[5612910F7A42394A]) [    ] o.a.s.s.SolrDispatchFilter solr.xml found in ZooKeeper. Loading...
   [junit4]   2> 1822655 DEBUG (ScheduledTrigger-1787-thread-3) [n:127.0.0.1:59440_solr    ] o.a.s.c.a.NodeAddedTrigger Running NodeAddedTrigger node_added_trigger
   [junit4]   2> 1822655 DEBUG (ScheduledTrigger-1787-thread-3) [n:127.0.0.1:59440_solr    ] o.a.s.c.a.NodeAddedTrigger Found livenodes: [127.0.0.1:51836_solr, 127.0.0.1:59440_solr, 127.0.0.1:60506_solr]
   [junit4]   2> 1823739 DEBUG (ScheduledTrigger-1787-thread-3) [n:127.0.0.1:59440_solr    ] o.a.s.c.a.NodeAddedTrigger Running NodeAddedTrigger node_added_trigger
   [junit4]   2> 1823739 DEBUG (ScheduledTrigger-1787-thread-3) [n:127.0.0.1:59440_solr    ] o.a.s.c.a.NodeAddedTrigger Found livenodes: [127.0.0.1:51836_solr, 127.0.0.1:59440_solr, 127.0.0.1:60506_solr]
   [junit4]   2> 1823805 INFO  (TEST-TriggerIntegrationTest.testEventFromRestoredState-seed#[5612910F7A42394A]) [    ] o.a.s.c.ZkContainer Zookeeper client=127.0.0.1:46826/solr
   [junit4]   2> 1824035 INFO  (TEST-TriggerIntegrationTest.testEventFromRestoredState-seed#[5612910F7A42394A]) [n:127.0.0.1:47242_solr    ] o.a.s.c.c.ZkStateReader Updated live nodes from ZooKeeper... (0) -> (3)
   [junit4]   2> 1824039 INFO  (TEST-TriggerIntegrationTest.testEventFromRestoredState-seed#[5612910F7A42394A]) [n:127.0.0.1:47242_solr    ] o.a.s.c.Overseer Overseer (id=null) closing
   [junit4]   2> 1824064 INFO  (TEST-TriggerIntegrationTest.testEventFromRestoredState-seed#[5612910F7A42394A]) [n:127.0.0.1:47242_solr    ] o.a.s.c.ZkController Register node as live in ZooKeeper:/live_nodes/127.0.0.1:47242_solr
   [junit4]   2> 1824065 INFO  (zkCallback-604-thread-1) [    ] o.a.s.c.c.ZkStateReader Updated live nodes from ZooKeeper... (3) -> (4)
   [junit4]   2> 1824065 INFO  (zkCallback-612-thread-1-processing-n:127.0.0.1:60506_solr) [n:127.0.0.1:60506_solr    ] o.a.s.c.c.ZkStateReader Updated live nodes from ZooKeeper... (3) -> (4)
   [junit4]   2> 1824065 INFO  (zkCallback-598-thread-1-processing-n:127.0.0.1:59440_solr) [n:127.0.0.1:59440_solr    ] o.a.s.c.c.ZkStateReader Updated live nodes from ZooKeeper... (3) -> (4)
   [junit4]   2> 1824065 INFO  (zkCallback-597-thread-1-processing-n:127.0.0.1:51836_solr) [n:127.0.0.1:51836_solr    ] o.a.s.c.c.ZkStateReader Updated live nodes from ZooKeeper... (3) -> (4)
   [junit4]   2> 1824447 INFO  (zkCallback-622-thread-1-processing-n:127.0.0.1:47242_solr) [n:127.0.0.1:47242_solr    ] o.a.s.c.c.ZkStateReader Updated live nodes from ZooKeeper... (3) -> (4)
   [junit4]   2> 1824822 DEBUG (ScheduledTrigger-1787-thread-3) [n:127.0.0.1:59440_solr    ] o.a.s.c.a.NodeAddedTrigger Running NodeAddedTrigger node_added_trigger
   [junit4]   2> 1824822 DEBUG (ScheduledTrigger-1787-thread-3) [n:127.0.0.1:59440_solr    ] o.a.s.c.a.NodeAddedTrigger Found livenodes: [127.0.0.1:47242_solr, 127.0.0.1:51836_solr, 127.0.0.1:59440_solr, 127.0.0.1:60506_solr]
   [junit4]   2> 1824823 DEBUG (ScheduledTrigger-1787-thread-3) [n:127.0.0.1:59440_solr    ] o.a.s.c.a.NodeAddedTrigger Tracking new node: 127.0.0.1:47242_solr at time 1507701716277000000
   [junit4]   2> 1825855 DEBUG (ScheduledTrigger-1787-thread-3) [n:127.0.0.1:59440_solr    ] o.a.s.c.a.NodeAddedTrigger Running NodeAddedTrigger node_added_trigger
   [junit4]   2> 1825855 DEBUG (ScheduledTrigger-1787-thread-3) [n:127.0.0.1:59440_solr    ] o.a.s.c.a.NodeAddedTrigger Found livenodes: [127.0.0.1:47242_solr, 127.0.0.1:51836_solr, 127.0.0.1:59440_solr, 127.0.0.1:60506_solr]
   [junit4]   2> 1826900 INFO  (TEST-TriggerIntegrationTest.testEventFromRestoredState-seed#[5612910F7A42394A]) [n:127.0.0.1:47242_solr    ] o.a.s.m.r.SolrJmxReporter JMX monitoring for 'solr_47242.solr.node' (registry 'solr.node') enabled at server: com.sun.jmx.mbeanserver.JmxMBeanServer@4f9b4b52
   [junit4]   2> 1826977 INFO  (TEST-TriggerIntegrationTest.testEventFromRestoredState-seed#[5612910F7A42394A]) [n:127.0.0.1:47242_solr    ] o.a.s.m.r.SolrJmxReporter JMX monitoring for 'solr_47242.solr.jvm' (registry 'solr.jvm') enabled at server: com.sun.jmx.mbeanserver.JmxMBeanServer@4f9b4b52
   [junit4]   2> 1826977 INFO  (TEST-TriggerIntegrationTest.testEventFromRestoredState-seed#[5612910F7A42394A]) [n:127.0.0.1:47242_solr    ] o.a.s.m.r.SolrJmxReporter JMX monitoring for 'solr_47242.solr.jetty' (registry 'solr.jetty') enabled at server: com.sun.jmx.mbeanserver.JmxMBeanServer@4f9b4b52
   [junit4]   2> 1826978 INFO  (TEST-TriggerIntegrationTest.testEventFromRestoredState-seed#[5612910F7A42394A]) [n:127.0.0.1:47242_solr    ] o.a.s.c.CorePropertiesLocator Found 0 core definitions underneath /x1/jenkins/jenkins-slave/workspace/Lucene-Solr-Tests-master/solr/build/solr-core/test/J2/temp/solr.cloud.autoscaling.TriggerIntegrationTest_5612910F7A42394A-001/tempDir-001/node4/.
   [junit4]   2> 1827471 DEBUG (ScheduledTrigger-1787-thread-3) [n:127.0.0.1:59440_solr    ] o.a.s.c.a.NodeAddedTrigger Running NodeAddedTrigger node_added_trigger
   [junit4]   2> 1827471 DEBUG (ScheduledTrigger-1787-thread-3) [n:127.0.0.1:59440_solr    ] o.a.s.c.a.NodeAddedTrigger Found livenodes: [127.0.0.1:47242_solr, 127.0.0.1:51836_solr, 127.0.0.1:59440_solr, 127.0.0.1:60506_solr]
   [junit4]   2> 1828473 DEBUG (ScheduledTrigger-1787-thread-3) [n:127.0.0.1:59440_solr    ] o.a.s.c.a.NodeAddedTrigger Running NodeAddedTrigger node_added_trigger
   [junit4]   2> 1828474 DEBUG (ScheduledTrigger-1787-thread-3) [n:127.0.0.1:59440_solr    ] o.a.s.c.a.NodeAddedTrigger Found livenodes: [127.0.0.1:47242_solr, 127.0.0.1:51836_solr, 127.0.0.1:59440_solr, 127.0.0.1:60506_solr]
   [junit4]   2> 1829474 DEBUG (ScheduledTrigger-1787-thread-3) [n:127.0.0.1:59440_solr    ] o.a.s.c.a.NodeAddedTrigger Running NodeAddedTrigger node_added_trigger
   [junit4]   2> 1829474 DEBUG (ScheduledTrigger-1787-thread-3) [n:127.0.0.1:59440_solr    ] o.a.s.c.a.NodeAddedTrigger Found livenodes: [127.0.0.1:47242_solr, 127.0.0.1:51836_solr, 127.0.0.1:59440_solr, 127.0.0.1:60506_solr]
   [junit4]   2> 1830474 DEBUG (ScheduledTrigger-1787-thread-3) [n:127.0.0.1:59440_solr    ] o.a.s.c.a.NodeAddedTrigger Running NodeAddedTrigger node_added_trigger
   [junit4]   2> 1830474 DEBUG (ScheduledTrigger-1787-thread-3) [n:127.0.0.1:59440_solr    ] o.a.s.c.a.NodeAddedTrigger Found livenodes: [127.0.0.1:47242_solr, 127.0.0.1:51836_solr, 127.0.0.1:59440_solr, 127.0.0.1:60506_solr]
   [junit4]   2> 1831474 DEBUG (ScheduledTrigger-1787-thread-3) [n:127.0.0.1:59440_solr    ] o.a.s.c.a.NodeAddedTrigger Running NodeAddedTrigger node_added_trigger
   [junit4]   2> 1831475 DEBUG (ScheduledTrigger-1787-thread-3) [n:127.0.0.1:59440_solr    ] o.a.s.c.a.NodeAddedTrigger Found livenodes: [127.0.0.1:47242_solr, 127.0.0.1:51836_solr, 127.0.0.1:59440_solr, 127.0.0.1:60506_solr]
   [junit4]   2> 1832482 DEBUG (ScheduledTrigger-1787-thread-3) [n:127.0.0.1:59440_solr    ] o.a.s.c.a.NodeAddedTrigger Running NodeAddedTrigger node_added_trigger
   [junit4]   2> 1832482 DEBUG (ScheduledTrigger-1787-thread-3) [n:127.0.0.1:59440_solr    ] o.a.s.c.a.NodeAddedTrigger Found livenodes: [127.0.0.1:47242_solr, 127.0.0.1:51836_solr, 127.0.0.1:59440_solr, 127.0.0.1:60506_solr]
   [junit4]   2> 1833484 DEBUG (ScheduledTrigger-1787-thread-3) [n:127.0.0.1:59440_solr    ] o.a.s.c.a.NodeAddedTrigger Running NodeAddedTrigger node_added_trigger
   [junit4]   2> 1833484 DEBUG (ScheduledTrigger-1787-thread-3) [n:127.0.0.1:59440_solr    ] o.a.s.c.a.NodeAddedTrigger Found livenodes: [127.0.0.1:47242_solr, 127.0.0.1:51836_solr, 127.0.0.1:59440_solr, 127.0.0.1:60506_solr]
   [junit4]   2> 1834487 DEBUG (ScheduledTrigger-1787-thread-3) [n:127.0.0.1:59440_solr    ] o.a.s.c.a.NodeAddedTrigger Running NodeAddedTrigger node_added_trigger
   [junit4]   2> 1834487 DEBUG (ScheduledTrigger-1787-thread-3) [n:127.0.0.1:59440_solr    ] o.a.s.c.a.NodeAddedTrigger Found livenodes: [127.0.0.1:47242_solr, 127.0.0.1:51836_solr, 127.0.0.1:59440_solr, 127.0.0.1:60506_solr]
   [junit4]   2> 1835487 DEBUG (ScheduledTrigger-1787-thread-3) [n:127.0.0.1:59440_solr    ] o.a.s.c.a.NodeAddedTrigger Running NodeAddedTrigger node_added_trigger
   [junit4]   2> 1835487 DEBUG (ScheduledTrigger-1787-thread-3) [n:127.0.0.1:59440_solr    ] o.a.s.c.a.NodeAddedTrigger Found livenodes: [127.0.0.1:47242_solr, 127.0.0.1:51836_solr, 127.0.0.1:59440_solr, 127.0.0.1:60506_solr]
   [junit4]   2> 1835487 DEBUG (ScheduledTrigger-1787-thread-3) [n:127.0.0.1:59440_solr    ] o.a.s.c.a.NodeAddedTrigger NodeAddedTrigger node_added_trigger firing registered processor for nodes: [127.0.0.1:47242_solr] added at times [1507701716277000000]
   [junit4]   2> 1835495 DEBUG (AutoscalingActionExecutor-1788-thread-1-processing-n:127.0.0.1:59440_solr) [n:127.0.0.1:59440_solr    ] o.a.s.c.a.ScheduledTriggers -- processing actions for NodeAddedEvent{id='14ec6eb909eff740Td5p33ddsu9iq1h6gxaxj98k8d', source='node_added_trigger', eventTime=1507701716277000000, properties={eventTimes=[1507701716277000000], _enqueue_time_=1507701726941000000, nodeNames=[127.0.0.1:47242_solr]}}
   [junit4]   2> 1835495 INFO  (AutoscalingActionExecutor-1788-thread-1-processing-n:127.0.0.1:59440_solr) [n:127.0.0.1:59440_solr    ] o.a.s.c.ActionThrottle The last action attempt started 14506ms ago.
   [junit4]   2> 1836563 DEBUG (ScheduledTrigger-1787-thread-3) [n:127.0.0.1:59440_solr    ] o.a.s.c.a.NodeAddedTrigger Running NodeAddedTrigger node_added_trigger
   [junit4]   2> 1836563 DEBUG (ScheduledTrigger-1787-thread-3) [n:127.0.0.1:59440_solr    ] o.a.s.c.a.NodeAddedTrigger Found livenodes: [127.0.0.1:47242_solr, 127.0.0.1:51836_solr, 127.0.0.1:59440_solr, 127.0.0.1:60506_solr]
   [junit4]   2> 1837474 INFO  (TEST-TriggerIntegrationTest.testEventFromRestoredState-seed#[5612910F7A42394A]) [    ] o.e.j.s.AbstractConnector Stopped ServerConnector@31df004f{HTTP/1.1,[http/1.1]}{127.0.0.1:0}
   [junit4]   2> 1837527 INFO  (TEST-TriggerIntegrationTest.testEventFromRestoredState-seed#[5612910F7A42394A]) [    ] o.a.s.c.CoreContainer Shutting down CoreContainer instance=1653307411
   [junit4]   2> 1837527 INFO  (TEST-TriggerIntegrationTest.testEventFromRestoredState-seed#[5612910F7A42394A]) [    ] o.a.s.m.SolrMetricManager Closing metric reporters for registry=solr.node, tag=null
   [junit4]   2> 1837528 INFO  (TEST-TriggerIntegrationTest.testEventFromRestoredState-seed#[5612910F7A42394A]) [    ] o.a.s.m.r.SolrJmxReporter Closing reporter [org.apache.solr.metrics.reporters.SolrJmxReporter@14769a33: rootName = solr_59440, domain = solr.node, service url = null, agent id = null] for registry solr.node / com.codahale.metrics.MetricRegistry@44b88dc4
   [junit4]   2> 1837533 INFO  (TEST-TriggerIntegrationTest.testEventFromRestoredState-seed#[5612910F7A42394A]) [    ] o.a.s.m.SolrMetricManager Closing metric reporters for registry=solr.jvm, tag=null
   [junit4]   2> 1837533 INFO  (TEST-TriggerIntegrationTest.testEventFromRestoredState-seed#[5612910F7A42394A]) [    ] o.a.s.m.r.SolrJmxReporter Closing reporter [org.apache.solr.metrics.reporters.SolrJmxReporter@7d8c5a74: rootName = solr_59440, domain = solr.jvm, service url = null, agent id = null] for registry solr.jvm / com.codahale.metrics.MetricRegistry@21dd76d3
   [junit4]   2> 1837557 INFO  (TEST-TriggerIntegrationTest.testEventFromRestoredState-seed#[5612910F7A42394A]) [    ] o.a.s.m.SolrMetricManager Closing metric reporters for registry=solr.jetty, tag=null
   [junit4]   2> 1837558 INFO  (TEST-TriggerIntegrationTest.testEventFromRestoredState-seed#[5612910F7A42394A]) [    ] o.a.s.m.r.SolrJmxReporter Closing reporter [org.apache.solr.metrics.reporters.SolrJmxReporter@5fdc0255: rootName = solr_59440, domain = solr.jetty, service url = null, agent id = null] for registry solr.jetty / com.codahale.metrics.MetricRegistry@7cd011a6
   [junit4]   2> 1837601 INFO  (TEST-TriggerIntegrationTest.testEventFromRestoredState-seed#[5612910F7A42394A]) [    ] o.a.s.m.SolrMetricManager Closing metric reporters for registry=solr.cluster, tag=null
   [junit4]   2> 1837794 DEBUG (ScheduledTrigger-1787-thread-3) [n:127.0.0.1:59440_solr    ] o.a.s.c.a.NodeAddedTrigger Running NodeAddedTrigger node_added_trigger
   [junit4]   2> 1837794 DEBUG (ScheduledTrigger-1787-thread-3) [n:127.0.0.1:59440_solr    ] o.a.s.c.a.NodeAddedTrigger Found livenodes: [127.0.0.1:47242_solr, 127.0.0.1:51836_solr, 127.0.0.1:59440_solr, 127.0.0.1:60506_solr]
   [junit4]   2> 1837797 INFO  (TEST-TriggerIntegrationTest.testEventFromRestoredState-seed#[5612910F7A42394A]) [    ] o.a.s.c.TransientSolrCoreCacheDefault Allocating transient cache for 2147483647 transient cores
   [junit4]   2> 1837797 INFO  (TEST-TriggerIntegrationTest.testEventFromRestoredState-seed#[5612910F7A42394A]) [    ] o.a.s.c.Overseer Overseer (id=98808737975828486-127.0.0.1:59440_solr-n_0000000000) closing
   [junit4]   2> 1837797 INFO  (OverseerStateUpdate-98808737975828486-127.0.0.1:59440_solr-n_0000000000) [n:127.0.0.1:59440_solr    ] o.a.s.c.Overseer Overseer Loop exiting : 127.0.0.1:59440_solr
   [junit4]   2> 1837920 DEBUG (TEST-TriggerIntegrationTest.testEventFromRestoredState-seed#[5612910F7A42394A]) [    ] o.a.s.c.a.OverseerTriggerThread OverseerTriggerThread has been closed explicitly
   [junit4]   2> 1837922 WARN  (OverseerAutoScalingTriggerThread-98808737975828486-127.0.0.1:59440_solr-n_0000000000) [n:127.0.0.1:59440_solr    ] o.a.s.c.a.OverseerTriggerThread OverseerTriggerThread woken up but we are closed, exiting.
   [junit4]   2> 1837948 INFO  (zkCallback-622-thread-1-processing-n:127.0.0.1:47242_solr) [n:127.0.0.1:47242_solr    ] o.a.s.c.c.ZkStateReader Updated live nodes from ZooKeeper... (4) -> (3)
   [junit4]   2> 1837948 INFO  (zkCallback-597-thread-1-processing-n:127.0.0.1:51836_solr) [n:127.0.0.1:51836_solr    ] o.a.s.c.OverseerElectionContext I am going to be the leader 127.0.0.1:51836_solr
   [junit4]   2> 1837948 INFO  (zkCallback-604-thread-1) [    ] o.a.s.c.c.ZkStateReader Updated live nodes from ZooKeeper... (4) -> (3)
   [junit4]   2> 1837949 INFO  (zkCallback-597-thread-1-processing-n:127.0.0.1:51836_solr) [n:127.0.0.1:51836_solr    ] o.a.s.c.Overseer Overseer (id=98808737975828485-127.0.0.1:51836_solr-n_0000000001) starting
   [junit4]   2> 1837951 INFO  (zkCallback-597-thread-2-processing-n:127.0.0.1:51836_solr) [n:127.0.0.1:51836_solr    ] o.a.s.c.c.ZkStateReader Updated live nodes from ZooKeeper... (4) -> (3)
   [junit4]   2> 1837996 DEBUG (OverseerAutoScalingTriggerThread-98808737975828485-127.0.0.1:51836_solr-n_0000000001) [n:127.0.0.1:51836_solr    ] o.a.s.c.a.OverseerTriggerThread Adding .autoAddReplicas trigger
   [junit4]   2> 1837997 DEBUG (OverseerAutoScalingTriggerThread-98808737975828485-127.0.0.1:51836_solr-n_0000000001) [n:127.0.0.1:51836_solr    ] o.a.s.c.a.OverseerTriggerThread Refreshing /autoscaling.json with znode version 4
   [junit4]   2> 1837997 DEBUG (OverseerAutoScalingTriggerThread-98808737975828485-127.0.0.1:51836_solr-n_0000000001) [n:127.0.0.1:51836_solr    ] o.a.s.c.a.NodeAddedTrigger Initial livenodes: [127.0.0.1:51836_solr, 127.0.0.1:60506_solr, 127.0.0.1:47242_solr]
   [junit4]   2> 1837997 DEBUG (OverseerAutoScalingTriggerThread-98808737975828485-127.0.0.1:51836_solr-n_0000000001) [n:127.0.0.1:51836_solr    ] o.a.s.c.a.NodeAddedTrigger NodeAddedTrigger node_added_trigger instantiated with properties: {event=nodeAdded, waitFor=10, actions=[{name=test, class=org.apache.solr.cloud.autoscaling.TriggerIntegrationTest$TestTriggerAction}], enabled=true}
   [junit4]   2> 1837998 DEBUG (OverseerAutoScalingTriggerThread-98808737975828485-127.0.0.1:51836_solr-n_0000000001) [n:127.0.0.1:51836_solr    ] o.a.s.c.a.NodeLostTrigger Initial livenodes: [127.0.0.1:51836_solr, 127.0.0.1:60506_solr, 127.0.0.1:47242_solr]
   [junit4]   2> 1837998 DEBUG (OverseerAutoScalingTriggerThread-98808737975828485-127.0.0.1:51836_solr-n_0000000001) [n:127.0.0.1:51836_solr    ] o.a.s.c.a.OverseerTriggerThread Current znodeVersion 4, lastZnodeVersion -1
   [junit4]   2> 1837998 DEBUG (OverseerAutoScalingTriggerThread-98808737975828485-127.0.0.1:51836_solr-n_0000000001) [n:127.0.0.1:51836_solr    ] o.a.s.c.a.OverseerTriggerThread Processed trigger updates upto znodeVersion 4
   [junit4]   2> 1838015 INFO  (OverseerAutoScalingTriggerThread-98808737975828485-127.0.0.1:51836_solr-n_0000000001) [n:127.0.0.1:51836_solr    ] o.a.s.c.a.TriggerIntegrationTest TestTriggerAction init
   [junit4]   2> 1838016 DEBUG (ScheduledTrigger-1808-thread-1) [n:127.0.0.1:51836_solr    ] o.a.s.c.a.NodeLostTrigger Running NodeLostTrigger: .auto_add_replicas with currently live nodes: [127.0.0.1:51836_solr, 127.0.0.1:60506_solr, 127.0.0.1:47242_solr]
   [junit4]   2> 1838018 DEBUG (OverseerAutoScalingTriggerThread-98808737975828485-127.0.0.1:51836_solr-n_0000000001) [n:127.0.0.1:51836_solr    ] o.a.s.c.a.OverseerTriggerThread Current znodeVersion 4, lastZnodeVersion 4
   [junit4]   2> 1838019 DEBUG (ScheduledTrigger-1808-thread-2) [n:127.0.0.1:51836_solr    ] o.a.s.c.a.NodeAddedTrigger Running NodeAddedTrigger node_added_trigger
   [junit4]   2> 1838019 DEBUG (ScheduledTrigger-1808-thread-2) [n:127.0.0.1:51836_solr    ] o.a.s.c.a.NodeAddedTrigger Found livenodes: [127.0.0.1:51836_solr, 127.0.0.1:60506_solr, 127.0.0.1:47242_solr]
   [junit4]   2> 1838375 INFO  (zkCallback-612-thread-1-processing-n:127.0.0.1:60506_solr) [n:127.0.0.1:60506_solr    ] o.a.s.c.c.ZkStateReader Updated live nodes from ZooKeeper... (4) -> (3)
   [junit4]   2> 1839039 DEBUG (ScheduledTrigger-1808-thread-1) [n:127.0.0.1:51836_solr    ] o.a.s.c.a.NodeLostTrigger Running NodeLostTrigger: .auto_add_replicas with currently live nodes: [127.0.0.1:51836_solr, 127.0.0.1:60506_solr, 127.0.0.1:47242_solr]
   [junit4]   2> 1839039 DEBUG (ScheduledTrigger-1808-thread-1) [n:127.0.0.1:51836_solr    ] o.a.s.c.a.NodeAddedTrigger Running NodeAddedTrigger node_added_trigger
   [junit4]   2> 1839039 DEBUG (ScheduledTrigger-1808-thread-1) [n:127.0.0.1:51836_solr    ] o.a.s.c.a.NodeAddedTrigger Found livenodes: [127.0.0.1:51836_solr, 127.0.0.1:60506_solr, 127.0.0.1:47242_solr]
   [junit4]   2> 1839448 WARN  (zkCallback-598-thread-1-processing-n:127.0.0.1:59440_solr) [n:127.0.0.1:59440_solr    ] o.a.s.c.c.ZkStateReader ZooKeeper watch triggered, but Solr cannot talk to ZK: [KeeperErrorCode = Session expired for /live_nodes]
   [j

[...truncated too long message...]

r /live_nodes]
   [junit4]   2> 184127 WARN  (NIOServerCxn.Factory:0.0.0.0/0.0.0.0:0) [    ] o.a.z.s.NIOServerCnxn caught end of stream exception
   [junit4]   2> EndOfStreamException: Unable to read additional data from client sessionid 0x15f0a4eb662000b, likely client has closed socket
   [junit4]   2> 	at org.apache.zookeeper.server.NIOServerCnxn.doIO(NIOServerCnxn.java:239)
   [junit4]   2> 	at org.apache.zookeeper.server.NIOServerCnxnFactory.run(NIOServerCnxnFactory.java:203)
   [junit4]   2> 	at java.lang.Thread.run(Thread.java:748)
   [junit4]   2> 184128 INFO  (zkCallback-41-thread-2-processing-n:127.0.0.1:35510_solr) [n:127.0.0.1:35510_solr    ] o.a.s.c.c.ZkStateReader Updated live nodes from ZooKeeper... (3) -> (2)
   [junit4]   2> 184128 INFO  (zkCallback-41-thread-3-processing-n:127.0.0.1:35510_solr) [n:127.0.0.1:35510_solr    ] o.a.s.c.OverseerElectionContext I am going to be the leader 127.0.0.1:35510_solr
   [junit4]   2> 184135 INFO  (zkCallback-47-thread-4-processing-n:127.0.0.1:48666_solr) [n:127.0.0.1:48666_solr    ] o.a.s.c.c.ZkStateReader Updated live nodes from ZooKeeper... (3) -> (2)
   [junit4]   2> 184139 WARN  (NIOServerCxn.Factory:0.0.0.0/0.0.0.0:0) [    ] o.a.z.s.NIOServerCnxn caught end of stream exception
   [junit4]   2> EndOfStreamException: Unable to read additional data from client sessionid 0x15f0a4eb6620018, likely client has closed socket
   [junit4]   2> 	at org.apache.zookeeper.server.NIOServerCnxn.doIO(NIOServerCnxn.java:239)
   [junit4]   2> 	at org.apache.zookeeper.server.NIOServerCnxnFactory.run(NIOServerCnxnFactory.java:203)
   [junit4]   2> 	at java.lang.Thread.run(Thread.java:748)
   [junit4]   2> 184143 INFO  (jetty-closer-3-thread-1) [    ] o.e.j.s.h.ContextHandler Stopped o.e.j.s.ServletContextHandler@3a6c622a{/solr,null,UNAVAILABLE}
   [junit4]   2> 184143 INFO  (zkCallback-41-thread-1-processing-n:127.0.0.1:35510_solr) [n:127.0.0.1:35510_solr    ] o.a.s.c.c.ZkStateReader Updated live nodes from ZooKeeper... (2) -> (1)
   [junit4]   2> 184155 INFO  (jetty-closer-3-thread-2) [    ] o.a.s.m.SolrMetricManager Closing metric reporters for registry=solr.cluster, tag=null
   [junit4]   2> 184259 INFO  (coreCloseExecutor-147-thread-1) [n:127.0.0.1:35510_solr c:falsepredicate s:shard4 r:core_node8 x:falsepredicate_shard4_replica_n5] o.a.s.c.SolrCore [falsepredicate_shard4_replica_n5]  CLOSING SolrCore org.apache.solr.core.SolrCore@ebc81fa
   [junit4]   2> 184259 INFO  (coreCloseExecutor-147-thread-1) [n:127.0.0.1:35510_solr c:falsepredicate s:shard4 r:core_node8 x:falsepredicate_shard4_replica_n5] o.a.s.m.SolrMetricManager Closing metric reporters for registry=solr.core.falsepredicate.shard4.replica_n5, tag=247235066
   [junit4]   2> 184259 INFO  (coreCloseExecutor-147-thread-1) [n:127.0.0.1:35510_solr c:falsepredicate s:shard4 r:core_node8 x:falsepredicate_shard4_replica_n5] o.a.s.m.r.SolrJmxReporter Closing reporter [org.apache.solr.metrics.reporters.SolrJmxReporter@6804ef5: rootName = solr_35510, domain = solr.core.falsepredicate.shard4.replica_n5, service url = null, agent id = null] for registry solr.core.falsepredicate.shard4.replica_n5 / com.codahale.metrics.MetricRegistry@4784d0be
   [junit4]   2> 184263 INFO  (coreCloseExecutor-147-thread-2) [n:127.0.0.1:35510_solr c:currentstate s:shard1 r:core_node2 x:currentstate_shard1_replica_n1] o.a.s.c.SolrCore [currentstate_shard1_replica_n1]  CLOSING SolrCore org.apache.solr.core.SolrCore@504e7c61
   [junit4]   2> 184519 INFO  (coreCloseExecutor-147-thread-3) [n:127.0.0.1:35510_solr c:testcollection s:shard4 r:core_node8 x:testcollection_shard4_replica_n6] o.a.s.c.SolrCore [testcollection_shard4_replica_n6]  CLOSING SolrCore org.apache.solr.core.SolrCore@1e44702d
   [junit4]   2> 184545 INFO  (coreCloseExecutor-147-thread-1) [n:127.0.0.1:35510_solr c:falsepredicate s:shard4 r:core_node8 x:falsepredicate_shard4_replica_n5] o.a.s.m.SolrMetricManager Closing metric reporters for registry=solr.collection.falsepredicate.shard4.leader, tag=247235066
   [junit4]   2> 184547 INFO  (coreCloseExecutor-147-thread-2) [n:127.0.0.1:35510_solr c:currentstate s:shard1 r:core_node2 x:currentstate_shard1_replica_n1] o.a.s.m.SolrMetricManager Closing metric reporters for registry=solr.core.currentstate.shard1.replica_n1, tag=1347320929
   [junit4]   2> 184547 INFO  (coreCloseExecutor-147-thread-2) [n:127.0.0.1:35510_solr c:currentstate s:shard1 r:core_node2 x:currentstate_shard1_replica_n1] o.a.s.m.r.SolrJmxReporter Closing reporter [org.apache.solr.metrics.reporters.SolrJmxReporter@3945bbb6: rootName = solr_35510, domain = solr.core.currentstate.shard1.replica_n1, service url = null, agent id = null] for registry solr.core.currentstate.shard1.replica_n1 / com.codahale.metrics.MetricRegistry@db20391
   [junit4]   2> 184842 INFO  (coreCloseExecutor-147-thread-2) [n:127.0.0.1:35510_solr c:currentstate s:shard1 r:core_node2 x:currentstate_shard1_replica_n1] o.a.s.m.SolrMetricManager Closing metric reporters for registry=solr.collection.currentstate.shard1.leader, tag=1347320929
   [junit4]   2> 184858 INFO  (coreCloseExecutor-147-thread-3) [n:127.0.0.1:35510_solr c:testcollection s:shard4 r:core_node8 x:testcollection_shard4_replica_n6] o.a.s.m.SolrMetricManager Closing metric reporters for registry=solr.core.testcollection.shard4.replica_n6, tag=507801645
   [junit4]   2> 184859 INFO  (coreCloseExecutor-147-thread-3) [n:127.0.0.1:35510_solr c:testcollection s:shard4 r:core_node8 x:testcollection_shard4_replica_n6] o.a.s.m.r.SolrJmxReporter Closing reporter [org.apache.solr.metrics.reporters.SolrJmxReporter@1e25d134: rootName = solr_35510, domain = solr.core.testcollection.shard4.replica_n6, service url = null, agent id = null] for registry solr.core.testcollection.shard4.replica_n6 / com.codahale.metrics.MetricRegistry@67a39654
   [junit4]   2> 184893 INFO  (coreCloseExecutor-147-thread-3) [n:127.0.0.1:35510_solr c:testcollection s:shard4 r:core_node8 x:testcollection_shard4_replica_n6] o.a.s.m.SolrMetricManager Closing metric reporters for registry=solr.collection.testcollection.shard4.leader, tag=507801645
   [junit4]   2> 185643 WARN  (zkCallback-47-thread-1-processing-n:127.0.0.1:48666_solr) [n:127.0.0.1:48666_solr    ] o.a.s.c.c.ZkStateReader ZooKeeper watch triggered, but Solr cannot talk to ZK: [KeeperErrorCode = Session expired for /live_nodes]
   [junit4]   2> 186028 INFO  (jetty-closer-3-thread-3) [    ] o.e.j.s.h.ContextHandler Stopped o.e.j.s.ServletContextHandler@6e8391b3{/solr,null,UNAVAILABLE}
   [junit4]   2> 186591 WARN  (zkCallback-41-thread-3-processing-n:127.0.0.1:35510_solr) [n:127.0.0.1:35510_solr    ] o.a.s.c.c.ZkStateReader ZooKeeper watch triggered, but Solr cannot talk to ZK: [KeeperErrorCode = Session expired for /live_nodes]
   [junit4]   2> 186591 INFO  (jetty-closer-3-thread-2) [    ] o.e.j.s.h.ContextHandler Stopped o.e.j.s.ServletContextHandler@5107debf{/solr,null,UNAVAILABLE}
   [junit4]   2> 186615 ERROR (SUITE-TestCollectionStateWatchers-seed#[AD638E0B3870CED8]-worker) [    ] o.a.z.s.ZooKeeperServer ZKShutdownHandler is not registered, so ZooKeeper server won't take any action on ERROR or SHUTDOWN server state changes
   [junit4]   2> 186635 INFO  (SUITE-TestCollectionStateWatchers-seed#[AD638E0B3870CED8]-worker) [    ] o.a.s.c.ZkTestServer connecting to 127.0.0.1:48276 48276
   [junit4]   2> 186760 INFO  (Thread-1) [    ] o.a.s.c.ZkTestServer connecting to 127.0.0.1:48276 48276
   [junit4]   2> 186767 WARN  (Thread-1) [    ] o.a.s.c.ZkTestServer Watch limit violations: 
   [junit4]   2> Maximum concurrent create/delete watches above limit:
   [junit4]   2> 
   [junit4]   2> 	11	/solr/aliases.json
   [junit4]   2> 	11	/solr/clusterprops.json
   [junit4]   2> 	7	/solr/security.json
   [junit4]   2> 	6	/solr/configs/config
   [junit4]   2> 	4	/solr/collections/stateformat1/state.json
   [junit4]   2> 
   [junit4]   2> Maximum concurrent data watches above limit:
   [junit4]   2> 
   [junit4]   2> 	71	/solr/collections/falsepredicate/state.json
   [junit4]   2> 	34	/solr/collections/testcollection/state.json
   [junit4]   2> 	21	/solr/collections/waitforstate/state.json
   [junit4]   2> 	11	/solr/collections/currentstate/state.json
   [junit4]   2> 	11	/solr/clusterstate.json
   [junit4]   2> 	6	/solr/collections/delayed/state.json
   [junit4]   2> 	6	/solr/collections/tobedeleted/state.json
   [junit4]   2> 	5	/solr/collections/stateformat1/state.json
   [junit4]   2> 	2	/solr/overseer_elect/election/98809050009042956-127.0.0.1:34120_solr-n_0000000001
   [junit4]   2> 	2	/solr/overseer_elect/election/98809050009042954-127.0.0.1:44606_solr-n_0000000000
   [junit4]   2> 	2	/solr/autoscaling.json
   [junit4]   2> 
   [junit4]   2> Maximum concurrent children watches above limit:
   [junit4]   2> 
   [junit4]   2> 	11	/solr/collections
   [junit4]   2> 	8	/solr/live_nodes
   [junit4]   2> 	2	/solr/overseer/queue
   [junit4]   2> 	2	/solr/overseer/collection-queue-work
   [junit4]   2> 
   [junit4]   2> NOTE: leaving temporary files on disk at: /x1/jenkins/jenkins-slave/workspace/Lucene-Solr-Tests-master/solr/build/solr-solrj/test/J1/temp/solr.common.cloud.TestCollectionStateWatchers_AD638E0B3870CED8-001
   [junit4]   2> Oct 11, 2017 7:23:56 AM com.carrotsearch.randomizedtesting.ThreadLeakControl checkThreadLeaks
   [junit4]   2> WARNING: Will linger awaiting termination of 1 leaked thread(s).
   [junit4]   2> NOTE: test params are: codec=Asserting(Lucene70): {}, docValues:{}, maxPointsInLeafNode=647, maxMBSortInHeap=5.320522305188987, sim=RandomSimilarity(queryNorm=true): {}, locale=be, timezone=America/Argentina/La_Rioja
   [junit4]   2> NOTE: Linux 3.13.0-88-generic amd64/Oracle Corporation 1.8.0_144 (64-bit)/cpus=4,threads=1,free=171139912,total=360710144
   [junit4]   2> NOTE: All tests run in this JVM: [ArcCosineEvaluatorTest, OperationsTest, SolrDocumentTest, TestCollectionStateWatchers]
   [junit4] Completed [21/145 (1!)] on J1 in 190.82s, 9 tests, 1 failure <<< FAILURES!

[...truncated 46318 lines...]

Mime
View raw message