lucene-dev mailing list archives

Site index · List index
Message view « Date » · « Thread »
Top « Date » · « Thread »
From Policeman Jenkins Server <jenk...@thetaphi.de>
Subject [JENKINS] Lucene-Solr-master-Windows (64bit/jdk1.8.0_144) - Build # 6972 - Still Unstable!
Date Sun, 22 Oct 2017 13:04:31 GMT
Build: https://jenkins.thetaphi.de/job/Lucene-Solr-master-Windows/6972/
Java: 64bit/jdk1.8.0_144 -XX:-UseCompressedOops -XX:+UseConcMarkSweepGC

1 tests failed.
FAILED:  org.apache.solr.handler.admin.AutoscalingHistoryHandlerTest.testHistory

Error Message:
action did not execute

Stack Trace:
java.lang.AssertionError: action did not execute
	at __randomizedtesting.SeedInfo.seed([8C9762697070A327:E16BC694CA385C20]:0)
	at org.junit.Assert.fail(Assert.java:93)
	at org.junit.Assert.assertTrue(Assert.java:43)
	at org.apache.solr.handler.admin.AutoscalingHistoryHandlerTest.testHistory(AutoscalingHistoryHandlerTest.java:260)
	at sun.reflect.NativeMethodAccessorImpl.invoke0(Native Method)
	at sun.reflect.NativeMethodAccessorImpl.invoke(NativeMethodAccessorImpl.java:62)
	at sun.reflect.DelegatingMethodAccessorImpl.invoke(DelegatingMethodAccessorImpl.java:43)
	at java.lang.reflect.Method.invoke(Method.java:498)
	at com.carrotsearch.randomizedtesting.RandomizedRunner.invoke(RandomizedRunner.java:1737)
	at com.carrotsearch.randomizedtesting.RandomizedRunner$8.evaluate(RandomizedRunner.java:934)
	at com.carrotsearch.randomizedtesting.RandomizedRunner$9.evaluate(RandomizedRunner.java:970)
	at com.carrotsearch.randomizedtesting.RandomizedRunner$10.evaluate(RandomizedRunner.java:984)
	at com.carrotsearch.randomizedtesting.rules.SystemPropertiesRestoreRule$1.evaluate(SystemPropertiesRestoreRule.java:57)
	at org.apache.lucene.util.TestRuleSetupTeardownChained$1.evaluate(TestRuleSetupTeardownChained.java:49)
	at org.apache.lucene.util.AbstractBeforeAfterRule$1.evaluate(AbstractBeforeAfterRule.java:45)
	at org.apache.lucene.util.TestRuleThreadAndTestName$1.evaluate(TestRuleThreadAndTestName.java:48)
	at org.apache.lucene.util.TestRuleIgnoreAfterMaxFailures$1.evaluate(TestRuleIgnoreAfterMaxFailures.java:64)
	at org.apache.lucene.util.TestRuleMarkFailure$1.evaluate(TestRuleMarkFailure.java:47)
	at com.carrotsearch.randomizedtesting.rules.StatementAdapter.evaluate(StatementAdapter.java:36)
	at com.carrotsearch.randomizedtesting.ThreadLeakControl$StatementRunner.run(ThreadLeakControl.java:368)
	at com.carrotsearch.randomizedtesting.ThreadLeakControl.forkTimeoutingTask(ThreadLeakControl.java:817)
	at com.carrotsearch.randomizedtesting.ThreadLeakControl$3.evaluate(ThreadLeakControl.java:468)
	at com.carrotsearch.randomizedtesting.RandomizedRunner.runSingleTest(RandomizedRunner.java:943)
	at com.carrotsearch.randomizedtesting.RandomizedRunner$5.evaluate(RandomizedRunner.java:829)
	at com.carrotsearch.randomizedtesting.RandomizedRunner$6.evaluate(RandomizedRunner.java:879)
	at com.carrotsearch.randomizedtesting.RandomizedRunner$7.evaluate(RandomizedRunner.java:890)
	at com.carrotsearch.randomizedtesting.rules.StatementAdapter.evaluate(StatementAdapter.java:36)
	at com.carrotsearch.randomizedtesting.rules.SystemPropertiesRestoreRule$1.evaluate(SystemPropertiesRestoreRule.java:57)
	at org.apache.lucene.util.AbstractBeforeAfterRule$1.evaluate(AbstractBeforeAfterRule.java:45)
	at com.carrotsearch.randomizedtesting.rules.StatementAdapter.evaluate(StatementAdapter.java:36)
	at org.apache.lucene.util.TestRuleStoreClassName$1.evaluate(TestRuleStoreClassName.java:41)
	at com.carrotsearch.randomizedtesting.rules.NoShadowingOrOverridesOnMethodsRule$1.evaluate(NoShadowingOrOverridesOnMethodsRule.java:40)
	at com.carrotsearch.randomizedtesting.rules.NoShadowingOrOverridesOnMethodsRule$1.evaluate(NoShadowingOrOverridesOnMethodsRule.java:40)
	at com.carrotsearch.randomizedtesting.rules.StatementAdapter.evaluate(StatementAdapter.java:36)
	at com.carrotsearch.randomizedtesting.rules.StatementAdapter.evaluate(StatementAdapter.java:36)
	at com.carrotsearch.randomizedtesting.rules.StatementAdapter.evaluate(StatementAdapter.java:36)
	at org.apache.lucene.util.TestRuleAssertionsRequired$1.evaluate(TestRuleAssertionsRequired.java:53)
	at org.apache.lucene.util.TestRuleMarkFailure$1.evaluate(TestRuleMarkFailure.java:47)
	at org.apache.lucene.util.TestRuleIgnoreAfterMaxFailures$1.evaluate(TestRuleIgnoreAfterMaxFailures.java:64)
	at org.apache.lucene.util.TestRuleIgnoreTestSuites$1.evaluate(TestRuleIgnoreTestSuites.java:54)
	at com.carrotsearch.randomizedtesting.rules.StatementAdapter.evaluate(StatementAdapter.java:36)
	at com.carrotsearch.randomizedtesting.ThreadLeakControl$StatementRunner.run(ThreadLeakControl.java:368)
	at java.lang.Thread.run(Thread.java:748)




Build Log:
[...truncated 14018 lines...]
   [junit4] Suite: org.apache.solr.handler.admin.AutoscalingHistoryHandlerTest
   [junit4]   2> 3538454 INFO  (SUITE-AutoscalingHistoryHandlerTest-seed#[8C9762697070A327]-worker) [    ] o.a.s.SolrTestCaseJ4 SecureRandom sanity checks: test.solr.allowed.securerandom=null & java.security.egd=file:/dev/./urandom
   [junit4]   2> Creating dataDir: C:\Users\jenkins\workspace\Lucene-Solr-master-Windows\solr\build\solr-core\test\J1\temp\solr.handler.admin.AutoscalingHistoryHandlerTest_8C9762697070A327-001\init-core-data-001
   [junit4]   2> 3538455 INFO  (SUITE-AutoscalingHistoryHandlerTest-seed#[8C9762697070A327]-worker) [    ] o.a.s.SolrTestCaseJ4 Using TrieFields (NUMERIC_POINTS_SYSPROP=false) w/NUMERIC_DOCVALUES_SYSPROP=false
   [junit4]   2> 3538460 INFO  (SUITE-AutoscalingHistoryHandlerTest-seed#[8C9762697070A327]-worker) [    ] o.a.s.SolrTestCaseJ4 Randomized ssl (false) and clientAuth (false) via: @org.apache.solr.util.RandomizeSSL(reason=, value=NaN, ssl=NaN, clientAuth=NaN)
   [junit4]   2> 3538461 INFO  (SUITE-AutoscalingHistoryHandlerTest-seed#[8C9762697070A327]-worker) [    ] o.a.s.c.MiniSolrCloudCluster Starting cluster of 3 servers in C:\Users\jenkins\workspace\Lucene-Solr-master-Windows\solr\build\solr-core\test\J1\temp\solr.handler.admin.AutoscalingHistoryHandlerTest_8C9762697070A327-001\tempDir-001
   [junit4]   2> 3538461 INFO  (SUITE-AutoscalingHistoryHandlerTest-seed#[8C9762697070A327]-worker) [    ] o.a.s.c.ZkTestServer STARTING ZK TEST SERVER
   [junit4]   2> 3538463 INFO  (Thread-5066) [    ] o.a.s.c.ZkTestServer client port:0.0.0.0/0.0.0.0:0
   [junit4]   2> 3538463 INFO  (Thread-5066) [    ] o.a.s.c.ZkTestServer Starting server
   [junit4]   2> 3538467 ERROR (Thread-5066) [    ] o.a.z.s.ZooKeeperServer ZKShutdownHandler is not registered, so ZooKeeper server won't take any action on ERROR or SHUTDOWN server state changes
   [junit4]   2> 3538561 INFO  (SUITE-AutoscalingHistoryHandlerTest-seed#[8C9762697070A327]-worker) [    ] o.a.s.c.ZkTestServer start zk server on port:58033
   [junit4]   2> 3538566 WARN  (NIOServerCxn.Factory:0.0.0.0/0.0.0.0:0) [    ] o.a.z.s.NIOServerCnxn caught end of stream exception
   [junit4]   2> EndOfStreamException: Unable to read additional data from client sessionid 0x15f441145ce0000, likely client has closed socket
   [junit4]   2> 	at org.apache.zookeeper.server.NIOServerCnxn.doIO(NIOServerCnxn.java:239)
   [junit4]   2> 	at org.apache.zookeeper.server.NIOServerCnxnFactory.run(NIOServerCnxnFactory.java:203)
   [junit4]   2> 	at java.lang.Thread.run(Thread.java:748)
   [junit4]   2> 3538567 INFO  (jetty-launcher-6257-thread-1) [    ] o.e.j.s.Server jetty-9.3.20.v20170531
   [junit4]   2> 3538567 INFO  (jetty-launcher-6257-thread-2) [    ] o.e.j.s.Server jetty-9.3.20.v20170531
   [junit4]   2> 3538568 INFO  (jetty-launcher-6257-thread-1) [    ] o.e.j.s.h.ContextHandler Started o.e.j.s.ServletContextHandler@5576e12e{/solr,null,AVAILABLE}
   [junit4]   2> 3538568 INFO  (jetty-launcher-6257-thread-2) [    ] o.e.j.s.h.ContextHandler Started o.e.j.s.ServletContextHandler@113e74d{/solr,null,AVAILABLE}
   [junit4]   2> 3538568 INFO  (jetty-launcher-6257-thread-1) [    ] o.e.j.s.AbstractConnector Started ServerConnector@abc55b2{HTTP/1.1,[http/1.1]}{127.0.0.1:58038}
   [junit4]   2> 3538568 INFO  (jetty-launcher-6257-thread-1) [    ] o.e.j.s.Server Started @3548977ms
   [junit4]   2> 3538568 INFO  (jetty-launcher-6257-thread-1) [    ] o.a.s.c.s.e.JettySolrRunner Jetty properties: {hostContext=/solr, hostPort=58038}
   [junit4]   2> 3538569 ERROR (jetty-launcher-6257-thread-1) [    ] o.a.s.u.StartupLoggingUtils Missing Java Option solr.log.dir. Logging may be missing or incomplete.
   [junit4]   2> 3538569 INFO  (jetty-launcher-6257-thread-2) [    ] o.e.j.s.AbstractConnector Started ServerConnector@1de64ee9{HTTP/1.1,[http/1.1]}{127.0.0.1:58041}
   [junit4]   2> 3538569 INFO  (jetty-launcher-6257-thread-1) [    ] o.a.s.s.SolrDispatchFilter  ___      _       Welcome to Apache Solr™ version 8.0.0
   [junit4]   2> 3538569 INFO  (jetty-launcher-6257-thread-2) [    ] o.e.j.s.Server Started @3548977ms
   [junit4]   2> 3538569 INFO  (jetty-launcher-6257-thread-1) [    ] o.a.s.s.SolrDispatchFilter / __| ___| |_ _   Starting in cloud mode on port null
   [junit4]   2> 3538569 INFO  (jetty-launcher-6257-thread-2) [    ] o.a.s.c.s.e.JettySolrRunner Jetty properties: {hostContext=/solr, hostPort=58041}
   [junit4]   2> 3538569 INFO  (jetty-launcher-6257-thread-1) [    ] o.a.s.s.SolrDispatchFilter \__ \/ _ \ | '_|  Install dir: null, Default config dir: null
   [junit4]   2> 3538569 INFO  (jetty-launcher-6257-thread-1) [    ] o.a.s.s.SolrDispatchFilter |___/\___/_|_|    Start time: 2017-10-22T12:31:43.669Z
   [junit4]   2> 3538569 ERROR (jetty-launcher-6257-thread-2) [    ] o.a.s.u.StartupLoggingUtils Missing Java Option solr.log.dir. Logging may be missing or incomplete.
   [junit4]   2> 3538569 INFO  (jetty-launcher-6257-thread-2) [    ] o.a.s.s.SolrDispatchFilter  ___      _       Welcome to Apache Solr™ version 8.0.0
   [junit4]   2> 3538569 INFO  (jetty-launcher-6257-thread-2) [    ] o.a.s.s.SolrDispatchFilter / __| ___| |_ _   Starting in cloud mode on port null
   [junit4]   2> 3538569 INFO  (jetty-launcher-6257-thread-2) [    ] o.a.s.s.SolrDispatchFilter \__ \/ _ \ | '_|  Install dir: null, Default config dir: null
   [junit4]   2> 3538569 INFO  (jetty-launcher-6257-thread-2) [    ] o.a.s.s.SolrDispatchFilter |___/\___/_|_|    Start time: 2017-10-22T12:31:43.669Z
   [junit4]   2> 3538570 INFO  (jetty-launcher-6257-thread-3) [    ] o.e.j.s.Server jetty-9.3.20.v20170531
   [junit4]   2> 3538572 INFO  (jetty-launcher-6257-thread-3) [    ] o.e.j.s.h.ContextHandler Started o.e.j.s.ServletContextHandler@58878230{/solr,null,AVAILABLE}
   [junit4]   2> 3538577 INFO  (jetty-launcher-6257-thread-3) [    ] o.e.j.s.AbstractConnector Started ServerConnector@1b0ae4f0{HTTP/1.1,[http/1.1]}{127.0.0.1:58050}
   [junit4]   2> 3538577 INFO  (jetty-launcher-6257-thread-3) [    ] o.e.j.s.Server Started @3548985ms
   [junit4]   2> 3538577 INFO  (jetty-launcher-6257-thread-3) [    ] o.a.s.c.s.e.JettySolrRunner Jetty properties: {hostContext=/solr, hostPort=58050}
   [junit4]   2> 3538577 ERROR (jetty-launcher-6257-thread-3) [    ] o.a.s.u.StartupLoggingUtils Missing Java Option solr.log.dir. Logging may be missing or incomplete.
   [junit4]   2> 3538578 INFO  (jetty-launcher-6257-thread-3) [    ] o.a.s.s.SolrDispatchFilter  ___      _       Welcome to Apache Solr™ version 8.0.0
   [junit4]   2> 3538578 INFO  (jetty-launcher-6257-thread-3) [    ] o.a.s.s.SolrDispatchFilter / __| ___| |_ _   Starting in cloud mode on port null
   [junit4]   2> 3538578 INFO  (jetty-launcher-6257-thread-3) [    ] o.a.s.s.SolrDispatchFilter \__ \/ _ \ | '_|  Install dir: null, Default config dir: null
   [junit4]   2> 3538578 INFO  (jetty-launcher-6257-thread-3) [    ] o.a.s.s.SolrDispatchFilter |___/\___/_|_|    Start time: 2017-10-22T12:31:43.678Z
   [junit4]   2> 3538578 INFO  (jetty-launcher-6257-thread-1) [    ] o.a.s.s.SolrDispatchFilter solr.xml found in ZooKeeper. Loading...
   [junit4]   2> 3538579 INFO  (jetty-launcher-6257-thread-2) [    ] o.a.s.s.SolrDispatchFilter solr.xml found in ZooKeeper. Loading...
   [junit4]   2> 3538590 INFO  (jetty-launcher-6257-thread-2) [    ] o.a.s.c.ZkContainer Zookeeper client=127.0.0.1:58033/solr
   [junit4]   2> 3538590 INFO  (jetty-launcher-6257-thread-1) [    ] o.a.s.c.ZkContainer Zookeeper client=127.0.0.1:58033/solr
   [junit4]   2> 3538590 INFO  (jetty-launcher-6257-thread-3) [    ] o.a.s.s.SolrDispatchFilter solr.xml found in ZooKeeper. Loading...
   [junit4]   2> 3538594 WARN  (NIOServerCxn.Factory:0.0.0.0/0.0.0.0:0) [    ] o.a.z.s.NIOServerCnxn caught end of stream exception
   [junit4]   2> EndOfStreamException: Unable to read additional data from client sessionid 0x15f441145ce0004, likely client has closed socket
   [junit4]   2> 	at org.apache.zookeeper.server.NIOServerCnxn.doIO(NIOServerCnxn.java:239)
   [junit4]   2> 	at org.apache.zookeeper.server.NIOServerCnxnFactory.run(NIOServerCnxnFactory.java:203)
   [junit4]   2> 	at java.lang.Thread.run(Thread.java:748)
   [junit4]   2> 3538595 WARN  (NIOServerCxn.Factory:0.0.0.0/0.0.0.0:0) [    ] o.a.z.s.NIOServerCnxn caught end of stream exception
   [junit4]   2> EndOfStreamException: Unable to read additional data from client sessionid 0x15f441145ce0003, likely client has closed socket
   [junit4]   2> 	at org.apache.zookeeper.server.NIOServerCnxn.doIO(NIOServerCnxn.java:239)
   [junit4]   2> 	at org.apache.zookeeper.server.NIOServerCnxnFactory.run(NIOServerCnxnFactory.java:203)
   [junit4]   2> 	at java.lang.Thread.run(Thread.java:748)
   [junit4]   2> 3538598 INFO  (jetty-launcher-6257-thread-3) [    ] o.a.s.c.ZkContainer Zookeeper client=127.0.0.1:58033/solr
   [junit4]   2> 3538601 WARN  (NIOServerCxn.Factory:0.0.0.0/0.0.0.0:0) [    ] o.a.z.s.NIOServerCnxn caught end of stream exception
   [junit4]   2> EndOfStreamException: Unable to read additional data from client sessionid 0x15f441145ce0008, likely client has closed socket
   [junit4]   2> 	at org.apache.zookeeper.server.NIOServerCnxn.doIO(NIOServerCnxn.java:239)
   [junit4]   2> 	at org.apache.zookeeper.server.NIOServerCnxnFactory.run(NIOServerCnxnFactory.java:203)
   [junit4]   2> 	at java.lang.Thread.run(Thread.java:748)
   [junit4]   2> 3538714 INFO  (jetty-launcher-6257-thread-1) [n:127.0.0.1:58038_solr    ] o.a.s.c.Overseer Overseer (id=null) closing
   [junit4]   2> 3538715 INFO  (jetty-launcher-6257-thread-1) [n:127.0.0.1:58038_solr    ] o.a.s.c.OverseerElectionContext I am going to be the leader 127.0.0.1:58038_solr
   [junit4]   2> 3538716 INFO  (jetty-launcher-6257-thread-1) [n:127.0.0.1:58038_solr    ] o.a.s.c.Overseer Overseer (id=98872557801701382-127.0.0.1:58038_solr-n_0000000000) starting
   [junit4]   2> 3538724 INFO  (jetty-launcher-6257-thread-2) [n:127.0.0.1:58041_solr    ] o.a.s.c.Overseer Overseer (id=null) closing
   [junit4]   2> 3538725 INFO  (jetty-launcher-6257-thread-3) [n:127.0.0.1:58050_solr    ] o.a.s.c.Overseer Overseer (id=null) closing
   [junit4]   2> 3538725 INFO  (jetty-launcher-6257-thread-1) [n:127.0.0.1:58038_solr    ] o.a.s.c.ZkController Register node as live in ZooKeeper:/live_nodes/127.0.0.1:58038_solr
   [junit4]   2> 3538725 INFO  (jetty-launcher-6257-thread-2) [n:127.0.0.1:58041_solr    ] o.a.s.c.ZkController Register node as live in ZooKeeper:/live_nodes/127.0.0.1:58041_solr
   [junit4]   2> 3538725 INFO  (zkCallback-6272-thread-1-processing-n:127.0.0.1:58041_solr) [n:127.0.0.1:58041_solr    ] o.a.s.c.c.ZkStateReader Updated live nodes from ZooKeeper... (0) -> (1)
   [junit4]   2> 3538725 INFO  (zkCallback-6269-thread-1-processing-n:127.0.0.1:58038_solr) [n:127.0.0.1:58038_solr    ] o.a.s.c.c.ZkStateReader Updated live nodes from ZooKeeper... (0) -> (1)
   [junit4]   2> 3538725 INFO  (zkCallback-6274-thread-1-processing-n:127.0.0.1:58050_solr) [n:127.0.0.1:58050_solr    ] o.a.s.c.c.ZkStateReader Updated live nodes from ZooKeeper... (0) -> (1)
   [junit4]   2> 3538727 INFO  (zkCallback-6269-thread-1-processing-n:127.0.0.1:58038_solr) [n:127.0.0.1:58038_solr    ] o.a.s.c.c.ZkStateReader Updated live nodes from ZooKeeper... (1) -> (2)
   [junit4]   2> 3538727 INFO  (zkCallback-6274-thread-1-processing-n:127.0.0.1:58050_solr) [n:127.0.0.1:58050_solr    ] o.a.s.c.c.ZkStateReader Updated live nodes from ZooKeeper... (1) -> (2)
   [junit4]   2> 3538727 INFO  (zkCallback-6272-thread-1-processing-n:127.0.0.1:58041_solr) [n:127.0.0.1:58041_solr    ] o.a.s.c.c.ZkStateReader Updated live nodes from ZooKeeper... (1) -> (2)
   [junit4]   2> 3538727 INFO  (jetty-launcher-6257-thread-3) [n:127.0.0.1:58050_solr    ] o.a.s.c.ZkController Register node as live in ZooKeeper:/live_nodes/127.0.0.1:58050_solr
   [junit4]   2> 3538778 DEBUG (OverseerAutoScalingTriggerThread-98872557801701382-127.0.0.1:58038_solr-n_0000000000) [n:127.0.0.1:58038_solr    ] o.a.s.c.a.OverseerTriggerThread Adding .autoAddReplicas trigger
   [junit4]   2> 3538779 DEBUG (OverseerStateUpdate-98872557801701382-127.0.0.1:58038_solr-n_0000000000) [n:127.0.0.1:58038_solr    ] o.a.s.c.Overseer Starting to work on the main queue
   [junit4]   2> 3538781 INFO  (zkCallback-6274-thread-1-processing-n:127.0.0.1:58050_solr) [n:127.0.0.1:58050_solr    ] o.a.s.c.c.ZkStateReader Updated live nodes from ZooKeeper... (2) -> (3)
   [junit4]   2> 3538781 INFO  (zkCallback-6272-thread-1-processing-n:127.0.0.1:58041_solr) [n:127.0.0.1:58041_solr    ] o.a.s.c.c.ZkStateReader Updated live nodes from ZooKeeper... (2) -> (3)
   [junit4]   2> 3538781 DEBUG (OverseerAutoScalingTriggerThread-98872557801701382-127.0.0.1:58038_solr-n_0000000000) [n:127.0.0.1:58038_solr    ] o.a.s.c.a.OverseerTriggerThread Refreshing /autoscaling.json with znode version 1
   [junit4]   2> 3538782 DEBUG (OverseerAutoScalingTriggerThread-98872557801701382-127.0.0.1:58038_solr-n_0000000000) [n:127.0.0.1:58038_solr    ] o.a.s.c.a.NodeLostTrigger Initial livenodes: [127.0.0.1:58038_solr, 127.0.0.1:58041_solr]
   [junit4]   2> 3538782 DEBUG (OverseerAutoScalingTriggerThread-98872557801701382-127.0.0.1:58038_solr-n_0000000000) [n:127.0.0.1:58038_solr    ] o.a.s.c.a.OverseerTriggerThread Current znodeVersion 1, lastZnodeVersion -1
   [junit4]   2> 3538782 DEBUG (OverseerAutoScalingTriggerThread-98872557801701382-127.0.0.1:58038_solr-n_0000000000) [n:127.0.0.1:58038_solr    ] o.a.s.c.a.OverseerTriggerThread Processed trigger updates upto znodeVersion 1
   [junit4]   2> 3538783 INFO  (OverseerStateUpdate-98872557801701382-127.0.0.1:58038_solr-n_0000000000) [n:127.0.0.1:58038_solr    ] o.a.s.c.c.ZkStateReader Updated live nodes from ZooKeeper... (2) -> (3)
   [junit4]   2> 3538786 DEBUG (OverseerStateUpdate-98872557801701382-127.0.0.1:58038_solr-n_0000000000) [n:127.0.0.1:58038_solr    ] o.a.s.c.Overseer processMessage: queueSize: 1, message = {
   [junit4]   2>   "operation":"downnode",
   [junit4]   2>   "node_name":"127.0.0.1:58050_solr"} current state version: 0
   [junit4]   2> 3538786 DEBUG (OverseerStateUpdate-98872557801701382-127.0.0.1:58038_solr-n_0000000000) [n:127.0.0.1:58038_solr    ] o.a.s.c.o.NodeMutator DownNode state invoked for node: 127.0.0.1:58050_solr
   [junit4]   2> 3538787 DEBUG (OverseerAutoScalingTriggerThread-98872557801701382-127.0.0.1:58038_solr-n_0000000000) [n:127.0.0.1:58038_solr    ] o.a.s.c.a.OverseerTriggerThread -- clean old nodeAdded markers
   [junit4]   2> 3538787 DEBUG (OverseerAutoScalingTriggerThread-98872557801701382-127.0.0.1:58038_solr-n_0000000000) [n:127.0.0.1:58038_solr    ] o.a.s.c.a.OverseerTriggerThread Current znodeVersion 1, lastZnodeVersion 1
   [junit4]   2> 3538819 DEBUG (ScheduledTrigger-10102-thread-1) [n:127.0.0.1:58038_solr    ] o.a.s.c.a.NodeLostTrigger Running NodeLostTrigger: .auto_add_replicas with currently live nodes: [127.0.0.1:58038_solr, 127.0.0.1:58050_solr, 127.0.0.1:58041_solr]
   [junit4]   2> 3538865 INFO  (jetty-launcher-6257-thread-3) [n:127.0.0.1:58050_solr    ] o.a.s.m.r.SolrJmxReporter JMX monitoring for 'solr_58050.solr.node' (registry 'solr.node') enabled at server: com.sun.jmx.mbeanserver.JmxMBeanServer@27254fb8
   [junit4]   2> 3538866 INFO  (jetty-launcher-6257-thread-2) [n:127.0.0.1:58041_solr    ] o.a.s.m.r.SolrJmxReporter JMX monitoring for 'solr_58041.solr.node' (registry 'solr.node') enabled at server: com.sun.jmx.mbeanserver.JmxMBeanServer@27254fb8
   [junit4]   2> 3538871 INFO  (jetty-launcher-6257-thread-1) [n:127.0.0.1:58038_solr    ] o.a.s.m.r.SolrJmxReporter JMX monitoring for 'solr_58038.solr.node' (registry 'solr.node') enabled at server: com.sun.jmx.mbeanserver.JmxMBeanServer@27254fb8
   [junit4]   2> 3538874 INFO  (jetty-launcher-6257-thread-3) [n:127.0.0.1:58050_solr    ] o.a.s.m.r.SolrJmxReporter JMX monitoring for 'solr_58050.solr.jvm' (registry 'solr.jvm') enabled at server: com.sun.jmx.mbeanserver.JmxMBeanServer@27254fb8
   [junit4]   2> 3538874 INFO  (jetty-launcher-6257-thread-3) [n:127.0.0.1:58050_solr    ] o.a.s.m.r.SolrJmxReporter JMX monitoring for 'solr_58050.solr.jetty' (registry 'solr.jetty') enabled at server: com.sun.jmx.mbeanserver.JmxMBeanServer@27254fb8
   [junit4]   2> 3538874 INFO  (jetty-launcher-6257-thread-2) [n:127.0.0.1:58041_solr    ] o.a.s.m.r.SolrJmxReporter JMX monitoring for 'solr_58041.solr.jvm' (registry 'solr.jvm') enabled at server: com.sun.jmx.mbeanserver.JmxMBeanServer@27254fb8
   [junit4]   2> 3538874 INFO  (jetty-launcher-6257-thread-2) [n:127.0.0.1:58041_solr    ] o.a.s.m.r.SolrJmxReporter JMX monitoring for 'solr_58041.solr.jetty' (registry 'solr.jetty') enabled at server: com.sun.jmx.mbeanserver.JmxMBeanServer@27254fb8
   [junit4]   2> 3538875 INFO  (jetty-launcher-6257-thread-3) [n:127.0.0.1:58050_solr    ] o.a.s.c.CorePropertiesLocator Found 0 core definitions underneath C:\Users\jenkins\workspace\Lucene-Solr-master-Windows\solr\build\solr-core\test\J1\temp\solr.handler.admin.AutoscalingHistoryHandlerTest_8C9762697070A327-001\tempDir-001\node3\.
   [junit4]   2> 3538875 INFO  (jetty-launcher-6257-thread-2) [n:127.0.0.1:58041_solr    ] o.a.s.c.CorePropertiesLocator Found 0 core definitions underneath C:\Users\jenkins\workspace\Lucene-Solr-master-Windows\solr\build\solr-core\test\J1\temp\solr.handler.admin.AutoscalingHistoryHandlerTest_8C9762697070A327-001\tempDir-001\node2\.
   [junit4]   2> 3538878 INFO  (jetty-launcher-6257-thread-1) [n:127.0.0.1:58038_solr    ] o.a.s.m.r.SolrJmxReporter JMX monitoring for 'solr_58038.solr.jvm' (registry 'solr.jvm') enabled at server: com.sun.jmx.mbeanserver.JmxMBeanServer@27254fb8
   [junit4]   2> 3538878 INFO  (jetty-launcher-6257-thread-1) [n:127.0.0.1:58038_solr    ] o.a.s.m.r.SolrJmxReporter JMX monitoring for 'solr_58038.solr.jetty' (registry 'solr.jetty') enabled at server: com.sun.jmx.mbeanserver.JmxMBeanServer@27254fb8
   [junit4]   2> 3538879 INFO  (jetty-launcher-6257-thread-1) [n:127.0.0.1:58038_solr    ] o.a.s.c.CorePropertiesLocator Found 0 core definitions underneath C:\Users\jenkins\workspace\Lucene-Solr-master-Windows\solr\build\solr-core\test\J1\temp\solr.handler.admin.AutoscalingHistoryHandlerTest_8C9762697070A327-001\tempDir-001\node1\.
   [junit4]   2> 3538950 INFO  (SUITE-AutoscalingHistoryHandlerTest-seed#[8C9762697070A327]-worker) [    ] o.a.s.c.c.ZkStateReader Updated live nodes from ZooKeeper... (0) -> (3)
   [junit4]   2> 3538951 INFO  (SUITE-AutoscalingHistoryHandlerTest-seed#[8C9762697070A327]-worker) [    ] o.a.s.c.s.i.ZkClientClusterStateProvider Cluster at 127.0.0.1:58033/solr ready
   [junit4]   2> 3538956 INFO  (qtp2083164565-26704) [n:127.0.0.1:58038_solr    ] o.a.s.h.a.CollectionsHandler Invoked Collection Action :create with params replicationFactor=3&name=AutoscalingHistoryHandlerTest_collection&nrtReplicas=3&action=CREATE&numShards=1&wt=javabin&version=2 and sendToOCPQueue=true
   [junit4]   2> 3538958 INFO  (OverseerThreadFactory-10105-thread-1-processing-n:127.0.0.1:58038_solr) [n:127.0.0.1:58038_solr    ] o.a.s.c.CreateCollectionCmd Create collection AutoscalingHistoryHandlerTest_collection
   [junit4]   2> 3538960 INFO  (OverseerThreadFactory-10105-thread-1-processing-n:127.0.0.1:58038_solr) [n:127.0.0.1:58038_solr    ] o.a.s.c.CreateCollectionCmd Only _default config set found, using it.
   [junit4]   2> 3538960 INFO  (OverseerThreadFactory-10105-thread-1-processing-n:127.0.0.1:58038_solr) [n:127.0.0.1:58038_solr    ] o.a.s.c.c.ZkConfigManager Copying zk node /configs/_default/managed-schema to /configs/AutoscalingHistoryHandlerTest_collection/managed-schema
   [junit4]   2> 3538962 INFO  (OverseerThreadFactory-10105-thread-1-processing-n:127.0.0.1:58038_solr) [n:127.0.0.1:58038_solr    ] o.a.s.c.c.ZkConfigManager Copying zk node /configs/_default/protwords.txt to /configs/AutoscalingHistoryHandlerTest_collection/protwords.txt
   [junit4]   2> 3538963 INFO  (OverseerThreadFactory-10105-thread-1-processing-n:127.0.0.1:58038_solr) [n:127.0.0.1:58038_solr    ] o.a.s.c.c.ZkConfigManager Copying zk node /configs/_default/solrconfig.xml to /configs/AutoscalingHistoryHandlerTest_collection/solrconfig.xml
   [junit4]   2> 3538966 INFO  (OverseerThreadFactory-10105-thread-1-processing-n:127.0.0.1:58038_solr) [n:127.0.0.1:58038_solr    ] o.a.s.c.c.ZkConfigManager Copying zk node /configs/_default/synonyms.txt to /configs/AutoscalingHistoryHandlerTest_collection/synonyms.txt
   [junit4]   2> 3538967 INFO  (OverseerThreadFactory-10105-thread-1-processing-n:127.0.0.1:58038_solr) [n:127.0.0.1:58038_solr    ] o.a.s.c.c.ZkConfigManager Copying zk node /configs/_default/stopwords.txt to /configs/AutoscalingHistoryHandlerTest_collection/stopwords.txt
   [junit4]   2> 3538969 INFO  (OverseerThreadFactory-10105-thread-1-processing-n:127.0.0.1:58038_solr) [n:127.0.0.1:58038_solr    ] o.a.s.c.c.ZkConfigManager Copying zk node /configs/_default/lang/contractions_it.txt to /configs/AutoscalingHistoryHandlerTest_collection/lang/contractions_it.txt
   [junit4]   2> 3538971 INFO  (OverseerThreadFactory-10105-thread-1-processing-n:127.0.0.1:58038_solr) [n:127.0.0.1:58038_solr    ] o.a.s.c.c.ZkConfigManager Copying zk node /configs/_default/lang/contractions_ca.txt to /configs/AutoscalingHistoryHandlerTest_collection/lang/contractions_ca.txt
   [junit4]   2> 3538973 INFO  (OverseerThreadFactory-10105-thread-1-processing-n:127.0.0.1:58038_solr) [n:127.0.0.1:58038_solr    ] o.a.s.c.c.ZkConfigManager Copying zk node /configs/_default/lang/stemdict_nl.txt to /configs/AutoscalingHistoryHandlerTest_collection/lang/stemdict_nl.txt
   [junit4]   2> 3538975 INFO  (OverseerThreadFactory-10105-thread-1-processing-n:127.0.0.1:58038_solr) [n:127.0.0.1:58038_solr    ] o.a.s.c.c.ZkConfigManager Copying zk node /configs/_default/lang/stopwords_hy.txt to /configs/AutoscalingHistoryHandlerTest_collection/lang/stopwords_hy.txt
   [junit4]   2> 3538977 INFO  (OverseerThreadFactory-10105-thread-1-processing-n:127.0.0.1:58038_solr) [n:127.0.0.1:58038_solr    ] o.a.s.c.c.ZkConfigManager Copying zk node /configs/_default/lang/stopwords_no.txt to /configs/AutoscalingHistoryHandlerTest_collection/lang/stopwords_no.txt
   [junit4]   2> 3538979 INFO  (OverseerThreadFactory-10105-thread-1-processing-n:127.0.0.1:58038_solr) [n:127.0.0.1:58038_solr    ] o.a.s.c.c.ZkConfigManager Copying zk node /configs/_default/lang/stopwords_id.txt to /configs/AutoscalingHistoryHandlerTest_collection/lang/stopwords_id.txt
   [junit4]   2> 3538980 INFO  (OverseerThreadFactory-10105-thread-1-processing-n:127.0.0.1:58038_solr) [n:127.0.0.1:58038_solr    ] o.a.s.c.c.ZkConfigManager Copying zk node /configs/_default/lang/stopwords_da.txt to /configs/AutoscalingHistoryHandlerTest_collection/lang/stopwords_da.txt
   [junit4]   2> 3538982 INFO  (OverseerThreadFactory-10105-thread-1-processing-n:127.0.0.1:58038_solr) [n:127.0.0.1:58038_solr    ] o.a.s.c.c.ZkConfigManager Copying zk node /configs/_default/lang/stopwords_ga.txt to /configs/AutoscalingHistoryHandlerTest_collection/lang/stopwords_ga.txt
   [junit4]   2> 3538984 INFO  (OverseerThreadFactory-10105-thread-1-processing-n:127.0.0.1:58038_solr) [n:127.0.0.1:58038_solr    ] o.a.s.c.c.ZkConfigManager Copying zk node /configs/_default/lang/stopwords_hi.txt to /configs/AutoscalingHistoryHandlerTest_collection/lang/stopwords_hi.txt
   [junit4]   2> 3538986 INFO  (OverseerThreadFactory-10105-thread-1-processing-n:127.0.0.1:58038_solr) [n:127.0.0.1:58038_solr    ] o.a.s.c.c.ZkConfigManager Copying zk node /configs/_default/lang/stopwords_ja.txt to /configs/AutoscalingHistoryHandlerTest_collection/lang/stopwords_ja.txt
   [junit4]   2> 3538988 INFO  (OverseerThreadFactory-10105-thread-1-processing-n:127.0.0.1:58038_solr) [n:127.0.0.1:58038_solr    ] o.a.s.c.c.ZkConfigManager Copying zk node /configs/_default/lang/stopwords_pt.txt to /configs/AutoscalingHistoryHandlerTest_collection/lang/stopwords_pt.txt
   [junit4]   2> 3538990 INFO  (OverseerThreadFactory-10105-thread-1-processing-n:127.0.0.1:58038_solr) [n:127.0.0.1:58038_solr    ] o.a.s.c.c.ZkConfigManager Copying zk node /configs/_default/lang/stopwords_hu.txt to /configs/AutoscalingHistoryHandlerTest_collection/lang/stopwords_hu.txt
   [junit4]   2> 3538992 INFO  (OverseerThreadFactory-10105-thread-1-processing-n:127.0.0.1:58038_solr) [n:127.0.0.1:58038_solr    ] o.a.s.c.c.ZkConfigManager Copying zk node /configs/_default/lang/stopwords_el.txt to /configs/AutoscalingHistoryHandlerTest_collection/lang/stopwords_el.txt
   [junit4]   2> 3538994 INFO  (OverseerThreadFactory-10105-thread-1-processing-n:127.0.0.1:58038_solr) [n:127.0.0.1:58038_solr    ] o.a.s.c.c.ZkConfigManager Copying zk node /configs/_default/lang/stopwords_ru.txt to /configs/AutoscalingHistoryHandlerTest_collection/lang/stopwords_ru.txt
   [junit4]   2> 3538995 INFO  (OverseerThreadFactory-10105-thread-1-processing-n:127.0.0.1:58038_solr) [n:127.0.0.1:58038_solr    ] o.a.s.c.c.ZkConfigManager Copying zk node /configs/_default/lang/stopwords_tr.txt to /configs/AutoscalingHistoryHandlerTest_collection/lang/stopwords_tr.txt
   [junit4]   2> 3538997 INFO  (OverseerThreadFactory-10105-thread-1-processing-n:127.0.0.1:58038_solr) [n:127.0.0.1:58038_solr    ] o.a.s.c.c.ZkConfigManager Copying zk node /configs/_default/lang/stopwords_ar.txt to /configs/AutoscalingHistoryHandlerTest_collection/lang/stopwords_ar.txt
   [junit4]   2> 3538999 INFO  (OverseerThreadFactory-10105-thread-1-processing-n:127.0.0.1:58038_solr) [n:127.0.0.1:58038_solr    ] o.a.s.c.c.ZkConfigManager Copying zk node /configs/_default/lang/userdict_ja.txt to /configs/AutoscalingHistoryHandlerTest_collection/lang/userdict_ja.txt
   [junit4]   2> 3539001 INFO  (OverseerThreadFactory-10105-thread-1-processing-n:127.0.0.1:58038_solr) [n:127.0.0.1:58038_solr    ] o.a.s.c.c.ZkConfigManager Copying zk node /configs/_default/lang/stopwords_eu.txt to /configs/AutoscalingHistoryHandlerTest_collection/lang/stopwords_eu.txt
   [junit4]   2> 3539002 INFO  (OverseerThreadFactory-10105-thread-1-processing-n:127.0.0.1:58038_solr) [n:127.0.0.1:58038_solr    ] o.a.s.c.c.ZkConfigManager Copying zk node /configs/_default/lang/stopwords_it.txt to /configs/AutoscalingHistoryHandlerTest_collection/lang/stopwords_it.txt
   [junit4]   2> 3539004 INFO  (OverseerThreadFactory-10105-thread-1-processing-n:127.0.0.1:58038_solr) [n:127.0.0.1:58038_solr    ] o.a.s.c.c.ZkConfigManager Copying zk node /configs/_default/lang/stopwords_cz.txt to /configs/AutoscalingHistoryHandlerTest_collection/lang/stopwords_cz.txt
   [junit4]   2> 3539006 INFO  (OverseerThreadFactory-10105-thread-1-processing-n:127.0.0.1:58038_solr) [n:127.0.0.1:58038_solr    ] o.a.s.c.c.ZkConfigManager Copying zk node /configs/_default/lang/stoptags_ja.txt to /configs/AutoscalingHistoryHandlerTest_collection/lang/stoptags_ja.txt
   [junit4]   2> 3539008 INFO  (OverseerThreadFactory-10105-thread-1-processing-n:127.0.0.1:58038_solr) [n:127.0.0.1:58038_solr    ] o.a.s.c.c.ZkConfigManager Copying zk node /configs/_default/lang/contractions_fr.txt to /configs/AutoscalingHistoryHandlerTest_collection/lang/contractions_fr.txt
   [junit4]   2> 3539010 INFO  (OverseerThreadFactory-10105-thread-1-processing-n:127.0.0.1:58038_solr) [n:127.0.0.1:58038_solr    ] o.a.s.c.c.ZkConfigManager Copying zk node /configs/_default/lang/stopwords_de.txt to /configs/AutoscalingHistoryHandlerTest_collection/lang/stopwords_de.txt
   [junit4]   2> 3539012 INFO  (OverseerThreadFactory-10105-thread-1-processing-n:127.0.0.1:58038_solr) [n:127.0.0.1:58038_solr    ] o.a.s.c.c.ZkConfigManager Copying zk node /configs/_default/lang/stopwords_fa.txt to /configs/AutoscalingHistoryHandlerTest_collection/lang/stopwords_fa.txt
   [junit4]   2> 3539014 INFO  (OverseerThreadFactory-10105-thread-1-processing-n:127.0.0.1:58038_solr) [n:127.0.0.1:58038_solr    ] o.a.s.c.c.ZkConfigManager Copying zk node /configs/_default/lang/contractions_ga.txt to /configs/AutoscalingHistoryHandlerTest_collection/lang/contractions_ga.txt
   [junit4]   2> 3539016 INFO  (OverseerThreadFactory-10105-thread-1-processing-n:127.0.0.1:58038_solr) [n:127.0.0.1:58038_solr    ] o.a.s.c.c.ZkConfigManager Copying zk node /configs/_default/lang/stopwords_ca.txt to /configs/AutoscalingHistoryHandlerTest_collection/lang/stopwords_ca.txt
   [junit4]   2> 3539017 INFO  (OverseerThreadFactory-10105-thread-1-processing-n:127.0.0.1:58038_solr) [n:127.0.0.1:58038_solr    ] o.a.s.c.c.ZkConfigManager Copying zk node /configs/_default/lang/stopwords_nl.txt to /configs/AutoscalingHistoryHandlerTest_collection/lang/stopwords_nl.txt
   [junit4]   2> 3539019 INFO  (OverseerThreadFactory-10105-thread-1-processing-n:127.0.0.1:58038_solr) [n:127.0.0.1:58038_solr    ] o.a.s.c.c.ZkConfigManager Copying zk node /configs/_default/lang/stopwords_bg.txt to /configs/AutoscalingHistoryHandlerTest_collection/lang/stopwords_bg.txt
   [junit4]   2> 3539021 INFO  (OverseerThreadFactory-10105-thread-1-processing-n:127.0.0.1:58038_solr) [n:127.0.0.1:58038_solr    ] o.a.s.c.c.ZkConfigManager Copying zk node /configs/_default/lang/stopwords_en.txt to /configs/AutoscalingHistoryHandlerTest_collection/lang/stopwords_en.txt
   [junit4]   2> 3539023 INFO  (OverseerThreadFactory-10105-thread-1-processing-n:127.0.0.1:58038_solr) [n:127.0.0.1:58038_solr    ] o.a.s.c.c.ZkConfigManager Copying zk node /configs/_default/lang/stopwords_es.txt to /configs/AutoscalingHistoryHandlerTest_collection/lang/stopwords_es.txt
   [junit4]   2> 3539024 INFO  (OverseerThreadFactory-10105-thread-1-processing-n:127.0.0.1:58038_solr) [n:127.0.0.1:58038_solr    ] o.a.s.c.c.ZkConfigManager Copying zk node /configs/_default/lang/stopwords_lv.txt to /configs/AutoscalingHistoryHandlerTest_collection/lang/stopwords_lv.txt
   [junit4]   2> 3539026 INFO  (OverseerThreadFactory-10105-thread-1-processing-n:127.0.0.1:58038_solr) [n:127.0.0.1:58038_solr    ] o.a.s.c.c.ZkConfigManager Copying zk node /configs/_default/lang/stopwords_ro.txt to /configs/AutoscalingHistoryHandlerTest_collection/lang/stopwords_ro.txt
   [junit4]   2> 3539028 INFO  (OverseerThreadFactory-10105-thread-1-processing-n:127.0.0.1:58038_solr) [n:127.0.0.1:58038_solr    ] o.a.s.c.c.ZkConfigManager Copying zk node /configs/_default/lang/stopwords_th.txt to /configs/AutoscalingHistoryHandlerTest_collection/lang/stopwords_th.txt
   [junit4]   2> 3539030 INFO  (OverseerThreadFactory-10105-thread-1-processing-n:127.0.0.1:58038_solr) [n:127.0.0.1:58038_solr    ] o.a.s.c.c.ZkConfigManager Copying zk node /configs/_default/lang/stopwords_fr.txt to /configs/AutoscalingHistoryHandlerTest_collection/lang/stopwords_fr.txt
   [junit4]   2> 3539031 INFO  (OverseerThreadFactory-10105-thread-1-processing-n:127.0.0.1:58038_solr) [n:127.0.0.1:58038_solr    ] o.a.s.c.c.ZkConfigManager Copying zk node /configs/_default/lang/stopwords_sv.txt to /configs/AutoscalingHistoryHandlerTest_collection/lang/stopwords_sv.txt
   [junit4]   2> 3539033 INFO  (OverseerThreadFactory-10105-thread-1-processing-n:127.0.0.1:58038_solr) [n:127.0.0.1:58038_solr    ] o.a.s.c.c.ZkConfigManager Copying zk node /configs/_default/lang/stopwords_fi.txt to /configs/AutoscalingHistoryHandlerTest_collection/lang/stopwords_fi.txt
   [junit4]   2> 3539035 INFO  (OverseerThreadFactory-10105-thread-1-processing-n:127.0.0.1:58038_solr) [n:127.0.0.1:58038_solr    ] o.a.s.c.c.ZkConfigManager Copying zk node /configs/_default/lang/hyphenations_ga.txt to /configs/AutoscalingHistoryHandlerTest_collection/lang/hyphenations_ga.txt
   [junit4]   2> 3539037 INFO  (OverseerThreadFactory-10105-thread-1-processing-n:127.0.0.1:58038_solr) [n:127.0.0.1:58038_solr    ] o.a.s.c.c.ZkConfigManager Copying zk node /configs/_default/lang/stopwords_gl.txt to /configs/AutoscalingHistoryHandlerTest_collection/lang/stopwords_gl.txt
   [junit4]   2> 3539039 INFO  (OverseerThreadFactory-10105-thread-1-processing-n:127.0.0.1:58038_solr) [n:127.0.0.1:58038_solr    ] o.a.s.c.c.ZkConfigManager Copying zk node /configs/_default/params.json to /configs/AutoscalingHistoryHandlerTest_collection/params.json
   [junit4]   2> 3539044 DEBUG (OverseerStateUpdate-98872557801701382-127.0.0.1:58038_solr-n_0000000000) [n:127.0.0.1:58038_solr    ] o.a.s.c.Overseer processMessage: queueSize: 1, message = {
   [junit4]   2>   "name":"AutoscalingHistoryHandlerTest_collection",
   [junit4]   2>   "fromApi":"true",
   [junit4]   2>   "replicationFactor":"3",
   [junit4]   2>   "numShards":"1",
   [junit4]   2>   "nrtReplicas":"3",
   [junit4]   2>   "stateFormat":"2",
   [junit4]   2>   "operation":"create"} current state version: 0
   [junit4]   2> 3539044 DEBUG (OverseerStateUpdate-98872557801701382-127.0.0.1:58038_solr-n_0000000000) [n:127.0.0.1:58038_solr    ] o.a.s.c.o.ClusterStateMutator building a new cName: AutoscalingHistoryHandlerTest_collection
   [junit4]   2> 3539045 DEBUG (OverseerStateUpdate-98872557801701382-127.0.0.1:58038_solr-n_0000000000) [n:127.0.0.1:58038_solr    ] o.a.s.c.o.ZkStateWriter going to create_collection /collections/AutoscalingHistoryHandlerTest_collection/state.json
   [junit4]   2> 3539150 DEBUG (OverseerStateUpdate-98872557801701382-127.0.0.1:58038_solr-n_0000000000) [n:127.0.0.1:58038_solr    ] o.a.s.c.Overseer processMessage: queueSize: 1, message = {
   [junit4]   2>   "operation":"ADDREPLICA",
   [junit4]   2>   "collection":"AutoscalingHistoryHandlerTest_collection",
   [junit4]   2>   "shard":"shard1",
   [junit4]   2>   "core":"AutoscalingHistoryHandlerTest_collection_shard1_replica_n1",
   [junit4]   2>   "state":"down",
   [junit4]   2>   "base_url":"http://127.0.0.1:58050/solr",
   [junit4]   2>   "type":"NRT",
   [junit4]   2>   "waitForFinalState":"false"} current state version: 0
   [junit4]   2> 3539150 INFO  (OverseerStateUpdate-98872557801701382-127.0.0.1:58038_solr-n_0000000000) [n:127.0.0.1:58038_solr    ] o.a.s.c.o.SliceMutator createReplica() {
   [junit4]   2>   "operation":"ADDREPLICA",
   [junit4]   2>   "collection":"AutoscalingHistoryHandlerTest_collection",
   [junit4]   2>   "shard":"shard1",
   [junit4]   2>   "core":"AutoscalingHistoryHandlerTest_collection_shard1_replica_n1",
   [junit4]   2>   "state":"down",
   [junit4]   2>   "base_url":"http://127.0.0.1:58050/solr",
   [junit4]   2>   "type":"NRT",
   [junit4]   2>   "waitForFinalState":"false"} 
   [junit4]   2> 3539151 DEBUG (OverseerStateUpdate-98872557801701382-127.0.0.1:58038_solr-n_0000000000) [n:127.0.0.1:58038_solr    ] o.a.s.c.o.SliceMutator Old Slice: shard1:{
   [junit4]   2>   "range":"80000000-7fffffff",
   [junit4]   2>   "state":"active",
   [junit4]   2>   "replicas":{}}
   [junit4]   2> 3539151 DEBUG (OverseerStateUpdate-98872557801701382-127.0.0.1:58038_solr-n_0000000000) [n:127.0.0.1:58038_solr    ] o.a.s.c.o.SliceMutator New Slice: shard1:{
   [junit4]   2>   "range":"80000000-7fffffff",
   [junit4]   2>   "state":"active",
   [junit4]   2>   "replicas":{"core_node3":{
   [junit4]   2>       "core":"AutoscalingHistoryHandlerTest_collection_shard1_replica_n1",
   [junit4]   2>       "base_url":"http://127.0.0.1:58050/solr",
   [junit4]   2>       "state":"down",
   [junit4]   2>       "node_name":null,
   [junit4]   2>       "type":"NRT"}}}
   [junit4]   2> 3539153 DEBUG (OverseerStateUpdate-98872557801701382-127.0.0.1:58038_solr-n_0000000000) [n:127.0.0.1:58038_solr    ] o.a.s.c.Overseer processMessage: queueSize: 2, message = {
   [junit4]   2>   "operation":"ADDREPLICA",
   [junit4]   2>   "collection":"AutoscalingHistoryHandlerTest_collection",
   [junit4]   2>   "shard":"shard1",
   [junit4]   2>   "core":"AutoscalingHistoryHandlerTest_collection_shard1_replica_n2",
   [junit4]   2>   "state":"down",
   [junit4]   2>   "base_url":"http://127.0.0.1:58038/solr",
   [junit4]   2>   "type":"NRT",
   [junit4]   2>   "waitForFinalState":"false"} current state version: 0
   [junit4]   2> 3539153 INFO  (OverseerStateUpdate-98872557801701382-127.0.0.1:58038_solr-n_0000000000) [n:127.0.0.1:58038_solr    ] o.a.s.c.o.SliceMutator createReplica() {
   [junit4]   2>   "operation":"ADDREPLICA",
   [junit4]   2>   "collection":"AutoscalingHistoryHandlerTest_collection",
   [junit4]   2>   "shard":"shard1",
   [junit4]   2>   "core":"AutoscalingHistoryHandlerTest_collection_shard1_replica_n2",
   [junit4]   2>   "state":"down",
   [junit4]   2>   "base_url":"http://127.0.0.1:58038/solr",
   [junit4]   2>   "type":"NRT",
   [junit4]   2>   "waitForFinalState":"false"} 
   [junit4]   2> 3539154 DEBUG (OverseerStateUpdate-98872557801701382-127.0.0.1:58038_solr-n_0000000000) [n:127.0.0.1:58038_solr    ] o.a.s.c.o.SliceMutator Old Slice: shard1:{
   [junit4]   2>   "range":"80000000-7fffffff",
   [junit4]   2>   "state":"active",
   [junit4]   2>   "replicas":{"core_node3":{
   [junit4]   2>       "core":"AutoscalingHistoryHandlerTest_collection_shard1_replica_n1",
   [junit4]   2>       "base_url":"http://127.0.0.1:58050/solr",
   [junit4]   2>       "state":"down",
   [junit4]   2>       "node_name":null,
   [junit4]   2>       "type":"NRT"}}}
   [junit4]   2> 3539155 DEBUG (OverseerStateUpdate-98872557801701382-127.0.0.1:58038_solr-n_0000000000) [n:127.0.0.1:58038_solr    ] o.a.s.c.o.SliceMutator New Slice: shard1:{
   [junit4]   2>   "range":"80000000-7fffffff",
   [junit4]   2>   "state":"active",
   [junit4]   2>   "replicas":{
   [junit4]   2>     "core_node3":{
   [junit4]   2>       "core":"AutoscalingHistoryHandlerTest_collection_shard1_replica_n1",
   [junit4]   2>       "base_url":"http://127.0.0.1:58050/solr",
   [junit4]   2>       "state":"down",
   [junit4]   2>       "node_name":null,
   [junit4]   2>       "type":"NRT"},
   [junit4]   2>     "core_node5":{
   [junit4]   2>       "core":"AutoscalingHistoryHandlerTest_collection_shard1_replica_n2",
   [junit4]   2>       "base_url":"http://127.0.0.1:58038/solr",
   [junit4]   2>       "state":"down",
   [junit4]   2>       "node_name":null,
   [junit4]   2>       "type":"NRT"}}}
   [junit4]   2> 3539156 DEBUG (OverseerStateUpdate-98872557801701382-127.0.0.1:58038_solr-n_0000000000) [n:127.0.0.1:58038_solr    ] o.a.s.c.Overseer processMessage: queueSize: 3, message = {
   [junit4]   2>   "operation":"ADDREPLICA",
   [junit4]   2>   "collection":"AutoscalingHistoryHandlerTest_collection",
   [junit4]   2>   "shard":"shard1",
   [junit4]   2>   "core":"AutoscalingHistoryHandlerTest_collection_shard1_replica_n4",
   [junit4]   2>   "state":"down",
   [junit4]   2>   "base_url":"http://127.0.0.1:58041/solr",
   [junit4]   2>   "type":"NRT",
   [junit4]   2>   "waitForFinalState":"false"} current state version: 0
   [junit4]   2> 3539156 INFO  (OverseerStateUpdate-98872557801701382-127.0.0.1:58038_solr-n_0000000000) [n:127.0.0.1:58038_solr    ] o.a.s.c.o.SliceMutator createReplica() {
   [junit4]   2>   "operation":"ADDREPLICA",
   [junit4]   2>   "collection":"AutoscalingHistoryHandlerTest_collection",
   [junit4]   2>   "shard":"shard1",
   [junit4]   2>   "core":"AutoscalingHistoryHandlerTest_collection_shard1_replica_n4",
   [junit4]   2>   "state":"down",
   [junit4]   2>   "base_url":"http://127.0.0.1:58041/solr",
   [junit4]   2>   "type":"NRT",
   [junit4]   2>   "waitForFinalState":"false"} 
   [junit4]   2> 3539158 DEBUG (OverseerStateUpdate-98872557801701382-127.0.0.1:58038_solr-n_0000000000) [n:127.0.0.1:58038_solr    ] o.a.s.c.o.SliceMutator Old Slice: shard1:{
   [junit4]   2>   "range":"80000000-7fffffff",
   [junit4]   2>   "state":"active",
   [junit4]   2>   "replicas":{
   [junit4]   2>     "core_node3":{
   [junit4]   2>       "core":"AutoscalingHistoryHandlerTest_collection_shard1_replica_n1",
   [junit4]   2>       "base_url":"http://127.0.0.1:58050/solr",
   [junit4]   2>       "state":"down",
   [junit4]   2>       "node_name":null,
   [junit4]   2>       "type":"NRT"},
   [junit4]   2>     "core_node5":{
   [junit4]   2>       "core":"AutoscalingHistoryHandlerTest_collection_shard1_replica_n2",
   [junit4]   2>       "base_url":"http://127.0.0.1:58038/solr",
   [junit4]   2>       "state":"down",
   [junit4]   2>       "node_name":null,
   [junit4]   2>       "type":"NRT"}}}
   [junit4]   2> 3539158 DEBUG (OverseerStateUpdate-98872557801701382-127.0.0.1:58038_solr-n_0000000000) [n:127.0.0.1:58038_solr    ] o.a.s.c.o.SliceMutator New Slice: shard1:{
   [junit4]   2>   "range":"80000000-7fffffff",
   [junit4]   2>   "state":"active",
   [junit4]   2>   "replicas":{
   [junit4]   2>     "core_node3":{
   [junit4]   2>       "core":"AutoscalingHistoryHandlerTest_collection_shard1_replica_n1",
   [junit4]   2>       "base_url":"http://127.0.0.1:58050/solr",
   [junit4]   2>       "state":"down",
   [junit4]   2>       "node_name":null,
   [junit4]   2>       "type":"NRT"},
   [junit4]   2>     "core_node5":{
   [junit4]   2>       "core":"AutoscalingHistoryHandlerTest_collection_shard1_replica_n2",
   [junit4]   2>       "base_url":"http://127.0.0.1:58038/solr",
   [junit4]   2>       "state":"down",
   [junit4]   2>       "node_name":null,
   [junit4]   2>       "type":"NRT"},
   [junit4]   2>     "core_node6":{
   [junit4]   2>       "core":"AutoscalingHistoryHandlerTest_collection_shard1_replica_n4",
   [junit4]   2>       "base_url":"http://127.0.0.1:58041/solr",
   [junit4]   2>       "state":"down",
   [junit4]   2>       "node_name":null,
   [junit4]   2>       "type":"NRT"}}}
   [junit4]   2> 3539259 DEBUG (OverseerStateUpdate-98872557801701382-127.0.0.1:58038_solr-n_0000000000) [n:127.0.0.1:58038_solr    ] o.a.s.c.o.ZkStateWriter going to update_collection /collections/AutoscalingHistoryHandlerTest_collection/state.json version: 0
   [junit4]   2> 3539361 INFO  (qtp2083164565-26689) [n:127.0.0.1:58038_solr    ] o.a.s.h.a.CoreAdminOperation core create command qt=/admin/cores&coreNodeName=core_node5&collection.configName=AutoscalingHistoryHandlerTest_collection&newCollection=true&name=AutoscalingHistoryHandlerTest_collection_shard1_replica_n2&action=CREATE&numShards=1&collection=AutoscalingHistoryHandlerTest_collection&shard=shard1&wt=javabin&version=2&replicaType=NRT
   [junit4]   2> 3539361 INFO  (qtp1192185322-26695) [n:127.0.0.1:58041_solr    ] o.a.s.h.a.CoreAdminOperation core create command qt=/admin/cores&coreNodeName=core_node6&collection.configName=AutoscalingHistoryHandlerTest_collection&newCollection=true&name=AutoscalingHistoryHandlerTest_collection_shard1_replica_n4&action=CREATE&numShards=1&collection=AutoscalingHistoryHandlerTest_collection&shard=shard1&wt=javabin&version=2&replicaType=NRT
   [junit4]   2> 3539361 INFO  (qtp696545289-26711) [n:127.0.0.1:58050_solr    ] o.a.s.h.a.CoreAdminOperation core create command qt=/admin/cores&coreNodeName=core_node3&collection.configName=AutoscalingHistoryHandlerTest_collection&newCollection=true&name=AutoscalingHistoryHandlerTest_collection_shard1_replica_n1&action=CREATE&numShards=1&collection=AutoscalingHistoryHandlerTest_collection&shard=shard1&wt=javabin&version=2&replicaType=NRT
   [junit4]   2> 3539365 INFO  (qtp2083164565-26689) [n:127.0.0.1:58038_solr    ] o.a.s.c.TransientSolrCoreCacheDefault Allocating transient cache for 2147483647 transient cores
   [junit4]   2> 3539367 INFO  (qtp1192185322-26695) [n:127.0.0.1:58041_solr    ] o.a.s.c.TransientSolrCoreCacheDefault Allocating transient cache for 2147483647 transient cores
   [junit4]   2> 3539368 INFO  (qtp696545289-26711) [n:127.0.0.1:58050_solr    ] o.a.s.c.TransientSolrCoreCacheDefault Allocating transient cache for 2147483647 transient cores
   [junit4]   2> 3539376 DEBUG (OverseerStateUpdate-98872557801701382-127.0.0.1:58038_solr-n_0000000000) [n:127.0.0.1:58038_solr    ] o.a.s.c.Overseer processMessage: queueSize: 3, message = {
   [junit4]   2>   "core":"AutoscalingHistoryHandlerTest_collection_shard1_replica_n2",
   [junit4]   2>   "core_node_name":"core_node5",
   [junit4]   2>   "roles":null,
   [junit4]   2>   "base_url":"http://127.0.0.1:58038/solr",
   [junit4]   2>   "node_name":"127.0.0.1:58038_solr",
   [junit4]   2>   "numShards":"1",
   [junit4]   2>   "state":"down",
   [junit4]   2>   "shard":"shard1",
   [junit4]   2>   "collection":"AutoscalingHistoryHandlerTest_collection",
   [junit4]   2>   "type":"NRT",
   [junit4]   2>   "operation":"state"} current state version: 0
   [junit4]   2> 3539377 DEBUG (OverseerStateUpdate-98872557801701382-127.0.0.1:58038_solr-n_0000000000) [n:127.0.0.1:58038_solr    ] o.a.s.c.o.ReplicaMutator Update state numShards=1 message={
   [junit4]   2>   "core":"AutoscalingHistoryHandlerTest_collection_shard1_replica_n2",
   [junit4]   2>   "core_node_name":"core_node5",
   [junit4]   2>   "roles":null,
   [junit4]   2>   "base_url":"http://127.0.0.1:58038/solr",
   [junit4]   2>   "node_name":"127.0.0.1:58038_solr",
   [junit4]   2>   "numShards":"1",
   [junit4]   2>   "state":"down",
   [junit4]   2>   "shard":"shard1",
   [junit4]   2>   "collection":"AutoscalingHistoryHandlerTest_collection",
   [junit4]   2>   "type":"NRT",
   [junit4]   2>   "operation":"state"}
   [junit4]   2> 3539377 DEBUG (OverseerStateUpdate-98872557801701382-127.0.0.1:58038_solr-n_0000000000) [n:127.0.0.1:58038_solr    ] o.a.s.c.o.ReplicaMutator Will update state for replica: core_node5:{"core":"AutoscalingHistoryHandlerTest_collection_shard1_replica_n2","base_url":"http://127.0.0.1:58038/solr","node_name":"127.0.0.1:58038_solr","state":"down","type":"NRT"}
   [junit4]   2> 3539377 DEBUG (OverseerStateUpdate-98872557801701382-127.0.0.1:58038_solr-n_0000000000) [n:127.0.0.1:58038_solr    ] o.a.s.c.o.ReplicaMutator Collection is now: DocCollection(AutoscalingHistoryHandlerTest_collection//collections/AutoscalingHistoryHandlerTest_collection/state.json/1)={
   [junit4]   2>   "pullReplicas":"0",
   [junit4]   2>   "replicationFactor":"3",
   [junit4]   2>   "router":{"name":"compositeId"},
   [junit4]   2>   "maxShardsPerNode":"1",
   [junit4]   2>   "autoAddReplicas":"false",
   [junit4]   2>   "nrtReplicas":"3",
   [junit4]   2>   "tlogReplicas":"0",
   [junit4]   2>   "shards":{"shard1":{
   [junit4]   2>       "range":"80000000-7fffffff",
   [junit4]   2>       "state":"active",
   [junit4]   2>       "replicas":{
   [junit4]   2>         "core_node3":{
   [junit4]   2>           "core":"AutoscalingHistoryHandlerTest_collection_shard1_replica_n1",
   [junit4]   2>           "base_url":"http://127.0.0.1:58050/solr",
   [junit4]   2>           "state":"down",
   [junit4]   2>           "node_name":null,
   [junit4]   2>           "type":"NRT"},
   [junit4]   2>         "core_node5":{
   [junit4]   2>           "core":"AutoscalingHistoryHandlerTest_collection_shard1_replica_n2",
   [junit4]   2>           "base_url":"http://127.0.0.1:58038/solr",
   [junit4]   2>           "node_name":"127.0.0.1:58038_solr",
   [junit4]   2>           "state":"down",
   [junit4]   2>           "type":"NRT"},
   [junit4]   2>         "core_node6":{
   [junit4]   2>           "core":"AutoscalingHistoryHandlerTest_collection_shard1_replica_n4",
   [junit4]   2>           "base_url":"http://127.0.0.1:58041/solr",
   [junit4]   2>           "state":"down",
   [junit4]   2>           "node_name":null,
   [junit4]   2>           "type":"NRT"}}}}}
   [junit4]   2> 3539377 DEBUG (OverseerStateUpdate-98872557801701382-127.0.0.1:58038_solr-n_0000000000) [n:127.0.0.1:58038_solr    ] o.a.s.c.Overseer processMessage: queueSize: 3, message = {
   [junit4]   2>   "core":"AutoscalingHistoryHandlerTest_collection_shard1_replica_n1",
   [junit4]   2>   "core_node_name":"core_node3",
   [junit4]   2>   "roles":null,
   [junit4]   2>   "base_url":"http://127.0.0.1:58050/solr",
   [junit4]   2>   "node_name":"127.0.0.1:58050_solr",
   [junit4]   2>   "numShards":"1",
   [junit4]   2>   "state":"down",
   [junit4]   2>   "shard":"shard1",
   [junit4]   2>   "collection":"AutoscalingHistoryHandlerTest_collection",
   [junit4]   2>   "type":"NRT",
   [junit4]   2>   "operation":"state"} current state version: 0
   [junit4]   2> 3539377 DEBUG (OverseerStateUpdate-98872557801701382-127.0.0.1:58038_solr-n_0000000000) [n:127.0.0.1:58038_solr    ] o.a.s.c.o.ReplicaMutator Update state numShards=1 message={
   [junit4]   2>   "core":"AutoscalingHistoryHandlerTest_collection_shard1_replica_n1",
   [junit4]   2>   "core_node_name":"core_node3",
   [junit4]   2>   "roles":null,
   [junit4]   2>   "base_url":"http://127.0.0.1:58050/solr",
   [junit4]   2>   "node_name":"127.0.0.1:58050_solr",
   [junit4]   2>   "numShards":"1",
   [junit4]   2>   "state":"down",
   [junit4]   2>   "shard":"shard1",
   [junit4]   2>   "collection":"AutoscalingHistoryHandlerTest_collection",
   [junit4]   2>   "type":"NRT",
   [junit4]   2>   "operation":"state"}
   [junit4]   2> 3539377 DEBUG (OverseerStateUpdate-98872557801701382-127.0.0.1:58038_solr-n_0000000000) [n:127.0.0.1:58038_solr    ] o.a.s.c.o.ReplicaMutator Will update state for replica: core_node3:{"core":"AutoscalingHistoryHandlerTest_collection_shard1_replica_n1","base_url":"http://127.0.0.1:58050/solr","node_name":"127.0.0.1:58050_solr","state":"down","type":"NRT"}
   [junit4]   2> 3539377 DEBUG (OverseerStateUpdate-98872557801701382-127.0.0.1:58038_solr-n_0000000000) [n:127.0.0.1:58038_solr    ] o.a.s.c.o.ReplicaMutator Collection is now: DocCollection(AutoscalingHistoryHandlerTest_collection//collections/AutoscalingHistoryHandlerTest_collection/state.json/1)={
   [junit4]   2>   "pullReplicas":"0",
   [junit4]   2>   "replicationFactor":"3",
   [junit4]   2>   "router":{"name":"compositeId"},
   [junit4]   2>   "maxShardsPerNode":"1",
   [junit4]   2>   "autoAddReplicas":"false",
   [junit4]   2>   "nrtReplicas":"3",
   [junit4]   2>   "tlogReplicas":"0",
   [junit4]   2>   "shards":{"shard1":{
   [junit4]   2>       "range":"80000000-7fffffff",
   [junit4]   2>       "state":"active",
   [junit4]   2>       "replicas":{
   [junit4]   2>         "core_node3":{
   [junit4]   2>           "core":"AutoscalingHistoryHandlerTest_collection_shard1_replica_n1",
   [junit4]   2>           "base_url":"http://127.0.0.1:58050/solr",
   [junit4]   2>           "node_name":"127.0.0.1:58050_solr",
   [junit4]   2>           "state":"down",
   [junit4]   2>           "type":"NRT"},
   [junit4]   2>         "core_node5":{
   [junit4]   2>           "core":"AutoscalingHistoryHandlerTest_collection_shard1_replica_n2",
   [junit4]   2>           "base_url":"http://127.0.0.1:58038/solr",
   [junit4]   2>           "node_name":"127.0.0.1:58038_solr",
   [junit4]   2>           "state":"down",
   [junit4]   2>           "type":"NRT"},
   [junit4]   2>         "core_node6":{
   [junit4]   2>           "core":"AutoscalingHistoryHandlerTest_collection_shard1_replica_n4",
   [junit4]   2>           "base_url":"http://127.0.0.1:58041/solr",
   [junit4]   2>           "state":"down",
   [junit4]   2>           "node_name":null,
   [junit4]   2>           "type":"NRT"}}}}}
   [junit4]   2> 3539378 DEBUG (OverseerStateUpdate-98872557801701382-127.0.0.1:58038_solr-n_0000000000) [n:127.0.0.1:58038_solr    ] o.a.s.c.Overseer processMessage: queueSize: 3, message = {
   [junit4]   2>   "core":"AutoscalingHistoryHandlerTest_collection_shard1_replica_n4",
   [junit4]   2>   "core_node_name":"core_node6",
   [junit4]   2>   "roles":null,
   [junit4]   2>   "base_url":"http://127.0.0.1:58041/solr",
   [junit4]   2>   "node_name":"127.0.0.1:58041_solr",
   [junit4]   2>   "numShards":"1",
   [junit4]   2>   "state":"down",
   [junit4]   2>   "shard":"shard1",
   [junit4]   2>   "collection":"AutoscalingHistoryHandlerTest_collection",
   [junit4]   2>   "type":"NRT",
   [junit4]   2>   "operation":"state"} current state version: 0
   [junit4]   2> 3539378 DEBUG (OverseerStateUpdate-98872557801701382-127.0.0.1:58038_solr-n_0000000000) [n:127.0.0.1:58038_solr    ] o.a.s.c.o.ReplicaMutator Update state numShards=1 message={
   [junit4]   2>   "core":"AutoscalingHistoryHandlerTest_collection_shard1_replica_n4",
   [junit4]   2>   "core_node_name":"core_node6",
   [junit4]   2>   "roles":null,
   [junit4]   2>   "base_url":"http://127.0.0.1:58041/solr",
   [junit4]   2>   "node_name":"127.0.0.1:58041_solr",
   [junit4]   2>   "numShards":"1",
   [junit4]   2>   "state":"down",
   [junit4]   2>   "shard":"shard1",
   [junit4]   2>   "collection":"AutoscalingHistoryHandlerTest_collection",
   [junit4]   2>   "type":"NRT",
   [junit4]   2>   "operation":"state"}
   [junit4]   2> 3539378 DEBUG (OverseerStateUpdate-98872557801701382-127.0.0.1:58038_solr-n_0000000000) [n:127.0.0.1:58038_solr    ] o.a.s.c.o.ReplicaMutator Will update state for replica: core_node6:{"core":"AutoscalingHistoryHandlerTest_collection_shard1_replica_n4","base_url":"http://127.0.0.1:58041/solr","node_name":"127.0.0.1:58041_solr","state":"down","type":"NRT"}
   [junit4]   2> 3539378 DEBUG (OverseerStateUpdate-98872557801701382-127.0.0.1:58038_solr-n_0000000000) [n:127.0.0.1:58038_solr    ] o.a.s.c.o.ReplicaMutator Collection is now: DocCollection(AutoscalingHistoryHandlerTest_collection//collections/AutoscalingHistoryHandlerTest_collection/state.json/1)={
   [junit4]   2>   "pullReplicas":"0",
   [junit4]   2>   "replicationFactor":"3",
   [junit4]   2>   "router":{"name":"compositeId"},
   [junit4]   2>   "maxShardsPerNode":"1",
   [junit4]   2>   "autoAddReplicas":"false",
   [junit4]   2>   "nrtReplicas":"3",
   [junit4]   2>   "tlogReplicas":"0",
   [junit4]   2>   "shards":{"shard1":{
   [junit4]   2>       "range":"80000000-7fffffff",
   [junit4]   2>       "state":"active",
   [junit4]   2>       "replicas":{
   [junit4]   2>         "core_node3":{
   [junit4]   2>           "core":"AutoscalingHistoryHandlerTest_collection_shard1_replica_n1",
   [junit4]   2>           "base_url":"http://127.0.0.1:58050/solr",
   [junit4]   2>           "node_name":"127.0.0.1:58050_solr",
   [junit4]   2>           "state":"down",
   [junit4]   2>           "type":"NRT"},
   [junit4]   2>         "core_node5":{
   [junit4]   2>           "core":"AutoscalingHistoryHandlerTest_collection_shard1_replica_n2",
   [junit4]   2>           "base_url":"http://127.0.0.1:58038/solr",
   [junit4]   2>           "node_name":"127.0.0.1:58038_solr",
   [junit4]   2>           "state":"down",
   [junit4]   2>           "type":"NRT"},
   [junit4]   2>         "core_node6":{
   [junit4]   2>           "core":"AutoscalingHistoryHandlerTest_collection_shard1_replica_n4",
   [junit4]   2>           "base_url":"http://127.0.0.1:58041/solr",
   [junit4]   2>           "node_name":"127.0.0.1:58041_solr",
   [junit4]   2>           "state":"down",
   [junit4]   2>           "type":"NRT"}}}}}
   [junit4]   2> 3539479 DEBUG (OverseerStateUpdate-98872557801701382-127.0.0.1:58038_solr-n_0000000000) [n:127.0.0.1:58038_solr    ] o.a.s.c.o.ZkStateWriter going to update_collection /collections/AutoscalingHistoryHandlerTest_collection/state.json version: 1
   [junit4]   2> 3539479 INFO  (zkCallback-6269-thread-1-processing-n:127.0.0.1:58038_solr) [n:127.0.0.1:58038_solr    ] o.a.s.c.c.ZkStateReader A cluster state change: [WatchedEvent state:SyncConnected type:NodeDataChanged path:/collections/AutoscalingHistoryHandlerTest_collection/state.json] for collection [AutoscalingHistoryHandlerTest_collection] has occurred - updating... (live nodes size: [3])
   [junit4]   2> 3539479 INFO  (zkCallback-6272-thread-1-processing-n:127.0.0.1:58041_solr) [n:127.0.0.1:58041_solr    ] o.a.s.c.c.ZkStateReader A cluster state change: [WatchedEvent state:SyncConnected type:NodeDataChanged path:/collections/AutoscalingHistoryHandlerTest_collection/state.json] for collection [AutoscalingHistoryHandlerTest_collection] has occurred - updating... (live nodes size: [3])
   [junit4]   2> 3539479 INFO  (zkCallback-6274-thread-1-processing-n:127.0.0.1:58050_solr) [n:127.0.0.1:58050_solr    ] o.a.s.c.c.ZkStateReader A cluster state change: [WatchedEvent state:SyncConnected type:NodeDataChanged path:/collections/AutoscalingHistoryHandlerTest_collection/state.json] for collection [AutoscalingHistoryHandlerTest_collection] has occurred - updating... (live nodes size: [3])
   [junit4]   2> 3539480 INFO  (zkCallback-6272-thread-2-processing-n:127.0.0.1:58041_solr) [n:127.0.0.1:58041_solr    ] o.a.s.c.c.ZkStateReader A cluster state change: [WatchedEvent state:SyncConnected type:NodeDataChanged path:/collections/AutoscalingHistoryHandlerTest_collection/state.json] for collection [AutoscalingHistoryHandlerTest_collection] has occurred - updating... (live nodes size: [3])
   [junit4]   2> 3539480 INFO  (zkCallback-6269-thread-2-processing-n:127.0.0.1:58038_solr) [n:127.0.0.1:58038_solr    ] o.a.s.c.c.ZkStateReader A cluster state change: [WatchedEvent state:SyncConnected type:NodeDataChanged path:/collections/AutoscalingHistoryHandlerTest_collection/state.json] for collection [AutoscalingHistoryHandlerTest_collection] has occurred - updating... (live nodes size: [3])
   [junit4]   2> 3539480 INFO  (zkCallback-6274-thread-2-processing-n:127.0.0.1:58050_solr) [n:127.0.0.1:58050_solr    ] o.a.s.c.c.ZkStateReader A cluster state change: [WatchedEvent state:SyncConnected type:NodeDataChanged path:/collections/AutoscalingHistoryHandlerTest_collection/state.json] for collection [AutoscalingHistoryHandlerTest_collection] has occurred - updating... (live nodes size: [3])
   [junit4]   2> 3539822 DEBUG (ScheduledTrigger-10102-thread-1) [n:127.0.0.1:58038_solr    ] o.a.s.c.a.NodeLostTrigger Running NodeLostTrigger: .auto_add_replicas with currently live nodes: [127.0.0.1:58038_solr, 127.0.0.1:58050_solr, 127.0.0.1:58041_solr]
   [junit4]   2> 3540394 INFO  (qtp696545289-26711) [n:127.0.0.1:58050_solr c:AutoscalingHistoryHandlerTest_collection s:shard1 r:core_node3 x:AutoscalingHistoryHandlerTest_collection_shard1_replica_n1] o.a.s.c.RequestParams conf resource params.json loaded . version : 0 
   [junit4]   2> 3540394 INFO  (qtp696545289-26711) [n:127.0.0.1:58050_solr c:AutoscalingHistoryHandlerTest_collection s:shard1 r:core_node3 x:AutoscalingHistoryHandlerTest_collection_shard1_replica_n1] o.a.s.c.RequestParams request params refreshed to version 0
   [junit4]   2> 3540394 INFO  (qtp2083164565-26689) [n:127.0.0.1:58038_solr c:AutoscalingHistoryHandlerTest_collection s:shard1 r:core_node5 x:AutoscalingHistoryHandlerTest_collection_shard1_replica_n2] o.a.s.c.RequestParams conf resource params.json loaded . version : 0 
   [junit4]   2> 3540394 INFO  (qtp2083164565-26689) [n:127.0.0.1:58038_solr c:AutoscalingHistoryHandlerTest_collection s:shard1 r:core_node5 x:AutoscalingHistoryHandlerTest_collection_shard1_replica_n2] o.a.s.c.RequestParams request params refreshed to version 0
   [junit4]   2> 3540395 WARN  (qtp696545289-26711) [n:127.0.0.1:58050_solr c:AutoscalingHistoryHandlerTest_collection s:shard1 r:core_node3 x:AutoscalingHistoryHandlerTest_collection_shard1_replica_n1] o.a.s.c.SolrConfig Couldn't add files from C:\Users\jenkins\workspace\Lucene-Solr-master-Windows\solr\build\solr-core\test\J1\temp\solr.handler.admin.AutoscalingHistoryHandlerTest_8C9762697070A327-001\tempDir-001\node3\AutoscalingHistoryHandlerTest_collection_shard1_replica_n1\..\..\..\..\contrib\extraction\lib filtered by .*\.jar to classpath: C:\Users\jenkins\workspace\Lucene-Solr-master-Windows\solr\build\solr-core\test\J1\temp\solr.handler.admin.AutoscalingHistoryHandlerTest_8C9762697070A327-001\tempDir-001\node3\AutoscalingHistoryHandlerTest_collection_shard1_replica_n1\..\..\..\..\contrib\extraction\lib
   [junit4]   2> 3540395 WARN  (qtp2083164565-26689) [n:127.0.0.1:58038_solr c:AutoscalingHistoryHandlerTest_collection s:shard1 r:core_node5 x:AutoscalingHistoryHandlerTest_collection_shard1_replica_n2] o.a.s.c.SolrConfig Couldn't add files from C:\Users\jenkins\workspace\Lucene-Solr-master-Windows\solr\build\solr-core\test\J1\temp\solr.handler.admin.AutoscalingHistoryHandlerTest_8C9762697070A327-001\tempDir-001\node1\AutoscalingHistoryHandlerTest_collection_shard1_replica_n2\..\..\..\..\contrib\extraction\lib filtered by .*\.jar to classpath: C:\Users\jenkins\workspace\Lucene-Solr-master-Windows\solr\build\solr-core\test\J1\temp\solr.handler.admin.AutoscalingHistoryHandlerTest_8C9762697070A327-001\tempDir-001\node1\AutoscalingHistoryHandlerTest_collection_shard1_replica_n2\..\..\..\..\contrib\extraction\lib
   [junit4]   2> 3540396 WARN  (qtp696545289-26711) [n:127.0.0.1:58050_solr c:AutoscalingHistoryHandlerTest_collection s:shard1 r:core_node3 x:AutoscalingHistoryHandlerTest_collection_shard1_replica_n1] o.a.s.c.SolrConfig Couldn't add files from C:\Users\jenkins\workspace\Lucene-Solr-master-Windows\solr\build\solr-core\test\J1\temp\solr.handler.admin.AutoscalingHistoryHandlerTest_8C9762697070A327-001\tempDir-001\node3\AutoscalingHistoryHandlerTest_collection_shard1_replica_n1\..\..\..\..\dist filtered by solr-cell-\d.*\.jar to classpath: C:\Users\jenkins\workspace\Lucene-Solr-master-Windows\solr\build\solr-core\test\J1\temp\solr.handler.admin.AutoscalingHistoryHandlerTest_8C9762697070A327-001\tempDir-001\node3\AutoscalingHistoryHandlerTest_collection_shard1_replica_n1\..\..\..\..\dist
   [junit4]   2> 3540396 WARN  (qtp2083164565-26689) [n:127.0.0.1:58038_solr c:AutoscalingHistoryHandlerTest_collection s:shard1 r:core_node5 x:AutoscalingHistoryHandlerTest_collection_shard1_replica_n2] o.a.s.c.SolrConfig Couldn't add files from C:\Users\jenkins\workspace\Lucene-Solr-master-Windows\solr\build\solr-core\test\J1\temp\solr.handler.admin.AutoscalingHistoryHandlerTest_8C9762697070A327-001\tempDir-001\node1\AutoscalingHistoryHandlerTest_collection_shard1_replica_n2\..\..\..\..\dist filtered by solr-cell-\d.*\.jar to classpath: C:\Users\jenkins\workspace\Lucene-Solr-master-Windows\solr\build\solr-core\test\J1\temp\solr.handler.admin.AutoscalingHistoryHandlerTest_8C9762697070A327-001\tempDir-001\node1\AutoscalingHistoryHandlerTest_collection_shard1_replica_n2\..\..\..\..\dist
   [junit4]   2> 3540396 WARN  (qtp696545289-26711) [n:127.0.0.1:58050_solr c:AutoscalingHistoryHandlerTest_collection s:shard1 r:core_node3 x:AutoscalingHistoryHandlerTest_collection_shard1_replica_n1] o.a.s.c.SolrConfig Couldn't add files from C:\Users\jenkins\workspace\Lucene-Solr-master-Windows\solr\build\solr-core\test\J1\temp\solr.handler.admin.AutoscalingHistoryHandlerTest_8C9762697070A327-001\tempDir-001\node3\AutoscalingHistoryHandlerTest_collection_shard1_replica_n1\..\..\..\..\contrib\clustering\lib filtered by .*\.jar to classpath: C:\Users\jenkins\workspace\Lucene-Solr-master-Windows\solr\build\solr-core\test\J1\temp\solr.handler.admin.AutoscalingHistoryHandlerTest_8C9762697070A327-001\tempDir-001\node3\AutoscalingHistoryHandlerTest_collection_shard1_replica_n1\..\..\..\..\contrib\clustering\lib
   [junit4]   2> 3540396 WARN  (qtp2083164565-26689) [n:127.0.0.1:58038_solr c:AutoscalingHistoryHandlerTest_collection s:shard1 r:core_node5 x:AutoscalingHistoryHandlerTest_collection_shard1_replica_n2] o.a.s.c.SolrConfig Couldn't add files from C:\Users\jenkins\workspace\Lucene-Solr-master-Windows\solr\build\solr-core\test\J1\temp\solr.handler.admin.AutoscalingHistoryHandlerTest_8C9762697070A327-001\tempDir-001\node1\AutoscalingHistoryHandlerTest_collection_shard1_replica_n2\..\..\..\..\contrib\clustering\lib filtered by .*\.jar to classpath: C:\Users\jenkins\workspace\Lucene-Solr-master-Windows\solr\build\solr-core\test\J1\temp\solr.handler.admin.AutoscalingHistoryHandlerTest_8C9762697070A327-001\tempDir-001\node1\AutoscalingHistoryHandlerTest_collection_shard1_replica_n2\..\..\..\..\contrib\clustering\lib
   [junit4]   2> 3540396 INFO  (qtp1192185322-26695) [n:127.0.0.1:58041_solr c:AutoscalingHistoryHandlerTest_collection s:shard1 r:core_node6 x:AutoscalingHistoryHandlerTest_collection_shard1_replica_n4] o.a.s.c.RequestParams conf resource params.json loaded . version : 0 
   [junit4]   2> 3540396 WARN  (qtp2083164565-26689) [n:127.0.0.1:58038_solr c:AutoscalingHistoryHandlerTest_collection s:shard1 r:core_node5 x:AutoscalingHistoryHandlerTest_collection_shard1_replica_n2] o.a.s.c.SolrConfig Couldn't add files from C:\Users\jenkins\workspace\Lucene-Solr-master-Windows\solr\build\solr-core\test\J1\temp\solr.handler.admin.AutoscalingHistoryHandlerTest_8C9762697070A327-001\tempDir-001\node1\AutoscalingHistoryHandlerTest_collection_shard1_replica_n2\..\..\..\..\dist filtered by solr-clustering-\d.*\.jar to classpath: C:\Users\jenkins\workspace\Lucene-Solr-master-Windows\solr\build\solr-core\test\J1\temp\solr.handler.admin.AutoscalingHistoryHandlerTest_8C9762697070A327-001\tempDir-001\node1\AutoscalingHistoryHandlerTest_collection_shard1_replica_n2\..\..\..\..\dist
   [junit4]   2> 3540396 WARN  (qtp696545289-26711) [n:127.0.0.1:58050_solr c:AutoscalingHistoryHandlerTest_collection s:shard1 r:core_node3 x:AutoscalingHistoryHandlerTest_collection_shard1_replica_n1] o.a.s.c.SolrConfig Couldn't add files from C:\Users\jenkins\workspace\Lucene-Solr-master-Windows\solr\build\solr-core\test\J1\temp\solr.handler.admin.AutoscalingHistoryHandlerTest_8C9762697070A327-001\tempDir-001\node3\AutoscalingHistoryHandlerTest_collection_shard1_replica_n1\..\..\..\..\dist filtered by solr-clustering-\d.*\.jar to classpath: C:\Users\jenkins\workspace\Lucene-Solr-master-Windows\solr\build\solr-core\test\J1\temp\solr.handler.admin.AutoscalingHistoryHandlerTest_8C9762697070A327-001\tempDir-001\node3\AutoscalingHistoryHandlerTest_collection_shard1_replica_n1\..\..\..\..\dist
   [junit4]   2> 3540397 INFO  (qtp1192185322-26695) [n:127.0.0.1:58041_solr c:AutoscalingHistoryHandlerTest_collection s:shard1 r:core_node6 x:AutoscalingHistoryHandlerTest_collection_shard1_replica_n4] o.a.s.c.RequestParams request params refreshed to version 0
   [junit4]   2> 3540397 WARN  (qtp696545289-26711) [n:127.0.0.1:58050_solr c:AutoscalingHistoryHandlerTest_collection s:shard1 r:core_node3 x:AutoscalingHistoryHandlerTest_collection_shard1_replica_n1] o.a.s.c.SolrConfig Couldn't add files from C:\Users\jenkins\workspace\Lucene-Solr-master-Windows\solr\build\solr-core\test\J1\temp\solr.handler.admin.AutoscalingHistoryHandlerTest_8C9762697070A327-001\tempDir-001\node3\AutoscalingHistoryHandlerTest_collection_shard1_replica_n1\..\..\..\..\contrib\langid\lib filtered by .*\.jar to classpath: C:\Users\jenkins\workspace\Lucene-Solr-master-Windows\solr\build\solr-core\test\J1\temp\solr.handler.admin.AutoscalingHistoryHandlerTest_8C9762697070A327-001\tempDir-001\node3\AutoscalingHistoryHandlerTest_collection_shard1_replica_n1\..\..\..\..\contrib\langid\lib
   [junit4]   2> 3540397 WARN  (qtp696545289-26711) [n:127.0.0.1:58050_solr c:AutoscalingHistoryHandlerTest_collection s:shard1 r:core_node3 x:AutoscalingHistoryHandlerTest_collection_shard1_replica_n1] o.a.s.c.SolrConfig Couldn't add files from C:\Users\jenkins\workspace\Lucene-Solr-master-Windows\solr\build\solr-core\test\J1\temp\solr.handler.admin.AutoscalingHistoryHandlerTest_8C9762697070A327-001\tempDir-001\node3\AutoscalingHistoryHandlerTest_collection_shard1_replica_n1\..\..\..\..\dist filtered by solr-langid-\d.*\.jar to classpath: C:\Users\jenkins\workspace\Lucene-Solr-master-Windows\solr\build\solr-core\test\J1\temp\solr.handler.admin.AutoscalingHistoryHandlerTest_8C9762697070A327-001\tempDir-001\node3\AutoscalingHistoryHandlerTest_collection_shard1_replica_n1\..\..\..\..\dist
   [junit4]   2> 3540398 WARN  (qtp1192185322-26695) [n:127.0.0.1:58041_solr c:AutoscalingHistoryHandlerTest_collection s:shard1 r:core_node6 x:AutoscalingHistoryHandlerTest_collection_shard1_replica_n4] o.a.s.c.SolrConfig Couldn't add files from C:\Users\jenkins\workspace\Lucene-Solr-master-Windows\solr\build\solr-core\test\J1\temp\solr.handler.admin.AutoscalingHistoryHandlerTest_8C9762697070A327-001\tempDir-001\node2\AutoscalingHistoryHandlerTest_collection_shard1_replica_n4\..\..\..\..\contrib\extraction\lib filtered by .*\.jar to classpath: C:\Users\jenkins\workspace\Lucene-Solr-master-Windows\solr\build\solr-core\test\J1\temp\solr.handler.admin.AutoscalingHistoryHandlerTest_8C9762697070A327-001\tempDir-001\node2\AutoscalingHistoryHandlerTest_collection_shard1_replica_n4\..\..\..\..\contrib\extraction\lib
   [junit4]   2> 3540398 WARN  (qtp2083164565-26689) [n:127.0.0.1:58038_solr c:AutoscalingHistoryHandlerTest_collection s:shard1 r:core_node5 x:AutoscalingHistoryHandlerTest_collection_shard1_replica_n2] o.a.s.c.SolrConfig Couldn't add files from C:\Users\jenkins\workspace\Lucene-Solr-master-Windows\solr\build\solr-core\test\J1\temp\solr.handler.admin.AutoscalingHistoryHandlerTest_8C9762697070A327-001\tempDir-001\node1\AutoscalingHistoryHandlerTest_collection_shard1_replica_n2\..\..\..\..\contrib\langid\lib filtered by .*\.jar to classpath: C:\Users\jenkins\workspace\Lucene-Solr-master-Windows\solr\build\solr-core\test\J1\temp\solr.handler.admin.AutoscalingHistoryHandlerTest_8C9762697070A327-001\tempDir-001\node1\AutoscalingHistoryHandlerTest_collection_shard1_replica_n2\..\..\..\..\contrib\langid\lib
   [junit4]   2> 3540398 WARN  (qtp696545289-26711) [n:127.0.0.1:58050_solr c:AutoscalingHistoryHandlerTest_collection s:shard1 r:core_node3 x:AutoscalingHistoryHandlerTest_collection_shard1_replica_n1] o.a.s.c.SolrConfig Couldn't add files from C:\Users\jenkins\workspace\Lucene-Solr-master-Windows\solr\build\solr-core\test\J1\temp\solr.handler.admin.AutoscalingHistoryHandlerTest_8C9762697070A327-001\tempDir-001\node3\AutoscalingHistoryHandlerTest_collection_shard1_replica_n1\..\..\..\..\contrib\velocity\lib filtered by .*\.jar to classpath: C:\Users\jenkins\workspace\Lucene-Solr-master-Windows\solr\build\solr-core\test\J1\temp\solr.handler.admin.AutoscalingHistoryHandlerTest_8C9762697070A327-001\tempDir-001\node3\AutoscalingHistoryHandlerTest_collection_shard1_replica_n1\..\..\..\..\contrib\velocity\lib
   [junit4]   2> 3540398 WARN  (qtp2083164565-26689) [n:127.0.0.1:58038_solr c:AutoscalingHistoryHandlerTest_collection s:shard1 r:core_node5 x:AutoscalingHistoryHandlerTest_collection_shard1_replica_n2] o.a.s.c.SolrConfig Couldn't add files from C:\Users\jenkins\workspace\Lucene-Solr-master-Windows\solr\build\solr-core\test\J1\temp\solr.handler.admin.AutoscalingHistoryHandlerTest_8C9762697070A327-001\tempDir-001\node1\AutoscalingHistoryHandlerTest_collection_shard1_replica_n2\..\..\..\..\dist filtered by solr-langid-\d.*\.jar to classpath: C:\Users\jenkins\workspace\Lucene-Solr-master-Windows\solr\build\solr-core\test\J1\temp\solr.handler.admin.AutoscalingHistoryHandlerTest_8C9762697070A327-001\tempDir-001\node1\AutoscalingHistoryHandlerTest_collection_shard1_replica_n2\..\..\..\..\dist
   [junit4]   2> 3540398 WARN  (qtp696545289-26711) [n:127.0.0.1:58050_solr c:AutoscalingHistoryHandlerTest_collection s:shard1 r:core_node3 x:AutoscalingHistoryHandlerTest_collection_shard1_replica_n1] o.a.s.c.SolrConfig Couldn't add files from C:\Users\jenkins\workspace\Lucene-Solr-master-Windows\solr\build\solr-core\test\J1\temp\solr.handler.admin.AutoscalingHistoryHandlerTest_8C9762697070A327-001\tempDir-001\node3\AutoscalingHistoryHandlerTest_collection_shard1_replica_n1\..\..\..\..\dist filtered by solr-velocity-\d.*\.jar to classpath: C:\Users\jenkins\workspace\Lucene-Solr-master-Windows\solr\build\solr-core\test\J1\temp\solr.handler.admin.AutoscalingHistoryHandlerTest_8C9762697070A327-001\tempDir-001\node3\AutoscalingHistoryHandlerTest_collection_shard1_replica_n1\..\..\..\..\dist
   [junit4]   2> 3540399 WARN  (qtp2083164565-26689) [n:127.0.0.1:58038_solr c:AutoscalingHistoryHandlerTest_collection s:shard1 r:core_node5 x:AutoscalingHistoryHandlerTest_collection_shard1_replica_n2] o.a.s.c.SolrConfig Couldn't add files from C:\Users\jenkins\workspace\Lucene-Solr-master-Windows\solr\build\solr-core\test\J1\temp\solr.handler.admin.AutoscalingHistoryHandlerTest_8C9762697070A327-001\tempDir-001\node1\AutoscalingHistoryHandlerTest_collection_shard1_replica_n2\..\..\..\..\contrib\velocity\lib filtered by .*\.jar to classpath: C:\Users\jenkins\workspace\Lucene-Solr-master-Windows\solr\build\solr-core\test\J1\temp\solr.handler.admin.AutoscalingHistoryHandlerTest_8C9762697070A327-001\tempDir-001\node1\AutoscalingHistoryHandlerTest_collection_shard1_replica_n2\..\..\..\..\contrib\velocity\lib
   [junit4]   2> 3540399 WARN  (qtp2083164565-26689) [n:127.0.0.1:58038_solr c:AutoscalingHistoryHandlerTest_collection s:shard1 r:core_node5 x:AutoscalingHistoryHandlerTest_collection_shard1_replica_n2] o.a.s.c.SolrConfig Couldn't add files from C:\Users\jenkins\workspace\Lucene-Solr-master-Windows\solr\build\solr-core\test\J1\temp\solr.handler.admin.AutoscalingHistoryHandlerTest_8C9762697070A327-001\tempDir-001\node1\AutoscalingHistoryHandlerTest_collection_shard1_replica_n2\..\..\..\..\dist filtered by solr-velocity-\d.*\.jar to classpath: C:\Users\jenkins\workspace\Lucene-Solr-master-Windows\solr\build\solr-core\test\J1\temp\solr.handler.admin.AutoscalingHistoryHandlerTest_8C9762697070A327-001\tempDir-001\node1\AutoscalingHistoryHandlerTest_collection_shard1_replica_n2\..\..\..\..\dist
   [junit4]   2> 3540404 INFO  (qtp696545289-26711) [n:127.0.0.1:58050_solr c:AutoscalingHistoryHandlerTest_collection s:shard1 r:core_node3 x:AutoscalingHistoryHandlerTest_collection_shard1_replica_n1] o.a.s.c.SolrConfig Using Lucene MatchVersion: 8.0.0
   [junit4]   2> 3540404 INFO  (qtp2083164565-26689) [n:127.0.0.1:58038_solr c:AutoscalingHistoryHandlerTest_collection s:shard1 r:core_node5 x:AutoscalingHistoryHandlerTest_collection_shard1_replica_n2] o.a.s.c.SolrConfig Using Lucene MatchVersion: 8.0.0
   [junit4]   2> 3540413 WARN  (qtp1192185322-26695) [n:127.0.0.1:58041_solr c:AutoscalingHistoryHandlerTest_collection s:shard1 r:core_node6 x:AutoscalingHistoryHandlerTest_collection_shard1_replica_n4] o.a.s.c.SolrConfig Couldn't add files from C:\Users\jenkins\workspace\Lucene-Solr-master-Windows\solr\build\solr-core\test\J1\temp\solr.handler.admin.AutoscalingHistoryHandlerTest_8C9762697070A327-001\tempDir-001\node2\AutoscalingHistoryHandlerTest_collection_shard1_replica_n4\..\..\..\..\dist filtered by solr-cell-\d.*\.jar to classpath: C:\Users\jenkins\workspace\Lucene-Solr-master-Windows\solr\build\solr-core\test\J1\temp\solr.handler.admin.AutoscalingHistoryHandlerTest_8C9762697070A327-001\tempDir-001\node2\AutoscalingHistoryHandlerTest_collection_shard1_replica_n4\..\..\..\..\dist
   [junit4]   2> 3540414 WARN  (qtp1192185322-26695) [n:127.0.0.1:58041_solr c:AutoscalingHistoryHandlerTest_collection s:shard1 r:core_node6 x:AutoscalingHistoryHandlerTest_collection_shard1_replica_n4] o.a.s.c.SolrConfig Couldn't add files from C:\Users\jenkins\workspace\Lucene-Solr-master-Windows\solr\build\solr-core\test\J1\temp\solr.handler.admin.AutoscalingHistoryHandlerTest_8C9762697070A327-001\tempDir-001\node2\AutoscalingHistoryHandlerTest_collection_shard1_replica_n4\..\..\..\..\contrib\clustering\lib filtered by .*\.jar to classpath: C:\Users\jenkins\workspace\Lucene-Solr-master-Windows\solr\build\solr-core\test\J1\temp\solr.handler.admin.AutoscalingHistoryHandlerTest_8C9762697070A327-001\tempDir-001\node2\AutoscalingHistoryHandlerTest_collection_shard1_replica_n4\..\..\..\..\contrib\clustering\lib
   [junit4]   2> 3540414 WARN  (qtp1192185322-26695) [n:127.0.0.1:58041_solr c:AutoscalingHistoryHandlerTest_collection s:shard1 r:core_node6 x:AutoscalingHistoryHandlerTest_collection_shard1_replica_n4] o.a.s.c.SolrConfig Couldn't add files from C:\Users\jenkins\workspace\Lucene-Solr-master-Windows\solr\build\solr-core\test\J1\temp\solr.handler.admin.AutoscalingHistoryHandlerTest_8C9762697070A327-001\tempDir-001\node2\AutoscalingHistoryHandlerTest_collection_shard1_replica_n4\..\..\..\..\dist filtered by solr-clustering-\d.*\.jar to classpath: C:\Users\jenkins\workspace\Lucene-Solr-master-Windows\solr\build\solr-core\test\J1\temp\solr.handler.admin.AutoscalingHistoryHandlerTest_8C9762697070A327-001\tempDir-001\node2\AutoscalingHistoryHandlerTest_collection_shard1_replica_n4\..\..\..\..\dist
   [junit4]   2> 3540430 WARN  (qtp1192185322-26695) [n:127.0.0.1:58041_solr c:AutoscalingHistoryHandlerTest_collection s:shard1 r:core_node6 x:AutoscalingHistoryHandlerTest_collection_shard1_replica_n4] o.a.s.c.SolrConfig Couldn't add files from C:\Users\jenkins\workspace\Lucene-Solr-master-Windows\solr\build\solr-core\test\J1\temp\solr.handler.admin.AutoscalingHistoryHandlerTest_8C9762697070A327-001\tempDir-001\node2\AutoscalingHistoryHandlerTest_collection_shard1_replica_n4\..\..\..\..\contrib\langid\lib filtered by .*\.jar to classpath: C:\Users\jenkins\workspace\Lucene-Solr-master-Windows\solr\build\solr-core\test\J1\temp\solr.handler.admin.AutoscalingHistoryHandlerTest_8C9762697070A327-001\tempDir-001\node2\AutoscalingHistoryHandlerTest_collection_shard1_replica_n4\..\..\..\..\contrib\langid\lib
   [junit4]   2> 3540430 WARN  (qtp1192185322-26695) [n:127.0.0.1:58041_solr c:AutoscalingHistoryHandlerTest_collection s:shard1 r:core_node6 x:AutoscalingHistoryHandlerTest_collection_shard1_replica_n4] o.a.s.c.SolrConfig Couldn't add files from C:\Users\jenkins\workspace\Lucene-Solr-master-Windows\solr\build\solr-core\test\J1\temp\solr.handler.admin.AutoscalingHistoryHandlerTest_8C9762697070A327-001\tempDir-001\node2\AutoscalingHistoryHandlerTest_collection_shard1_replica_n4\..\..\..\..\dist filtered by solr-langid-\d.*\.jar to classpath: C:\Users\jenkins\workspace\Lucene-Solr-master-Windows\solr\build\solr-core\test\J1\temp\solr.handler.admin.AutoscalingHistoryHandlerTest_8C9762697070A327-001\tempDir-001\node2\AutoscalingHistoryHandlerTest_collection_shard1_replica_n4\..\..\..\..\dist
   [junit4]   2> 3540430 INFO  (qtp696545289-26711) [n:127.0.0.1:58050_solr c:AutoscalingHistoryHandlerTest_collection s:shard1 r:core_node3 x:AutoscalingHistoryHandlerTest_collection_shard1_replica_n1] o.a.s.s.IndexSchema [AutoscalingHistoryHandlerTest_collection_shard1_replica_n1] Schema name=default-config
   [junit4]   2> 3540431 WARN  (qtp1192185322-26695) [n:127.0.0.1:58041_solr c:AutoscalingHistoryHandlerTest_collection s:shard1 r:core_node6 x:AutoscalingHistoryHandlerTest_collection_shard1_replica_n4] o.a.s.c.SolrConfig Couldn't add files from C:\Users\jenkins\workspace\Lucene-Solr-master-Windows\solr\build\solr-core\test\J1\temp\solr.handler.admin.AutoscalingHistoryHandlerTest_8C9762697070A327-001\tempDir-001\node2\AutoscalingHistoryHandlerTest_collection_shard1_replica_n4\..\..\..\..\contrib\velocity\lib filtered by .*\.jar to classpath: C:\Users\jenkins\workspace\Lucene-Solr-master-Windows\solr\build\solr-core\test\J1\temp\solr.handler.admin.AutoscalingHistoryHandlerTest_8C9762697070A327-001\tempDir-001\node2\AutoscalingHistoryHandlerTest_collection_shard1_replica_n4\..\..\..\..\contrib\velocity\lib
   [junit4]   2> 3540431 WARN  (qtp1192185322-26695) [n:127.0.0.1:58041_solr c:AutoscalingHistoryHandlerTest_collection s:shard1 r:core_node6 x:AutoscalingHistoryHandlerTest_collection_shard1_replica_n4] o.a.s.c.SolrConfig Couldn't add files from C:\Users\jenkins\workspace\Lucene-Solr-master-Windows\solr\build\solr-core\test\J1\temp\solr.handler.admin.AutoscalingHistoryHandlerTest_8C9762697070A327-001\tempDir-001\node2\AutoscalingHistoryHandlerTest_collection_shard1_replica_n4\..\..\..\..\dist filtered by solr-velocity-\d.*\.jar to classpath: C:\Users\jenkins\workspace\Lucene-Solr-master-Windows\solr\build\solr-core\test\J1\temp\solr.handler.admin.AutoscalingHistoryHandlerTest_8C9762697070A327-001\tempDir-001\node2\AutoscalingHistoryHandlerTest_collection_shard1_replica_n4\..\..\..\..\dist
   [junit4]   2> 3540433 INFO  (qtp2083164565-26689) [n:127.0.0.1:58038_solr c:AutoscalingHistoryHandlerTest_collection s:shard1 r:core_node5 x:AutoscalingHistoryHandlerTest_collection_shard1_replica_n2] o.a.s.s.IndexSchema [AutoscalingHistoryHandlerTest_collection_shard1_replica_n2] Schema name=default-config
   [junit4]   2> 3540446 INFO  (qtp1192185322-26695) [n:127.0.0.1:58041_solr c:AutoscalingHistoryHandlerTest_collection s:shard1 r:core_node6 x:AutoscalingHistoryHandlerTest_collection_shard1_replica_n4] o.a.s.c.SolrConfig Using Lucene MatchVersion: 8.0.0
   [junit4]   2> 3540475 INFO  (qtp1192185322-26695) [n:127.0.0.1:58041_solr c:AutoscalingHistoryHandlerTest_collection s:shard1 r:core_node6 x:AutoscalingHistoryHandlerTest_collection_shard1_replica_n4] o.a.s.s.IndexSchema [AutoscalingHistoryHandlerTest_collection_shard1_replica_n4] Schema name=default-config
   [junit4]   2> 3540606 INFO  (qtp696545289-26711) [n:127.0.0.1:58050_solr c:AutoscalingHistoryHandlerTest_collection s:shard1 r:core_node3 x:AutoscalingHistoryHandlerTest_collection_shard1_replica_n1] o.a.s.s.IndexSchema Loaded schema default-config/1.6 with uniqueid field id
   [junit4]   2> 3540618 INFO  (qtp2083164565-26689) [n:127.0.0.1:58038_solr c:AutoscalingHistoryHandlerTest_collection s:shard1 r:core_node5 x:AutoscalingHistoryHandlerTest_collection_shard1_replica_n2] o.a.s.s.IndexSchema Loaded schema default-config/1.6 with uniqueid field id
   [junit4]   2> 3540629 INFO  (qtp1192185322-26695) [n:127.0.0.1:58041_solr c:AutoscalingHistoryHandlerTest_collection s:shard1 r:core_node6 x:AutoscalingHistoryHandlerTest_collection_shard1_replica_n4] o.a.s.s.IndexSchema Loaded schema default-config/1.6 with uniqueid field id
   [junit4]   2> 3540635 INFO  (qtp696545289-26711) [n:127.0.0.1:58050_solr c:AutoscalingHistoryHandlerTest_collection s:shard1 r:core_node3 x:AutoscalingHistoryHandlerTest_collection_shard1_replica_n1] o.a.s.c.CoreContainer Creating SolrCore 'AutoscalingHistoryHandlerTest_collection_shard1_replica_n1' using configuration from collection AutoscalingHistoryHandlerTest_collection, trusted=true
   [junit4]   2> 3540636 INFO  (qtp696545289-26711) [n:127.0.0.1:58050_solr c:AutoscalingHistoryHandlerTest_collection s:shard1 r:core_node3 x:AutoscalingHistoryHandlerTest_collection_shard1_replica_n1] o.a.s.m.r.SolrJmxReporter JMX monitoring for 'solr_58050.solr.core.AutoscalingHistoryHandlerTest_collection.shard1.replica_n1' (registry 'solr.core.AutoscalingHistoryHandlerTest_collection.shard1.replica_n1') enabled at server: com.sun.jmx.mbeanserver.JmxMBeanServer@27254fb8
   [junit4]   2> 3540636 INFO  (qtp696545289-26711) [n:127.0.0.1:58050_solr c:AutoscalingHistoryHandlerTest_collection s:shard1 r:core_node3 x:AutoscalingHistoryHandlerTest_collection_shard1_replica_n1] o.a.s.c.SolrCore solr.RecoveryStrategy.Builder
   [junit4]   2> 3540636 INFO  (qtp696545289-26711) [n:127.0.0.1:58050_solr c:AutoscalingHistoryHandlerTest_collection s:shard1 r:core_node3 x:AutoscalingHistoryHandlerTest_collection_shard1_replica_n1] o.a.s.c.SolrCore [[AutoscalingHistoryHandlerTest_collection_shard1_replica_n1] ] Opening new SolrCore at [C:\Users\jenkins\workspace\Lucene-Solr-master-Windows\solr\build\solr-core\test\J1\temp\solr.handler.admin.AutoscalingHistoryHandlerTest_8C9762697070A327-001\tempDir-001\node3\AutoscalingHistoryHandlerTest_collection_shard1_replica_n1], dataDir=[C:\Users\jenkins\workspace\Lucene-Solr-master-Windows\solr\build\solr-core\test\J1\temp\solr.handler.admin.AutoscalingHistoryHandlerTest_8C9762697070A327-001\tempDir-001\node3\.\AutoscalingHistoryHandlerTest_collection_shard1_replica_n1\data\]
   [junit4]   2> 3540646 INFO  (qtp696545289-26711) [n:127.0.0.1:58050_solr c:AutoscalingHistoryHandlerTest_collection s:shard1 r:core_node3 x:AutoscalingHistoryHandlerTest_collection_shard1_replica_n1] o.a.s.r.XSLTResponseWriter xsltCacheLifetimeSeconds=5
   [junit4]   2> 3540653 INFO  (qtp2083164565-26689) [n:127.0.0.1:58038_solr c:AutoscalingHistoryHandlerTest_collection s:shard1 r:core_node5 x:AutoscalingHistoryHandlerTest_collection_shard1_replica_n2] o.a.s.c.CoreContainer Creating SolrCore 'AutoscalingHistoryHandlerTest_collection_shard1_replica_n2' using configuration from collection AutoscalingHistoryHandlerTest_collection, trusted=true
   [junit4]   2> 3540654 INFO  (qtp2083164565-26689) [n:127.0.0.1:58038_solr c:AutoscalingHistoryHandlerTest_collection s:shard1 r:core_node5 x:AutoscalingHistoryHandlerTest_collection_shard1_replica_n2] o.a.s.m.r.SolrJmxReporter JMX monitoring for 'solr_58038.solr.core.AutoscalingHistoryHandlerTest_collection.shard1.replica_n2' (registry 'solr.core.AutoscalingHistoryHandlerTest_collection.shard1.replica_n2') enabled at server: com.sun.jmx.mbeanserver.JmxMBeanServer@27254fb8
   [junit4]   2> 3540654 INFO  (qtp2083164565-26689) [n:127.0.0.1:58038_solr c:AutoscalingHistoryHandlerTest_collection s:shard1 r:core_node5 x:AutoscalingHistoryHandlerTest_collection_shard1_replica_n2] o.a.s.c.SolrCore solr.RecoveryStrategy.Builder
   [junit4]   2> 3540654 INFO  (qtp2083164565-26689) [n:127.0.0.1:58038_solr c:AutoscalingHistoryHandlerTest_collection s:shard1 r:core_node5 x:AutoscalingHistoryHandlerTest_collection_shard1_replica_n2] o.a.s.c.SolrCore [[AutoscalingHistoryHandlerTest_collection_shard1_replica_n2] ] Opening new SolrCore at [C:\Users\jenkins\workspace\Lucene-Solr-master-Windows\solr\build\solr-core\test\J1\temp\solr.handler.admin.AutoscalingHistoryHandlerTest_8C9762697070A327-001\tempDir-001\node1\AutoscalingHistoryHandlerTest_collection_shard1_replica_n2], dataDir=[C:\Users\jenkins\workspace\Lucene-Solr-master-Windows\solr\build\solr-core\test\J1\temp\solr.handler.admin.AutoscalingHistoryHandlerTest_8C9762697070A327-001\tempDir-001\node1\.\AutoscalingHistoryHandlerTest_collection_shard1_replica_n2\data\]
   [junit4]   2> 354

[...truncated too long message...]

tory:0.0.0.0/0.0.0.0:0) [    ] o.a.z.s.NIOServerCnxn caught end of stream exception
   [junit4]   2> EndOfStreamException: Unable to read additional data from client sessionid 0x15f441145ce0006, likely client has closed socket
   [junit4]   2> 	at org.apache.zookeeper.server.NIOServerCnxn.doIO(NIOServerCnxn.java:239)
   [junit4]   2> 	at org.apache.zookeeper.server.NIOServerCnxnFactory.run(NIOServerCnxnFactory.java:203)
   [junit4]   2> 	at java.lang.Thread.run(Thread.java:748)
   [junit4]   2> 4196060 INFO  (jetty-closer-6258-thread-2) [    ] o.e.j.s.h.ContextHandler Stopped o.e.j.s.ServletContextHandler@5576e12e{/solr,null,UNAVAILABLE}
   [junit4]   2> 4196061 ERROR (SUITE-AutoscalingHistoryHandlerTest-seed#[8C9762697070A327]-worker) [    ] o.a.z.s.ZooKeeperServer ZKShutdownHandler is not registered, so ZooKeeper server won't take any action on ERROR or SHUTDOWN server state changes
   [junit4]   2> 4196062 INFO  (SUITE-AutoscalingHistoryHandlerTest-seed#[8C9762697070A327]-worker) [    ] o.a.s.c.ZkTestServer connecting to 127.0.0.1:58033 58033
   [junit4]   2> 4196065 INFO  (Thread-5066) [    ] o.a.s.c.ZkTestServer connecting to 127.0.0.1:58033 58033
   [junit4]   2> 4196066 WARN  (Thread-5066) [    ] o.a.s.c.ZkTestServer Watch limit violations: 
   [junit4]   2> Maximum concurrent create/delete watches above limit:
   [junit4]   2> 
   [junit4]   2> 	17	/solr/aliases.json
   [junit4]   2> 	17	/solr/clusterprops.json
   [junit4]   2> 	5	/solr/configs/.system
   [junit4]   2> 	5	/solr/configs/.system/managed-schema
   [junit4]   2> 	4	/solr/security.json
   [junit4]   2> 	3	/solr/configs/AutoscalingHistoryHandlerTest_collection
   [junit4]   2> 	3	/solr/configs/AutoscalingHistoryHandlerTest_collection/managed-schema
   [junit4]   2> 
   [junit4]   2> Maximum concurrent data watches above limit:
   [junit4]   2> 
   [junit4]   2> 	80	/solr/collections/.system/state.json
   [junit4]   2> 	29	/solr/collections/AutoscalingHistoryHandlerTest_collection/state.json
   [junit4]   2> 	17	/solr/clusterstate.json
   [junit4]   2> 	3	/solr/collections/.system/leader_elect/shard1/election/98872557801701385-core_node5-n_0000000001
   [junit4]   2> 	2	/solr/overseer_elect/election/98872557801701382-127.0.0.1:58038_solr-n_0000000000
   [junit4]   2> 
   [junit4]   2> Maximum concurrent children watches above limit:
   [junit4]   2> 
   [junit4]   2> 	17	/solr/live_nodes
   [junit4]   2> 	17	/solr/collections
   [junit4]   2> 
   [junit4]   2> NOTE: leaving temporary files on disk at: C:\Users\jenkins\workspace\Lucene-Solr-master-Windows\solr\build\solr-core\test\J1\temp\solr.handler.admin.AutoscalingHistoryHandlerTest_8C9762697070A327-001
   [junit4]   2> Oct 22, 2017 12:42:41 PM com.carrotsearch.randomizedtesting.ThreadLeakControl checkThreadLeaks
   [junit4]   2> WARNING: Will linger awaiting termination of 2 leaked thread(s).
   [junit4]   2> NOTE: test params are: codec=Asserting(Lucene70): {action_s=FSTOrd50, event.source_s=BlockTreeOrds(blocksize=128), type=FSTOrd50, before.actions_ss=BlockTreeOrds(blocksize=128), event.property._enqueue_time__ss=FSTOrd50, after.actions_ss=FST50, stage_s=FSTOrd50, event.id_s=PostingsFormat(name=Memory), event.property.eventTimes_ss=FSTOrd50, source_s=PostingsFormat(name=Memory), event.type_s=FSTOrd50, responses_ts=FST50, id=PostingsFormat(name=Memory), collections_ss=FSTOrd50, operations.params_ts=FSTOrd50, event.property.nodeNames_ss=FSTOrd50}, docValues:{_version_=DocValuesFormat(name=Memory), event.time_l=DocValuesFormat(name=Memory), timestamp=DocValuesFormat(name=Memory)}, maxPointsInLeafNode=1328, maxMBSortInHeap=5.763338699283007, sim=RandomSimilarity(queryNorm=true): {}, locale=hr-HR, timezone=Africa/Kigali
   [junit4]   2> NOTE: Windows 10 10.0 amd64/Oracle Corporation 1.8.0_144 (64-bit)/cpus=3,threads=1,free=128952408,total=518979584
   [junit4]   2> NOTE: All tests run in this JVM: [BadComponentTest, HealthCheckHandlerTest, SolrCloudExampleTest, TestOnReconnectListenerSupport, TestPayloadScoreQParserPlugin, TestEmbeddedSolrServerConstructors, TestLuceneMatchVersion, DeleteStatusTest, CopyFieldTest, TestCollectionsAPIViaSolrCloudCluster, TestElisionMultitermQuery, LeaderElectionContextKeyTest, SimpleCollectionCreateDeleteTest, BaseCdcrDistributedZkTest, SolrShardReporterTest, DistributedIntervalFacetingTest, FieldMutatingUpdateProcessorTest, SchemaVersionSpecificBehaviorTest, ReplaceNodeTest, SolrIndexSplitterTest, TestRandomCollapseQParserPlugin, CollectionsAPIDistributedZkTest, HdfsRecoveryZkTest, TestJsonFacetRefinement, EchoParamsTest, MissingSegmentRecoveryTest, TestCloudManagedSchema, ChaosMonkeySafeLeaderTest, ZkNodePropsTest, BigEndianAscendingWordDeserializerTest, TestCloudNestedDocsSort, MBeansHandlerTest, ConcurrentDeleteAndCreateCollectionTest, TestSkipOverseerOperations, SuggestComponentTest, ShardSplitTest, SolrIndexConfigTest, SimplePostToolTest, TestSolrConfigHandler, TestMaxScoreQueryParser, TestExclusionRuleCollectionAccess, TestSQLHandler, HLLUtilTest, SpellingQueryConverterTest, TestLockTree, TestUniqueKeyFieldResource, TestCryptoKeys, TestCSVLoader, TestFunctionQuery, AnalysisErrorHandlingTest, TestQueryUtils, TlogReplayBufferedWhileIndexingTest, TestCloudRecovery, HdfsTlogReplayBufferedWhileIndexingTest, TestRandomFlRTGCloud, IndexSchemaRuntimeFieldTest, TestSubQueryTransformerCrossCore, BasicFunctionalityTest, PingRequestHandlerTest, DocValuesTest, OverseerCollectionConfigSetProcessorTest, TestUninvertingReader, SolrIndexMetricsTest, TestDefaultStatsCache, CdcrReplicationDistributedZkTest, TestReRankQParserPlugin, DateRangeFieldTest, LeaderFailureAfterFreshStartTest, ConnectionManagerTest, DirectSolrSpellCheckerTest, TestCollationFieldDocValues, UninvertDocValuesMergePolicyTest, TestConfigSetProperties, ShardRoutingCustomTest, ConjunctionSolrSpellCheckerTest, TestCopyFieldCollectionResource, TestSolrCLIRunExample, BlockJoinFacetDistribTest, TestAuthenticationFramework, SynonymTokenizerTest, CustomCollectionTest, BasicZkTest, TestCoreAdminApis, TestMultiWordSynonyms, TestPostingsSolrHighlighter, DOMUtilTest, SolrCoreCheckLockOnStartupTest, UpdateLogTest, TestDistributedGrouping, BlobRepositoryCloudTest, TermVectorComponentDistributedTest, DistributedQueryComponentOptimizationTest, CursorMarkTest, CoreSorterTest, TestAnalyzedSuggestions, LoggingHandlerTest, TestExpandComponent, TestSolrQueryParser, TemplateUpdateProcessorTest, JvmMetricsTest, TestRTGBase, SystemLogListenerTest, TestManagedSchema, TestSolrJ, TestDynamicFieldResource, ClassificationUpdateProcessorIntegrationTest, TestAnalyzeInfixSuggestions, RecoveryAfterSoftCommitTest, SolrJmxReporterCloudTest, SolrMetricReporterTest, NodeLostTriggerTest, SampleTest, CloudExitableDirectoryReaderTest, TestSchemaVersionResource, TestPerFieldSimilarity, BitVectorTest, TestShortCircuitedRequests, TestLuceneIndexBackCompat, SpellPossibilityIteratorTest, TestRequestForwarding, ExecutePlanActionTest, TestCoreContainer, BlockJoinFacetSimpleTest, TestHdfsBackupRestoreCore, TestAuthorizationFramework, TestMergePolicyConfig, TestSimpleTrackingShardHandler, CdcrRequestHandlerTest, TestQueryTypes, HttpSolrCallGetCoreTest, TestLRUCache, TestSchemaManager, TestGeoJSONResponseWriter, TestFieldCacheSortRandom, TestSort, DistributedExpandComponentTest, TestDocumentBuilder, TestScoreJoinQPNoScore, TestRestManager, TestSortByMinMaxFunction, TestRemoteStreaming, CollectionsAPIAsyncDistributedZkTest, TestCharFilters, SolrCoreMetricManagerTest, TestFoldingMultitermQuery, BadCopyFieldTest, MultiThreadedOCPTest, HdfsBasicDistributedZkTest, AnalyticsMergeStrategyTest, TestRuleBasedAuthorizationPlugin, HdfsNNFailoverTest, DocumentAnalysisRequestHandlerTest, TestDelegationWithHadoopAuth, PreAnalyzedFieldManagedSchemaCloudTest, TestReload, TestFieldCacheReopen, DistributedQueueTest, AutoScalingHandlerTest, TestRawResponseWriter, TestDynamicLoading, QueryResultKeyTest, TestManagedResource, DocumentBuilderTest, MetricsHandlerTest, DataDrivenBlockJoinTest, JavabinLoaderTest, BlockDirectoryTest, MoreLikeThisHandlerTest, TestFastWriter, TestClusterProperties, PreAnalyzedFieldTest, TestBlobHandler, TestStressLucene, DeleteReplicaTest, TestGroupingSearch, VMParamsZkACLAndCredentialsProvidersTest, TestDocTermOrds, CoreAdminHandlerTest, CachingDirectoryFactoryTest, TestClusterStateMutator, HttpTriggerListenerTest, ChangedSchemaMergeTest, HdfsChaosMonkeySafeLeaderTest, TestExceedMaxTermLength, TestSolrCloudWithHadoopAuthPlugin, TestXmlQParser, NodeMutatorTest, OutOfBoxZkACLAndCredentialsProvidersTest, OverriddenZkACLAndCredentialsProvidersTest, OverseerModifyCollectionTest, OverseerTaskQueueTest, RestartWhileUpdatingTest, RollingRestartTest, SSLMigrationTest, SolrCLIZkUtilsTest, SolrXmlInZkTest, TestCloudInspectUtil, TestCloudJSONFacetJoinDomain, TestCloudPivotFacet, TestConfigSetsAPIExclusivity, TestDeleteCollectionOnDownNodes, TestDistribDocBasedVersion, TestLeaderElectionZkExpiry, TestLocalFSCloudBackupRestore, TestPullReplica, TestSSLRandomization, TestSizeLimitedDistributedMap, TestSolrCloudWithSecureImpersonation, TestStressCloudBlindAtomicUpdates, TestTolerantUpdateProcessorCloud, ZkFailoverTest, HdfsAutoAddReplicasIntegrationTest, SearchRateTriggerTest, HdfsRestartWhileUpdatingTest, HdfsSyncSliceTest, HdfsThreadLeakTest, HdfsUnloadDistributedZkTest, HdfsWriteToMultipleCollectionsTest, StressHdfsTest, ZkStateWriterTest, RuleEngineTest, ConfigureRecoveryStrategyTest, DirectoryFactoryTest, ExitableDirectoryReaderTest, TestBackupRepositoryFactory, TestConfigOverlay, TestConfigSetImmutable, TestCorePropertiesReload, TestCustomStream, TestInfoStreamLogging, TestNRTOpen, TestShardHandlerFactory, TestSimpleTextCodec, TestSolrXml, TestSolrCloudSnapshots, TestSolrCoreSnapshots, RequestLoggingTest, TestReqParamsAPI, TestSolrConfigHandlerCloud, V2StandaloneTest, AutoscalingHistoryHandlerTest]
   [junit4] Completed [745/745 (1!)] on J1 in 658.65s, 1 test, 1 failure <<< FAILURES!

[...truncated 47151 lines...]

Mime
View raw message