lucene-dev mailing list archives

Site index · List index
Message view « Date » · « Thread »
Top « Date » · « Thread »
From Policeman Jenkins Server <jenk...@thetaphi.de>
Subject [JENKINS] Lucene-Solr-master-Windows (64bit/jdk1.8.0_144) - Build # 6934 - Still Unstable!
Date Sun, 01 Oct 2017 19:25:52 GMT
Build: https://jenkins.thetaphi.de/job/Lucene-Solr-master-Windows/6934/
Java: 64bit/jdk1.8.0_144 -XX:+UseCompressedOops -XX:+UseParallelGC

4 tests failed.
FAILED:  junit.framework.TestSuite.org.apache.solr.cloud.TestCloudRecovery

Error Message:
Could not remove the following files (in the order of attempts):    C:\Users\jenkins\workspace\Lucene-Solr-master-Windows\solr\build\solr-core\test\J1\temp\solr.cloud.TestCloudRecovery_3F52E31C4FAD49EF-001\tempDir-001\node1\collection1_shard2_replica_t6\data\tlog\tlog.0000000000000000000: java.nio.file.FileSystemException: C:\Users\jenkins\workspace\Lucene-Solr-master-Windows\solr\build\solr-core\test\J1\temp\solr.cloud.TestCloudRecovery_3F52E31C4FAD49EF-001\tempDir-001\node1\collection1_shard2_replica_t6\data\tlog\tlog.0000000000000000000: The process cannot access the file because it is being used by another process.     C:\Users\jenkins\workspace\Lucene-Solr-master-Windows\solr\build\solr-core\test\J1\temp\solr.cloud.TestCloudRecovery_3F52E31C4FAD49EF-001\tempDir-001\node1\collection1_shard2_replica_t6\data\tlog: java.nio.file.DirectoryNotEmptyException: C:\Users\jenkins\workspace\Lucene-Solr-master-Windows\solr\build\solr-core\test\J1\temp\solr.cloud.TestCloudRecovery_3F52E31C4FAD49EF-001\tempDir-001\node1\collection1_shard2_replica_t6\data\tlog    C:\Users\jenkins\workspace\Lucene-Solr-master-Windows\solr\build\solr-core\test\J1\temp\solr.cloud.TestCloudRecovery_3F52E31C4FAD49EF-001\tempDir-001\node1\collection1_shard2_replica_t6\data: java.nio.file.DirectoryNotEmptyException: C:\Users\jenkins\workspace\Lucene-Solr-master-Windows\solr\build\solr-core\test\J1\temp\solr.cloud.TestCloudRecovery_3F52E31C4FAD49EF-001\tempDir-001\node1\collection1_shard2_replica_t6\data    C:\Users\jenkins\workspace\Lucene-Solr-master-Windows\solr\build\solr-core\test\J1\temp\solr.cloud.TestCloudRecovery_3F52E31C4FAD49EF-001\tempDir-001\node1\collection1_shard2_replica_t6: java.nio.file.DirectoryNotEmptyException: C:\Users\jenkins\workspace\Lucene-Solr-master-Windows\solr\build\solr-core\test\J1\temp\solr.cloud.TestCloudRecovery_3F52E31C4FAD49EF-001\tempDir-001\node1\collection1_shard2_replica_t6    C:\Users\jenkins\workspace\Lucene-Solr-master-Windows\solr\build\solr-core\test\J1\temp\solr.cloud.TestCloudRecovery_3F52E31C4FAD49EF-001\tempDir-001\node1\collection1_shard1_replica_t2\data\tlog\tlog.0000000000000000000: java.nio.file.FileSystemException: C:\Users\jenkins\workspace\Lucene-Solr-master-Windows\solr\build\solr-core\test\J1\temp\solr.cloud.TestCloudRecovery_3F52E31C4FAD49EF-001\tempDir-001\node1\collection1_shard1_replica_t2\data\tlog\tlog.0000000000000000000: The process cannot access the file because it is being used by another process.     C:\Users\jenkins\workspace\Lucene-Solr-master-Windows\solr\build\solr-core\test\J1\temp\solr.cloud.TestCloudRecovery_3F52E31C4FAD49EF-001\tempDir-001\node1\collection1_shard1_replica_t2\data\tlog: java.nio.file.DirectoryNotEmptyException: C:\Users\jenkins\workspace\Lucene-Solr-master-Windows\solr\build\solr-core\test\J1\temp\solr.cloud.TestCloudRecovery_3F52E31C4FAD49EF-001\tempDir-001\node1\collection1_shard1_replica_t2\data\tlog    C:\Users\jenkins\workspace\Lucene-Solr-master-Windows\solr\build\solr-core\test\J1\temp\solr.cloud.TestCloudRecovery_3F52E31C4FAD49EF-001\tempDir-001\node1\collection1_shard1_replica_t2\data: java.nio.file.DirectoryNotEmptyException: C:\Users\jenkins\workspace\Lucene-Solr-master-Windows\solr\build\solr-core\test\J1\temp\solr.cloud.TestCloudRecovery_3F52E31C4FAD49EF-001\tempDir-001\node1\collection1_shard1_replica_t2\data    C:\Users\jenkins\workspace\Lucene-Solr-master-Windows\solr\build\solr-core\test\J1\temp\solr.cloud.TestCloudRecovery_3F52E31C4FAD49EF-001\tempDir-001\node1\collection1_shard1_replica_t2: java.nio.file.DirectoryNotEmptyException: C:\Users\jenkins\workspace\Lucene-Solr-master-Windows\solr\build\solr-core\test\J1\temp\solr.cloud.TestCloudRecovery_3F52E31C4FAD49EF-001\tempDir-001\node1\collection1_shard1_replica_t2    C:\Users\jenkins\workspace\Lucene-Solr-master-Windows\solr\build\solr-core\test\J1\temp\solr.cloud.TestCloudRecovery_3F52E31C4FAD49EF-001\tempDir-001\node1: java.nio.file.DirectoryNotEmptyException: C:\Users\jenkins\workspace\Lucene-Solr-master-Windows\solr\build\solr-core\test\J1\temp\solr.cloud.TestCloudRecovery_3F52E31C4FAD49EF-001\tempDir-001\node1    C:\Users\jenkins\workspace\Lucene-Solr-master-Windows\solr\build\solr-core\test\J1\temp\solr.cloud.TestCloudRecovery_3F52E31C4FAD49EF-001\tempDir-001\node2\collection1_shard2_replica_t4\data\tlog\tlog.0000000000000000001: java.nio.file.FileSystemException: C:\Users\jenkins\workspace\Lucene-Solr-master-Windows\solr\build\solr-core\test\J1\temp\solr.cloud.TestCloudRecovery_3F52E31C4FAD49EF-001\tempDir-001\node2\collection1_shard2_replica_t4\data\tlog\tlog.0000000000000000001: The process cannot access the file because it is being used by another process.     C:\Users\jenkins\workspace\Lucene-Solr-master-Windows\solr\build\solr-core\test\J1\temp\solr.cloud.TestCloudRecovery_3F52E31C4FAD49EF-001\tempDir-001\node2\collection1_shard2_replica_t4\data\tlog: java.nio.file.DirectoryNotEmptyException: C:\Users\jenkins\workspace\Lucene-Solr-master-Windows\solr\build\solr-core\test\J1\temp\solr.cloud.TestCloudRecovery_3F52E31C4FAD49EF-001\tempDir-001\node2\collection1_shard2_replica_t4\data\tlog    C:\Users\jenkins\workspace\Lucene-Solr-master-Windows\solr\build\solr-core\test\J1\temp\solr.cloud.TestCloudRecovery_3F52E31C4FAD49EF-001\tempDir-001\node2\collection1_shard2_replica_t4\data: java.nio.file.DirectoryNotEmptyException: C:\Users\jenkins\workspace\Lucene-Solr-master-Windows\solr\build\solr-core\test\J1\temp\solr.cloud.TestCloudRecovery_3F52E31C4FAD49EF-001\tempDir-001\node2\collection1_shard2_replica_t4\data    C:\Users\jenkins\workspace\Lucene-Solr-master-Windows\solr\build\solr-core\test\J1\temp\solr.cloud.TestCloudRecovery_3F52E31C4FAD49EF-001\tempDir-001\node2\collection1_shard2_replica_t4: java.nio.file.DirectoryNotEmptyException: C:\Users\jenkins\workspace\Lucene-Solr-master-Windows\solr\build\solr-core\test\J1\temp\solr.cloud.TestCloudRecovery_3F52E31C4FAD49EF-001\tempDir-001\node2\collection1_shard2_replica_t4    C:\Users\jenkins\workspace\Lucene-Solr-master-Windows\solr\build\solr-core\test\J1\temp\solr.cloud.TestCloudRecovery_3F52E31C4FAD49EF-001\tempDir-001\node2\collection1_shard1_replica_t1\data\tlog\tlog.0000000000000000001: java.nio.file.FileSystemException: C:\Users\jenkins\workspace\Lucene-Solr-master-Windows\solr\build\solr-core\test\J1\temp\solr.cloud.TestCloudRecovery_3F52E31C4FAD49EF-001\tempDir-001\node2\collection1_shard1_replica_t1\data\tlog\tlog.0000000000000000001: The process cannot access the file because it is being used by another process.     C:\Users\jenkins\workspace\Lucene-Solr-master-Windows\solr\build\solr-core\test\J1\temp\solr.cloud.TestCloudRecovery_3F52E31C4FAD49EF-001\tempDir-001\node2\collection1_shard1_replica_t1\data\tlog: java.nio.file.DirectoryNotEmptyException: C:\Users\jenkins\workspace\Lucene-Solr-master-Windows\solr\build\solr-core\test\J1\temp\solr.cloud.TestCloudRecovery_3F52E31C4FAD49EF-001\tempDir-001\node2\collection1_shard1_replica_t1\data\tlog    C:\Users\jenkins\workspace\Lucene-Solr-master-Windows\solr\build\solr-core\test\J1\temp\solr.cloud.TestCloudRecovery_3F52E31C4FAD49EF-001\tempDir-001\node2\collection1_shard1_replica_t1\data: java.nio.file.DirectoryNotEmptyException: C:\Users\jenkins\workspace\Lucene-Solr-master-Windows\solr\build\solr-core\test\J1\temp\solr.cloud.TestCloudRecovery_3F52E31C4FAD49EF-001\tempDir-001\node2\collection1_shard1_replica_t1\data    C:\Users\jenkins\workspace\Lucene-Solr-master-Windows\solr\build\solr-core\test\J1\temp\solr.cloud.TestCloudRecovery_3F52E31C4FAD49EF-001\tempDir-001\node2\collection1_shard1_replica_t1: java.nio.file.DirectoryNotEmptyException: C:\Users\jenkins\workspace\Lucene-Solr-master-Windows\solr\build\solr-core\test\J1\temp\solr.cloud.TestCloudRecovery_3F52E31C4FAD49EF-001\tempDir-001\node2\collection1_shard1_replica_t1    C:\Users\jenkins\workspace\Lucene-Solr-master-Windows\solr\build\solr-core\test\J1\temp\solr.cloud.TestCloudRecovery_3F52E31C4FAD49EF-001\tempDir-001\node2: java.nio.file.DirectoryNotEmptyException: C:\Users\jenkins\workspace\Lucene-Solr-master-Windows\solr\build\solr-core\test\J1\temp\solr.cloud.TestCloudRecovery_3F52E31C4FAD49EF-001\tempDir-001\node2    C:\Users\jenkins\workspace\Lucene-Solr-master-Windows\solr\build\solr-core\test\J1\temp\solr.cloud.TestCloudRecovery_3F52E31C4FAD49EF-001\tempDir-001: java.nio.file.DirectoryNotEmptyException: C:\Users\jenkins\workspace\Lucene-Solr-master-Windows\solr\build\solr-core\test\J1\temp\solr.cloud.TestCloudRecovery_3F52E31C4FAD49EF-001\tempDir-001    C:\Users\jenkins\workspace\Lucene-Solr-master-Windows\solr\build\solr-core\test\J1\temp\solr.cloud.TestCloudRecovery_3F52E31C4FAD49EF-001: java.nio.file.DirectoryNotEmptyException: C:\Users\jenkins\workspace\Lucene-Solr-master-Windows\solr\build\solr-core\test\J1\temp\solr.cloud.TestCloudRecovery_3F52E31C4FAD49EF-001 

Stack Trace:
java.io.IOException: Could not remove the following files (in the order of attempts):
   C:\Users\jenkins\workspace\Lucene-Solr-master-Windows\solr\build\solr-core\test\J1\temp\solr.cloud.TestCloudRecovery_3F52E31C4FAD49EF-001\tempDir-001\node1\collection1_shard2_replica_t6\data\tlog\tlog.0000000000000000000: java.nio.file.FileSystemException: C:\Users\jenkins\workspace\Lucene-Solr-master-Windows\solr\build\solr-core\test\J1\temp\solr.cloud.TestCloudRecovery_3F52E31C4FAD49EF-001\tempDir-001\node1\collection1_shard2_replica_t6\data\tlog\tlog.0000000000000000000: The process cannot access the file because it is being used by another process.

   C:\Users\jenkins\workspace\Lucene-Solr-master-Windows\solr\build\solr-core\test\J1\temp\solr.cloud.TestCloudRecovery_3F52E31C4FAD49EF-001\tempDir-001\node1\collection1_shard2_replica_t6\data\tlog: java.nio.file.DirectoryNotEmptyException: C:\Users\jenkins\workspace\Lucene-Solr-master-Windows\solr\build\solr-core\test\J1\temp\solr.cloud.TestCloudRecovery_3F52E31C4FAD49EF-001\tempDir-001\node1\collection1_shard2_replica_t6\data\tlog
   C:\Users\jenkins\workspace\Lucene-Solr-master-Windows\solr\build\solr-core\test\J1\temp\solr.cloud.TestCloudRecovery_3F52E31C4FAD49EF-001\tempDir-001\node1\collection1_shard2_replica_t6\data: java.nio.file.DirectoryNotEmptyException: C:\Users\jenkins\workspace\Lucene-Solr-master-Windows\solr\build\solr-core\test\J1\temp\solr.cloud.TestCloudRecovery_3F52E31C4FAD49EF-001\tempDir-001\node1\collection1_shard2_replica_t6\data
   C:\Users\jenkins\workspace\Lucene-Solr-master-Windows\solr\build\solr-core\test\J1\temp\solr.cloud.TestCloudRecovery_3F52E31C4FAD49EF-001\tempDir-001\node1\collection1_shard2_replica_t6: java.nio.file.DirectoryNotEmptyException: C:\Users\jenkins\workspace\Lucene-Solr-master-Windows\solr\build\solr-core\test\J1\temp\solr.cloud.TestCloudRecovery_3F52E31C4FAD49EF-001\tempDir-001\node1\collection1_shard2_replica_t6
   C:\Users\jenkins\workspace\Lucene-Solr-master-Windows\solr\build\solr-core\test\J1\temp\solr.cloud.TestCloudRecovery_3F52E31C4FAD49EF-001\tempDir-001\node1\collection1_shard1_replica_t2\data\tlog\tlog.0000000000000000000: java.nio.file.FileSystemException: C:\Users\jenkins\workspace\Lucene-Solr-master-Windows\solr\build\solr-core\test\J1\temp\solr.cloud.TestCloudRecovery_3F52E31C4FAD49EF-001\tempDir-001\node1\collection1_shard1_replica_t2\data\tlog\tlog.0000000000000000000: The process cannot access the file because it is being used by another process.

   C:\Users\jenkins\workspace\Lucene-Solr-master-Windows\solr\build\solr-core\test\J1\temp\solr.cloud.TestCloudRecovery_3F52E31C4FAD49EF-001\tempDir-001\node1\collection1_shard1_replica_t2\data\tlog: java.nio.file.DirectoryNotEmptyException: C:\Users\jenkins\workspace\Lucene-Solr-master-Windows\solr\build\solr-core\test\J1\temp\solr.cloud.TestCloudRecovery_3F52E31C4FAD49EF-001\tempDir-001\node1\collection1_shard1_replica_t2\data\tlog
   C:\Users\jenkins\workspace\Lucene-Solr-master-Windows\solr\build\solr-core\test\J1\temp\solr.cloud.TestCloudRecovery_3F52E31C4FAD49EF-001\tempDir-001\node1\collection1_shard1_replica_t2\data: java.nio.file.DirectoryNotEmptyException: C:\Users\jenkins\workspace\Lucene-Solr-master-Windows\solr\build\solr-core\test\J1\temp\solr.cloud.TestCloudRecovery_3F52E31C4FAD49EF-001\tempDir-001\node1\collection1_shard1_replica_t2\data
   C:\Users\jenkins\workspace\Lucene-Solr-master-Windows\solr\build\solr-core\test\J1\temp\solr.cloud.TestCloudRecovery_3F52E31C4FAD49EF-001\tempDir-001\node1\collection1_shard1_replica_t2: java.nio.file.DirectoryNotEmptyException: C:\Users\jenkins\workspace\Lucene-Solr-master-Windows\solr\build\solr-core\test\J1\temp\solr.cloud.TestCloudRecovery_3F52E31C4FAD49EF-001\tempDir-001\node1\collection1_shard1_replica_t2
   C:\Users\jenkins\workspace\Lucene-Solr-master-Windows\solr\build\solr-core\test\J1\temp\solr.cloud.TestCloudRecovery_3F52E31C4FAD49EF-001\tempDir-001\node1: java.nio.file.DirectoryNotEmptyException: C:\Users\jenkins\workspace\Lucene-Solr-master-Windows\solr\build\solr-core\test\J1\temp\solr.cloud.TestCloudRecovery_3F52E31C4FAD49EF-001\tempDir-001\node1
   C:\Users\jenkins\workspace\Lucene-Solr-master-Windows\solr\build\solr-core\test\J1\temp\solr.cloud.TestCloudRecovery_3F52E31C4FAD49EF-001\tempDir-001\node2\collection1_shard2_replica_t4\data\tlog\tlog.0000000000000000001: java.nio.file.FileSystemException: C:\Users\jenkins\workspace\Lucene-Solr-master-Windows\solr\build\solr-core\test\J1\temp\solr.cloud.TestCloudRecovery_3F52E31C4FAD49EF-001\tempDir-001\node2\collection1_shard2_replica_t4\data\tlog\tlog.0000000000000000001: The process cannot access the file because it is being used by another process.

   C:\Users\jenkins\workspace\Lucene-Solr-master-Windows\solr\build\solr-core\test\J1\temp\solr.cloud.TestCloudRecovery_3F52E31C4FAD49EF-001\tempDir-001\node2\collection1_shard2_replica_t4\data\tlog: java.nio.file.DirectoryNotEmptyException: C:\Users\jenkins\workspace\Lucene-Solr-master-Windows\solr\build\solr-core\test\J1\temp\solr.cloud.TestCloudRecovery_3F52E31C4FAD49EF-001\tempDir-001\node2\collection1_shard2_replica_t4\data\tlog
   C:\Users\jenkins\workspace\Lucene-Solr-master-Windows\solr\build\solr-core\test\J1\temp\solr.cloud.TestCloudRecovery_3F52E31C4FAD49EF-001\tempDir-001\node2\collection1_shard2_replica_t4\data: java.nio.file.DirectoryNotEmptyException: C:\Users\jenkins\workspace\Lucene-Solr-master-Windows\solr\build\solr-core\test\J1\temp\solr.cloud.TestCloudRecovery_3F52E31C4FAD49EF-001\tempDir-001\node2\collection1_shard2_replica_t4\data
   C:\Users\jenkins\workspace\Lucene-Solr-master-Windows\solr\build\solr-core\test\J1\temp\solr.cloud.TestCloudRecovery_3F52E31C4FAD49EF-001\tempDir-001\node2\collection1_shard2_replica_t4: java.nio.file.DirectoryNotEmptyException: C:\Users\jenkins\workspace\Lucene-Solr-master-Windows\solr\build\solr-core\test\J1\temp\solr.cloud.TestCloudRecovery_3F52E31C4FAD49EF-001\tempDir-001\node2\collection1_shard2_replica_t4
   C:\Users\jenkins\workspace\Lucene-Solr-master-Windows\solr\build\solr-core\test\J1\temp\solr.cloud.TestCloudRecovery_3F52E31C4FAD49EF-001\tempDir-001\node2\collection1_shard1_replica_t1\data\tlog\tlog.0000000000000000001: java.nio.file.FileSystemException: C:\Users\jenkins\workspace\Lucene-Solr-master-Windows\solr\build\solr-core\test\J1\temp\solr.cloud.TestCloudRecovery_3F52E31C4FAD49EF-001\tempDir-001\node2\collection1_shard1_replica_t1\data\tlog\tlog.0000000000000000001: The process cannot access the file because it is being used by another process.

   C:\Users\jenkins\workspace\Lucene-Solr-master-Windows\solr\build\solr-core\test\J1\temp\solr.cloud.TestCloudRecovery_3F52E31C4FAD49EF-001\tempDir-001\node2\collection1_shard1_replica_t1\data\tlog: java.nio.file.DirectoryNotEmptyException: C:\Users\jenkins\workspace\Lucene-Solr-master-Windows\solr\build\solr-core\test\J1\temp\solr.cloud.TestCloudRecovery_3F52E31C4FAD49EF-001\tempDir-001\node2\collection1_shard1_replica_t1\data\tlog
   C:\Users\jenkins\workspace\Lucene-Solr-master-Windows\solr\build\solr-core\test\J1\temp\solr.cloud.TestCloudRecovery_3F52E31C4FAD49EF-001\tempDir-001\node2\collection1_shard1_replica_t1\data: java.nio.file.DirectoryNotEmptyException: C:\Users\jenkins\workspace\Lucene-Solr-master-Windows\solr\build\solr-core\test\J1\temp\solr.cloud.TestCloudRecovery_3F52E31C4FAD49EF-001\tempDir-001\node2\collection1_shard1_replica_t1\data
   C:\Users\jenkins\workspace\Lucene-Solr-master-Windows\solr\build\solr-core\test\J1\temp\solr.cloud.TestCloudRecovery_3F52E31C4FAD49EF-001\tempDir-001\node2\collection1_shard1_replica_t1: java.nio.file.DirectoryNotEmptyException: C:\Users\jenkins\workspace\Lucene-Solr-master-Windows\solr\build\solr-core\test\J1\temp\solr.cloud.TestCloudRecovery_3F52E31C4FAD49EF-001\tempDir-001\node2\collection1_shard1_replica_t1
   C:\Users\jenkins\workspace\Lucene-Solr-master-Windows\solr\build\solr-core\test\J1\temp\solr.cloud.TestCloudRecovery_3F52E31C4FAD49EF-001\tempDir-001\node2: java.nio.file.DirectoryNotEmptyException: C:\Users\jenkins\workspace\Lucene-Solr-master-Windows\solr\build\solr-core\test\J1\temp\solr.cloud.TestCloudRecovery_3F52E31C4FAD49EF-001\tempDir-001\node2
   C:\Users\jenkins\workspace\Lucene-Solr-master-Windows\solr\build\solr-core\test\J1\temp\solr.cloud.TestCloudRecovery_3F52E31C4FAD49EF-001\tempDir-001: java.nio.file.DirectoryNotEmptyException: C:\Users\jenkins\workspace\Lucene-Solr-master-Windows\solr\build\solr-core\test\J1\temp\solr.cloud.TestCloudRecovery_3F52E31C4FAD49EF-001\tempDir-001
   C:\Users\jenkins\workspace\Lucene-Solr-master-Windows\solr\build\solr-core\test\J1\temp\solr.cloud.TestCloudRecovery_3F52E31C4FAD49EF-001: java.nio.file.DirectoryNotEmptyException: C:\Users\jenkins\workspace\Lucene-Solr-master-Windows\solr\build\solr-core\test\J1\temp\solr.cloud.TestCloudRecovery_3F52E31C4FAD49EF-001

	at __randomizedtesting.SeedInfo.seed([3F52E31C4FAD49EF]:0)
	at org.apache.lucene.util.IOUtils.rm(IOUtils.java:329)
	at org.apache.lucene.util.TestRuleTemporaryFilesCleanup.afterAlways(TestRuleTemporaryFilesCleanup.java:216)
	at com.carrotsearch.randomizedtesting.rules.TestRuleAdapter$1.afterAlways(TestRuleAdapter.java:31)
	at com.carrotsearch.randomizedtesting.rules.StatementAdapter.evaluate(StatementAdapter.java:43)
	at com.carrotsearch.randomizedtesting.rules.StatementAdapter.evaluate(StatementAdapter.java:36)
	at org.apache.lucene.util.TestRuleAssertionsRequired$1.evaluate(TestRuleAssertionsRequired.java:53)
	at org.apache.lucene.util.TestRuleMarkFailure$1.evaluate(TestRuleMarkFailure.java:47)
	at org.apache.lucene.util.TestRuleIgnoreAfterMaxFailures$1.evaluate(TestRuleIgnoreAfterMaxFailures.java:64)
	at org.apache.lucene.util.TestRuleIgnoreTestSuites$1.evaluate(TestRuleIgnoreTestSuites.java:54)
	at com.carrotsearch.randomizedtesting.rules.StatementAdapter.evaluate(StatementAdapter.java:36)
	at com.carrotsearch.randomizedtesting.ThreadLeakControl$StatementRunner.run(ThreadLeakControl.java:368)
	at java.lang.Thread.run(Thread.java:748)


FAILED:  org.apache.solr.cloud.TestTlogReplica.testOutOfOrderDBQWithInPlaceUpdates

Error Message:
Can not find doc 1 in http://127.0.0.1:63576/solr

Stack Trace:
java.lang.AssertionError: Can not find doc 1 in http://127.0.0.1:63576/solr
	at __randomizedtesting.SeedInfo.seed([3F52E31C4FAD49EF:B9931BF110FC9F0F]:0)
	at org.junit.Assert.fail(Assert.java:93)
	at org.junit.Assert.assertTrue(Assert.java:43)
	at org.junit.Assert.assertNotNull(Assert.java:526)
	at org.apache.solr.cloud.TestTlogReplica.checkRTG(TestTlogReplica.java:861)
	at org.apache.solr.cloud.TestTlogReplica.testOutOfOrderDBQWithInPlaceUpdates(TestTlogReplica.java:664)
	at sun.reflect.NativeMethodAccessorImpl.invoke0(Native Method)
	at sun.reflect.NativeMethodAccessorImpl.invoke(NativeMethodAccessorImpl.java:62)
	at sun.reflect.DelegatingMethodAccessorImpl.invoke(DelegatingMethodAccessorImpl.java:43)
	at java.lang.reflect.Method.invoke(Method.java:498)
	at com.carrotsearch.randomizedtesting.RandomizedRunner.invoke(RandomizedRunner.java:1737)
	at com.carrotsearch.randomizedtesting.RandomizedRunner$8.evaluate(RandomizedRunner.java:934)
	at com.carrotsearch.randomizedtesting.RandomizedRunner$9.evaluate(RandomizedRunner.java:970)
	at com.carrotsearch.randomizedtesting.RandomizedRunner$10.evaluate(RandomizedRunner.java:984)
	at com.carrotsearch.randomizedtesting.rules.SystemPropertiesRestoreRule$1.evaluate(SystemPropertiesRestoreRule.java:57)
	at org.apache.lucene.util.TestRuleSetupTeardownChained$1.evaluate(TestRuleSetupTeardownChained.java:49)
	at org.apache.lucene.util.AbstractBeforeAfterRule$1.evaluate(AbstractBeforeAfterRule.java:45)
	at org.apache.lucene.util.TestRuleThreadAndTestName$1.evaluate(TestRuleThreadAndTestName.java:48)
	at org.apache.lucene.util.TestRuleIgnoreAfterMaxFailures$1.evaluate(TestRuleIgnoreAfterMaxFailures.java:64)
	at org.apache.lucene.util.TestRuleMarkFailure$1.evaluate(TestRuleMarkFailure.java:47)
	at com.carrotsearch.randomizedtesting.rules.StatementAdapter.evaluate(StatementAdapter.java:36)
	at com.carrotsearch.randomizedtesting.ThreadLeakControl$StatementRunner.run(ThreadLeakControl.java:368)
	at com.carrotsearch.randomizedtesting.ThreadLeakControl.forkTimeoutingTask(ThreadLeakControl.java:817)
	at com.carrotsearch.randomizedtesting.ThreadLeakControl$3.evaluate(ThreadLeakControl.java:468)
	at com.carrotsearch.randomizedtesting.RandomizedRunner.runSingleTest(RandomizedRunner.java:943)
	at com.carrotsearch.randomizedtesting.RandomizedRunner$5.evaluate(RandomizedRunner.java:829)
	at com.carrotsearch.randomizedtesting.RandomizedRunner$6.evaluate(RandomizedRunner.java:879)
	at com.carrotsearch.randomizedtesting.RandomizedRunner$7.evaluate(RandomizedRunner.java:890)
	at com.carrotsearch.randomizedtesting.rules.StatementAdapter.evaluate(StatementAdapter.java:36)
	at com.carrotsearch.randomizedtesting.rules.SystemPropertiesRestoreRule$1.evaluate(SystemPropertiesRestoreRule.java:57)
	at org.apache.lucene.util.AbstractBeforeAfterRule$1.evaluate(AbstractBeforeAfterRule.java:45)
	at com.carrotsearch.randomizedtesting.rules.StatementAdapter.evaluate(StatementAdapter.java:36)
	at org.apache.lucene.util.TestRuleStoreClassName$1.evaluate(TestRuleStoreClassName.java:41)
	at com.carrotsearch.randomizedtesting.rules.NoShadowingOrOverridesOnMethodsRule$1.evaluate(NoShadowingOrOverridesOnMethodsRule.java:40)
	at com.carrotsearch.randomizedtesting.rules.NoShadowingOrOverridesOnMethodsRule$1.evaluate(NoShadowingOrOverridesOnMethodsRule.java:40)
	at com.carrotsearch.randomizedtesting.rules.StatementAdapter.evaluate(StatementAdapter.java:36)
	at com.carrotsearch.randomizedtesting.rules.StatementAdapter.evaluate(StatementAdapter.java:36)
	at com.carrotsearch.randomizedtesting.rules.StatementAdapter.evaluate(StatementAdapter.java:36)
	at org.apache.lucene.util.TestRuleAssertionsRequired$1.evaluate(TestRuleAssertionsRequired.java:53)
	at org.apache.lucene.util.TestRuleMarkFailure$1.evaluate(TestRuleMarkFailure.java:47)
	at org.apache.lucene.util.TestRuleIgnoreAfterMaxFailures$1.evaluate(TestRuleIgnoreAfterMaxFailures.java:64)
	at org.apache.lucene.util.TestRuleIgnoreTestSuites$1.evaluate(TestRuleIgnoreTestSuites.java:54)
	at com.carrotsearch.randomizedtesting.rules.StatementAdapter.evaluate(StatementAdapter.java:36)
	at com.carrotsearch.randomizedtesting.ThreadLeakControl$StatementRunner.run(ThreadLeakControl.java:368)
	at java.lang.Thread.run(Thread.java:748)


FAILED:  junit.framework.TestSuite.org.apache.solr.core.TestInfoStreamLogging

Error Message:
Could not remove the following files (in the order of attempts):    C:\Users\jenkins\workspace\Lucene-Solr-master-Windows\solr\build\solr-core\test\J1\temp\solr.core.TestInfoStreamLogging_3F52E31C4FAD49EF-001\init-core-data-001: java.nio.file.AccessDeniedException: C:\Users\jenkins\workspace\Lucene-Solr-master-Windows\solr\build\solr-core\test\J1\temp\solr.core.TestInfoStreamLogging_3F52E31C4FAD49EF-001\init-core-data-001    C:\Users\jenkins\workspace\Lucene-Solr-master-Windows\solr\build\solr-core\test\J1\temp\solr.core.TestInfoStreamLogging_3F52E31C4FAD49EF-001: java.nio.file.DirectoryNotEmptyException: C:\Users\jenkins\workspace\Lucene-Solr-master-Windows\solr\build\solr-core\test\J1\temp\solr.core.TestInfoStreamLogging_3F52E31C4FAD49EF-001 

Stack Trace:
java.io.IOException: Could not remove the following files (in the order of attempts):
   C:\Users\jenkins\workspace\Lucene-Solr-master-Windows\solr\build\solr-core\test\J1\temp\solr.core.TestInfoStreamLogging_3F52E31C4FAD49EF-001\init-core-data-001: java.nio.file.AccessDeniedException: C:\Users\jenkins\workspace\Lucene-Solr-master-Windows\solr\build\solr-core\test\J1\temp\solr.core.TestInfoStreamLogging_3F52E31C4FAD49EF-001\init-core-data-001
   C:\Users\jenkins\workspace\Lucene-Solr-master-Windows\solr\build\solr-core\test\J1\temp\solr.core.TestInfoStreamLogging_3F52E31C4FAD49EF-001: java.nio.file.DirectoryNotEmptyException: C:\Users\jenkins\workspace\Lucene-Solr-master-Windows\solr\build\solr-core\test\J1\temp\solr.core.TestInfoStreamLogging_3F52E31C4FAD49EF-001

	at __randomizedtesting.SeedInfo.seed([3F52E31C4FAD49EF]:0)
	at org.apache.lucene.util.IOUtils.rm(IOUtils.java:329)
	at org.apache.lucene.util.TestRuleTemporaryFilesCleanup.afterAlways(TestRuleTemporaryFilesCleanup.java:216)
	at com.carrotsearch.randomizedtesting.rules.TestRuleAdapter$1.afterAlways(TestRuleAdapter.java:31)
	at com.carrotsearch.randomizedtesting.rules.StatementAdapter.evaluate(StatementAdapter.java:43)
	at com.carrotsearch.randomizedtesting.rules.StatementAdapter.evaluate(StatementAdapter.java:36)
	at org.apache.lucene.util.TestRuleAssertionsRequired$1.evaluate(TestRuleAssertionsRequired.java:53)
	at org.apache.lucene.util.TestRuleMarkFailure$1.evaluate(TestRuleMarkFailure.java:47)
	at org.apache.lucene.util.TestRuleIgnoreAfterMaxFailures$1.evaluate(TestRuleIgnoreAfterMaxFailures.java:64)
	at org.apache.lucene.util.TestRuleIgnoreTestSuites$1.evaluate(TestRuleIgnoreTestSuites.java:54)
	at com.carrotsearch.randomizedtesting.rules.StatementAdapter.evaluate(StatementAdapter.java:36)
	at com.carrotsearch.randomizedtesting.ThreadLeakControl$StatementRunner.run(ThreadLeakControl.java:368)
	at java.lang.Thread.run(Thread.java:748)


FAILED:  org.apache.solr.client.solrj.io.stream.StreamExpressionTest.testParallelExecutorStream

Error Message:
Error from server at http://127.0.0.1:50640/solr/workQueue_shard2_replica_n3: Expected mime type application/octet-stream but got text/html. <html> <head> <meta http-equiv="Content-Type" content="text/html;charset=ISO-8859-1"/> <title>Error 404 </title> </head> <body> <h2>HTTP ERROR: 404</h2> <p>Problem accessing /solr/workQueue_shard2_replica_n3/update. Reason: <pre>    Can not find: /solr/workQueue_shard2_replica_n3/update</pre></p> <hr /><a href="http://eclipse.org/jetty">Powered by Jetty:// 9.3.20.v20170531</a><hr/> </body> </html> 

Stack Trace:
org.apache.solr.client.solrj.impl.CloudSolrClient$RouteException: Error from server at http://127.0.0.1:50640/solr/workQueue_shard2_replica_n3: Expected mime type application/octet-stream but got text/html. <html>
<head>
<meta http-equiv="Content-Type" content="text/html;charset=ISO-8859-1"/>
<title>Error 404 </title>
</head>
<body>
<h2>HTTP ERROR: 404</h2>
<p>Problem accessing /solr/workQueue_shard2_replica_n3/update. Reason:
<pre>    Can not find: /solr/workQueue_shard2_replica_n3/update</pre></p>
<hr /><a href="http://eclipse.org/jetty">Powered by Jetty:// 9.3.20.v20170531</a><hr/>
</body>
</html>

	at __randomizedtesting.SeedInfo.seed([F066521A7F78AA4D:4D71270346549710]:0)
	at org.apache.solr.client.solrj.impl.CloudSolrClient.directUpdate(CloudSolrClient.java:539)
	at org.apache.solr.client.solrj.impl.CloudSolrClient.sendRequest(CloudSolrClient.java:993)
	at org.apache.solr.client.solrj.impl.CloudSolrClient.requestWithRetryOnStaleState(CloudSolrClient.java:862)
	at org.apache.solr.client.solrj.impl.CloudSolrClient.request(CloudSolrClient.java:793)
	at org.apache.solr.client.solrj.SolrRequest.process(SolrRequest.java:178)
	at org.apache.solr.client.solrj.request.UpdateRequest.commit(UpdateRequest.java:233)
	at org.apache.solr.client.solrj.io.stream.StreamExpressionTest.testParallelExecutorStream(StreamExpressionTest.java:7540)
	at sun.reflect.NativeMethodAccessorImpl.invoke0(Native Method)
	at sun.reflect.NativeMethodAccessorImpl.invoke(NativeMethodAccessorImpl.java:62)
	at sun.reflect.DelegatingMethodAccessorImpl.invoke(DelegatingMethodAccessorImpl.java:43)
	at java.lang.reflect.Method.invoke(Method.java:498)
	at com.carrotsearch.randomizedtesting.RandomizedRunner.invoke(RandomizedRunner.java:1737)
	at com.carrotsearch.randomizedtesting.RandomizedRunner$8.evaluate(RandomizedRunner.java:934)
	at com.carrotsearch.randomizedtesting.RandomizedRunner$9.evaluate(RandomizedRunner.java:970)
	at com.carrotsearch.randomizedtesting.RandomizedRunner$10.evaluate(RandomizedRunner.java:984)
	at com.carrotsearch.randomizedtesting.rules.SystemPropertiesRestoreRule$1.evaluate(SystemPropertiesRestoreRule.java:57)
	at org.apache.lucene.util.TestRuleSetupTeardownChained$1.evaluate(TestRuleSetupTeardownChained.java:49)
	at org.apache.lucene.util.AbstractBeforeAfterRule$1.evaluate(AbstractBeforeAfterRule.java:45)
	at org.apache.lucene.util.TestRuleThreadAndTestName$1.evaluate(TestRuleThreadAndTestName.java:48)
	at org.apache.lucene.util.TestRuleIgnoreAfterMaxFailures$1.evaluate(TestRuleIgnoreAfterMaxFailures.java:64)
	at org.apache.lucene.util.TestRuleMarkFailure$1.evaluate(TestRuleMarkFailure.java:47)
	at com.carrotsearch.randomizedtesting.rules.StatementAdapter.evaluate(StatementAdapter.java:36)
	at com.carrotsearch.randomizedtesting.ThreadLeakControl$StatementRunner.run(ThreadLeakControl.java:368)
	at com.carrotsearch.randomizedtesting.ThreadLeakControl.forkTimeoutingTask(ThreadLeakControl.java:817)
	at com.carrotsearch.randomizedtesting.ThreadLeakControl$3.evaluate(ThreadLeakControl.java:468)
	at com.carrotsearch.randomizedtesting.RandomizedRunner.runSingleTest(RandomizedRunner.java:943)
	at com.carrotsearch.randomizedtesting.RandomizedRunner$5.evaluate(RandomizedRunner.java:829)
	at com.carrotsearch.randomizedtesting.RandomizedRunner$6.evaluate(RandomizedRunner.java:879)
	at com.carrotsearch.randomizedtesting.RandomizedRunner$7.evaluate(RandomizedRunner.java:890)
	at com.carrotsearch.randomizedtesting.rules.StatementAdapter.evaluate(StatementAdapter.java:36)
	at com.carrotsearch.randomizedtesting.rules.SystemPropertiesRestoreRule$1.evaluate(SystemPropertiesRestoreRule.java:57)
	at org.apache.lucene.util.AbstractBeforeAfterRule$1.evaluate(AbstractBeforeAfterRule.java:45)
	at com.carrotsearch.randomizedtesting.rules.StatementAdapter.evaluate(StatementAdapter.java:36)
	at org.apache.lucene.util.TestRuleStoreClassName$1.evaluate(TestRuleStoreClassName.java:41)
	at com.carrotsearch.randomizedtesting.rules.NoShadowingOrOverridesOnMethodsRule$1.evaluate(NoShadowingOrOverridesOnMethodsRule.java:40)
	at com.carrotsearch.randomizedtesting.rules.NoShadowingOrOverridesOnMethodsRule$1.evaluate(NoShadowingOrOverridesOnMethodsRule.java:40)
	at com.carrotsearch.randomizedtesting.rules.StatementAdapter.evaluate(StatementAdapter.java:36)
	at com.carrotsearch.randomizedtesting.rules.StatementAdapter.evaluate(StatementAdapter.java:36)
	at com.carrotsearch.randomizedtesting.rules.StatementAdapter.evaluate(StatementAdapter.java:36)
	at org.apache.lucene.util.TestRuleAssertionsRequired$1.evaluate(TestRuleAssertionsRequired.java:53)
	at org.apache.lucene.util.TestRuleMarkFailure$1.evaluate(TestRuleMarkFailure.java:47)
	at org.apache.lucene.util.TestRuleIgnoreAfterMaxFailures$1.evaluate(TestRuleIgnoreAfterMaxFailures.java:64)
	at org.apache.lucene.util.TestRuleIgnoreTestSuites$1.evaluate(TestRuleIgnoreTestSuites.java:54)
	at com.carrotsearch.randomizedtesting.rules.StatementAdapter.evaluate(StatementAdapter.java:36)
	at com.carrotsearch.randomizedtesting.ThreadLeakControl$StatementRunner.run(ThreadLeakControl.java:368)
	at java.lang.Thread.run(Thread.java:748)
Caused by: org.apache.solr.client.solrj.impl.HttpSolrClient$RemoteSolrException: Error from server at http://127.0.0.1:50640/solr/workQueue_shard2_replica_n3: Expected mime type application/octet-stream but got text/html. <html>
<head>
<meta http-equiv="Content-Type" content="text/html;charset=ISO-8859-1"/>
<title>Error 404 </title>
</head>
<body>
<h2>HTTP ERROR: 404</h2>
<p>Problem accessing /solr/workQueue_shard2_replica_n3/update. Reason:
<pre>    Can not find: /solr/workQueue_shard2_replica_n3/update</pre></p>
<hr /><a href="http://eclipse.org/jetty">Powered by Jetty:// 9.3.20.v20170531</a><hr/>
</body>
</html>

	at org.apache.solr.client.solrj.impl.HttpSolrClient.executeMethod(HttpSolrClient.java:591)
	at org.apache.solr.client.solrj.impl.HttpSolrClient.request(HttpSolrClient.java:253)
	at org.apache.solr.client.solrj.impl.HttpSolrClient.request(HttpSolrClient.java:242)
	at org.apache.solr.client.solrj.impl.LBHttpSolrClient.doRequest(LBHttpSolrClient.java:483)
	at org.apache.solr.client.solrj.impl.LBHttpSolrClient.request(LBHttpSolrClient.java:413)
	at org.apache.solr.client.solrj.impl.CloudSolrClient.lambda$directUpdate$0(CloudSolrClient.java:516)
	at java.util.concurrent.FutureTask.run(FutureTask.java:266)
	at org.apache.solr.common.util.ExecutorUtil$MDCAwareThreadPoolExecutor.lambda$execute$0(ExecutorUtil.java:188)
	at java.util.concurrent.ThreadPoolExecutor.runWorker(ThreadPoolExecutor.java:1149)
	at java.util.concurrent.ThreadPoolExecutor$Worker.run(ThreadPoolExecutor.java:624)
	... 1 more




Build Log:
[...truncated 11592 lines...]
   [junit4] Suite: org.apache.solr.cloud.TestCloudRecovery
   [junit4]   2> Creating dataDir: C:\Users\jenkins\workspace\Lucene-Solr-master-Windows\solr\build\solr-core\test\J1\temp\solr.cloud.TestCloudRecovery_3F52E31C4FAD49EF-001\init-core-data-001
   [junit4]   2> 198905 WARN  (SUITE-TestCloudRecovery-seed#[3F52E31C4FAD49EF]-worker) [    ] o.a.s.SolrTestCaseJ4 startTrackingSearchers: numOpens=5 numCloses=5
   [junit4]   2> 198906 INFO  (SUITE-TestCloudRecovery-seed#[3F52E31C4FAD49EF]-worker) [    ] o.a.s.SolrTestCaseJ4 Using PointFields (NUMERIC_POINTS_SYSPROP=true) w/NUMERIC_DOCVALUES_SYSPROP=true
   [junit4]   2> 198910 INFO  (SUITE-TestCloudRecovery-seed#[3F52E31C4FAD49EF]-worker) [    ] o.a.s.SolrTestCaseJ4 Randomized ssl (false) and clientAuth (false) via: @org.apache.solr.util.RandomizeSSL(reason=, value=NaN, ssl=NaN, clientAuth=NaN)
   [junit4]   2> 198910 INFO  (SUITE-TestCloudRecovery-seed#[3F52E31C4FAD49EF]-worker) [    ] o.a.s.SolrTestCaseJ4 SecureRandom sanity checks: test.solr.allowed.securerandom=null & java.security.egd=file:/dev/./urandom
   [junit4]   2> 198912 INFO  (SUITE-TestCloudRecovery-seed#[3F52E31C4FAD49EF]-worker) [    ] o.a.s.c.MiniSolrCloudCluster Starting cluster of 2 servers in C:\Users\jenkins\workspace\Lucene-Solr-master-Windows\solr\build\solr-core\test\J1\temp\solr.cloud.TestCloudRecovery_3F52E31C4FAD49EF-001\tempDir-001
   [junit4]   2> 198912 INFO  (SUITE-TestCloudRecovery-seed#[3F52E31C4FAD49EF]-worker) [    ] o.a.s.c.ZkTestServer STARTING ZK TEST SERVER
   [junit4]   2> 198913 INFO  (Thread-478) [    ] o.a.s.c.ZkTestServer client port:0.0.0.0/0.0.0.0:0
   [junit4]   2> 198913 INFO  (Thread-478) [    ] o.a.s.c.ZkTestServer Starting server
   [junit4]   2> 198915 ERROR (Thread-478) [    ] o.a.z.s.ZooKeeperServer ZKShutdownHandler is not registered, so ZooKeeper server won't take any action on ERROR or SHUTDOWN server state changes
   [junit4]   2> 199012 INFO  (SUITE-TestCloudRecovery-seed#[3F52E31C4FAD49EF]-worker) [    ] o.a.s.c.ZkTestServer start zk server on port:56584
   [junit4]   2> 199019 INFO  (jetty-launcher-333-thread-2) [    ] o.e.j.s.Server jetty-9.3.20.v20170531
   [junit4]   2> 199019 INFO  (jetty-launcher-333-thread-1) [    ] o.e.j.s.Server jetty-9.3.20.v20170531
   [junit4]   2> 199020 INFO  (jetty-launcher-333-thread-2) [    ] o.e.j.s.h.ContextHandler Started o.e.j.s.ServletContextHandler@4b783800{/solr,null,AVAILABLE}
   [junit4]   2> 199020 INFO  (jetty-launcher-333-thread-1) [    ] o.e.j.s.h.ContextHandler Started o.e.j.s.ServletContextHandler@52045238{/solr,null,AVAILABLE}
   [junit4]   2> 199024 INFO  (jetty-launcher-333-thread-2) [    ] o.e.j.s.AbstractConnector Started ServerConnector@536bcc1c{HTTP/1.1,[http/1.1]}{127.0.0.1:56588}
   [junit4]   2> 199024 INFO  (jetty-launcher-333-thread-1) [    ] o.e.j.s.AbstractConnector Started ServerConnector@7349eac2{HTTP/1.1,[http/1.1]}{127.0.0.1:56589}
   [junit4]   2> 199024 INFO  (jetty-launcher-333-thread-2) [    ] o.e.j.s.Server Started @210296ms
   [junit4]   2> 199024 INFO  (jetty-launcher-333-thread-1) [    ] o.e.j.s.Server Started @210296ms
   [junit4]   2> 199024 INFO  (jetty-launcher-333-thread-2) [    ] o.a.s.c.s.e.JettySolrRunner Jetty properties: {hostContext=/solr, hostPort=56588}
   [junit4]   2> 199024 INFO  (jetty-launcher-333-thread-1) [    ] o.a.s.c.s.e.JettySolrRunner Jetty properties: {hostContext=/solr, hostPort=56589}
   [junit4]   2> 199024 ERROR (jetty-launcher-333-thread-1) [    ] o.a.s.u.StartupLoggingUtils Missing Java Option solr.log.dir. Logging may be missing or incomplete.
   [junit4]   2> 199024 ERROR (jetty-launcher-333-thread-2) [    ] o.a.s.u.StartupLoggingUtils Missing Java Option solr.log.dir. Logging may be missing or incomplete.
   [junit4]   2> 199024 INFO  (jetty-launcher-333-thread-1) [    ] o.a.s.s.SolrDispatchFilter  ___      _       Welcome to Apache Solr? version 8.0.0
   [junit4]   2> 199024 INFO  (jetty-launcher-333-thread-2) [    ] o.a.s.s.SolrDispatchFilter  ___      _       Welcome to Apache Solr? version 8.0.0
   [junit4]   2> 199024 INFO  (jetty-launcher-333-thread-1) [    ] o.a.s.s.SolrDispatchFilter / __| ___| |_ _   Starting in cloud mode on port null
   [junit4]   2> 199024 INFO  (jetty-launcher-333-thread-2) [    ] o.a.s.s.SolrDispatchFilter / __| ___| |_ _   Starting in cloud mode on port null
   [junit4]   2> 199025 INFO  (jetty-launcher-333-thread-1) [    ] o.a.s.s.SolrDispatchFilter \__ \/ _ \ | '_|  Install dir: null, Default config dir: null
   [junit4]   2> 199025 INFO  (jetty-launcher-333-thread-2) [    ] o.a.s.s.SolrDispatchFilter \__ \/ _ \ | '_|  Install dir: null, Default config dir: null
   [junit4]   2> 199025 INFO  (jetty-launcher-333-thread-1) [    ] o.a.s.s.SolrDispatchFilter |___/\___/_|_|    Start time: 2017-10-01T18:07:55.033Z
   [junit4]   2> 199025 INFO  (jetty-launcher-333-thread-2) [    ] o.a.s.s.SolrDispatchFilter |___/\___/_|_|    Start time: 2017-10-01T18:07:55.033Z
   [junit4]   2> 199028 INFO  (jetty-launcher-333-thread-2) [    ] o.a.s.s.SolrDispatchFilter solr.xml found in ZooKeeper. Loading...
   [junit4]   2> 199030 INFO  (jetty-launcher-333-thread-1) [    ] o.a.s.s.SolrDispatchFilter solr.xml found in ZooKeeper. Loading...
   [junit4]   2> 199045 WARN  (NIOServerCxn.Factory:0.0.0.0/0.0.0.0:0) [    ] o.a.z.s.NIOServerCnxn caught end of stream exception
   [junit4]   2> EndOfStreamException: Unable to read additional data from client sessionid 0x15ed91f842b0001, likely client has closed socket
   [junit4]   2> 	at org.apache.zookeeper.server.NIOServerCnxn.doIO(NIOServerCnxn.java:239)
   [junit4]   2> 	at org.apache.zookeeper.server.NIOServerCnxnFactory.run(NIOServerCnxnFactory.java:203)
   [junit4]   2> 	at java.lang.Thread.run(Thread.java:748)
   [junit4]   2> 199050 INFO  (jetty-launcher-333-thread-1) [    ] o.a.s.c.ZkContainer Zookeeper client=127.0.0.1:56584/solr
   [junit4]   2> 199050 INFO  (jetty-launcher-333-thread-2) [    ] o.a.s.c.ZkContainer Zookeeper client=127.0.0.1:56584/solr
   [junit4]   2> 199053 WARN  (NIOServerCxn.Factory:0.0.0.0/0.0.0.0:0) [    ] o.a.z.s.NIOServerCnxn caught end of stream exception
   [junit4]   2> EndOfStreamException: Unable to read additional data from client sessionid 0x15ed91f842b0004, likely client has closed socket
   [junit4]   2> 	at org.apache.zookeeper.server.NIOServerCnxn.doIO(NIOServerCnxn.java:239)
   [junit4]   2> 	at org.apache.zookeeper.server.NIOServerCnxnFactory.run(NIOServerCnxnFactory.java:203)
   [junit4]   2> 	at java.lang.Thread.run(Thread.java:748)
   [junit4]   2> 199181 INFO  (jetty-launcher-333-thread-1) [n:127.0.0.1:56589_solr    ] o.a.s.c.Overseer Overseer (id=null) closing
   [junit4]   2> 199181 INFO  (jetty-launcher-333-thread-2) [n:127.0.0.1:56588_solr    ] o.a.s.c.Overseer Overseer (id=null) closing
   [junit4]   2> 199182 INFO  (jetty-launcher-333-thread-1) [n:127.0.0.1:56589_solr    ] o.a.s.c.OverseerElectionContext I am going to be the leader 127.0.0.1:56589_solr
   [junit4]   2> 199183 INFO  (jetty-launcher-333-thread-2) [n:127.0.0.1:56588_solr    ] o.a.s.c.ZkController Register node as live in ZooKeeper:/live_nodes/127.0.0.1:56588_solr
   [junit4]   2> 199184 INFO  (jetty-launcher-333-thread-1) [n:127.0.0.1:56589_solr    ] o.a.s.c.Overseer Overseer (id=98754971233353733-127.0.0.1:56589_solr-n_0000000000) starting
   [junit4]   2> 199186 INFO  (zkCallback-345-thread-1-processing-n:127.0.0.1:56588_solr) [n:127.0.0.1:56588_solr    ] o.a.s.c.c.ZkStateReader Updated live nodes from ZooKeeper... (0) -> (1)
   [junit4]   2> 199187 INFO  (zkCallback-344-thread-1-processing-n:127.0.0.1:56589_solr) [n:127.0.0.1:56589_solr    ] o.a.s.c.c.ZkStateReader Updated live nodes from ZooKeeper... (0) -> (1)
   [junit4]   2> 199197 INFO  (jetty-launcher-333-thread-1) [n:127.0.0.1:56589_solr    ] o.a.s.c.ZkController Register node as live in ZooKeeper:/live_nodes/127.0.0.1:56589_solr
   [junit4]   2> 199198 INFO  (zkCallback-344-thread-1-processing-n:127.0.0.1:56589_solr) [n:127.0.0.1:56589_solr    ] o.a.s.c.c.ZkStateReader Updated live nodes from ZooKeeper... (1) -> (2)
   [junit4]   2> 199198 INFO  (zkCallback-345-thread-1-processing-n:127.0.0.1:56588_solr) [n:127.0.0.1:56588_solr    ] o.a.s.c.c.ZkStateReader Updated live nodes from ZooKeeper... (1) -> (2)
   [junit4]   2> 199420 INFO  (jetty-launcher-333-thread-2) [n:127.0.0.1:56588_solr    ] o.a.s.m.r.SolrJmxReporter JMX monitoring for 'solr_56588.solr.node' (registry 'solr.node') enabled at server: com.sun.jmx.mbeanserver.JmxMBeanServer@4eaf2039
   [junit4]   2> 199420 INFO  (jetty-launcher-333-thread-1) [n:127.0.0.1:56589_solr    ] o.a.s.m.r.SolrJmxReporter JMX monitoring for 'solr_56589.solr.node' (registry 'solr.node') enabled at server: com.sun.jmx.mbeanserver.JmxMBeanServer@4eaf2039
   [junit4]   2> 199436 INFO  (jetty-launcher-333-thread-2) [n:127.0.0.1:56588_solr    ] o.a.s.m.r.SolrJmxReporter JMX monitoring for 'solr_56588.solr.jvm' (registry 'solr.jvm') enabled at server: com.sun.jmx.mbeanserver.JmxMBeanServer@4eaf2039
   [junit4]   2> 199437 INFO  (jetty-launcher-333-thread-2) [n:127.0.0.1:56588_solr    ] o.a.s.m.r.SolrJmxReporter JMX monitoring for 'solr_56588.solr.jetty' (registry 'solr.jetty') enabled at server: com.sun.jmx.mbeanserver.JmxMBeanServer@4eaf2039
   [junit4]   2> 199438 INFO  (jetty-launcher-333-thread-1) [n:127.0.0.1:56589_solr    ] o.a.s.m.r.SolrJmxReporter JMX monitoring for 'solr_56589.solr.jvm' (registry 'solr.jvm') enabled at server: com.sun.jmx.mbeanserver.JmxMBeanServer@4eaf2039
   [junit4]   2> 199438 INFO  (jetty-launcher-333-thread-1) [n:127.0.0.1:56589_solr    ] o.a.s.m.r.SolrJmxReporter JMX monitoring for 'solr_56589.solr.jetty' (registry 'solr.jetty') enabled at server: com.sun.jmx.mbeanserver.JmxMBeanServer@4eaf2039
   [junit4]   2> 199441 INFO  (jetty-launcher-333-thread-1) [n:127.0.0.1:56589_solr    ] o.a.s.c.CorePropertiesLocator Found 0 core definitions underneath C:\Users\jenkins\workspace\Lucene-Solr-master-Windows\solr\build\solr-core\test\J1\temp\solr.cloud.TestCloudRecovery_3F52E31C4FAD49EF-001\tempDir-001\node1\.
   [junit4]   2> 199441 INFO  (jetty-launcher-333-thread-2) [n:127.0.0.1:56588_solr    ] o.a.s.c.CorePropertiesLocator Found 0 core definitions underneath C:\Users\jenkins\workspace\Lucene-Solr-master-Windows\solr\build\solr-core\test\J1\temp\solr.cloud.TestCloudRecovery_3F52E31C4FAD49EF-001\tempDir-001\node2\.
   [junit4]   2> 199519 INFO  (SUITE-TestCloudRecovery-seed#[3F52E31C4FAD49EF]-worker) [    ] o.a.s.c.c.ZkStateReader Updated live nodes from ZooKeeper... (0) -> (2)
   [junit4]   2> 199520 INFO  (SUITE-TestCloudRecovery-seed#[3F52E31C4FAD49EF]-worker) [    ] o.a.s.c.s.i.ZkClientClusterStateProvider Cluster at 127.0.0.1:56584/solr ready
   [junit4]   2> 199530 INFO  (qtp429308343-1969) [n:127.0.0.1:56588_solr    ] o.a.s.h.a.CollectionsHandler Invoked Collection Action :create with params pullReplicas=0&replicationFactor=0&collection.configName=config&maxShardsPerNode=2&name=collection1&nrtReplicas=0&action=CREATE&numShards=2&tlogReplicas=2&wt=javabin&version=2 and sendToOCPQueue=true
   [junit4]   2> 199537 INFO  (OverseerThreadFactory-872-thread-1-processing-n:127.0.0.1:56589_solr) [n:127.0.0.1:56589_solr    ] o.a.s.c.CreateCollectionCmd Create collection collection1
   [junit4]   2> 199651 INFO  (OverseerStateUpdate-98754971233353733-127.0.0.1:56589_solr-n_0000000000) [n:127.0.0.1:56589_solr    ] o.a.s.c.o.SliceMutator createReplica() {
   [junit4]   2>   "operation":"ADDREPLICA",
   [junit4]   2>   "collection":"collection1",
   [junit4]   2>   "shard":"shard1",
   [junit4]   2>   "core":"collection1_shard1_replica_t1",
   [junit4]   2>   "state":"down",
   [junit4]   2>   "base_url":"http://127.0.0.1:56588/solr",
   [junit4]   2>   "type":"TLOG"} 
   [junit4]   2> 199656 INFO  (OverseerStateUpdate-98754971233353733-127.0.0.1:56589_solr-n_0000000000) [n:127.0.0.1:56589_solr    ] o.a.s.c.o.SliceMutator createReplica() {
   [junit4]   2>   "operation":"ADDREPLICA",
   [junit4]   2>   "collection":"collection1",
   [junit4]   2>   "shard":"shard1",
   [junit4]   2>   "core":"collection1_shard1_replica_t2",
   [junit4]   2>   "state":"down",
   [junit4]   2>   "base_url":"http://127.0.0.1:56589/solr",
   [junit4]   2>   "type":"TLOG"} 
   [junit4]   2> 199662 INFO  (OverseerStateUpdate-98754971233353733-127.0.0.1:56589_solr-n_0000000000) [n:127.0.0.1:56589_solr    ] o.a.s.c.o.SliceMutator createReplica() {
   [junit4]   2>   "operation":"ADDREPLICA",
   [junit4]   2>   "collection":"collection1",
   [junit4]   2>   "shard":"shard2",
   [junit4]   2>   "core":"collection1_shard2_replica_t4",
   [junit4]   2>   "state":"down",
   [junit4]   2>   "base_url":"http://127.0.0.1:56588/solr",
   [junit4]   2>   "type":"TLOG"} 
   [junit4]   2> 199665 INFO  (OverseerStateUpdate-98754971233353733-127.0.0.1:56589_solr-n_0000000000) [n:127.0.0.1:56589_solr    ] o.a.s.c.o.SliceMutator createReplica() {
   [junit4]   2>   "operation":"ADDREPLICA",
   [junit4]   2>   "collection":"collection1",
   [junit4]   2>   "shard":"shard2",
   [junit4]   2>   "core":"collection1_shard2_replica_t6",
   [junit4]   2>   "state":"down",
   [junit4]   2>   "base_url":"http://127.0.0.1:56589/solr",
   [junit4]   2>   "type":"TLOG"} 
   [junit4]   2> 199873 INFO  (qtp1631556808-1975) [n:127.0.0.1:56589_solr    ] o.a.s.h.a.CoreAdminOperation core create command qt=/admin/cores&coreNodeName=core_node8&collection.configName=config&newCollection=true&name=collection1_shard2_replica_t6&action=CREATE&numShards=2&collection=collection1&shard=shard2&wt=javabin&version=2&replicaType=TLOG
   [junit4]   2> 199875 INFO  (qtp429308343-1970) [n:127.0.0.1:56588_solr    ] o.a.s.h.a.CoreAdminOperation core create command qt=/admin/cores&coreNodeName=core_node3&collection.configName=config&newCollection=true&name=collection1_shard1_replica_t1&action=CREATE&numShards=2&collection=collection1&shard=shard1&wt=javabin&version=2&replicaType=TLOG
   [junit4]   2> 199875 INFO  (qtp1631556808-1975) [n:127.0.0.1:56589_solr    ] o.a.s.c.TransientSolrCoreCacheDefault Allocating transient cache for 2147483647 transient cores
   [junit4]   2> 199876 INFO  (qtp429308343-1970) [n:127.0.0.1:56588_solr    ] o.a.s.c.TransientSolrCoreCacheDefault Allocating transient cache for 2147483647 transient cores
   [junit4]   2> 199881 INFO  (qtp429308343-1972) [n:127.0.0.1:56588_solr    ] o.a.s.h.a.CoreAdminOperation core create command qt=/admin/cores&coreNodeName=core_node7&collection.configName=config&newCollection=true&name=collection1_shard2_replica_t4&action=CREATE&numShards=2&collection=collection1&shard=shard2&wt=javabin&version=2&replicaType=TLOG
   [junit4]   2> 199886 INFO  (qtp1631556808-1973) [n:127.0.0.1:56589_solr    ] o.a.s.h.a.CoreAdminOperation core create command qt=/admin/cores&coreNodeName=core_node5&collection.configName=config&newCollection=true&name=collection1_shard1_replica_t2&action=CREATE&numShards=2&collection=collection1&shard=shard1&wt=javabin&version=2&replicaType=TLOG
   [junit4]   2> 200012 INFO  (zkCallback-344-thread-1-processing-n:127.0.0.1:56589_solr) [n:127.0.0.1:56589_solr    ] o.a.s.c.c.ZkStateReader A cluster state change: [WatchedEvent state:SyncConnected type:NodeDataChanged path:/collections/collection1/state.json] for collection [collection1] has occurred - updating... (live nodes size: [2])
   [junit4]   2> 200012 INFO  (zkCallback-344-thread-2-processing-n:127.0.0.1:56589_solr) [n:127.0.0.1:56589_solr    ] o.a.s.c.c.ZkStateReader A cluster state change: [WatchedEvent state:SyncConnected type:NodeDataChanged path:/collections/collection1/state.json] for collection [collection1] has occurred - updating... (live nodes size: [2])
   [junit4]   2> 200013 INFO  (zkCallback-345-thread-1-processing-n:127.0.0.1:56588_solr) [n:127.0.0.1:56588_solr    ] o.a.s.c.c.ZkStateReader A cluster state change: [WatchedEvent state:SyncConnected type:NodeDataChanged path:/collections/collection1/state.json] for collection [collection1] has occurred - updating... (live nodes size: [2])
   [junit4]   2> 200014 INFO  (zkCallback-345-thread-2-processing-n:127.0.0.1:56588_solr) [n:127.0.0.1:56588_solr    ] o.a.s.c.c.ZkStateReader A cluster state change: [WatchedEvent state:SyncConnected type:NodeDataChanged path:/collections/collection1/state.json] for collection [collection1] has occurred - updating... (live nodes size: [2])
   [junit4]   2> 200921 INFO  (qtp1631556808-1975) [n:127.0.0.1:56589_solr c:collection1 s:shard2 r:core_node8 x:collection1_shard2_replica_t6] o.a.s.c.SolrConfig Using Lucene MatchVersion: 8.0.0
   [junit4]   2> 200921 INFO  (qtp1631556808-1973) [n:127.0.0.1:56589_solr c:collection1 s:shard1 r:core_node5 x:collection1_shard1_replica_t2] o.a.s.c.SolrConfig Using Lucene MatchVersion: 8.0.0
   [junit4]   2> 200922 INFO  (qtp429308343-1972) [n:127.0.0.1:56588_solr c:collection1 s:shard2 r:core_node7 x:collection1_shard2_replica_t4] o.a.s.c.SolrConfig Using Lucene MatchVersion: 8.0.0
   [junit4]   2> 201137 INFO  (qtp429308343-1970) [n:127.0.0.1:56588_solr c:collection1 s:shard1 r:core_node3 x:collection1_shard1_replica_t1] o.a.s.c.SolrConfig Using Lucene MatchVersion: 8.0.0
   [junit4]   2> 201140 INFO  (qtp1631556808-1973) [n:127.0.0.1:56589_solr c:collection1 s:shard1 r:core_node5 x:collection1_shard1_replica_t2] o.a.s.s.IndexSchema [collection1_shard1_replica_t2] Schema name=minimal
   [junit4]   2> 201143 INFO  (qtp429308343-1972) [n:127.0.0.1:56588_solr c:collection1 s:shard2 r:core_node7 x:collection1_shard2_replica_t4] o.a.s.s.IndexSchema [collection1_shard2_replica_t4] Schema name=minimal
   [junit4]   2> 201144 INFO  (qtp1631556808-1975) [n:127.0.0.1:56589_solr c:collection1 s:shard2 r:core_node8 x:collection1_shard2_replica_t6] o.a.s.s.IndexSchema [collection1_shard2_replica_t6] Schema name=minimal
   [junit4]   2> 201146 INFO  (qtp429308343-1972) [n:127.0.0.1:56588_solr c:collection1 s:shard2 r:core_node7 x:collection1_shard2_replica_t4] o.a.s.s.IndexSchema Loaded schema minimal/1.1 with uniqueid field id
   [junit4]   2> 201146 INFO  (qtp1631556808-1973) [n:127.0.0.1:56589_solr c:collection1 s:shard1 r:core_node5 x:collection1_shard1_replica_t2] o.a.s.s.IndexSchema Loaded schema minimal/1.1 with uniqueid field id
   [junit4]   2> 201146 INFO  (qtp429308343-1972) [n:127.0.0.1:56588_solr c:collection1 s:shard2 r:core_node7 x:collection1_shard2_replica_t4] o.a.s.c.CoreContainer Creating SolrCore 'collection1_shard2_replica_t4' using configuration from collection collection1, trusted=true
   [junit4]   2> 201146 INFO  (qtp1631556808-1973) [n:127.0.0.1:56589_solr c:collection1 s:shard1 r:core_node5 x:collection1_shard1_replica_t2] o.a.s.c.CoreContainer Creating SolrCore 'collection1_shard1_replica_t2' using configuration from collection collection1, trusted=true
   [junit4]   2> 201147 INFO  (qtp1631556808-1973) [n:127.0.0.1:56589_solr c:collection1 s:shard1 r:core_node5 x:collection1_shard1_replica_t2] o.a.s.m.r.SolrJmxReporter JMX monitoring for 'solr_56589.solr.core.collection1.shard1.replica_t2' (registry 'solr.core.collection1.shard1.replica_t2') enabled at server: com.sun.jmx.mbeanserver.JmxMBeanServer@4eaf2039
   [junit4]   2> 201147 INFO  (qtp1631556808-1973) [n:127.0.0.1:56589_solr c:collection1 s:shard1 r:core_node5 x:collection1_shard1_replica_t2] o.a.s.c.SolrCore solr.RecoveryStrategy.Builder
   [junit4]   2> 201147 INFO  (qtp1631556808-1973) [n:127.0.0.1:56589_solr c:collection1 s:shard1 r:core_node5 x:collection1_shard1_replica_t2] o.a.s.c.SolrCore [[collection1_shard1_replica_t2] ] Opening new SolrCore at [C:\Users\jenkins\workspace\Lucene-Solr-master-Windows\solr\build\solr-core\test\J1\temp\solr.cloud.TestCloudRecovery_3F52E31C4FAD49EF-001\tempDir-001\node1\collection1_shard1_replica_t2], dataDir=[C:\Users\jenkins\workspace\Lucene-Solr-master-Windows\solr\build\solr-core\test\J1\temp\solr.cloud.TestCloudRecovery_3F52E31C4FAD49EF-001\tempDir-001\node1\.\collection1_shard1_replica_t2\data\]
   [junit4]   2> 201148 INFO  (qtp429308343-1972) [n:127.0.0.1:56588_solr c:collection1 s:shard2 r:core_node7 x:collection1_shard2_replica_t4] o.a.s.m.r.SolrJmxReporter JMX monitoring for 'solr_56588.solr.core.collection1.shard2.replica_t4' (registry 'solr.core.collection1.shard2.replica_t4') enabled at server: com.sun.jmx.mbeanserver.JmxMBeanServer@4eaf2039
   [junit4]   2> 201148 INFO  (qtp429308343-1972) [n:127.0.0.1:56588_solr c:collection1 s:shard2 r:core_node7 x:collection1_shard2_replica_t4] o.a.s.c.SolrCore solr.RecoveryStrategy.Builder
   [junit4]   2> 201148 INFO  (qtp429308343-1972) [n:127.0.0.1:56588_solr c:collection1 s:shard2 r:core_node7 x:collection1_shard2_replica_t4] o.a.s.c.SolrCore [[collection1_shard2_replica_t4] ] Opening new SolrCore at [C:\Users\jenkins\workspace\Lucene-Solr-master-Windows\solr\build\solr-core\test\J1\temp\solr.cloud.TestCloudRecovery_3F52E31C4FAD49EF-001\tempDir-001\node2\collection1_shard2_replica_t4], dataDir=[C:\Users\jenkins\workspace\Lucene-Solr-master-Windows\solr\build\solr-core\test\J1\temp\solr.cloud.TestCloudRecovery_3F52E31C4FAD49EF-001\tempDir-001\node2\.\collection1_shard2_replica_t4\data\]
   [junit4]   2> 201156 INFO  (qtp429308343-1970) [n:127.0.0.1:56588_solr c:collection1 s:shard1 r:core_node3 x:collection1_shard1_replica_t1] o.a.s.s.IndexSchema [collection1_shard1_replica_t1] Schema name=minimal
   [junit4]   2> 201162 INFO  (qtp1631556808-1975) [n:127.0.0.1:56589_solr c:collection1 s:shard2 r:core_node8 x:collection1_shard2_replica_t6] o.a.s.s.IndexSchema Loaded schema minimal/1.1 with uniqueid field id
   [junit4]   2> 201162 INFO  (qtp1631556808-1975) [n:127.0.0.1:56589_solr c:collection1 s:shard2 r:core_node8 x:collection1_shard2_replica_t6] o.a.s.c.CoreContainer Creating SolrCore 'collection1_shard2_replica_t6' using configuration from collection collection1, trusted=true
   [junit4]   2> 201163 INFO  (qtp1631556808-1975) [n:127.0.0.1:56589_solr c:collection1 s:shard2 r:core_node8 x:collection1_shard2_replica_t6] o.a.s.m.r.SolrJmxReporter JMX monitoring for 'solr_56589.solr.core.collection1.shard2.replica_t6' (registry 'solr.core.collection1.shard2.replica_t6') enabled at server: com.sun.jmx.mbeanserver.JmxMBeanServer@4eaf2039
   [junit4]   2> 201163 INFO  (qtp1631556808-1975) [n:127.0.0.1:56589_solr c:collection1 s:shard2 r:core_node8 x:collection1_shard2_replica_t6] o.a.s.c.SolrCore solr.RecoveryStrategy.Builder
   [junit4]   2> 201163 INFO  (qtp1631556808-1975) [n:127.0.0.1:56589_solr c:collection1 s:shard2 r:core_node8 x:collection1_shard2_replica_t6] o.a.s.c.SolrCore [[collection1_shard2_replica_t6] ] Opening new SolrCore at [C:\Users\jenkins\workspace\Lucene-Solr-master-Windows\solr\build\solr-core\test\J1\temp\solr.cloud.TestCloudRecovery_3F52E31C4FAD49EF-001\tempDir-001\node1\collection1_shard2_replica_t6], dataDir=[C:\Users\jenkins\workspace\Lucene-Solr-master-Windows\solr\build\solr-core\test\J1\temp\solr.cloud.TestCloudRecovery_3F52E31C4FAD49EF-001\tempDir-001\node1\.\collection1_shard2_replica_t6\data\]
   [junit4]   2> 201206 INFO  (qtp429308343-1970) [n:127.0.0.1:56588_solr c:collection1 s:shard1 r:core_node3 x:collection1_shard1_replica_t1] o.a.s.s.IndexSchema Loaded schema minimal/1.1 with uniqueid field id
   [junit4]   2> 201206 INFO  (qtp429308343-1970) [n:127.0.0.1:56588_solr c:collection1 s:shard1 r:core_node3 x:collection1_shard1_replica_t1] o.a.s.c.CoreContainer Creating SolrCore 'collection1_shard1_replica_t1' using configuration from collection collection1, trusted=true
   [junit4]   2> 201206 INFO  (qtp429308343-1970) [n:127.0.0.1:56588_solr c:collection1 s:shard1 r:core_node3 x:collection1_shard1_replica_t1] o.a.s.m.r.SolrJmxReporter JMX monitoring for 'solr_56588.solr.core.collection1.shard1.replica_t1' (registry 'solr.core.collection1.shard1.replica_t1') enabled at server: com.sun.jmx.mbeanserver.JmxMBeanServer@4eaf2039
   [junit4]   2> 201206 INFO  (qtp429308343-1970) [n:127.0.0.1:56588_solr c:collection1 s:shard1 r:core_node3 x:collection1_shard1_replica_t1] o.a.s.c.SolrCore solr.RecoveryStrategy.Builder
   [junit4]   2> 201206 INFO  (qtp429308343-1970) [n:127.0.0.1:56588_solr c:collection1 s:shard1 r:core_node3 x:collection1_shard1_replica_t1] o.a.s.c.SolrCore [[collection1_shard1_replica_t1] ] Opening new SolrCore at [C:\Users\jenkins\workspace\Lucene-Solr-master-Windows\solr\build\solr-core\test\J1\temp\solr.cloud.TestCloudRecovery_3F52E31C4FAD49EF-001\tempDir-001\node2\collection1_shard1_replica_t1], dataDir=[C:\Users\jenkins\workspace\Lucene-Solr-master-Windows\solr\build\solr-core\test\J1\temp\solr.cloud.TestCloudRecovery_3F52E31C4FAD49EF-001\tempDir-001\node2\.\collection1_shard1_replica_t1\data\]
   [junit4]   2> 201266 INFO  (qtp1631556808-1973) [n:127.0.0.1:56589_solr c:collection1 s:shard1 r:core_node5 x:collection1_shard1_replica_t2] o.a.s.u.UpdateHandler Using UpdateLog implementation: org.apache.solr.update.UpdateLog
   [junit4]   2> 201266 INFO  (qtp429308343-1972) [n:127.0.0.1:56588_solr c:collection1 s:shard2 r:core_node7 x:collection1_shard2_replica_t4] o.a.s.u.UpdateHandler Using UpdateLog implementation: org.apache.solr.update.UpdateLog
   [junit4]   2> 201266 INFO  (qtp429308343-1972) [n:127.0.0.1:56588_solr c:collection1 s:shard2 r:core_node7 x:collection1_shard2_replica_t4] o.a.s.u.UpdateLog Initializing UpdateLog: dataDir=null defaultSyncLevel=FLUSH numRecordsToKeep=100 maxNumLogsToKeep=10 numVersionBuckets=65536
   [junit4]   2> 201267 INFO  (qtp429308343-1970) [n:127.0.0.1:56588_solr c:collection1 s:shard1 r:core_node3 x:collection1_shard1_replica_t1] o.a.s.u.UpdateHandler Using UpdateLog implementation: org.apache.solr.update.UpdateLog
   [junit4]   2> 201267 INFO  (qtp429308343-1970) [n:127.0.0.1:56588_solr c:collection1 s:shard1 r:core_node3 x:collection1_shard1_replica_t1] o.a.s.u.UpdateLog Initializing UpdateLog: dataDir=null defaultSyncLevel=FLUSH numRecordsToKeep=100 maxNumLogsToKeep=10 numVersionBuckets=65536
   [junit4]   2> 201267 INFO  (qtp1631556808-1973) [n:127.0.0.1:56589_solr c:collection1 s:shard1 r:core_node5 x:collection1_shard1_replica_t2] o.a.s.u.UpdateLog Initializing UpdateLog: dataDir=null defaultSyncLevel=FLUSH numRecordsToKeep=100 maxNumLogsToKeep=10 numVersionBuckets=65536
   [junit4]   2> 201268 INFO  (qtp429308343-1972) [n:127.0.0.1:56588_solr c:collection1 s:shard2 r:core_node7 x:collection1_shard2_replica_t4] o.a.s.u.CommitTracker Hard AutoCommit: disabled
   [junit4]   2> 201268 INFO  (qtp429308343-1972) [n:127.0.0.1:56588_solr c:collection1 s:shard2 r:core_node7 x:collection1_shard2_replica_t4] o.a.s.u.CommitTracker Soft AutoCommit: disabled
   [junit4]   2> 201268 INFO  (qtp1631556808-1975) [n:127.0.0.1:56589_solr c:collection1 s:shard2 r:core_node8 x:collection1_shard2_replica_t6] o.a.s.u.UpdateHandler Using UpdateLog implementation: org.apache.solr.update.UpdateLog
   [junit4]   2> 201268 INFO  (qtp429308343-1970) [n:127.0.0.1:56588_solr c:collection1 s:shard1 r:core_node3 x:collection1_shard1_replica_t1] o.a.s.u.CommitTracker Hard AutoCommit: disabled
   [junit4]   2> 201268 INFO  (qtp429308343-1970) [n:127.0.0.1:56588_solr c:collection1 s:shard1 r:core_node3 x:collection1_shard1_replica_t1] o.a.s.u.CommitTracker Soft AutoCommit: disabled
   [junit4]   2> 201269 INFO  (qtp1631556808-1973) [n:127.0.0.1:56589_solr c:collection1 s:shard1 r:core_node5 x:collection1_shard1_replica_t2] o.a.s.u.CommitTracker Hard AutoCommit: disabled
   [junit4]   2> 201269 INFO  (qtp1631556808-1973) [n:127.0.0.1:56589_solr c:collection1 s:shard1 r:core_node5 x:collection1_shard1_replica_t2] o.a.s.u.CommitTracker Soft AutoCommit: disabled
   [junit4]   2> 201268 INFO  (qtp1631556808-1975) [n:127.0.0.1:56589_solr c:collection1 s:shard2 r:core_node8 x:collection1_shard2_replica_t6] o.a.s.u.UpdateLog Initializing UpdateLog: dataDir=null defaultSyncLevel=FLUSH numRecordsToKeep=100 maxNumLogsToKeep=10 numVersionBuckets=65536
   [junit4]   2> 201271 INFO  (qtp1631556808-1975) [n:127.0.0.1:56589_solr c:collection1 s:shard2 r:core_node8 x:collection1_shard2_replica_t6] o.a.s.u.CommitTracker Hard AutoCommit: disabled
   [junit4]   2> 201271 INFO  (qtp1631556808-1975) [n:127.0.0.1:56589_solr c:collection1 s:shard2 r:core_node8 x:collection1_shard2_replica_t6] o.a.s.u.CommitTracker Soft AutoCommit: disabled
   [junit4]   2> 201272 INFO  (qtp429308343-1970) [n:127.0.0.1:56588_solr c:collection1 s:shard1 r:core_node3 x:collection1_shard1_replica_t1] o.a.s.s.SolrIndexSearcher Opening [Searcher@1f271b5d[collection1_shard1_replica_t1] main]
   [junit4]   2> 201272 INFO  (qtp429308343-1972) [n:127.0.0.1:56588_solr c:collection1 s:shard2 r:core_node7 x:collection1_shard2_replica_t4] o.a.s.s.SolrIndexSearcher Opening [Searcher@5a310848[collection1_shard2_replica_t4] main]
   [junit4]   2> 201272 INFO  (qtp1631556808-1973) [n:127.0.0.1:56589_solr c:collection1 s:shard1 r:core_node5 x:collection1_shard1_replica_t2] o.a.s.s.SolrIndexSearcher Opening [Searcher@7add721c[collection1_shard1_replica_t2] main]
   [junit4]   2> 201273 INFO  (qtp429308343-1972) [n:127.0.0.1:56588_solr c:collection1 s:shard2 r:core_node7 x:collection1_shard2_replica_t4] o.a.s.r.ManagedResourceStorage Configured ZooKeeperStorageIO with znodeBase: /configs/config
   [junit4]   2> 201273 INFO  (qtp429308343-1972) [n:127.0.0.1:56588_solr c:collection1 s:shard2 r:core_node7 x:collection1_shard2_replica_t4] o.a.s.r.ManagedResourceStorage Loaded null at path _rest_managed.json using ZooKeeperStorageIO:path=/configs/config
   [junit4]   2> 201274 INFO  (qtp1631556808-1973) [n:127.0.0.1:56589_solr c:collection1 s:shard1 r:core_node5 x:collection1_shard1_replica_t2] o.a.s.r.ManagedResourceStorage Configured ZooKeeperStorageIO with znodeBase: /configs/config
   [junit4]   2> 201274 INFO  (qtp429308343-1972) [n:127.0.0.1:56588_solr c:collection1 s:shard2 r:core_node7 x:collection1_shard2_replica_t4] o.a.s.h.ReplicationHandler Commits will be reserved for 10000ms.
   [junit4]   2> 201274 INFO  (qtp429308343-1970) [n:127.0.0.1:56588_solr c:collection1 s:shard1 r:core_node3 x:collection1_shard1_replica_t1] o.a.s.r.ManagedResourceStorage Configured ZooKeeperStorageIO with znodeBase: /configs/config
   [junit4]   2> 201274 INFO  (qtp429308343-1972) [n:127.0.0.1:56588_solr c:collection1 s:shard2 r:core_node7 x:collection1_shard2_replica_t4] o.a.s.u.UpdateLog Could not find max version in index or recent updates, using new clock 1580079542207250432
   [junit4]   2> 201275 INFO  (searcherExecutor-878-thread-1-processing-n:127.0.0.1:56588_solr x:collection1_shard2_replica_t4 s:shard2 c:collection1 r:core_node7) [n:127.0.0.1:56588_solr c:collection1 s:shard2 r:core_node7 x:collection1_shard2_replica_t4] o.a.s.c.SolrCore [collection1_shard2_replica_t4] Registered new searcher Searcher@5a310848[collection1_shard2_replica_t4] main{ExitableDirectoryReader(UninvertingDirectoryReader())}
   [junit4]   2> 201275 INFO  (qtp1631556808-1973) [n:127.0.0.1:56589_solr c:collection1 s:shard1 r:core_node5 x:collection1_shard1_replica_t2] o.a.s.r.ManagedResourceStorage Loaded null at path _rest_managed.json using ZooKeeperStorageIO:path=/configs/config
   [junit4]   2> 201275 INFO  (qtp429308343-1970) [n:127.0.0.1:56588_solr c:collection1 s:shard1 r:core_node3 x:collection1_shard1_replica_t1] o.a.s.r.ManagedResourceStorage Loaded null at path _rest_managed.json using ZooKeeperStorageIO:path=/configs/config
   [junit4]   2> 201276 INFO  (qtp1631556808-1973) [n:127.0.0.1:56589_solr c:collection1 s:shard1 r:core_node5 x:collection1_shard1_replica_t2] o.a.s.h.ReplicationHandler Commits will be reserved for 10000ms.
   [junit4]   2> 201276 INFO  (qtp429308343-1970) [n:127.0.0.1:56588_solr c:collection1 s:shard1 r:core_node3 x:collection1_shard1_replica_t1] o.a.s.h.ReplicationHandler Commits will be reserved for 10000ms.
   [junit4]   2> 201277 INFO  (qtp1631556808-1973) [n:127.0.0.1:56589_solr c:collection1 s:shard1 r:core_node5 x:collection1_shard1_replica_t2] o.a.s.u.UpdateLog Could not find max version in index or recent updates, using new clock 1580079542210396160
   [junit4]   2> 201277 INFO  (qtp429308343-1970) [n:127.0.0.1:56588_solr c:collection1 s:shard1 r:core_node3 x:collection1_shard1_replica_t1] o.a.s.u.UpdateLog Could not find max version in index or recent updates, using new clock 1580079542210396160
   [junit4]   2> 201278 INFO  (qtp1631556808-1975) [n:127.0.0.1:56589_solr c:collection1 s:shard2 r:core_node8 x:collection1_shard2_replica_t6] o.a.s.s.SolrIndexSearcher Opening [Searcher@138f0591[collection1_shard2_replica_t6] main]
   [junit4]   2> 201278 INFO  (searcherExecutor-877-thread-1-processing-n:127.0.0.1:56589_solr x:collection1_shard1_replica_t2 s:shard1 c:collection1 r:core_node5) [n:127.0.0.1:56589_solr c:collection1 s:shard1 r:core_node5 x:collection1_shard1_replica_t2] o.a.s.c.SolrCore [collection1_shard1_replica_t2] Registered new searcher Searcher@7add721c[collection1_shard1_replica_t2] main{ExitableDirectoryReader(UninvertingDirectoryReader())}
   [junit4]   2> 201279 INFO  (searcherExecutor-880-thread-1-processing-n:127.0.0.1:56588_solr x:collection1_shard1_replica_t1 s:shard1 c:collection1 r:core_node3) [n:127.0.0.1:56588_solr c:collection1 s:shard1 r:core_node3 x:collection1_shard1_replica_t1] o.a.s.c.SolrCore [collection1_shard1_replica_t1] Registered new searcher Searcher@1f271b5d[collection1_shard1_replica_t1] main{ExitableDirectoryReader(UninvertingDirectoryReader())}
   [junit4]   2> 201281 INFO  (qtp1631556808-1975) [n:127.0.0.1:56589_solr c:collection1 s:shard2 r:core_node8 x:collection1_shard2_replica_t6] o.a.s.r.ManagedResourceStorage Configured ZooKeeperStorageIO with znodeBase: /configs/config
   [junit4]   2> 201281 INFO  (qtp1631556808-1975) [n:127.0.0.1:56589_solr c:collection1 s:shard2 r:core_node8 x:collection1_shard2_replica_t6] o.a.s.r.ManagedResourceStorage Loaded null at path _rest_managed.json using ZooKeeperStorageIO:path=/configs/config
   [junit4]   2> 201282 INFO  (qtp1631556808-1975) [n:127.0.0.1:56589_solr c:collection1 s:shard2 r:core_node8 x:collection1_shard2_replica_t6] o.a.s.h.ReplicationHandler Commits will be reserved for 10000ms.
   [junit4]   2> 201282 INFO  (qtp1631556808-1975) [n:127.0.0.1:56589_solr c:collection1 s:shard2 r:core_node8 x:collection1_shard2_replica_t6] o.a.s.u.UpdateLog Could not find max version in index or recent updates, using new clock 1580079542215639040
   [junit4]   2> 201285 INFO  (searcherExecutor-879-thread-1-processing-n:127.0.0.1:56589_solr x:collection1_shard2_replica_t6 s:shard2 c:collection1 r:core_node8) [n:127.0.0.1:56589_solr c:collection1 s:shard2 r:core_node8 x:collection1_shard2_replica_t6] o.a.s.c.SolrCore [collection1_shard2_replica_t6] Registered new searcher Searcher@138f0591[collection1_shard2_replica_t6] main{ExitableDirectoryReader(UninvertingDirectoryReader())}
   [junit4]   2> 201290 INFO  (qtp429308343-1972) [n:127.0.0.1:56588_solr c:collection1 s:shard2 r:core_node7 x:collection1_shard2_replica_t4] o.a.s.c.ShardLeaderElectionContext Enough replicas found to continue.
   [junit4]   2> 201290 INFO  (qtp429308343-1972) [n:127.0.0.1:56588_solr c:collection1 s:shard2 r:core_node7 x:collection1_shard2_replica_t4] o.a.s.c.ShardLeaderElectionContext I may be the new leader - try and sync
   [junit4]   2> 201290 INFO  (qtp429308343-1972) [n:127.0.0.1:56588_solr c:collection1 s:shard2 r:core_node7 x:collection1_shard2_replica_t4] o.a.s.c.SyncStrategy Sync replicas to http://127.0.0.1:56588/solr/collection1_shard2_replica_t4/
   [junit4]   2> 201290 INFO  (qtp429308343-1970) [n:127.0.0.1:56588_solr c:collection1 s:shard1 r:core_node3 x:collection1_shard1_replica_t1] o.a.s.c.ShardLeaderElectionContext Enough replicas found to continue.
   [junit4]   2> 201290 INFO  (qtp429308343-1970) [n:127.0.0.1:56588_solr c:collection1 s:shard1 r:core_node3 x:collection1_shard1_replica_t1] o.a.s.c.ShardLeaderElectionContext I may be the new leader - try and sync
   [junit4]   2> 201290 INFO  (qtp429308343-1970) [n:127.0.0.1:56588_solr c:collection1 s:shard1 r:core_node3 x:collection1_shard1_replica_t1] o.a.s.c.SyncStrategy Sync replicas to http://127.0.0.1:56588/solr/collection1_shard1_replica_t1/
   [junit4]   2> 201290 INFO  (qtp429308343-1972) [n:127.0.0.1:56588_solr c:collection1 s:shard2 r:core_node7 x:collection1_shard2_replica_t4] o.a.s.u.PeerSync PeerSync: core=collection1_shard2_replica_t4 url=http://127.0.0.1:56588/solr START replicas=[http://127.0.0.1:56589/solr/collection1_shard2_replica_t6/] nUpdates=100
   [junit4]   2> 201290 INFO  (qtp429308343-1970) [n:127.0.0.1:56588_solr c:collection1 s:shard1 r:core_node3 x:collection1_shard1_replica_t1] o.a.s.u.PeerSync PeerSync: core=collection1_shard1_replica_t1 url=http://127.0.0.1:56588/solr START replicas=[http://127.0.0.1:56589/solr/collection1_shard1_replica_t2/] nUpdates=100
   [junit4]   2> 201293 INFO  (qtp1631556808-1979) [n:127.0.0.1:56589_solr c:collection1 s:shard1 r:core_node5 x:collection1_shard1_replica_t2] o.a.s.c.S.Request [collection1_shard1_replica_t2]  webapp=/solr path=/get params={distrib=false&qt=/get&fingerprint=false&getVersions=100&wt=javabin&version=2} status=0 QTime=0
   [junit4]   2> 201294 INFO  (qtp1631556808-1971) [n:127.0.0.1:56589_solr c:collection1 s:shard2 r:core_node8 x:collection1_shard2_replica_t6] o.a.s.c.S.Request [collection1_shard2_replica_t6]  webapp=/solr path=/get params={distrib=false&qt=/get&fingerprint=false&getVersions=100&wt=javabin&version=2} status=0 QTime=0
   [junit4]   2> 201395 INFO  (zkCallback-344-thread-2-processing-n:127.0.0.1:56589_solr) [n:127.0.0.1:56589_solr    ] o.a.s.c.c.ZkStateReader A cluster state change: [WatchedEvent state:SyncConnected type:NodeDataChanged path:/collections/collection1/state.json] for collection [collection1] has occurred - updating... (live nodes size: [2])
   [junit4]   2> 201395 INFO  (zkCallback-344-thread-1-processing-n:127.0.0.1:56589_solr) [n:127.0.0.1:56589_solr    ] o.a.s.c.c.ZkStateReader A cluster state change: [WatchedEvent state:SyncConnected type:NodeDataChanged path:/collections/collection1/state.json] for collection [collection1] has occurred - updating... (live nodes size: [2])
   [junit4]   2> 201395 INFO  (zkCallback-345-thread-1-processing-n:127.0.0.1:56588_solr) [n:127.0.0.1:56588_solr    ] o.a.s.c.c.ZkStateReader A cluster state change: [WatchedEvent state:SyncConnected type:NodeDataChanged path:/collections/collection1/state.json] for collection [collection1] has occurred - updating... (live nodes size: [2])
   [junit4]   2> 201395 INFO  (zkCallback-345-thread-2-processing-n:127.0.0.1:56588_solr) [n:127.0.0.1:56588_solr    ] o.a.s.c.c.ZkStateReader A cluster state change: [WatchedEvent state:SyncConnected type:NodeDataChanged path:/collections/collection1/state.json] for collection [collection1] has occurred - updating... (live nodes size: [2])
   [junit4]   2> 201590 INFO  (qtp429308343-1970) [n:127.0.0.1:56588_solr c:collection1 s:shard1 r:core_node3 x:collection1_shard1_replica_t1] o.a.s.u.PeerSync PeerSync: core=collection1_shard1_replica_t1 url=http://127.0.0.1:56588/solr DONE.  We have no versions.  sync failed.
   [junit4]   2> 201590 INFO  (qtp429308343-1970) [n:127.0.0.1:56588_solr c:collection1 s:shard1 r:core_node3 x:collection1_shard1_replica_t1] o.a.s.c.SyncStrategy Leader's attempt to sync with shard failed, moving to the next candidate
   [junit4]   2> 201590 INFO  (qtp429308343-1970) [n:127.0.0.1:56588_solr c:collection1 s:shard1 r:core_node3 x:collection1_shard1_replica_t1] o.a.s.c.ShardLeaderElectionContext We failed sync, but we have no versions - we can't sync in that case - we were active before, so become leader anyway
   [junit4]   2> 201590 INFO  (qtp429308343-1970) [n:127.0.0.1:56588_solr c:collection1 s:shard1 r:core_node3 x:collection1_shard1_replica_t1] o.a.s.c.ShardLeaderElectionContext Found all replicas participating in election, clear LIR
   [junit4]   2> 201590 INFO  (qtp429308343-1972) [n:127.0.0.1:56588_solr c:collection1 s:shard2 r:core_node7 x:collection1_shard2_replica_t4] o.a.s.u.PeerSync PeerSync: core=collection1_shard2_replica_t4 url=http://127.0.0.1:56588/solr DONE.  We have no versions.  sync failed.
   [junit4]   2> 201590 INFO  (qtp429308343-1972) [n:127.0.0.1:56588_solr c:collection1 s:shard2 r:core_node7 x:collection1_shard2_replica_t4] o.a.s.c.SyncStrategy Leader's attempt to sync with shard failed, moving to the next candidate
   [junit4]   2> 201590 INFO  (qtp429308343-1972) [n:127.0.0.1:56588_solr c:collection1 s:shard2 r:core_node7 x:collection1_shard2_replica_t4] o.a.s.c.ShardLeaderElectionContext We failed sync, but we have no versions - we can't sync in that case - we were active before, so become leader anyway
   [junit4]   2> 201590 INFO  (qtp429308343-1972) [n:127.0.0.1:56588_solr c:collection1 s:shard2 r:core_node7 x:collection1_shard2_replica_t4] o.a.s.c.ShardLeaderElectionContext Found all replicas participating in election, clear LIR
   [junit4]   2> 201590 INFO  (qtp429308343-1970) [n:127.0.0.1:56588_solr c:collection1 s:shard1 r:core_node3 x:collection1_shard1_replica_t1] o.a.s.c.ZkController collection1_shard1_replica_t1 stopping background replication from leader
   [junit4]   2> 201590 INFO  (qtp429308343-1972) [n:127.0.0.1:56588_solr c:collection1 s:shard2 r:core_node7 x:collection1_shard2_replica_t4] o.a.s.c.ZkController collection1_shard2_replica_t4 stopping background replication from leader
   [junit4]   2> 201594 INFO  (qtp429308343-1970) [n:127.0.0.1:56588_solr c:collection1 s:shard1 r:core_node3 x:collection1_shard1_replica_t1] o.a.s.c.ShardLeaderElectionContext I am the new leader: http://127.0.0.1:56588/solr/collection1_shard1_replica_t1/ shard1
   [junit4]   2> 201594 INFO  (qtp429308343-1972) [n:127.0.0.1:56588_solr c:collection1 s:shard2 r:core_node7 x:collection1_shard2_replica_t4] o.a.s.c.ShardLeaderElectionContext I am the new leader: http://127.0.0.1:56588/solr/collection1_shard2_replica_t4/ shard2
   [junit4]   2> 201700 INFO  (zkCallback-344-thread-1-processing-n:127.0.0.1:56589_solr) [n:127.0.0.1:56589_solr    ] o.a.s.c.c.ZkStateReader A cluster state change: [WatchedEvent state:SyncConnected type:NodeDataChanged path:/collections/collection1/state.json] for collection [collection1] has occurred - updating... (live nodes size: [2])
   [junit4]   2> 201700 INFO  (zkCallback-344-thread-2-processing-n:127.0.0.1:56589_solr) [n:127.0.0.1:56589_solr    ] o.a.s.c.c.ZkStateReader A cluster state change: [WatchedEvent state:SyncConnected type:NodeDataChanged path:/collections/collection1/state.json] for collection [collection1] has occurred - updating... (live nodes size: [2])
   [junit4]   2> 201700 INFO  (zkCallback-345-thread-1-processing-n:127.0.0.1:56588_solr) [n:127.0.0.1:56588_solr    ] o.a.s.c.c.ZkStateReader A cluster state change: [WatchedEvent state:SyncConnected type:NodeDataChanged path:/collections/collection1/state.json] for collection [collection1] has occurred - updating... (live nodes size: [2])
   [junit4]   2> 201700 INFO  (zkCallback-345-thread-2-processing-n:127.0.0.1:56588_solr) [n:127.0.0.1:56588_solr    ] o.a.s.c.c.ZkStateReader A cluster state change: [WatchedEvent state:SyncConnected type:NodeDataChanged path:/collections/collection1/state.json] for collection [collection1] has occurred - updating... (live nodes size: [2])
   [junit4]   2> 201751 INFO  (qtp429308343-1972) [n:127.0.0.1:56588_solr c:collection1 s:shard2 r:core_node7 x:collection1_shard2_replica_t4] o.a.s.c.ZkController I am the leader, no recovery necessary
   [junit4]   2> 201751 INFO  (qtp429308343-1970) [n:127.0.0.1:56588_solr c:collection1 s:shard1 r:core_node3 x:collection1_shard1_replica_t1] o.a.s.c.ZkController I am the leader, no recovery necessary
   [junit4]   2> 201752 INFO  (qtp429308343-1970) [n:127.0.0.1:56588_solr c:collection1 s:shard1 r:core_node3 x:collection1_shard1_replica_t1] o.a.s.s.HttpSolrCall [admin] webapp=null path=/admin/cores params={qt=/admin/cores&coreNodeName=core_node3&collection.configName=config&newCollection=true&name=collection1_shard1_replica_t1&action=CREATE&numShards=2&collection=collection1&shard=shard1&wt=javabin&version=2&replicaType=TLOG} status=0 QTime=1876
   [junit4]   2> 201752 INFO  (qtp429308343-1972) [n:127.0.0.1:56588_solr c:collection1 s:shard2 r:core_node7 x:collection1_shard2_replica_t4] o.a.s.s.HttpSolrCall [admin] webapp=null path=/admin/cores params={qt=/admin/cores&coreNodeName=core_node7&collection.configName=config&newCollection=true&name=collection1_shard2_replica_t4&action=CREATE&numShards=2&collection=collection1&shard=shard2&wt=javabin&version=2&replicaType=TLOG} status=0 QTime=1871
   [junit4]   2> 201856 INFO  (zkCallback-344-thread-1-processing-n:127.0.0.1:56589_solr) [n:127.0.0.1:56589_solr    ] o.a.s.c.c.ZkStateReader A cluster state change: [WatchedEvent state:SyncConnected type:NodeDataChanged path:/collections/collection1/state.json] for collection [collection1] has occurred - updating... (live nodes size: [2])
   [junit4]   2> 201856 INFO  (zkCallback-344-thread-2-processing-n:127.0.0.1:56589_solr) [n:127.0.0.1:56589_solr    ] o.a.s.c.c.ZkStateReader A cluster state change: [WatchedEvent state:SyncConnected type:NodeDataChanged path:/collections/collection1/state.json] for collection [collection1] has occurred - updating... (live nodes size: [2])
   [junit4]   2> 201856 INFO  (zkCallback-345-thread-1-processing-n:127.0.0.1:56588_solr) [n:127.0.0.1:56588_solr    ] o.a.s.c.c.ZkStateReader A cluster state change: [WatchedEvent state:SyncConnected type:NodeDataChanged path:/collections/collection1/state.json] for collection [collection1] has occurred - updating... (live nodes size: [2])
   [junit4]   2> 201856 INFO  (zkCallback-345-thread-2-processing-n:127.0.0.1:56588_solr) [n:127.0.0.1:56588_solr    ] o.a.s.c.c.ZkStateReader A cluster state change: [WatchedEvent state:SyncConnected type:NodeDataChanged path:/collections/collection1/state.json] for collection [collection1] has occurred - updating... (live nodes size: [2])
   [junit4]   2> 202292 INFO  (qtp1631556808-1975) [n:127.0.0.1:56589_solr c:collection1 s:shard2 r:core_node8 x:collection1_shard2_replica_t6] o.a.s.c.ZkController collection1_shard2_replica_t6 starting background replication from leader
   [junit4]   2> 202292 INFO  (qtp1631556808-1973) [n:127.0.0.1:56589_solr c:collection1 s:shard1 r:core_node5 x:collection1_shard1_replica_t2] o.a.s.c.ZkController collection1_shard1_replica_t2 starting background replication from leader
   [junit4]   2> 202293 INFO  (qtp1631556808-1975) [n:127.0.0.1:56589_solr c:collection1 s:shard2 r:core_node8 x:collection1_shard2_replica_t6] o.a.s.c.ReplicateFromLeader Will start replication from leader with poll interval: 00:00:03
   [junit4]   2> 202293 INFO  (qtp1631556808-1973) [n:127.0.0.1:56589_solr c:collection1 s:shard1 r:core_node5 x:collection1_shard1_replica_t2] o.a.s.c.ReplicateFromLeader Will start replication from leader with poll interval: 00:00:03
   [junit4]   2> 202299 INFO  (qtp1631556808-1975) [n:127.0.0.1:56589_solr c:collection1 s:shard2 r:core_node8 x:collection1_shard2_replica_t6] o.a.s.h.ReplicationHandler Poll scheduled at an interval of 3000ms
   [junit4]   2> 202299 INFO  (qtp1631556808-1973) [n:127.0.0.1:56589_solr c:collection1 s:shard1 r:core_node5 x:collection1_shard1_replica_t2] o.a.s.h.ReplicationHandler Poll scheduled at an interval of 3000ms
   [junit4]   2> 202299 INFO  (qtp1631556808-1975) [n:127.0.0.1:56589_solr c:collection1 s:shard2 r:core_node8 x:collection1_shard2_replica_t6] o.a.s.h.ReplicationHandler Commits will be reserved for 10000ms.
   [junit4]   2> 202299 INFO  (qtp1631556808-1973) [n:127.0.0.1:56589_solr c:collection1 s:shard1 r:core_node5 x:collection1_shard1_replica_t2] o.a.s.h.ReplicationHandler Commits will be reserved for 10000ms.
   [junit4]   2> 202301 INFO  (qtp1631556808-1975) [n:127.0.0.1:56589_solr c:collection1 s:shard2 r:core_node8 x:collection1_shard2_replica_t6] o.a.s.s.HttpSolrCall [admin] webapp=null path=/admin/cores params={qt=/admin/cores&coreNodeName=core_node8&collection.configName=config&newCollection=true&name=collection1_shard2_replica_t6&action=CREATE&numShards=2&collection=collection1&shard=shard2&wt=javabin&version=2&replicaType=TLOG} status=0 QTime=2427
   [junit4]   2> 202301 INFO  (qtp1631556808-1973) [n:127.0.0.1:56589_solr c:collection1 s:shard1 r:core_node5 x:collection1_shard1_replica_t2] o.a.s.s.HttpSolrCall [admin] webapp=null path=/admin/cores params={qt=/admin/cores&coreNodeName=core_node5&collection.configName=config&newCollection=true&name=collection1_shard1_replica_t2&action=CREATE&numShards=2&collection=collection1&shard=shard1&wt=javabin&version=2&replicaType=TLOG} status=0 QTime=2414
   [junit4]   2> 202303 INFO  (indexFetcher-899-thread-1) [n:127.0.0.1:56589_solr c:collection1 s:shard2 r:core_node8 x:collection1_shard2_replica_t6] o.a.s.h.IndexFetcher Updated masterUrl to http://127.0.0.1:56588/solr/collection1_shard2_replica_t4/
   [junit4]   2> 202303 INFO  (indexFetcher-900-thread-1) [n:127.0.0.1:56589_solr c:collection1 s:shard1 r:core_node5 x:collection1_shard1_replica_t2] o.a.s.h.IndexFetcher Updated masterUrl to http://127.0.0.1:56588/solr/collection1_shard1_replica_t1/
   [junit4]   2> 202304 INFO  (qtp429308343-1974) [n:127.0.0.1:56588_solr c:collection1 s:shard1 r:core_node3 x:collection1_shard1_replica_t1] o.a.s.c.S.Request [collection1_shard1_replica_t1]  webapp=/solr path=/replication params={qt=/replication&wt=javabin&version=2&command=indexversion} status=0 QTime=0
   [junit4]   2> 202305 INFO  (indexFetcher-900-thread-1) [n:127.0.0.1:56589_solr c:collection1 s:shard1 r:core_node5 x:collection1_shard1_replica_t2] o.a.s.h.IndexFetcher Master's generation: 1
   [junit4]   2> 202305 INFO  (indexFetcher-900-thread-1) [n:127.0.0.1:56589_solr c:collection1 s:shard1 r:core_node5 x:collection1_shard1_replica_t2] o.a.s.h.IndexFetcher Master's version: 0
   [junit4]   2> 202305 INFO  (indexFetcher-900-thread-1) [n:127.0.0.1:56589_solr c:collection1 s:shard1 r:core_node5 x:collection1_shard1_replica_t2] o.a.s.h.IndexFetcher Slave's generation: 1
   [junit4]   2> 202305 INFO  (indexFetcher-900-thread-1) [n:127.0.0.1:56589_solr c:collection1 s:shard1 r:core_node5 x:collection1_shard1_replica_t2] o.a.s.h.IndexFetcher Slave's version: 0
   [junit4]   2> 202305 INFO  (indexFetcher-900-thread-1) [n:127.0.0.1:56589_solr c:collection1 s:shard1 r:core_node5 x:collection1_shard1_replica_t2] o.a.s.h.IndexFetcher New index in Master. Deleting mine...
   [junit4]   2> 202306 INFO  (indexFetcher-900-thread-1) [n:127.0.0.1:56589_solr c:collection1 s:shard1 r:core_node5 x:collection1_shard1_replica_t2] o.a.s.s.SolrIndexSearcher Opening [Searcher@316a9c5a[collection1_shard1_replica_t2] main]
   [junit4]   2> 202308 INFO  (qtp429308343-1974) [n:127.0.0.1:56588_solr c:collection1 s:shard2 r:core_node7 x:collection1_shard2_replica_t4] o.a.s.c.S.Request [collection1_shard2_replica_t4]  webapp=/solr path=/replication params={qt=/replication&wt=javabin&version=2&command=indexversion} status=0 QTime=0
   [junit4]   2> 202308 INFO  (indexFetcher-899-thread-1) [n:127.0.0.1:56589_solr c:collection1 s:shard2 r:core_node8 x:collection1_shard2_replica_t6] o.a.s.h.IndexFetcher Master's generation: 1
   [junit4]   2> 202308 INFO  (indexFetcher-899-thread-1) [n:127.0.0.1:56589_solr c:collection1 s:shard2 r:core_node8 x:collection1_shard2_replica_t6] o.a.s.h.IndexFetcher Master's version: 0
   [junit4]   2> 202308 INFO  (indexFetcher-899-thread-1) [n:127.0.0.1:56589_solr c:collection1 s:shard2 r:core_node8 x:collection1_shard2_replica_t6] o.a.s.h.IndexFetcher Slave's generation: 1
   [junit4]   2> 202308 INFO  (indexFetcher-899-thread-1) [n:127.0.0.1:56589_solr c:collection1 s:shard2 r:core_node8 x:collection1_shard2_replica_t6] o.a.s.h.IndexFetcher Slave's version: 0
   [junit4]   2> 202308 INFO  (indexFetcher-899-thread-1) [n:127.0.0.1:56589_solr c:collection1 s:shard2 r:core_node8 x:collection1_shard2_replica_t6] o.a.s.h.IndexFetcher New index in Master. Deleting mine...
   [junit4]   2> 202309 INFO  (indexFetcher-899-thread-1) [n:127.0.0.1:56589_solr c:collection1 s:shard2 r:core_node8 x:collection1_shard2_replica_t6] o.a.s.s.SolrIndexSearcher Opening [Searcher@640d17c0[collection1_shard2_replica_t6] main]
   [junit4]   2> 202312 INFO  (searcherExecutor-877-thread-1-processing-n:127.0.0.1:56589_solr x:collection1_shard1_replica_t2 s:shard1 c:collection1 r:core_node5) [n:127.0.0.1:56589_solr c:collection1 s:shard1 r:core_node5 x:collection1_shard1_replica_t2] o.a.s.c.SolrCore [collection1_shard1_replica_t2] Registered new searcher Searcher@316a9c5a[collection1_shard1_replica_t2] main{ExitableDirectoryReader(UninvertingDirectoryReader())}
   [junit4]   2> 202312 INFO  (searcherExecutor-879-thread-1-processing-n:127.0.0.1:56589_solr x:collection1_shard2_replica_t6 s:shard2 c:collection1 r:core_node8) [n:127.0.0.1:56589_solr c:collection1 s:shard2 r:core_node8 x:collection1_shard2_replica_t6] o.a.s.c.SolrCore [collection1_shard2_replica_t6] Registered new searcher Searcher@640d17c0[collection1_shard2_replica_t6] main{ExitableDirectoryReader(UninvertingDirectoryReader())}
   [junit4]   2> 202315 INFO  (qtp429308343-1969) [n:127.0.0.1:56588_solr    ] o.a.s.h.a.CollectionsHandler Wait for new collection to be active for at most 30 seconds. Check all shard replicas
   [junit4]   2> 202417 INFO  (zkCallback-344-thread-2-processing-n:127.0.0.1:56589_solr) [n:127.0.0.1:56589_solr    ] o.a.s.c.c.ZkStateReader A cluster state change: [WatchedEvent state:SyncConnected type:NodeDataChanged path:/collections/collection1/state.json] for collection [collection1] has occurred - updating... (live nodes size: [2])
   [junit4]   2> 202417 INFO  (zkCallback-344-thread-1-processing-n:127.0.0.1:56589_solr) [n:127.0.0.1:56589_solr    ] o.a.s.c.c.ZkStateReader A cluster state change: [WatchedEvent state:SyncConnected type:NodeDataChanged path:/collections/collection1/state.json] for collection [collection1] has occurred - updating... (live nodes size: [2])
   [junit4]   2> 202417 INFO  (zkCallback-345-thread-2-processing-n:127.0.0.1:56588_solr) [n:127.0.0.1:56588_solr    ] o.a.s.c.c.ZkStateReader A cluster state change: [WatchedEvent state:SyncConnected type:NodeDataChanged path:/collections/collection1/state.json] for collection [collection1] has occurred - updating... (live nodes size: [2])
   [junit4]   2> 202417 INFO  (zkCallback-345-thread-1-processing-n:127.0.0.1:56588_solr) [n:127.0.0.1:56588_solr    ] o.a.s.c.c.ZkStateReader A cluster state change: [WatchedEvent state:SyncConnected type:NodeDataChanged path:/collections/collection1/state.json] for collection [collection1] has occurred - updating... (live nodes size: [2])
   [junit4]   2> 203315 INFO  (qtp429308343-1969) [n:127.0.0.1:56588_solr    ] o.a.s.s.HttpSolrCall [admin] webapp=null path=/admin/collections params={pullReplicas=0&replicationFactor=0&collection.configName=config&maxShardsPerNode=2&name=collection1&nrtReplicas=0&action=CREATE&numShards=2&tlogReplicas=2&wt=javabin&version=2} status=0 QTime=3784
   [junit4]   2> 203315 INFO  (SUITE-TestCloudRecovery-seed#[3F52E31C4FAD49EF]-worker) [    ] o.a.s.c.AbstractDistribZkTestBase Wait for recoveries to finish - collection: collection1 failOnTimeout:true timeout (sec):30
   [junit4]   2> 203316 INFO  (SUITE-TestCloudRecovery-seed#[3F52E31C4FAD49EF]-worker) [    ] o.a.s.c.AbstractDistribZkTestBase Recoveries finished - collection: collection1
   [junit4]   2> 203331 INFO  (TEST-TestCloudRecovery.corruptedLogTest-seed#[3F52E31C4FAD49EF]) [    ] o.a.s.SolrTestCaseJ4 ###Starting corruptedLogTest
   [junit4]   2> 203352 INFO  (qtp1631556808-1980) [n:127.0.0.1:56589_solr c:collection1 s:shard2 r:core_node8 x:collection1_shard2_replica_t6] o.a.s.u.p.LogUpdateProcessorFactory [collection1_shard2_replica_t6]  webapp=/solr path=/update params={update.distrib=FROMLEADER&_version_=-1580079544370462720&distrib.from=http://127.0.0.1:56588/solr/collection1_shard2_replica_t4/&wt=javabin&version=2}{deleteByQuery=*:* (-1580079544370462720)} 0 10
   [junit4]   2> 203352 INFO  (qtp429308343-1966) [n:127.0.0.1:56588_solr c:collection1 s:shard2 r:core_node7 x:coll

[...truncated too long message...]

ServerCnxnFactory.run(NIOServerCnxnFactory.java:203)
   [junit4]   2> 	at java.lang.Thread.run(Thread.java:748)
   [junit4]   2> 143092 WARN  (zkCallback-67-thread-1-processing-n:127.0.0.1:50640_solr) [n:127.0.0.1:50640_solr    ] o.a.s.c.c.ZkStateReader ZooKeeper watch triggered, but Solr cannot talk to ZK: [KeeperErrorCode = Session expired for /live_nodes]
   [junit4]   2> 143092 INFO  (zkCallback-69-thread-1-processing-n:127.0.0.1:50645_solr) [n:127.0.0.1:50645_solr    ] o.a.s.c.c.ZkStateReader Updated live nodes from ZooKeeper... (4) -> (3)
   [junit4]   2> 143092 INFO  (zkCallback-68-thread-2-processing-n:127.0.0.1:50635_solr) [n:127.0.0.1:50635_solr    ] o.a.s.c.c.ZkStateReader Updated live nodes from ZooKeeper... (4) -> (3)
   [junit4]   2> 143092 INFO  (zkCallback-66-thread-1-processing-n:127.0.0.1:50646_solr) [n:127.0.0.1:50646_solr    ] o.a.s.c.c.ZkStateReader Updated live nodes from ZooKeeper... (4) -> (3)
   [junit4]   2> 143093 INFO  (jetty-closer-48-thread-1) [    ] o.e.j.s.h.ContextHandler Stopped o.e.j.s.ServletContextHandler@4db7992e{/solr,null,UNAVAILABLE}
   [junit4]   2> 143099 INFO  (coreCloseExecutor-537-thread-2) [n:127.0.0.1:50646_solr c:mainCorpus s:shard1 r:core_node3 x:mainCorpus_shard1_replica_n1] o.a.s.m.SolrMetricManager Closing metric reporters for registry=solr.collection.mainCorpus.shard1.leader, tag=409802445
   [junit4]   2> 143099 INFO  (coreCloseExecutor-537-thread-1) [n:127.0.0.1:50646_solr c:workQueue s:shard2 r:core_node4 x:workQueue_shard2_replica_n2] o.a.s.m.SolrMetricManager Closing metric reporters for registry=solr.core.workQueue.shard2.replica_n2, tag=1982469182
   [junit4]   2> 143099 INFO  (coreCloseExecutor-537-thread-1) [n:127.0.0.1:50646_solr c:workQueue s:shard2 r:core_node4 x:workQueue_shard2_replica_n2] o.a.s.m.r.SolrJmxReporter Closing reporter [org.apache.solr.metrics.reporters.SolrJmxReporter@58c8435d: rootName = solr_50646, domain = solr.core.workQueue.shard2.replica_n2, service url = null, agent id = null] for registry solr.core.workQueue.shard2.replica_n2 / com.codahale.metrics.MetricRegistry@7075ca0a
   [junit4]   2> 143101 INFO  (coreCloseExecutor-535-thread-1) [n:127.0.0.1:50645_solr c:collection1_collection s:shard1 r:core_node3 x:collection1_collection_shard1_replica_n1] o.a.s.m.SolrMetricManager Closing metric reporters for registry=solr.collection.collection1_collection.shard1.leader, tag=1311022954
   [junit4]   2> 143108 INFO  (coreCloseExecutor-534-thread-1) [n:127.0.0.1:50635_solr c:workQueue s:shard1 r:core_node3 x:workQueue_shard1_replica_n1] o.a.s.m.SolrMetricManager Closing metric reporters for registry=solr.collection.workQueue.shard1.leader, tag=2071990840
   [junit4]   2> 143108 INFO  (coreCloseExecutor-534-thread-1) [n:127.0.0.1:50635_solr c:workQueue s:shard1 r:core_node3 x:workQueue_shard1_replica_n1] o.a.s.u.DirectUpdateHandler2 Committing on IndexWriter close.
   [junit4]   2> 143109 INFO  (coreCloseExecutor-534-thread-1) [n:127.0.0.1:50635_solr c:workQueue s:shard1 r:core_node3 x:workQueue_shard1_replica_n1] o.a.s.u.SolrIndexWriter Calling setCommitData with IW:org.apache.solr.update.SolrIndexWriter@5ad0ba9e commitCommandVersion:0
   [junit4]   2> 143111 INFO  (coreCloseExecutor-537-thread-1) [n:127.0.0.1:50646_solr c:workQueue s:shard2 r:core_node4 x:workQueue_shard2_replica_n2] o.a.s.m.SolrMetricManager Closing metric reporters for registry=solr.collection.workQueue.shard2.leader, tag=1982469182
   [junit4]   2> 143113 WARN  (zkCallback-69-thread-2-processing-n:127.0.0.1:50645_solr) [n:127.0.0.1:50645_solr    ] o.a.s.c.c.ZkStateReader ZooKeeper watch triggered, but Solr cannot talk to ZK: [KeeperErrorCode = Session expired for /live_nodes]
   [junit4]   2> 143113 INFO  (jetty-closer-48-thread-4) [    ] o.e.j.s.h.ContextHandler Stopped o.e.j.s.ServletContextHandler@371e5e7c{/solr,null,UNAVAILABLE}
   [junit4]   2> 143113 INFO  (zkCallback-68-thread-1-processing-n:127.0.0.1:50635_solr) [n:127.0.0.1:50635_solr    ] o.a.s.c.c.ZkStateReader Updated live nodes from ZooKeeper... (3) -> (2)
   [junit4]   2> 143113 INFO  (zkCallback-66-thread-1-processing-n:127.0.0.1:50646_solr) [n:127.0.0.1:50646_solr    ] o.a.s.c.c.ZkStateReader Updated live nodes from ZooKeeper... (3) -> (2)
   [junit4]   2> 143116 INFO  (jetty-closer-48-thread-3) [    ] o.a.s.c.Overseer Overseer (id=98755182370226186-127.0.0.1:50646_solr-n_0000000000) closing
   [junit4]   2> 143116 INFO  (OverseerStateUpdate-98755182370226186-127.0.0.1:50646_solr-n_0000000000) [n:127.0.0.1:50646_solr    ] o.a.s.c.Overseer Overseer Loop exiting : 127.0.0.1:50646_solr
   [junit4]   2> 143119 INFO  (zkCallback-68-thread-2-processing-n:127.0.0.1:50635_solr) [n:127.0.0.1:50635_solr    ] o.a.s.c.c.ZkStateReader Updated live nodes from ZooKeeper... (2) -> (1)
   [junit4]   2> 143119 INFO  (zkCallback-68-thread-1-processing-n:127.0.0.1:50635_solr) [n:127.0.0.1:50635_solr    ] o.a.s.c.OverseerElectionContext I am going to be the leader 127.0.0.1:50635_solr
   [junit4]   2> 143135 WARN  (NIOServerCxn.Factory:0.0.0.0/0.0.0.0:0) [    ] o.a.z.s.NIOServerCnxn caught end of stream exception
   [junit4]   2> EndOfStreamException: Unable to read additional data from client sessionid 0x15ed950ace8000c, likely client has closed socket
   [junit4]   2> 	at org.apache.zookeeper.server.NIOServerCnxn.doIO(NIOServerCnxn.java:239)
   [junit4]   2> 	at org.apache.zookeeper.server.NIOServerCnxnFactory.run(NIOServerCnxnFactory.java:203)
   [junit4]   2> 	at java.lang.Thread.run(Thread.java:748)
   [junit4]   2> 143135 WARN  (zkCallback-68-thread-1-processing-n:127.0.0.1:50635_solr) [n:127.0.0.1:50635_solr    ] o.a.s.c.c.ZkStateReader ZooKeeper watch triggered, but Solr cannot talk to ZK: [KeeperErrorCode = Session expired for /live_nodes]
   [junit4]   2> 143136 INFO  (jetty-closer-48-thread-2) [    ] o.e.j.s.h.ContextHandler Stopped o.e.j.s.ServletContextHandler@c3663c8{/solr,null,UNAVAILABLE}
   [junit4]   2> 144618 WARN  (zkCallback-66-thread-1-processing-n:127.0.0.1:50646_solr) [n:127.0.0.1:50646_solr    ] o.a.s.c.c.ZkStateReader ZooKeeper watch triggered, but Solr cannot talk to ZK: [KeeperErrorCode = Session expired for /live_nodes]
   [junit4]   2> 144618 INFO  (jetty-closer-48-thread-3) [    ] o.e.j.s.h.ContextHandler Stopped o.e.j.s.ServletContextHandler@73824200{/solr,null,UNAVAILABLE}
   [junit4]   2> 144620 ERROR (SUITE-StreamExpressionTest-seed#[F066521A7F78AA4D]-worker) [    ] o.a.z.s.ZooKeeperServer ZKShutdownHandler is not registered, so ZooKeeper server won't take any action on ERROR or SHUTDOWN server state changes
   [junit4]   2> 144622 INFO  (SUITE-StreamExpressionTest-seed#[F066521A7F78AA4D]-worker) [    ] o.a.s.c.ZkTestServer connecting to 127.0.0.1:50631 50631
   [junit4]   2> 144623 INFO  (Thread-104) [    ] o.a.s.c.ZkTestServer connecting to 127.0.0.1:50631 50631
   [junit4]   2> 144628 WARN  (Thread-104) [    ] o.a.s.c.ZkTestServer Watch limit violations: 
   [junit4]   2> Maximum concurrent create/delete watches above limit:
   [junit4]   2> 
   [junit4]   2> 	78	/solr/clusterprops.json
   [junit4]   2> 	78	/solr/aliases.json
   [junit4]   2> 	9	/solr/configs/conf
   [junit4]   2> 	4	/solr/security.json
   [junit4]   2> 
   [junit4]   2> Maximum concurrent data watches above limit:
   [junit4]   2> 
   [junit4]   2> 	78	/solr/clusterstate.json
   [junit4]   2> 	20	/solr/collections/destination/state.json
   [junit4]   2> 	20	/solr/collections/parallelDestinationCollection/state.json
   [junit4]   2> 	20	/solr/collections/parallelDestinationCollection1/state.json
   [junit4]   2> 	20	/solr/collections/destinationCollection/state.json
   [junit4]   2> 	20	/solr/collections/mainCorpus/state.json
   [junit4]   2> 	18	/solr/collections/workQueue/state.json
   [junit4]   2> 	10	/solr/collections/collection1_collection/state.json
   [junit4]   2> 	3	/solr/overseer_elect/election/98755182370226186-127.0.0.1:50646_solr-n_0000000000
   [junit4]   2> 
   [junit4]   2> Maximum concurrent children watches above limit:
   [junit4]   2> 
   [junit4]   2> 	78	/solr/live_nodes
   [junit4]   2> 	78	/solr/collections
   [junit4]   2> 
   [junit4]   2> NOTE: leaving temporary files on disk at: C:\Users\jenkins\workspace\Lucene-Solr-master-Windows\solr\build\solr-solrj\test\J0\temp\solr.client.solrj.io.stream.StreamExpressionTest_F066521A7F78AA4D-001
   [junit4]   2> Oct 01, 2017 7:03:05 PM com.carrotsearch.randomizedtesting.ThreadLeakControl checkThreadLeaks
   [junit4]   2> WARNING: Will linger awaiting termination of 1 leaked thread(s).
   [junit4]   2> NOTE: test params are: codec=FastDecompressionCompressingStoredFields(storedFieldsFormat=CompressingStoredFieldsFormat(compressionMode=FAST_DECOMPRESSION, chunkSize=28015, maxDocsPerChunk=8, blockSize=5), termVectorsFormat=CompressingTermVectorsFormat(compressionMode=FAST_DECOMPRESSION, chunkSize=28015, blockSize=5)), sim=RandomSimilarity(queryNorm=false): {}, locale=sr-Latn, timezone=Asia/Ho_Chi_Minh
   [junit4]   2> NOTE: Windows 10 10.0 amd64/Oracle Corporation 1.8.0_144 (64-bit)/cpus=3,threads=1,free=165357832,total=342360064
   [junit4]   2> NOTE: All tests run in this JVM: [SolrPingTest, OperationsTest, AscEvaluatorTest, NaturalLogEvaluatorTest, HttpSolrClientConPoolTest, TestBatchUpdate, TestValidatingJsonMap, TestXMLEscaping, UniformDistributionEvaluatorTest, FieldValueEvaluatorTest, TestSolrJErrorHandling, TestPathTrie, TestJavaBinCodec, DivideEvaluatorTest, TangentEvaluatorTest, ArcTangentEvaluatorTest, OrEvaluatorTest, JsonValidatorTest, HyperbolicTangentEvaluatorTest, SolrExampleEmbeddedTest, TestCoreAdmin, JettyWebappTest, HyperbolicCosineEvaluatorTest, FieldAnalysisResponseTest, CoalesceEvaluatorTest, AndEvaluatorTest, JdbcDriverTest, ConcurrentUpdateSolrClientTest, LessThanEqualToEvaluatorTest, CorrelationEvaluatorTest, StreamExpressionTest]
   [junit4] Completed [92/145 (1!)] on J0 in 89.56s, 117 tests, 1 error, 9 skipped <<< FAILURES!

[...truncated 46083 lines...]

Mime
View raw message