lucene-dev mailing list archives

Site index · List index
Message view « Date » · « Thread »
Top « Date » · « Thread »
From Policeman Jenkins Server <jenk...@thetaphi.de>
Subject [JENKINS] Lucene-Solr-master-Linux (64bit/jdk-9) - Build # 20663 - Still Unstable!
Date Thu, 12 Oct 2017 14:55:38 GMT
Build: https://jenkins.thetaphi.de/job/Lucene-Solr-master-Linux/20663/
Java: 64bit/jdk-9 -XX:-UseCompressedOops -XX:+UseParallelGC --illegal-access=deny

1 tests failed.
FAILED:  org.apache.solr.cloud.LeaderElectionContextKeyTest.test

Error Message:


Stack Trace:
java.lang.AssertionError
	at __randomizedtesting.SeedInfo.seed([E5E30D1D8F479F6C:6DB732C721BBF294]:0)
	at org.junit.Assert.fail(Assert.java:92)
	at org.junit.Assert.assertTrue(Assert.java:43)
	at org.junit.Assert.assertTrue(Assert.java:54)
	at org.apache.solr.cloud.LeaderElectionContextKeyTest.test(LeaderElectionContextKeyTest.java:88)
	at java.base/jdk.internal.reflect.NativeMethodAccessorImpl.invoke0(Native Method)
	at java.base/jdk.internal.reflect.NativeMethodAccessorImpl.invoke(NativeMethodAccessorImpl.java:62)
	at java.base/jdk.internal.reflect.DelegatingMethodAccessorImpl.invoke(DelegatingMethodAccessorImpl.java:43)
	at java.base/java.lang.reflect.Method.invoke(Method.java:564)
	at com.carrotsearch.randomizedtesting.RandomizedRunner.invoke(RandomizedRunner.java:1737)
	at com.carrotsearch.randomizedtesting.RandomizedRunner$8.evaluate(RandomizedRunner.java:934)
	at com.carrotsearch.randomizedtesting.RandomizedRunner$9.evaluate(RandomizedRunner.java:970)
	at com.carrotsearch.randomizedtesting.RandomizedRunner$10.evaluate(RandomizedRunner.java:984)
	at com.carrotsearch.randomizedtesting.rules.SystemPropertiesRestoreRule$1.evaluate(SystemPropertiesRestoreRule.java:57)
	at org.apache.lucene.util.TestRuleSetupTeardownChained$1.evaluate(TestRuleSetupTeardownChained.java:49)
	at org.apache.lucene.util.AbstractBeforeAfterRule$1.evaluate(AbstractBeforeAfterRule.java:45)
	at org.apache.lucene.util.TestRuleThreadAndTestName$1.evaluate(TestRuleThreadAndTestName.java:48)
	at org.apache.lucene.util.TestRuleIgnoreAfterMaxFailures$1.evaluate(TestRuleIgnoreAfterMaxFailures.java:64)
	at org.apache.lucene.util.TestRuleMarkFailure$1.evaluate(TestRuleMarkFailure.java:47)
	at com.carrotsearch.randomizedtesting.rules.StatementAdapter.evaluate(StatementAdapter.java:36)
	at com.carrotsearch.randomizedtesting.ThreadLeakControl$StatementRunner.run(ThreadLeakControl.java:368)
	at com.carrotsearch.randomizedtesting.ThreadLeakControl.forkTimeoutingTask(ThreadLeakControl.java:817)
	at com.carrotsearch.randomizedtesting.ThreadLeakControl$3.evaluate(ThreadLeakControl.java:468)
	at com.carrotsearch.randomizedtesting.RandomizedRunner.runSingleTest(RandomizedRunner.java:943)
	at com.carrotsearch.randomizedtesting.RandomizedRunner$5.evaluate(RandomizedRunner.java:829)
	at com.carrotsearch.randomizedtesting.RandomizedRunner$6.evaluate(RandomizedRunner.java:879)
	at com.carrotsearch.randomizedtesting.RandomizedRunner$7.evaluate(RandomizedRunner.java:890)
	at com.carrotsearch.randomizedtesting.rules.StatementAdapter.evaluate(StatementAdapter.java:36)
	at com.carrotsearch.randomizedtesting.rules.SystemPropertiesRestoreRule$1.evaluate(SystemPropertiesRestoreRule.java:57)
	at org.apache.lucene.util.AbstractBeforeAfterRule$1.evaluate(AbstractBeforeAfterRule.java:45)
	at com.carrotsearch.randomizedtesting.rules.StatementAdapter.evaluate(StatementAdapter.java:36)
	at org.apache.lucene.util.TestRuleStoreClassName$1.evaluate(TestRuleStoreClassName.java:41)
	at com.carrotsearch.randomizedtesting.rules.NoShadowingOrOverridesOnMethodsRule$1.evaluate(NoShadowingOrOverridesOnMethodsRule.java:40)
	at com.carrotsearch.randomizedtesting.rules.NoShadowingOrOverridesOnMethodsRule$1.evaluate(NoShadowingOrOverridesOnMethodsRule.java:40)
	at com.carrotsearch.randomizedtesting.rules.StatementAdapter.evaluate(StatementAdapter.java:36)
	at com.carrotsearch.randomizedtesting.rules.StatementAdapter.evaluate(StatementAdapter.java:36)
	at org.apache.lucene.util.TestRuleAssertionsRequired$1.evaluate(TestRuleAssertionsRequired.java:53)
	at org.apache.lucene.util.TestRuleMarkFailure$1.evaluate(TestRuleMarkFailure.java:47)
	at org.apache.lucene.util.TestRuleIgnoreAfterMaxFailures$1.evaluate(TestRuleIgnoreAfterMaxFailures.java:64)
	at org.apache.lucene.util.TestRuleIgnoreTestSuites$1.evaluate(TestRuleIgnoreTestSuites.java:54)
	at com.carrotsearch.randomizedtesting.rules.StatementAdapter.evaluate(StatementAdapter.java:36)
	at com.carrotsearch.randomizedtesting.ThreadLeakControl$StatementRunner.run(ThreadLeakControl.java:368)
	at java.base/java.lang.Thread.run(Thread.java:844)




Build Log:
[...truncated 13266 lines...]
   [junit4] Suite: org.apache.solr.cloud.LeaderElectionContextKeyTest
   [junit4]   2> Creating dataDir: /home/jenkins/workspace/Lucene-Solr-master-Linux/solr/build/solr-core/test/J1/temp/solr.cloud.LeaderElectionContextKeyTest_E5E30D1D8F479F6C-001/init-core-data-001
   [junit4]   2> 2305933 WARN  (SUITE-LeaderElectionContextKeyTest-seed#[E5E30D1D8F479F6C]-worker) [    ] o.a.s.SolrTestCaseJ4 startTrackingSearchers: numOpens=904 numCloses=904
   [junit4]   2> 2305933 INFO  (SUITE-LeaderElectionContextKeyTest-seed#[E5E30D1D8F479F6C]-worker) [    ] o.a.s.SolrTestCaseJ4 Using PointFields (NUMERIC_POINTS_SYSPROP=true) w/NUMERIC_DOCVALUES_SYSPROP=false
   [junit4]   2> 2305934 INFO  (SUITE-LeaderElectionContextKeyTest-seed#[E5E30D1D8F479F6C]-worker) [    ] o.a.s.SolrTestCaseJ4 Randomized ssl (true) and clientAuth (true) via: @org.apache.solr.util.RandomizeSSL(reason="", ssl=0.0/0.0, value=0.0/0.0, clientAuth=0.0/0.0)
   [junit4]   2> 2305934 INFO  (SUITE-LeaderElectionContextKeyTest-seed#[E5E30D1D8F479F6C]-worker) [    ] o.a.s.SolrTestCaseJ4 SecureRandom sanity checks: test.solr.allowed.securerandom=null & java.security.egd=file:/dev/./urandom
   [junit4]   2> 2305935 INFO  (SUITE-LeaderElectionContextKeyTest-seed#[E5E30D1D8F479F6C]-worker) [    ] o.a.s.c.MiniSolrCloudCluster Starting cluster of 1 servers in /home/jenkins/workspace/Lucene-Solr-master-Linux/solr/build/solr-core/test/J1/temp/solr.cloud.LeaderElectionContextKeyTest_E5E30D1D8F479F6C-001/tempDir-001
   [junit4]   2> 2305935 INFO  (SUITE-LeaderElectionContextKeyTest-seed#[E5E30D1D8F479F6C]-worker) [    ] o.a.s.c.ZkTestServer STARTING ZK TEST SERVER
   [junit4]   2> 2305935 INFO  (Thread-4811) [    ] o.a.s.c.ZkTestServer client port:0.0.0.0/0.0.0.0:0
   [junit4]   2> 2305935 INFO  (Thread-4811) [    ] o.a.s.c.ZkTestServer Starting server
   [junit4]   2> 2305936 ERROR (Thread-4811) [    ] o.a.z.s.ZooKeeperServer ZKShutdownHandler is not registered, so ZooKeeper server won't take any action on ERROR or SHUTDOWN server state changes
   [junit4]   2> 2306035 INFO  (SUITE-LeaderElectionContextKeyTest-seed#[E5E30D1D8F479F6C]-worker) [    ] o.a.s.c.ZkTestServer start zk server on port:44169
   [junit4]   2> 2306039 INFO  (jetty-launcher-1657-thread-1) [    ] o.e.j.s.Server jetty-9.3.20.v20170531
   [junit4]   2> 2306041 INFO  (jetty-launcher-1657-thread-1) [    ] o.e.j.s.h.ContextHandler Started o.e.j.s.ServletContextHandler@72ce0309{/solr,null,AVAILABLE}
   [junit4]   2> 2306043 INFO  (jetty-launcher-1657-thread-1) [    ] o.e.j.s.AbstractConnector Started ServerConnector@3244629d{SSL,[ssl, http/1.1]}{127.0.0.1:41801}
   [junit4]   2> 2306043 INFO  (jetty-launcher-1657-thread-1) [    ] o.e.j.s.Server Started @2307383ms
   [junit4]   2> 2306043 INFO  (jetty-launcher-1657-thread-1) [    ] o.a.s.c.s.e.JettySolrRunner Jetty properties: {hostContext=/solr, hostPort=41801}
   [junit4]   2> 2306043 ERROR (jetty-launcher-1657-thread-1) [    ] o.a.s.u.StartupLoggingUtils Missing Java Option solr.log.dir. Logging may be missing or incomplete.
   [junit4]   2> 2306043 INFO  (jetty-launcher-1657-thread-1) [    ] o.a.s.s.SolrDispatchFilter  ___      _       Welcome to Apache Solr™ version 8.0.0
   [junit4]   2> 2306043 INFO  (jetty-launcher-1657-thread-1) [    ] o.a.s.s.SolrDispatchFilter / __| ___| |_ _   Starting in cloud mode on port null
   [junit4]   2> 2306043 INFO  (jetty-launcher-1657-thread-1) [    ] o.a.s.s.SolrDispatchFilter \__ \/ _ \ | '_|  Install dir: null, Default config dir: null
   [junit4]   2> 2306043 INFO  (jetty-launcher-1657-thread-1) [    ] o.a.s.s.SolrDispatchFilter |___/\___/_|_|    Start time: 2017-10-12T14:29:05.712715Z
   [junit4]   2> 2306046 INFO  (jetty-launcher-1657-thread-1) [    ] o.a.s.s.SolrDispatchFilter solr.xml found in ZooKeeper. Loading...
   [junit4]   2> 2306057 INFO  (jetty-launcher-1657-thread-1) [    ] o.a.s.c.ZkContainer Zookeeper client=127.0.0.1:44169/solr
   [junit4]   2> 2306117 INFO  (jetty-launcher-1657-thread-1) [    ] o.a.s.c.Overseer Overseer (id=null) closing
   [junit4]   2> 2306118 INFO  (jetty-launcher-1657-thread-1) [    ] o.a.s.c.OverseerElectionContext I am going to be the leader 127.0.0.1:41801_solr
   [junit4]   2> 2306118 INFO  (jetty-launcher-1657-thread-1) [    ] o.a.s.c.Overseer Overseer (id=98816396204769283-127.0.0.1:41801_solr-n_0000000000) starting
   [junit4]   2> 2306120 INFO  (jetty-launcher-1657-thread-1) [    ] o.a.s.c.ZkController Register node as live in ZooKeeper:/live_nodes/127.0.0.1:41801_solr
   [junit4]   2> 2306121 INFO  (zkCallback-1664-thread-1) [    ] o.a.s.c.c.ZkStateReader Updated live nodes from ZooKeeper... (0) -> (1)
   [junit4]   2> 2306162 INFO  (jetty-launcher-1657-thread-1) [    ] o.a.s.m.r.SolrJmxReporter JMX monitoring for 'solr_41801.solr.node' (registry 'solr.node') enabled at server: com.sun.jmx.mbeanserver.JmxMBeanServer@6c81c1f6
   [junit4]   2> 2306167 INFO  (jetty-launcher-1657-thread-1) [    ] o.a.s.m.r.SolrJmxReporter JMX monitoring for 'solr_41801.solr.jvm' (registry 'solr.jvm') enabled at server: com.sun.jmx.mbeanserver.JmxMBeanServer@6c81c1f6
   [junit4]   2> 2306168 INFO  (jetty-launcher-1657-thread-1) [    ] o.a.s.m.r.SolrJmxReporter JMX monitoring for 'solr_41801.solr.jetty' (registry 'solr.jetty') enabled at server: com.sun.jmx.mbeanserver.JmxMBeanServer@6c81c1f6
   [junit4]   2> 2306168 INFO  (jetty-launcher-1657-thread-1) [    ] o.a.s.c.CorePropertiesLocator Found 0 core definitions underneath /home/jenkins/workspace/Lucene-Solr-master-Linux/solr/build/solr-core/test/J1/temp/solr.cloud.LeaderElectionContextKeyTest_E5E30D1D8F479F6C-001/tempDir-001/node1/.
   [junit4]   2> 2306178 INFO  (SUITE-LeaderElectionContextKeyTest-seed#[E5E30D1D8F479F6C]-worker) [    ] o.a.s.c.c.ZkStateReader Updated live nodes from ZooKeeper... (0) -> (1)
   [junit4]   2> 2306178 INFO  (SUITE-LeaderElectionContextKeyTest-seed#[E5E30D1D8F479F6C]-worker) [    ] o.a.s.c.s.i.ZkClientClusterStateProvider Cluster at 127.0.0.1:44169/solr ready
   [junit4]   2> 2306195 INFO  (qtp444431326-18706) [    ] o.a.s.h.a.CollectionsHandler Invoked Collection Action :create with params replicationFactor=1&collection.configName=config&maxShardsPerNode=1000&name=testCollection1&nrtReplicas=1&action=CREATE&numShards=2&wt=javabin&version=2 and sendToOCPQueue=true
   [junit4]   2> 2306196 INFO  (OverseerThreadFactory-5438-thread-1) [    ] o.a.s.c.CreateCollectionCmd Create collection testCollection1
   [junit4]   2> 2306303 INFO  (OverseerStateUpdate-98816396204769283-127.0.0.1:41801_solr-n_0000000000) [    ] o.a.s.c.o.SliceMutator createReplica() {
   [junit4]   2>   "operation":"ADDREPLICA",
   [junit4]   2>   "collection":"testCollection1",
   [junit4]   2>   "shard":"shard1",
   [junit4]   2>   "core":"testCollection1_shard1_replica_n1",
   [junit4]   2>   "state":"down",
   [junit4]   2>   "base_url":"https://127.0.0.1:41801/solr",
   [junit4]   2>   "type":"NRT"} 
   [junit4]   2> 2306305 INFO  (OverseerStateUpdate-98816396204769283-127.0.0.1:41801_solr-n_0000000000) [    ] o.a.s.c.o.SliceMutator createReplica() {
   [junit4]   2>   "operation":"ADDREPLICA",
   [junit4]   2>   "collection":"testCollection1",
   [junit4]   2>   "shard":"shard2",
   [junit4]   2>   "core":"testCollection1_shard2_replica_n3",
   [junit4]   2>   "state":"down",
   [junit4]   2>   "base_url":"https://127.0.0.1:41801/solr",
   [junit4]   2>   "type":"NRT"} 
   [junit4]   2> 2306509 INFO  (qtp444431326-18712) [    ] o.a.s.h.a.CoreAdminOperation core create command qt=/admin/cores&coreNodeName=core_node2&collection.configName=config&newCollection=true&name=testCollection1_shard1_replica_n1&action=CREATE&numShards=2&collection=testCollection1&shard=shard1&wt=javabin&version=2&replicaType=NRT
   [junit4]   2> 2306509 INFO  (qtp444431326-18707) [    ] o.a.s.h.a.CoreAdminOperation core create command qt=/admin/cores&coreNodeName=core_node4&collection.configName=config&newCollection=true&name=testCollection1_shard2_replica_n3&action=CREATE&numShards=2&collection=testCollection1&shard=shard2&wt=javabin&version=2&replicaType=NRT
   [junit4]   2> 2306510 INFO  (qtp444431326-18712) [    ] o.a.s.c.TransientSolrCoreCacheDefault Allocating transient cache for 2147483647 transient cores
   [junit4]   2> 2306614 INFO  (zkCallback-1664-thread-1) [    ] o.a.s.c.c.ZkStateReader A cluster state change: [WatchedEvent state:SyncConnected type:NodeDataChanged path:/collections/testCollection1/state.json] for collection [testCollection1] has occurred - updating... (live nodes size: [1])
   [junit4]   2> 2306615 INFO  (zkCallback-1664-thread-2) [    ] o.a.s.c.c.ZkStateReader A cluster state change: [WatchedEvent state:SyncConnected type:NodeDataChanged path:/collections/testCollection1/state.json] for collection [testCollection1] has occurred - updating... (live nodes size: [1])
   [junit4]   2> 2307516 INFO  (qtp444431326-18712) [    ] o.a.s.c.SolrConfig Using Lucene MatchVersion: 8.0.0
   [junit4]   2> 2307516 INFO  (qtp444431326-18707) [    ] o.a.s.c.SolrConfig Using Lucene MatchVersion: 8.0.0
   [junit4]   2> 2307520 INFO  (qtp444431326-18712) [    ] o.a.s.s.IndexSchema [testCollection1_shard1_replica_n1] Schema name=minimal
   [junit4]   2> 2307521 INFO  (qtp444431326-18707) [    ] o.a.s.s.IndexSchema [testCollection1_shard2_replica_n3] Schema name=minimal
   [junit4]   2> 2307521 INFO  (qtp444431326-18712) [    ] o.a.s.s.IndexSchema Loaded schema minimal/1.1 with uniqueid field id
   [junit4]   2> 2307521 INFO  (qtp444431326-18712) [    ] o.a.s.c.CoreContainer Creating SolrCore 'testCollection1_shard1_replica_n1' using configuration from collection testCollection1, trusted=true
   [junit4]   2> 2307529 INFO  (qtp444431326-18712) [    ] o.a.s.m.r.SolrJmxReporter JMX monitoring for 'solr_41801.solr.core.testCollection1.shard1.replica_n1' (registry 'solr.core.testCollection1.shard1.replica_n1') enabled at server: com.sun.jmx.mbeanserver.JmxMBeanServer@6c81c1f6
   [junit4]   2> 2307530 INFO  (qtp444431326-18712) [    ] o.a.s.c.SolrCore solr.RecoveryStrategy.Builder
   [junit4]   2> 2307530 INFO  (qtp444431326-18712) [    ] o.a.s.c.SolrCore [[testCollection1_shard1_replica_n1] ] Opening new SolrCore at [/home/jenkins/workspace/Lucene-Solr-master-Linux/solr/build/solr-core/test/J1/temp/solr.cloud.LeaderElectionContextKeyTest_E5E30D1D8F479F6C-001/tempDir-001/node1/testCollection1_shard1_replica_n1], dataDir=[/home/jenkins/workspace/Lucene-Solr-master-Linux/solr/build/solr-core/test/J1/temp/solr.cloud.LeaderElectionContextKeyTest_E5E30D1D8F479F6C-001/tempDir-001/node1/./testCollection1_shard1_replica_n1/data/]
   [junit4]   2> 2307530 INFO  (qtp444431326-18707) [    ] o.a.s.s.IndexSchema Loaded schema minimal/1.1 with uniqueid field id
   [junit4]   2> 2307530 INFO  (qtp444431326-18707) [    ] o.a.s.c.CoreContainer Creating SolrCore 'testCollection1_shard2_replica_n3' using configuration from collection testCollection1, trusted=true
   [junit4]   2> 2307530 INFO  (qtp444431326-18707) [    ] o.a.s.m.r.SolrJmxReporter JMX monitoring for 'solr_41801.solr.core.testCollection1.shard2.replica_n3' (registry 'solr.core.testCollection1.shard2.replica_n3') enabled at server: com.sun.jmx.mbeanserver.JmxMBeanServer@6c81c1f6
   [junit4]   2> 2307530 INFO  (qtp444431326-18707) [    ] o.a.s.c.SolrCore solr.RecoveryStrategy.Builder
   [junit4]   2> 2307530 INFO  (qtp444431326-18707) [    ] o.a.s.c.SolrCore [[testCollection1_shard2_replica_n3] ] Opening new SolrCore at [/home/jenkins/workspace/Lucene-Solr-master-Linux/solr/build/solr-core/test/J1/temp/solr.cloud.LeaderElectionContextKeyTest_E5E30D1D8F479F6C-001/tempDir-001/node1/testCollection1_shard2_replica_n3], dataDir=[/home/jenkins/workspace/Lucene-Solr-master-Linux/solr/build/solr-core/test/J1/temp/solr.cloud.LeaderElectionContextKeyTest_E5E30D1D8F479F6C-001/tempDir-001/node1/./testCollection1_shard2_replica_n3/data/]
   [junit4]   2> 2307553 INFO  (qtp444431326-18712) [    ] o.a.s.u.UpdateHandler Using UpdateLog implementation: org.apache.solr.update.UpdateLog
   [junit4]   2> 2307553 INFO  (qtp444431326-18712) [    ] o.a.s.u.UpdateLog Initializing UpdateLog: dataDir=null defaultSyncLevel=FLUSH numRecordsToKeep=100 maxNumLogsToKeep=10 numVersionBuckets=65536
   [junit4]   2> 2307553 INFO  (qtp444431326-18712) [    ] o.a.s.u.CommitTracker Hard AutoCommit: disabled
   [junit4]   2> 2307554 INFO  (qtp444431326-18712) [    ] o.a.s.u.CommitTracker Soft AutoCommit: disabled
   [junit4]   2> 2307554 INFO  (qtp444431326-18712) [    ] o.a.s.s.SolrIndexSearcher Opening [Searcher@60e057e6[testCollection1_shard1_replica_n1] main]
   [junit4]   2> 2307555 INFO  (qtp444431326-18712) [    ] o.a.s.r.ManagedResourceStorage Configured ZooKeeperStorageIO with znodeBase: /configs/config
   [junit4]   2> 2307555 INFO  (qtp444431326-18712) [    ] o.a.s.r.ManagedResourceStorage Loaded null at path _rest_managed.json using ZooKeeperStorageIO:path=/configs/config
   [junit4]   2> 2307555 INFO  (qtp444431326-18712) [    ] o.a.s.h.ReplicationHandler Commits will be reserved for 10000ms.
   [junit4]   2> 2307556 INFO  (searcherExecutor-5441-thread-1) [    ] o.a.s.c.SolrCore [testCollection1_shard1_replica_n1] Registered new searcher Searcher@60e057e6[testCollection1_shard1_replica_n1] main{ExitableDirectoryReader(UninvertingDirectoryReader())}
   [junit4]   2> 2307556 INFO  (qtp444431326-18712) [    ] o.a.s.u.UpdateLog Could not find max version in index or recent updates, using new clock 1581062340975001600
   [junit4]   2> 2307558 INFO  (qtp444431326-18712) [    ] o.a.s.c.ShardLeaderElectionContext Enough replicas found to continue.
   [junit4]   2> 2307558 INFO  (qtp444431326-18712) [    ] o.a.s.c.ShardLeaderElectionContext I may be the new leader - try and sync
   [junit4]   2> 2307558 INFO  (qtp444431326-18712) [    ] o.a.s.c.SyncStrategy Sync replicas to https://127.0.0.1:41801/solr/testCollection1_shard1_replica_n1/
   [junit4]   2> 2307558 INFO  (qtp444431326-18712) [    ] o.a.s.c.SyncStrategy Sync Success - now sync replicas to me
   [junit4]   2> 2307558 INFO  (qtp444431326-18712) [    ] o.a.s.c.SyncStrategy https://127.0.0.1:41801/solr/testCollection1_shard1_replica_n1/ has no replicas
   [junit4]   2> 2307558 INFO  (qtp444431326-18712) [    ] o.a.s.c.ShardLeaderElectionContext Found all replicas participating in election, clear LIR
   [junit4]   2> 2307559 INFO  (qtp444431326-18712) [    ] o.a.s.c.ShardLeaderElectionContext I am the new leader: https://127.0.0.1:41801/solr/testCollection1_shard1_replica_n1/ shard1
   [junit4]   2> 2307564 INFO  (qtp444431326-18707) [    ] o.a.s.u.UpdateHandler Using UpdateLog implementation: org.apache.solr.update.UpdateLog
   [junit4]   2> 2307564 INFO  (qtp444431326-18707) [    ] o.a.s.u.UpdateLog Initializing UpdateLog: dataDir=null defaultSyncLevel=FLUSH numRecordsToKeep=100 maxNumLogsToKeep=10 numVersionBuckets=65536
   [junit4]   2> 2307565 INFO  (qtp444431326-18707) [    ] o.a.s.u.CommitTracker Hard AutoCommit: disabled
   [junit4]   2> 2307565 INFO  (qtp444431326-18707) [    ] o.a.s.u.CommitTracker Soft AutoCommit: disabled
   [junit4]   2> 2307566 INFO  (qtp444431326-18707) [    ] o.a.s.s.SolrIndexSearcher Opening [Searcher@70a49547[testCollection1_shard2_replica_n3] main]
   [junit4]   2> 2307566 INFO  (qtp444431326-18707) [    ] o.a.s.r.ManagedResourceStorage Configured ZooKeeperStorageIO with znodeBase: /configs/config
   [junit4]   2> 2307567 INFO  (qtp444431326-18707) [    ] o.a.s.r.ManagedResourceStorage Loaded null at path _rest_managed.json using ZooKeeperStorageIO:path=/configs/config
   [junit4]   2> 2307567 INFO  (qtp444431326-18707) [    ] o.a.s.h.ReplicationHandler Commits will be reserved for 10000ms.
   [junit4]   2> 2307568 INFO  (searcherExecutor-5442-thread-1) [    ] o.a.s.c.SolrCore [testCollection1_shard2_replica_n3] Registered new searcher Searcher@70a49547[testCollection1_shard2_replica_n3] main{ExitableDirectoryReader(UninvertingDirectoryReader())}
   [junit4]   2> 2307568 INFO  (qtp444431326-18707) [    ] o.a.s.u.UpdateLog Could not find max version in index or recent updates, using new clock 1581062340987584512
   [junit4]   2> 2307570 INFO  (qtp444431326-18707) [    ] o.a.s.c.ShardLeaderElectionContext Enough replicas found to continue.
   [junit4]   2> 2307570 INFO  (qtp444431326-18707) [    ] o.a.s.c.ShardLeaderElectionContext I may be the new leader - try and sync
   [junit4]   2> 2307570 INFO  (qtp444431326-18707) [    ] o.a.s.c.SyncStrategy Sync replicas to https://127.0.0.1:41801/solr/testCollection1_shard2_replica_n3/
   [junit4]   2> 2307570 INFO  (qtp444431326-18707) [    ] o.a.s.c.SyncStrategy Sync Success - now sync replicas to me
   [junit4]   2> 2307570 INFO  (qtp444431326-18707) [    ] o.a.s.c.SyncStrategy https://127.0.0.1:41801/solr/testCollection1_shard2_replica_n3/ has no replicas
   [junit4]   2> 2307570 INFO  (qtp444431326-18707) [    ] o.a.s.c.ShardLeaderElectionContext Found all replicas participating in election, clear LIR
   [junit4]   2> 2307571 INFO  (qtp444431326-18707) [    ] o.a.s.c.ShardLeaderElectionContext I am the new leader: https://127.0.0.1:41801/solr/testCollection1_shard2_replica_n3/ shard2
   [junit4]   2> 2307672 INFO  (zkCallback-1664-thread-2) [    ] o.a.s.c.c.ZkStateReader A cluster state change: [WatchedEvent state:SyncConnected type:NodeDataChanged path:/collections/testCollection1/state.json] for collection [testCollection1] has occurred - updating... (live nodes size: [1])
   [junit4]   2> 2307672 INFO  (zkCallback-1664-thread-1) [    ] o.a.s.c.c.ZkStateReader A cluster state change: [WatchedEvent state:SyncConnected type:NodeDataChanged path:/collections/testCollection1/state.json] for collection [testCollection1] has occurred - updating... (live nodes size: [1])
   [junit4]   2> 2307709 INFO  (qtp444431326-18712) [    ] o.a.s.c.ZkController I am the leader, no recovery necessary
   [junit4]   2> 2307710 INFO  (qtp444431326-18712) [    ] o.a.s.s.HttpSolrCall [admin] webapp=null path=/admin/cores params={qt=/admin/cores&coreNodeName=core_node2&collection.configName=config&newCollection=true&name=testCollection1_shard1_replica_n1&action=CREATE&numShards=2&collection=testCollection1&shard=shard1&wt=javabin&version=2&replicaType=NRT} status=0 QTime=1200
   [junit4]   2> 2307721 INFO  (qtp444431326-18707) [    ] o.a.s.c.ZkController I am the leader, no recovery necessary
   [junit4]   2> 2307722 INFO  (qtp444431326-18707) [    ] o.a.s.s.HttpSolrCall [admin] webapp=null path=/admin/cores params={qt=/admin/cores&coreNodeName=core_node4&collection.configName=config&newCollection=true&name=testCollection1_shard2_replica_n3&action=CREATE&numShards=2&collection=testCollection1&shard=shard2&wt=javabin&version=2&replicaType=NRT} status=0 QTime=1212
   [junit4]   2> 2307723 INFO  (qtp444431326-18706) [    ] o.a.s.h.a.CollectionsHandler Wait for new collection to be active for at most 30 seconds. Check all shard replicas
   [junit4]   2> 2307823 INFO  (zkCallback-1664-thread-1) [    ] o.a.s.c.c.ZkStateReader A cluster state change: [WatchedEvent state:SyncConnected type:NodeDataChanged path:/collections/testCollection1/state.json] for collection [testCollection1] has occurred - updating... (live nodes size: [1])
   [junit4]   2> 2307823 INFO  (zkCallback-1664-thread-2) [    ] o.a.s.c.c.ZkStateReader A cluster state change: [WatchedEvent state:SyncConnected type:NodeDataChanged path:/collections/testCollection1/state.json] for collection [testCollection1] has occurred - updating... (live nodes size: [1])
   [junit4]   2> 2308197 INFO  (OverseerCollectionConfigSetProcessor-98816396204769283-127.0.0.1:41801_solr-n_0000000000) [    ] o.a.s.c.OverseerTaskQueue Response ZK path: /overseer/collection-queue-work/qnr-0000000000 doesn't exist.  Requestor may have disconnected from ZooKeeper
   [junit4]   2> 2308723 INFO  (qtp444431326-18706) [    ] o.a.s.s.HttpSolrCall [admin] webapp=null path=/admin/collections params={replicationFactor=1&collection.configName=config&maxShardsPerNode=1000&name=testCollection1&nrtReplicas=1&action=CREATE&numShards=2&wt=javabin&version=2} status=0 QTime=2528
   [junit4]   2> 2308724 INFO  (qtp444431326-18711) [    ] o.a.s.h.a.CollectionsHandler Invoked Collection Action :create with params replicationFactor=1&collection.configName=config&maxShardsPerNode=1000&name=testCollection2&nrtReplicas=1&action=CREATE&numShards=2&wt=javabin&version=2 and sendToOCPQueue=true
   [junit4]   2> 2308726 INFO  (OverseerThreadFactory-5438-thread-2) [    ] o.a.s.c.CreateCollectionCmd Create collection testCollection2
   [junit4]   2> 2308934 INFO  (OverseerStateUpdate-98816396204769283-127.0.0.1:41801_solr-n_0000000000) [    ] o.a.s.c.o.SliceMutator createReplica() {
   [junit4]   2>   "operation":"ADDREPLICA",
   [junit4]   2>   "collection":"testCollection2",
   [junit4]   2>   "shard":"shard1",
   [junit4]   2>   "core":"testCollection2_shard1_replica_n1",
   [junit4]   2>   "state":"down",
   [junit4]   2>   "base_url":"https://127.0.0.1:41801/solr",
   [junit4]   2>   "type":"NRT"} 
   [junit4]   2> 2308935 INFO  (OverseerStateUpdate-98816396204769283-127.0.0.1:41801_solr-n_0000000000) [    ] o.a.s.c.o.SliceMutator createReplica() {
   [junit4]   2>   "operation":"ADDREPLICA",
   [junit4]   2>   "collection":"testCollection2",
   [junit4]   2>   "shard":"shard2",
   [junit4]   2>   "core":"testCollection2_shard2_replica_n2",
   [junit4]   2>   "state":"down",
   [junit4]   2>   "base_url":"https://127.0.0.1:41801/solr",
   [junit4]   2>   "type":"NRT"} 
   [junit4]   2> 2309136 INFO  (qtp444431326-18745) [    ] o.a.s.h.a.CoreAdminOperation core create command qt=/admin/cores&coreNodeName=core_node3&collection.configName=config&newCollection=true&name=testCollection2_shard1_replica_n1&action=CREATE&numShards=2&collection=testCollection2&shard=shard1&wt=javabin&version=2&replicaType=NRT
   [junit4]   2> 2309136 INFO  (qtp444431326-18708) [    ] o.a.s.h.a.CoreAdminOperation core create command qt=/admin/cores&coreNodeName=core_node4&collection.configName=config&newCollection=true&name=testCollection2_shard2_replica_n2&action=CREATE&numShards=2&collection=testCollection2&shard=shard2&wt=javabin&version=2&replicaType=NRT
   [junit4]   2> 2309238 INFO  (zkCallback-1664-thread-1) [    ] o.a.s.c.c.ZkStateReader A cluster state change: [WatchedEvent state:SyncConnected type:NodeDataChanged path:/collections/testCollection2/state.json] for collection [testCollection2] has occurred - updating... (live nodes size: [1])
   [junit4]   2> 2309238 INFO  (zkCallback-1664-thread-2) [    ] o.a.s.c.c.ZkStateReader A cluster state change: [WatchedEvent state:SyncConnected type:NodeDataChanged path:/collections/testCollection2/state.json] for collection [testCollection2] has occurred - updating... (live nodes size: [1])
   [junit4]   2> 2310140 INFO  (qtp444431326-18708) [    ] o.a.s.c.SolrConfig Using Lucene MatchVersion: 8.0.0
   [junit4]   2> 2310141 INFO  (qtp444431326-18745) [    ] o.a.s.c.SolrConfig Using Lucene MatchVersion: 8.0.0
   [junit4]   2> 2310154 INFO  (qtp444431326-18708) [    ] o.a.s.s.IndexSchema [testCollection2_shard2_replica_n2] Schema name=minimal
   [junit4]   2> 2310154 INFO  (qtp444431326-18745) [    ] o.a.s.s.IndexSchema [testCollection2_shard1_replica_n1] Schema name=minimal
   [junit4]   2> 2310155 INFO  (qtp444431326-18708) [    ] o.a.s.s.IndexSchema Loaded schema minimal/1.1 with uniqueid field id
   [junit4]   2> 2310155 INFO  (qtp444431326-18745) [    ] o.a.s.s.IndexSchema Loaded schema minimal/1.1 with uniqueid field id
   [junit4]   2> 2310155 INFO  (qtp444431326-18708) [    ] o.a.s.c.CoreContainer Creating SolrCore 'testCollection2_shard2_replica_n2' using configuration from collection testCollection2, trusted=true
   [junit4]   2> 2310155 INFO  (qtp444431326-18745) [    ] o.a.s.c.CoreContainer Creating SolrCore 'testCollection2_shard1_replica_n1' using configuration from collection testCollection2, trusted=true
   [junit4]   2> 2310155 INFO  (qtp444431326-18708) [    ] o.a.s.m.r.SolrJmxReporter JMX monitoring for 'solr_41801.solr.core.testCollection2.shard2.replica_n2' (registry 'solr.core.testCollection2.shard2.replica_n2') enabled at server: com.sun.jmx.mbeanserver.JmxMBeanServer@6c81c1f6
   [junit4]   2> 2310155 INFO  (qtp444431326-18745) [    ] o.a.s.m.r.SolrJmxReporter JMX monitoring for 'solr_41801.solr.core.testCollection2.shard1.replica_n1' (registry 'solr.core.testCollection2.shard1.replica_n1') enabled at server: com.sun.jmx.mbeanserver.JmxMBeanServer@6c81c1f6
   [junit4]   2> 2310155 INFO  (qtp444431326-18708) [    ] o.a.s.c.SolrCore solr.RecoveryStrategy.Builder
   [junit4]   2> 2310156 INFO  (qtp444431326-18745) [    ] o.a.s.c.SolrCore solr.RecoveryStrategy.Builder
   [junit4]   2> 2310156 INFO  (qtp444431326-18708) [    ] o.a.s.c.SolrCore [[testCollection2_shard2_replica_n2] ] Opening new SolrCore at [/home/jenkins/workspace/Lucene-Solr-master-Linux/solr/build/solr-core/test/J1/temp/solr.cloud.LeaderElectionContextKeyTest_E5E30D1D8F479F6C-001/tempDir-001/node1/testCollection2_shard2_replica_n2], dataDir=[/home/jenkins/workspace/Lucene-Solr-master-Linux/solr/build/solr-core/test/J1/temp/solr.cloud.LeaderElectionContextKeyTest_E5E30D1D8F479F6C-001/tempDir-001/node1/./testCollection2_shard2_replica_n2/data/]
   [junit4]   2> 2310156 INFO  (qtp444431326-18745) [    ] o.a.s.c.SolrCore [[testCollection2_shard1_replica_n1] ] Opening new SolrCore at [/home/jenkins/workspace/Lucene-Solr-master-Linux/solr/build/solr-core/test/J1/temp/solr.cloud.LeaderElectionContextKeyTest_E5E30D1D8F479F6C-001/tempDir-001/node1/testCollection2_shard1_replica_n1], dataDir=[/home/jenkins/workspace/Lucene-Solr-master-Linux/solr/build/solr-core/test/J1/temp/solr.cloud.LeaderElectionContextKeyTest_E5E30D1D8F479F6C-001/tempDir-001/node1/./testCollection2_shard1_replica_n1/data/]
   [junit4]   2> 2310179 INFO  (qtp444431326-18708) [    ] o.a.s.u.UpdateHandler Using UpdateLog implementation: org.apache.solr.update.UpdateLog
   [junit4]   2> 2310179 INFO  (qtp444431326-18708) [    ] o.a.s.u.UpdateLog Initializing UpdateLog: dataDir=null defaultSyncLevel=FLUSH numRecordsToKeep=100 maxNumLogsToKeep=10 numVersionBuckets=65536
   [junit4]   2> 2310179 INFO  (qtp444431326-18708) [    ] o.a.s.u.CommitTracker Hard AutoCommit: disabled
   [junit4]   2> 2310179 INFO  (qtp444431326-18708) [    ] o.a.s.u.CommitTracker Soft AutoCommit: disabled
   [junit4]   2> 2310180 INFO  (qtp444431326-18708) [    ] o.a.s.s.SolrIndexSearcher Opening [Searcher@6aa57733[testCollection2_shard2_replica_n2] main]
   [junit4]   2> 2310180 INFO  (qtp444431326-18745) [    ] o.a.s.u.UpdateHandler Using UpdateLog implementation: org.apache.solr.update.UpdateLog
   [junit4]   2> 2310180 INFO  (qtp444431326-18745) [    ] o.a.s.u.UpdateLog Initializing UpdateLog: dataDir=null defaultSyncLevel=FLUSH numRecordsToKeep=100 maxNumLogsToKeep=10 numVersionBuckets=65536
   [junit4]   2> 2310181 INFO  (qtp444431326-18708) [    ] o.a.s.r.ManagedResourceStorage Configured ZooKeeperStorageIO with znodeBase: /configs/config
   [junit4]   2> 2310181 INFO  (qtp444431326-18708) [    ] o.a.s.r.ManagedResourceStorage Loaded null at path _rest_managed.json using ZooKeeperStorageIO:path=/configs/config
   [junit4]   2> 2310181 INFO  (qtp444431326-18708) [    ] o.a.s.h.ReplicationHandler Commits will be reserved for 10000ms.
   [junit4]   2> 2310181 INFO  (qtp444431326-18745) [    ] o.a.s.u.CommitTracker Hard AutoCommit: disabled
   [junit4]   2> 2310181 INFO  (qtp444431326-18745) [    ] o.a.s.u.CommitTracker Soft AutoCommit: disabled
   [junit4]   2> 2310182 INFO  (searcherExecutor-5451-thread-1) [    ] o.a.s.c.SolrCore [testCollection2_shard2_replica_n2] Registered new searcher Searcher@6aa57733[testCollection2_shard2_replica_n2] main{ExitableDirectoryReader(UninvertingDirectoryReader())}
   [junit4]   2> 2310182 INFO  (qtp444431326-18708) [    ] o.a.s.u.UpdateLog Could not find max version in index or recent updates, using new clock 1581062343728562176
   [junit4]   2> 2310182 INFO  (qtp444431326-18745) [    ] o.a.s.s.SolrIndexSearcher Opening [Searcher@2c7f2806[testCollection2_shard1_replica_n1] main]
   [junit4]   2> 2310182 INFO  (qtp444431326-18745) [    ] o.a.s.r.ManagedResourceStorage Configured ZooKeeperStorageIO with znodeBase: /configs/config
   [junit4]   2> 2310183 INFO  (qtp444431326-18745) [    ] o.a.s.r.ManagedResourceStorage Loaded null at path _rest_managed.json using ZooKeeperStorageIO:path=/configs/config
   [junit4]   2> 2310183 INFO  (qtp444431326-18745) [    ] o.a.s.h.ReplicationHandler Commits will be reserved for 10000ms.
   [junit4]   2> 2310183 INFO  (searcherExecutor-5452-thread-1) [    ] o.a.s.c.SolrCore [testCollection2_shard1_replica_n1] Registered new searcher Searcher@2c7f2806[testCollection2_shard1_replica_n1] main{ExitableDirectoryReader(UninvertingDirectoryReader())}
   [junit4]   2> 2310183 INFO  (qtp444431326-18745) [    ] o.a.s.u.UpdateLog Could not find max version in index or recent updates, using new clock 1581062343729610752
   [junit4]   2> 2310184 INFO  (qtp444431326-18708) [    ] o.a.s.c.ShardLeaderElectionContext Enough replicas found to continue.
   [junit4]   2> 2310184 INFO  (qtp444431326-18708) [    ] o.a.s.c.ShardLeaderElectionContext I may be the new leader - try and sync
   [junit4]   2> 2310184 INFO  (qtp444431326-18708) [    ] o.a.s.c.SyncStrategy Sync replicas to https://127.0.0.1:41801/solr/testCollection2_shard2_replica_n2/
   [junit4]   2> 2310184 INFO  (qtp444431326-18708) [    ] o.a.s.c.SyncStrategy Sync Success - now sync replicas to me
   [junit4]   2> 2310184 INFO  (qtp444431326-18708) [    ] o.a.s.c.SyncStrategy https://127.0.0.1:41801/solr/testCollection2_shard2_replica_n2/ has no replicas
   [junit4]   2> 2310184 INFO  (qtp444431326-18708) [    ] o.a.s.c.ShardLeaderElectionContext Found all replicas participating in election, clear LIR
   [junit4]   2> 2310185 INFO  (qtp444431326-18708) [    ] o.a.s.c.ShardLeaderElectionContext I am the new leader: https://127.0.0.1:41801/solr/testCollection2_shard2_replica_n2/ shard2
   [junit4]   2> 2310186 INFO  (qtp444431326-18745) [    ] o.a.s.c.ShardLeaderElectionContext Enough replicas found to continue.
   [junit4]   2> 2310186 INFO  (qtp444431326-18745) [    ] o.a.s.c.ShardLeaderElectionContext I may be the new leader - try and sync
   [junit4]   2> 2310186 INFO  (qtp444431326-18745) [    ] o.a.s.c.SyncStrategy Sync replicas to https://127.0.0.1:41801/solr/testCollection2_shard1_replica_n1/
   [junit4]   2> 2310186 INFO  (qtp444431326-18745) [    ] o.a.s.c.SyncStrategy Sync Success - now sync replicas to me
   [junit4]   2> 2310186 INFO  (qtp444431326-18745) [    ] o.a.s.c.SyncStrategy https://127.0.0.1:41801/solr/testCollection2_shard1_replica_n1/ has no replicas
   [junit4]   2> 2310186 INFO  (qtp444431326-18745) [    ] o.a.s.c.ShardLeaderElectionContext Found all replicas participating in election, clear LIR
   [junit4]   2> 2310187 INFO  (qtp444431326-18745) [    ] o.a.s.c.ShardLeaderElectionContext I am the new leader: https://127.0.0.1:41801/solr/testCollection2_shard1_replica_n1/ shard1
   [junit4]   2> 2310288 INFO  (zkCallback-1664-thread-1) [    ] o.a.s.c.c.ZkStateReader A cluster state change: [WatchedEvent state:SyncConnected type:NodeDataChanged path:/collections/testCollection2/state.json] for collection [testCollection2] has occurred - updating... (live nodes size: [1])
   [junit4]   2> 2310288 INFO  (zkCallback-1664-thread-2) [    ] o.a.s.c.c.ZkStateReader A cluster state change: [WatchedEvent state:SyncConnected type:NodeDataChanged path:/collections/testCollection2/state.json] for collection [testCollection2] has occurred - updating... (live nodes size: [1])
   [junit4]   2> 2310335 INFO  (qtp444431326-18708) [    ] o.a.s.c.ZkController I am the leader, no recovery necessary
   [junit4]   2> 2310336 INFO  (qtp444431326-18708) [    ] o.a.s.s.HttpSolrCall [admin] webapp=null path=/admin/cores params={qt=/admin/cores&coreNodeName=core_node4&collection.configName=config&newCollection=true&name=testCollection2_shard2_replica_n2&action=CREATE&numShards=2&collection=testCollection2&shard=shard2&wt=javabin&version=2&replicaType=NRT} status=0 QTime=1200
   [junit4]   2> 2310337 INFO  (qtp444431326-18745) [    ] o.a.s.c.ZkController I am the leader, no recovery necessary
   [junit4]   2> 2310337 INFO  (qtp444431326-18745) [    ] o.a.s.s.HttpSolrCall [admin] webapp=null path=/admin/cores params={qt=/admin/cores&coreNodeName=core_node3&collection.configName=config&newCollection=true&name=testCollection2_shard1_replica_n1&action=CREATE&numShards=2&collection=testCollection2&shard=shard1&wt=javabin&version=2&replicaType=NRT} status=0 QTime=1201
   [junit4]   2> 2310338 INFO  (qtp444431326-18711) [    ] o.a.s.h.a.CollectionsHandler Wait for new collection to be active for at most 30 seconds. Check all shard replicas
   [junit4]   2> 2310438 INFO  (zkCallback-1664-thread-1) [    ] o.a.s.c.c.ZkStateReader A cluster state change: [WatchedEvent state:SyncConnected type:NodeDataChanged path:/collections/testCollection2/state.json] for collection [testCollection2] has occurred - updating... (live nodes size: [1])
   [junit4]   2> 2310438 INFO  (zkCallback-1664-thread-2) [    ] o.a.s.c.c.ZkStateReader A cluster state change: [WatchedEvent state:SyncConnected type:NodeDataChanged path:/collections/testCollection2/state.json] for collection [testCollection2] has occurred - updating... (live nodes size: [1])
   [junit4]   2> 2310727 INFO  (OverseerCollectionConfigSetProcessor-98816396204769283-127.0.0.1:41801_solr-n_0000000000) [    ] o.a.s.c.OverseerTaskQueue Response ZK path: /overseer/collection-queue-work/qnr-0000000002 doesn't exist.  Requestor may have disconnected from ZooKeeper
   [junit4]   2> 2311338 INFO  (qtp444431326-18711) [    ] o.a.s.s.HttpSolrCall [admin] webapp=null path=/admin/collections params={replicationFactor=1&collection.configName=config&maxShardsPerNode=1000&name=testCollection2&nrtReplicas=1&action=CREATE&numShards=2&wt=javabin&version=2} status=0 QTime=2614
   [junit4]   2> 2311338 INFO  (SUITE-LeaderElectionContextKeyTest-seed#[E5E30D1D8F479F6C]-worker) [    ] o.a.s.c.AbstractDistribZkTestBase Wait for recoveries to finish - collection: testCollection1 failOnTimeout:true timeout (sec):30
   [junit4]   2> 2311339 INFO  (SUITE-LeaderElectionContextKeyTest-seed#[E5E30D1D8F479F6C]-worker) [    ] o.a.s.c.AbstractDistribZkTestBase Recoveries finished - collection: testCollection1
   [junit4]   2> 2311339 INFO  (SUITE-LeaderElectionContextKeyTest-seed#[E5E30D1D8F479F6C]-worker) [    ] o.a.s.c.AbstractDistribZkTestBase Wait for recoveries to finish - collection: testCollection2 failOnTimeout:true timeout (sec):30
   [junit4]   2> 2311339 INFO  (SUITE-LeaderElectionContextKeyTest-seed#[E5E30D1D8F479F6C]-worker) [    ] o.a.s.c.AbstractDistribZkTestBase Recoveries finished - collection: testCollection2
   [junit4]   2> 2311344 INFO  (TEST-LeaderElectionContextKeyTest.test-seed#[E5E30D1D8F479F6C]) [    ] o.a.s.SolrTestCaseJ4 ###Starting test
   [junit4]   2> 2311347 INFO  (qtp444431326-18708) [    ] o.a.s.m.SolrMetricManager Closing metric reporters for registry=solr.core.testCollection1.shard2.replica_n3, tag=null
   [junit4]   2> 2311347 INFO  (qtp444431326-18708) [    ] o.a.s.m.r.SolrJmxReporter Closing reporter [org.apache.solr.metrics.reporters.SolrJmxReporter@1e18001: rootName = solr_41801, domain = solr.core.testCollection1.shard2.replica_n3, service url = null, agent id = null] for registry solr.core.testCollection1.shard2.replica_n3 / com.codahale.metrics.MetricRegistry@3e73948b
   [junit4]   2> 2311357 INFO  (qtp444431326-18708) [    ] o.a.s.c.SolrCore [testCollection1_shard2_replica_n3]  CLOSING SolrCore org.apache.solr.core.SolrCore@2b1c8ca9
   [junit4]   2> 2311357 INFO  (qtp444431326-18708) [    ] o.a.s.m.SolrMetricManager Closing metric reporters for registry=solr.core.testCollection1.shard2.replica_n3, tag=723291305
   [junit4]   2> 2311357 INFO  (qtp444431326-18708) [    ] o.a.s.m.SolrMetricManager Closing metric reporters for registry=solr.collection.testCollection1.shard2.leader, tag=723291305
   [junit4]   2> 2311360 INFO  (qtp444431326-18708) [    ] o.a.s.s.HttpSolrCall [admin] webapp=null path=/admin/cores params={deleteInstanceDir=false&core=testCollection1_shard2_replica_n3&deleteDataDir=false&action=UNLOAD&indexInfo=true&wt=javabin&version=2&deleteIndex=false} status=0 QTime=12
   [junit4]   2> 2311361 INFO  (TEST-LeaderElectionContextKeyTest.test-seed#[E5E30D1D8F479F6C]) [    ] o.a.s.SolrTestCaseJ4 ###Ending test
   [junit4]   2> NOTE: reproduce with: ant test  -Dtestcase=LeaderElectionContextKeyTest -Dtests.method=test -Dtests.seed=E5E30D1D8F479F6C -Dtests.multiplier=3 -Dtests.slow=true -Dtests.locale=shi-Tfng-MA -Dtests.timezone=America/Noronha -Dtests.asserts=true -Dtests.file.encoding=UTF-8
   [junit4] FAILURE 0.02s J1 | LeaderElectionContextKeyTest.test <<<
   [junit4]    > Throwable #1: java.lang.AssertionError
   [junit4]    > 	at __randomizedtesting.SeedInfo.seed([E5E30D1D8F479F6C:6DB732C721BBF294]:0)
   [junit4]    > 	at org.apache.solr.cloud.LeaderElectionContextKeyTest.test(LeaderElectionContextKeyTest.java:88)
   [junit4]    > 	at java.base/jdk.internal.reflect.NativeMethodAccessorImpl.invoke0(Native Method)
   [junit4]    > 	at java.base/jdk.internal.reflect.NativeMethodAccessorImpl.invoke(NativeMethodAccessorImpl.java:62)
   [junit4]    > 	at java.base/jdk.internal.reflect.DelegatingMethodAccessorImpl.invoke(DelegatingMethodAccessorImpl.java:43)
   [junit4]    > 	at java.base/java.lang.reflect.Method.invoke(Method.java:564)
   [junit4]    > 	at java.base/java.lang.Thread.run(Thread.java:844)
   [junit4]   2> 2311363 INFO  (jetty-closer-1658-thread-1) [    ] o.e.j.s.AbstractConnector Stopped ServerConnector@3244629d{SSL,[ssl, http/1.1]}{127.0.0.1:0}
   [junit4]   2> 2311363 INFO  (jetty-closer-1658-thread-1) [    ] o.a.s.c.CoreContainer Shutting down CoreContainer instance=418237009
   [junit4]   2> 2311363 INFO  (jetty-closer-1658-thread-1) [    ] o.a.s.m.SolrMetricManager Closing metric reporters for registry=solr.node, tag=null
   [junit4]   2> 2311363 INFO  (jetty-closer-1658-thread-1) [    ] o.a.s.m.r.SolrJmxReporter Closing reporter [org.apache.solr.metrics.reporters.SolrJmxReporter@1c5d40c6: rootName = solr_41801, domain = solr.node, service url = null, agent id = null] for registry solr.node / com.codahale.metrics.MetricRegistry@5ee91009
   [junit4]   2> 2311366 INFO  (jetty-closer-1658-thread-1) [    ] o.a.s.m.SolrMetricManager Closing metric reporters for registry=solr.jvm, tag=null
   [junit4]   2> 2311366 INFO  (jetty-closer-1658-thread-1) [    ] o.a.s.m.r.SolrJmxReporter Closing reporter [org.apache.solr.metrics.reporters.SolrJmxReporter@44c9831f: rootName = solr_41801, domain = solr.jvm, service url = null, agent id = null] for registry solr.jvm / com.codahale.metrics.MetricRegistry@335cac6c
   [junit4]   2> 2311368 INFO  (jetty-closer-1658-thread-1) [    ] o.a.s.m.SolrMetricManager Closing metric reporters for registry=solr.jetty, tag=null
   [junit4]   2> 2311368 INFO  (jetty-closer-1658-thread-1) [    ] o.a.s.m.r.SolrJmxReporter Closing reporter [org.apache.solr.metrics.reporters.SolrJmxReporter@242b1419: rootName = solr_41801, domain = solr.jetty, service url = null, agent id = null] for registry solr.jetty / com.codahale.metrics.MetricRegistry@1cafc6bb
   [junit4]   2> 2311368 INFO  (jetty-closer-1658-thread-1) [    ] o.a.s.m.SolrMetricManager Closing metric reporters for registry=solr.cluster, tag=null
   [junit4]   2> 2311369 INFO  (coreCloseExecutor-5461-thread-2) [    ] o.a.s.c.SolrCore [testCollection2_shard2_replica_n2]  CLOSING SolrCore org.apache.solr.core.SolrCore@751b4622
   [junit4]   2> 2311369 INFO  (coreCloseExecutor-5461-thread-2) [    ] o.a.s.m.SolrMetricManager Closing metric reporters for registry=solr.core.testCollection2.shard2.replica_n2, tag=1964721698
   [junit4]   2> 2311369 INFO  (coreCloseExecutor-5461-thread-3) [    ] o.a.s.c.SolrCore [testCollection2_shard1_replica_n1]  CLOSING SolrCore org.apache.solr.core.SolrCore@2e9e2183
   [junit4]   2> 2311369 INFO  (coreCloseExecutor-5461-thread-2) [    ] o.a.s.m.r.SolrJmxReporter Closing reporter [org.apache.solr.metrics.reporters.SolrJmxReporter@340d41e1: rootName = solr_41801, domain = solr.core.testCollection2.shard2.replica_n2, service url = null, agent id = null] for registry solr.core.testCollection2.shard2.replica_n2 / com.codahale.metrics.MetricRegistry@7b8bb4cf
   [junit4]   2> 2311369 INFO  (coreCloseExecutor-5461-thread-1) [    ] o.a.s.c.SolrCore [testCollection1_shard1_replica_n1]  CLOSING SolrCore org.apache.solr.core.SolrCore@621aba99
   [junit4]   2> 2311376 INFO  (coreCloseExecutor-5461-thread-3) [    ] o.a.s.m.SolrMetricManager Closing metric reporters for registry=solr.core.testCollection2.shard1.replica_n1, tag=782115203
   [junit4]   2> 2311376 INFO  (coreCloseExecutor-5461-thread-3) [    ] o.a.s.m.r.SolrJmxReporter Closing reporter [org.apache.solr.metrics.reporters.SolrJmxReporter@33ed7f8: rootName = solr_41801, domain = solr.core.testCollection2.shard1.replica_n1, service url = null, agent id = null] for registry solr.core.testCollection2.shard1.replica_n1 / com.codahale.metrics.MetricRegistry@6049e3e1
   [junit4]   2> 2311380 INFO  (coreCloseExecutor-5461-thread-3) [    ] o.a.s.m.SolrMetricManager Closing metric reporters for registry=solr.collection.testCollection2.shard1.leader, tag=782115203
   [junit4]   2> 2311380 INFO  (coreCloseExecutor-5461-thread-1) [    ] o.a.s.m.SolrMetricManager Closing metric reporters for registry=solr.core.testCollection1.shard1.replica_n1, tag=1645918873
   [junit4]   2> 2311380 INFO  (coreCloseExecutor-5461-thread-1) [    ] o.a.s.m.r.SolrJmxReporter Closing reporter [org.apache.solr.metrics.reporters.SolrJmxReporter@7e9fba75: rootName = solr_41801, domain = solr.core.testCollection1.shard1.replica_n1, service url = null, agent id = null] for registry solr.core.testCollection1.shard1.replica_n1 / com.codahale.metrics.MetricRegistry@37789e93
   [junit4]   2> 2311387 INFO  (coreCloseExecutor-5461-thread-1) [    ] o.a.s.m.SolrMetricManager Closing metric reporters for registry=solr.collection.testCollection1.shard1.leader, tag=1645918873
   [junit4]   2> 2311387 INFO  (coreCloseExecutor-5461-thread-2) [    ] o.a.s.m.SolrMetricManager Closing metric reporters for registry=solr.collection.testCollection2.shard2.leader, tag=1964721698
   [junit4]   2> 2311388 INFO  (jetty-closer-1658-thread-1) [    ] o.a.s.c.Overseer Overseer (id=98816396204769283-127.0.0.1:41801_solr-n_0000000000) closing
   [junit4]   2> 2311388 INFO  (OverseerStateUpdate-98816396204769283-127.0.0.1:41801_solr-n_0000000000) [    ] o.a.s.c.Overseer Overseer Loop exiting : 127.0.0.1:41801_solr
   [junit4]   2> 2311388 WARN  (OverseerAutoScalingTriggerThread-98816396204769283-127.0.0.1:41801_solr-n_0000000000) [    ] o.a.s.c.a.OverseerTriggerThread OverseerTriggerThread woken up but we are closed, exiting.
   [junit4]   2> 2312889 WARN  (zkCallback-1664-thread-2) [    ] o.a.s.c.c.ZkStateReader ZooKeeper watch triggered, but Solr cannot talk to ZK: [KeeperErrorCode = Session expired for /live_nodes]
   [junit4]   2> 2312890 INFO  (jetty-closer-1658-thread-1) [    ] o.e.j.s.h.ContextHandler Stopped o.e.j.s.ServletContextHandler@72ce0309{/solr,null,UNAVAILABLE}
   [junit4]   2> 2312890 ERROR (SUITE-LeaderElectionContextKeyTest-seed#[E5E30D1D8F479F6C]-worker) [    ] o.a.z.s.ZooKeeperServer ZKShutdownHandler is not registered, so ZooKeeper server won't take any action on ERROR or SHUTDOWN server state changes
   [junit4]   2> 2312890 INFO  (SUITE-LeaderElectionContextKeyTest-seed#[E5E30D1D8F479F6C]-worker) [    ] o.a.s.c.ZkTestServer connecting to 127.0.0.1:44169 44169
   [junit4]   2> 2318118 INFO  (Thread-4811) [    ] o.a.s.c.ZkTestServer connecting to 127.0.0.1:44169 44169
   [junit4]   2> 2318118 WARN  (Thread-4811) [    ] o.a.s.c.ZkTestServer Watch limit violations: 
   [junit4]   2> Maximum concurrent create/delete watches above limit:
   [junit4]   2> 
   [junit4]   2> 	2	/solr/aliases.json
   [junit4]   2> 
   [junit4]   2> Maximum concurrent data watches above limit:
   [junit4]   2> 
   [junit4]   2> 	5	/solr/collections/testCollection2/state.json
   [junit4]   2> 	5	/solr/collections/testCollection1/state.json
   [junit4]   2> 	2	/solr/clusterstate.json
   [junit4]   2> 	2	/solr/clusterprops.json
   [junit4]   2> 
   [junit4]   2> Maximum concurrent children watches above limit:
   [junit4]   2> 
   [junit4]   2> 	2	/solr/live_nodes
   [junit4]   2> 	2	/solr/collections
   [junit4]   2> 
   [junit4]   2> NOTE: leaving temporary files on disk at: /home/jenkins/workspace/Lucene-Solr-master-Linux/solr/build/solr-core/test/J1/temp/solr.cloud.LeaderElectionContextKeyTest_E5E30D1D8F479F6C-001
   [junit4]   2> NOTE: test params are: codec=Lucene70, sim=RandomSimilarity(queryNorm=true): {}, locale=shi-Tfng-MA, timezone=America/Noronha
   [junit4]   2> NOTE: Linux 4.10.0-33-generic amd64/Oracle Corporation 9 (64-bit)/cpus=8,threads=1,free=102419872,total=529006592
   [junit4]   2> NOTE: All tests run in this JVM: [TestSolrXml, TestQueryTypes, TestStressUserVersions, DirectSolrConnectionTest, MoveReplicaHDFSTest, SOLR749Test, TestConfigSets, CursorMarkTest, SuggesterTSTTest, TestNumericTokenStream, TestSystemCollAutoCreate, TestXmlQParserPlugin, DOMUtilTest, TestSolrCloudWithSecureImpersonation, DocValuesMissingTest, TestLeaderInitiatedRecoveryThread, LoggingHandlerTest, FileBasedSpellCheckerTest, DistanceUnitsTest, TermVectorComponentTest, TestStressRecovery, TestFieldCacheSortRandom, FullHLLTest, DirectSolrSpellCheckerTest, TestHdfsCloudBackupRestore, DocValuesTest, TestUpdate, TestJettySolrRunner, CoreMergeIndexesAdminHandlerTest, UpdateLogTest, LukeRequestHandlerTest, TestCollapseQParserPlugin, TestNestedDocsSort, TestUseDocValuesAsStored2, TestRecoveryHdfs, AlternateDirectoryTest, TestStreamBody, CSVRequestHandlerTest, TestMinMaxOnMultiValuedField, SolrCmdDistributorTest, DocExpirationUpdateProcessorFactoryTest, TestFastLRUCache, TestBM25SimilarityFactory, TestJsonRequest, TestSolrCoreParser, TestCollationFieldDocValues, DocValuesMultiTest, TestManagedResourceStorage, TestStressVersions, TestFiltering, TestRTGBase, ResourceLoaderTest, TestCloudDeleteByQuery, TestEmbeddedSolrServerAdminHandler, TestDistributedGrouping, RequestLoggingTest, TestLRUStatsCache, RecoveryAfterSoftCommitTest, SolrMetricReporterTest, TestConfigsApi, TestGraphTermsQParserPlugin, DeleteStatusTest, TestPullReplica, ChaosMonkeySafeLeaderTest, CoreAdminHandlerTest, FileUtilsTest, BasicFunctionalityTest, TestCursorMarkWithoutUniqueKey, TestManagedSchemaAPI, TestFuzzyAnalyzedSuggestions, TestPolicyCloud, OverseerStatusTest, OverseerCollectionConfigSetProcessorTest, AutoscalingHistoryHandlerTest, TestBulkSchemaConcurrent, TestCoreDiscovery, TestSkipOverseerOperations, NodeAddedTriggerTest, TestCustomDocTransformer, QueryParsingTest, HdfsCollectionsAPIDistributedZkTest, DistributedIntervalFacetingTest, DistributedFacetPivotWhiteBoxTest, SolrSlf4jReporterTest, TestSolrJ, SolrCloudExampleTest, ZkStateReaderTest, CollectionReloadTest, HttpSolrCallGetCoreTest, ReplicationFactorTest, HdfsDirectoryFactoryTest, SolrIndexMetricsTest, CustomCollectionTest, JSONWriterTest, TestPostingsSolrHighlighter, CdcrReplicationDistributedZkTest, TestCollectionsAPIViaSolrCloudCluster, DistanceFunctionTest, TestLegacyFieldReuse, TestMultiValuedNumericRangeQuery, SchemaVersionSpecificBehaviorTest, AtomicUpdateProcessorFactoryTest, TestSubQueryTransformerCrossCore, ConvertedLegacyTest, TestFileDictionaryLookup, TestRequestForwarding, TestGraphMLResponseWriter, SSLMigrationTest, NoCacheHeaderTest, TestTolerantUpdateProcessorRandomCloud, TestSearchPerf, TestCharFilters, TestCloudSearcherWarming, SparseHLLTest, TestPerFieldSimilarity, SpellCheckComponentTest, TestExpandComponent, TestDistribIDF, ShardRoutingCustomTest, SpatialFilterTest, DeleteNodeTest, ClassificationUpdateProcessorIntegrationTest, BlockCacheTest, CacheHeaderTest, BasicDistributedZkTest, LeaderElectionContextKeyTest]
   [junit4] Completed [519/745 (1!)] on J1 in 12.19s, 1 test, 1 failure <<< FAILURES!

[...truncated 40477 lines...]

Mime
View raw message