lucene-dev mailing list archives

Site index · List index
Message view « Date » · « Thread »
Top « Date » · « Thread »
From Policeman Jenkins Server <jenk...@thetaphi.de>
Subject [JENKINS] Lucene-Solr-7.x-Solaris (64bit/jdk1.8.0) - Build # 222 - Still Failing!
Date Tue, 03 Oct 2017 13:13:30 GMT
Build: https://jenkins.thetaphi.de/job/Lucene-Solr-7.x-Solaris/222/
Java: 64bit/jdk1.8.0 -XX:-UseCompressedOops -XX:+UseG1GC

2 tests failed.
FAILED:  junit.framework.TestSuite.org.apache.solr.cloud.TestSolrCloudWithSecureImpersonation

Error Message:
3 threads leaked from SUITE scope at org.apache.solr.cloud.TestSolrCloudWithSecureImpersonation:     1) Thread[id=11449, name=jetty-launcher-1930-thread-1-EventThread, state=TIMED_WAITING, group=TGRP-TestSolrCloudWithSecureImpersonation]         at sun.misc.Unsafe.park(Native Method)         at java.util.concurrent.locks.LockSupport.parkNanos(LockSupport.java:215)         at java.util.concurrent.locks.AbstractQueuedSynchronizer.doAcquireSharedNanos(AbstractQueuedSynchronizer.java:1037)         at java.util.concurrent.locks.AbstractQueuedSynchronizer.tryAcquireSharedNanos(AbstractQueuedSynchronizer.java:1328)         at java.util.concurrent.CountDownLatch.await(CountDownLatch.java:277)         at org.apache.curator.CuratorZookeeperClient.internalBlockUntilConnectedOrTimedOut(CuratorZookeeperClient.java:323)         at org.apache.curator.RetryLoop.callWithRetry(RetryLoop.java:105)         at org.apache.curator.framework.imps.GetDataBuilderImpl.pathInForeground(GetDataBuilderImpl.java:288)         at org.apache.curator.framework.imps.GetDataBuilderImpl.forPath(GetDataBuilderImpl.java:279)         at org.apache.curator.framework.imps.GetDataBuilderImpl.forPath(GetDataBuilderImpl.java:41)         at org.apache.curator.framework.recipes.shared.SharedValue.readValue(SharedValue.java:244)         at org.apache.curator.framework.recipes.shared.SharedValue.access$100(SharedValue.java:44)         at org.apache.curator.framework.recipes.shared.SharedValue$1.process(SharedValue.java:61)         at org.apache.curator.framework.imps.NamespaceWatcher.process(NamespaceWatcher.java:67)         at org.apache.zookeeper.ClientCnxn$EventThread.processEvent(ClientCnxn.java:530)         at org.apache.zookeeper.ClientCnxn$EventThread.run(ClientCnxn.java:505)    2) Thread[id=11515, name=jetty-launcher-1930-thread-2-SendThread(127.0.0.1:55939), state=TIMED_WAITING, group=TGRP-TestSolrCloudWithSecureImpersonation]         at java.lang.Thread.sleep(Native Method)         at org.apache.zookeeper.client.StaticHostProvider.next(StaticHostProvider.java:101)         at org.apache.zookeeper.ClientCnxn$SendThread.startConnect(ClientCnxn.java:997)         at org.apache.zookeeper.ClientCnxn$SendThread.run(ClientCnxn.java:1060)    3) Thread[id=11516, name=jetty-launcher-1930-thread-2-EventThread, state=WAITING, group=TGRP-TestSolrCloudWithSecureImpersonation]         at sun.misc.Unsafe.park(Native Method)         at java.util.concurrent.locks.LockSupport.park(LockSupport.java:175)         at java.util.concurrent.locks.AbstractQueuedSynchronizer$ConditionObject.await(AbstractQueuedSynchronizer.java:2039)         at java.util.concurrent.LinkedBlockingQueue.take(LinkedBlockingQueue.java:442)         at org.apache.zookeeper.ClientCnxn$EventThread.run(ClientCnxn.java:501)

Stack Trace:
com.carrotsearch.randomizedtesting.ThreadLeakError: 3 threads leaked from SUITE scope at org.apache.solr.cloud.TestSolrCloudWithSecureImpersonation: 
   1) Thread[id=11449, name=jetty-launcher-1930-thread-1-EventThread, state=TIMED_WAITING, group=TGRP-TestSolrCloudWithSecureImpersonation]
        at sun.misc.Unsafe.park(Native Method)
        at java.util.concurrent.locks.LockSupport.parkNanos(LockSupport.java:215)
        at java.util.concurrent.locks.AbstractQueuedSynchronizer.doAcquireSharedNanos(AbstractQueuedSynchronizer.java:1037)
        at java.util.concurrent.locks.AbstractQueuedSynchronizer.tryAcquireSharedNanos(AbstractQueuedSynchronizer.java:1328)
        at java.util.concurrent.CountDownLatch.await(CountDownLatch.java:277)
        at org.apache.curator.CuratorZookeeperClient.internalBlockUntilConnectedOrTimedOut(CuratorZookeeperClient.java:323)
        at org.apache.curator.RetryLoop.callWithRetry(RetryLoop.java:105)
        at org.apache.curator.framework.imps.GetDataBuilderImpl.pathInForeground(GetDataBuilderImpl.java:288)
        at org.apache.curator.framework.imps.GetDataBuilderImpl.forPath(GetDataBuilderImpl.java:279)
        at org.apache.curator.framework.imps.GetDataBuilderImpl.forPath(GetDataBuilderImpl.java:41)
        at org.apache.curator.framework.recipes.shared.SharedValue.readValue(SharedValue.java:244)
        at org.apache.curator.framework.recipes.shared.SharedValue.access$100(SharedValue.java:44)
        at org.apache.curator.framework.recipes.shared.SharedValue$1.process(SharedValue.java:61)
        at org.apache.curator.framework.imps.NamespaceWatcher.process(NamespaceWatcher.java:67)
        at org.apache.zookeeper.ClientCnxn$EventThread.processEvent(ClientCnxn.java:530)
        at org.apache.zookeeper.ClientCnxn$EventThread.run(ClientCnxn.java:505)
   2) Thread[id=11515, name=jetty-launcher-1930-thread-2-SendThread(127.0.0.1:55939), state=TIMED_WAITING, group=TGRP-TestSolrCloudWithSecureImpersonation]
        at java.lang.Thread.sleep(Native Method)
        at org.apache.zookeeper.client.StaticHostProvider.next(StaticHostProvider.java:101)
        at org.apache.zookeeper.ClientCnxn$SendThread.startConnect(ClientCnxn.java:997)
        at org.apache.zookeeper.ClientCnxn$SendThread.run(ClientCnxn.java:1060)
   3) Thread[id=11516, name=jetty-launcher-1930-thread-2-EventThread, state=WAITING, group=TGRP-TestSolrCloudWithSecureImpersonation]
        at sun.misc.Unsafe.park(Native Method)
        at java.util.concurrent.locks.LockSupport.park(LockSupport.java:175)
        at java.util.concurrent.locks.AbstractQueuedSynchronizer$ConditionObject.await(AbstractQueuedSynchronizer.java:2039)
        at java.util.concurrent.LinkedBlockingQueue.take(LinkedBlockingQueue.java:442)
        at org.apache.zookeeper.ClientCnxn$EventThread.run(ClientCnxn.java:501)
	at __randomizedtesting.SeedInfo.seed([AB163D8AFF236488]:0)


FAILED:  junit.framework.TestSuite.org.apache.solr.cloud.TestSolrCloudWithSecureImpersonation

Error Message:
There are still zombie threads that couldn't be terminated:    1) Thread[id=11515, name=jetty-launcher-1930-thread-2-SendThread(127.0.0.1:55939), state=TIMED_WAITING, group=TGRP-TestSolrCloudWithSecureImpersonation]         at java.lang.Thread.sleep(Native Method)         at org.apache.zookeeper.client.StaticHostProvider.next(StaticHostProvider.java:101)         at org.apache.zookeeper.ClientCnxn$SendThread.startConnect(ClientCnxn.java:997)         at org.apache.zookeeper.ClientCnxn$SendThread.run(ClientCnxn.java:1060)

Stack Trace:
com.carrotsearch.randomizedtesting.ThreadLeakError: There are still zombie threads that couldn't be terminated:
   1) Thread[id=11515, name=jetty-launcher-1930-thread-2-SendThread(127.0.0.1:55939), state=TIMED_WAITING, group=TGRP-TestSolrCloudWithSecureImpersonation]
        at java.lang.Thread.sleep(Native Method)
        at org.apache.zookeeper.client.StaticHostProvider.next(StaticHostProvider.java:101)
        at org.apache.zookeeper.ClientCnxn$SendThread.startConnect(ClientCnxn.java:997)
        at org.apache.zookeeper.ClientCnxn$SendThread.run(ClientCnxn.java:1060)
	at __randomizedtesting.SeedInfo.seed([AB163D8AFF236488]:0)




Build Log:
[...truncated 12006 lines...]
   [junit4] Suite: org.apache.solr.cloud.TestSolrCloudWithSecureImpersonation
   [junit4]   2> 1382799 INFO  (SUITE-TestSolrCloudWithSecureImpersonation-seed#[AB163D8AFF236488]-worker) [    ] o.a.s.SolrTestCaseJ4 SecureRandom sanity checks: test.solr.allowed.securerandom=null & java.security.egd=file:/dev/./urandom
   [junit4]   2> Creating dataDir: /export/home/jenkins/workspace/Lucene-Solr-7.x-Solaris/solr/build/solr-core/test/J0/temp/solr.cloud.TestSolrCloudWithSecureImpersonation_AB163D8AFF236488-001/init-core-data-001
   [junit4]   2> 1382800 WARN  (SUITE-TestSolrCloudWithSecureImpersonation-seed#[AB163D8AFF236488]-worker) [    ] o.a.s.SolrTestCaseJ4 startTrackingSearchers: numOpens=2 numCloses=2
   [junit4]   2> 1382846 INFO  (SUITE-TestSolrCloudWithSecureImpersonation-seed#[AB163D8AFF236488]-worker) [    ] o.a.s.SolrTestCaseJ4 Using PointFields (NUMERIC_POINTS_SYSPROP=true) w/NUMERIC_DOCVALUES_SYSPROP=true
   [junit4]   2> 1382848 INFO  (SUITE-TestSolrCloudWithSecureImpersonation-seed#[AB163D8AFF236488]-worker) [    ] o.a.s.SolrTestCaseJ4 Randomized ssl (true) and clientAuth (false) via: @org.apache.solr.util.RandomizeSSL(reason=, value=NaN, ssl=NaN, clientAuth=NaN)
   [junit4]   2> 1382983 INFO  (SUITE-TestSolrCloudWithSecureImpersonation-seed#[AB163D8AFF236488]-worker) [    ] o.a.s.c.MiniSolrCloudCluster Starting cluster of 2 servers in /export/home/jenkins/workspace/Lucene-Solr-7.x-Solaris/solr/build/solr-core/test/J0/temp/solr.cloud.TestSolrCloudWithSecureImpersonation_AB163D8AFF236488-001/tempDir-001
   [junit4]   2> 1382983 INFO  (SUITE-TestSolrCloudWithSecureImpersonation-seed#[AB163D8AFF236488]-worker) [    ] o.a.s.c.ZkTestServer STARTING ZK TEST SERVER
   [junit4]   2> 1382984 INFO  (Thread-1876) [    ] o.a.s.c.ZkTestServer client port:0.0.0.0/0.0.0.0:0
   [junit4]   2> 1382984 INFO  (Thread-1876) [    ] o.a.s.c.ZkTestServer Starting server
   [junit4]   2> 1382986 ERROR (Thread-1876) [    ] o.a.z.s.ZooKeeperServer ZKShutdownHandler is not registered, so ZooKeeper server won't take any action on ERROR or SHUTDOWN server state changes
   [junit4]   2> 1383085 INFO  (SUITE-TestSolrCloudWithSecureImpersonation-seed#[AB163D8AFF236488]-worker) [    ] o.a.s.c.ZkTestServer start zk server on port:55939
   [junit4]   2> 1383182 INFO  (jetty-launcher-1930-thread-2) [    ] o.e.j.s.Server jetty-9.3.20.v20170531
   [junit4]   2> 1383184 INFO  (jetty-launcher-1930-thread-2) [    ] o.e.j.s.h.ContextHandler Started o.e.j.s.ServletContextHandler@26a6d61{/solr,null,AVAILABLE}
   [junit4]   2> 1383190 INFO  (jetty-launcher-1930-thread-2) [    ] o.e.j.s.AbstractConnector Started ServerConnector@6afb11e6{SSL,[ssl, http/1.1]}{127.0.0.1:36381}
   [junit4]   2> 1383190 INFO  (jetty-launcher-1930-thread-2) [    ] o.e.j.s.Server Started @1385865ms
   [junit4]   2> 1383190 INFO  (jetty-launcher-1930-thread-2) [    ] o.a.s.c.s.e.JettySolrRunner Jetty properties: {hostContext=/solr, hostPort=36381}
   [junit4]   2> 1383190 ERROR (jetty-launcher-1930-thread-2) [    ] o.a.s.u.StartupLoggingUtils Missing Java Option solr.log.dir. Logging may be missing or incomplete.
   [junit4]   2> 1383190 INFO  (jetty-launcher-1930-thread-2) [    ] o.a.s.s.SolrDispatchFilter  ___      _       Welcome to Apache Solr™ version 7.1.0
   [junit4]   2> 1383190 INFO  (jetty-launcher-1930-thread-2) [    ] o.a.s.s.SolrDispatchFilter / __| ___| |_ _   Starting in cloud mode on port null
   [junit4]   2> 1383190 INFO  (jetty-launcher-1930-thread-2) [    ] o.a.s.s.SolrDispatchFilter \__ \/ _ \ | '_|  Install dir: null, Default config dir: null
   [junit4]   2> 1383190 INFO  (jetty-launcher-1930-thread-2) [    ] o.a.s.s.SolrDispatchFilter |___/\___/_|_|    Start time: 2017-10-03T12:39:05.276Z
   [junit4]   2> 1383213 INFO  (jetty-launcher-1930-thread-2) [    ] o.a.s.s.SolrDispatchFilter solr.xml found in ZooKeeper. Loading...
   [junit4]   2> 1383218 INFO  (jetty-launcher-1930-thread-1) [    ] o.e.j.s.Server jetty-9.3.20.v20170531
   [junit4]   2> 1383220 INFO  (jetty-launcher-1930-thread-1) [    ] o.e.j.s.h.ContextHandler Started o.e.j.s.ServletContextHandler@1b4096e7{/solr,null,AVAILABLE}
   [junit4]   2> 1383221 INFO  (jetty-launcher-1930-thread-1) [    ] o.e.j.s.AbstractConnector Started ServerConnector@5007a3fd{SSL,[ssl, http/1.1]}{127.0.0.1:57908}
   [junit4]   2> 1383221 INFO  (jetty-launcher-1930-thread-1) [    ] o.e.j.s.Server Started @1385896ms
   [junit4]   2> 1383221 INFO  (jetty-launcher-1930-thread-1) [    ] o.a.s.c.s.e.JettySolrRunner Jetty properties: {hostContext=/solr, hostPort=57908}
   [junit4]   2> 1383221 ERROR (jetty-launcher-1930-thread-1) [    ] o.a.s.u.StartupLoggingUtils Missing Java Option solr.log.dir. Logging may be missing or incomplete.
   [junit4]   2> 1383221 INFO  (jetty-launcher-1930-thread-1) [    ] o.a.s.s.SolrDispatchFilter  ___      _       Welcome to Apache Solr™ version 7.1.0
   [junit4]   2> 1383221 INFO  (jetty-launcher-1930-thread-1) [    ] o.a.s.s.SolrDispatchFilter / __| ___| |_ _   Starting in cloud mode on port null
   [junit4]   2> 1383221 INFO  (jetty-launcher-1930-thread-1) [    ] o.a.s.s.SolrDispatchFilter \__ \/ _ \ | '_|  Install dir: null, Default config dir: null
   [junit4]   2> 1383221 INFO  (jetty-launcher-1930-thread-1) [    ] o.a.s.s.SolrDispatchFilter |___/\___/_|_|    Start time: 2017-10-03T12:39:05.307Z
   [junit4]   2> 1383227 INFO  (jetty-launcher-1930-thread-2) [    ] o.a.s.c.ZkContainer Zookeeper client=127.0.0.1:55939/solr
   [junit4]   2> 1383234 INFO  (jetty-launcher-1930-thread-1) [    ] o.a.s.s.SolrDispatchFilter solr.xml found in ZooKeeper. Loading...
   [junit4]   2> 1383245 INFO  (jetty-launcher-1930-thread-1) [    ] o.a.s.c.ZkContainer Zookeeper client=127.0.0.1:55939/solr
   [junit4]   2> 1383545 INFO  (jetty-launcher-1930-thread-2) [n:127.0.0.1:36381_solr    ] o.a.s.c.Overseer Overseer (id=null) closing
   [junit4]   2> 1383553 INFO  (jetty-launcher-1930-thread-2) [n:127.0.0.1:36381_solr    ] o.a.s.c.OverseerElectionContext I am going to be the leader 127.0.0.1:36381_solr
   [junit4]   2> 1383555 INFO  (jetty-launcher-1930-thread-2) [n:127.0.0.1:36381_solr    ] o.a.s.c.Overseer Overseer (id=98765002838638596-127.0.0.1:36381_solr-n_0000000000) starting
   [junit4]   2> 1383599 INFO  (jetty-launcher-1930-thread-1) [n:127.0.0.1:57908_solr    ] o.a.s.c.Overseer Overseer (id=null) closing
   [junit4]   2> 1383615 INFO  (jetty-launcher-1930-thread-1) [n:127.0.0.1:57908_solr    ] o.a.s.c.ZkController Register node as live in ZooKeeper:/live_nodes/127.0.0.1:57908_solr
   [junit4]   2> 1383635 INFO  (zkCallback-1938-thread-1-processing-n:127.0.0.1:36381_solr) [n:127.0.0.1:36381_solr    ] o.a.s.c.c.ZkStateReader Updated live nodes from ZooKeeper... (0) -> (1)
   [junit4]   2> 1383635 INFO  (zkCallback-1943-thread-1-processing-n:127.0.0.1:57908_solr) [n:127.0.0.1:57908_solr    ] o.a.s.c.c.ZkStateReader Updated live nodes from ZooKeeper... (0) -> (1)
   [junit4]   2> 1383691 INFO  (jetty-launcher-1930-thread-2) [n:127.0.0.1:36381_solr    ] o.a.s.c.ZkController Register node as live in ZooKeeper:/live_nodes/127.0.0.1:36381_solr
   [junit4]   2> 1383699 INFO  (zkCallback-1943-thread-1-processing-n:127.0.0.1:57908_solr) [n:127.0.0.1:57908_solr    ] o.a.s.c.c.ZkStateReader Updated live nodes from ZooKeeper... (1) -> (2)
   [junit4]   2> 1383717 INFO  (zkCallback-1938-thread-1-processing-n:127.0.0.1:36381_solr) [n:127.0.0.1:36381_solr    ] o.a.s.c.c.ZkStateReader Updated live nodes from ZooKeeper... (1) -> (2)
   [junit4]   2> 1383781 INFO  (jetty-launcher-1930-thread-2) [n:127.0.0.1:36381_solr    ] o.a.s.c.CoreContainer Initializing authentication plugin: org.apache.solr.security.HttpParamDelegationTokenPlugin
   [junit4]   2> 1383790 WARN  (jetty-launcher-1930-thread-2) [n:127.0.0.1:36381_solr    ] o.a.s.c.s.i.Krb5HttpClientBuilder org.apache.solr.client.solrj.impl.Krb5HttpClientBuilder is configured without specifying system property 'java.security.auth.login.config'
   [junit4]   2> 1383802 INFO  (jetty-launcher-1930-thread-2) [n:127.0.0.1:36381_solr    ] o.a.s.s.KerberosPlugin Params: {solr.kerberos.impersonator.user.noGroups.hosts=*, solr.kerberos.impersonator.user.bogusGroup.groups=__some_bogus_group, token.valid=30, cookie.domain=127.0.0.1, solr.kerberos.impersonator.user.anyHostAnyUser.groups=*, solr.kerberos.impersonator.user.bogusGroup.hosts=*, solr.kerberos.impersonator.user.anyHostAnyUser.hosts=*, token.validity=36000, solr.kerberos.impersonator.user.noHosts.groups=*, type=kerberos, solr.kerberos.impersonator.user.localHostAnyGroup.groups=*, delegation-token.token-kind=solr-dt, solr.kerberos.impersonator.user.wrongHost.hosts=1.1.1.1.1.1, cookie.path=/, zk-dt-secret-manager.znodeWorkingPath=solr/security/zkdtsm, solr.kerberos.impersonator.user.localHostAnyGroup.hosts=serv1-vm3,localhost,127.0.0.1, signer.secret.provider.zookeeper.path=/token, solr.kerberos.impersonator.user.anyHostUsersGroup.groups=staff, zk-dt-secret-manager.enable=true, solr.kerberos.impersonator.user.wrongHost.groups=*, kerberos.name.rules=DEFAULT, signer.secret.provider=zookeeper, solr.kerberos.impersonator.user.anyHostUsersGroup.hosts=*}
   [junit4]   2> 1383947 INFO  (jetty-launcher-1930-thread-1) [n:127.0.0.1:57908_solr    ] o.a.s.c.CoreContainer Initializing authentication plugin: org.apache.solr.security.HttpParamDelegationTokenPlugin
   [junit4]   2> 1383947 WARN  (jetty-launcher-1930-thread-1) [n:127.0.0.1:57908_solr    ] o.a.s.c.s.i.Krb5HttpClientBuilder org.apache.solr.client.solrj.impl.Krb5HttpClientBuilder is configured without specifying system property 'java.security.auth.login.config'
   [junit4]   2> 1383952 INFO  (jetty-launcher-1930-thread-1) [n:127.0.0.1:57908_solr    ] o.a.s.s.KerberosPlugin Params: {solr.kerberos.impersonator.user.noGroups.hosts=*, solr.kerberos.impersonator.user.bogusGroup.groups=__some_bogus_group, token.valid=30, cookie.domain=127.0.0.1, solr.kerberos.impersonator.user.anyHostAnyUser.groups=*, solr.kerberos.impersonator.user.bogusGroup.hosts=*, solr.kerberos.impersonator.user.anyHostAnyUser.hosts=*, token.validity=36000, solr.kerberos.impersonator.user.noHosts.groups=*, type=kerberos, solr.kerberos.impersonator.user.localHostAnyGroup.groups=*, delegation-token.token-kind=solr-dt, solr.kerberos.impersonator.user.wrongHost.hosts=1.1.1.1.1.1, cookie.path=/, zk-dt-secret-manager.znodeWorkingPath=solr/security/zkdtsm, solr.kerberos.impersonator.user.localHostAnyGroup.hosts=serv1-vm3,localhost,127.0.0.1, signer.secret.provider.zookeeper.path=/token, solr.kerberos.impersonator.user.anyHostUsersGroup.groups=staff, zk-dt-secret-manager.enable=true, solr.kerberos.impersonator.user.wrongHost.groups=*, kerberos.name.rules=DEFAULT, signer.secret.provider=zookeeper, solr.kerberos.impersonator.user.anyHostUsersGroup.hosts=*}
   [junit4]   2> 1383974 INFO  (jetty-launcher-1930-thread-1) [n:127.0.0.1:57908_solr    ] o.a.c.f.i.CuratorFrameworkImpl Starting
   [junit4]   2> 1383974 INFO  (jetty-launcher-1930-thread-2) [n:127.0.0.1:36381_solr    ] o.a.c.f.i.CuratorFrameworkImpl Starting
   [junit4]   2> 1384019 INFO  (jetty-launcher-1930-thread-2-EventThread) [n:127.0.0.1:36381_solr    ] o.a.c.f.s.ConnectionStateManager State change: CONNECTED
   [junit4]   2> 1384021 INFO  (jetty-launcher-1930-thread-1-EventThread) [n:127.0.0.1:57908_solr    ] o.a.c.f.s.ConnectionStateManager State change: CONNECTED
   [junit4]   2> 1384374 WARN  (jetty-launcher-1930-thread-2) [n:127.0.0.1:36381_solr    ] o.a.s.c.s.i.Krb5HttpClientBuilder org.apache.solr.client.solrj.impl.Krb5HttpClientBuilder is configured without specifying system property 'java.security.auth.login.config'
   [junit4]   2> 1384391 WARN  (jetty-launcher-1930-thread-1) [n:127.0.0.1:57908_solr    ] o.a.s.c.s.i.Krb5HttpClientBuilder org.apache.solr.client.solrj.impl.Krb5HttpClientBuilder is configured without specifying system property 'java.security.auth.login.config'
   [junit4]   2> 1384463 INFO  (jetty-launcher-1930-thread-2) [n:127.0.0.1:36381_solr    ] o.a.s.m.r.SolrJmxReporter JMX monitoring for 'solr_36381.solr.node' (registry 'solr.node') enabled at server: com.sun.jmx.mbeanserver.JmxMBeanServer@1dcaea79
   [junit4]   2> 1384477 INFO  (jetty-launcher-1930-thread-1) [n:127.0.0.1:57908_solr    ] o.a.s.m.r.SolrJmxReporter JMX monitoring for 'solr_57908.solr.node' (registry 'solr.node') enabled at server: com.sun.jmx.mbeanserver.JmxMBeanServer@1dcaea79
   [junit4]   2> 1384485 INFO  (jetty-launcher-1930-thread-1) [n:127.0.0.1:57908_solr    ] o.a.s.m.r.SolrJmxReporter JMX monitoring for 'solr_57908.solr.jvm' (registry 'solr.jvm') enabled at server: com.sun.jmx.mbeanserver.JmxMBeanServer@1dcaea79
   [junit4]   2> 1384485 INFO  (jetty-launcher-1930-thread-1) [n:127.0.0.1:57908_solr    ] o.a.s.m.r.SolrJmxReporter JMX monitoring for 'solr_57908.solr.jetty' (registry 'solr.jetty') enabled at server: com.sun.jmx.mbeanserver.JmxMBeanServer@1dcaea79
   [junit4]   2> 1384486 INFO  (jetty-launcher-1930-thread-1) [n:127.0.0.1:57908_solr    ] o.a.s.c.CorePropertiesLocator Found 0 core definitions underneath /export/home/jenkins/workspace/Lucene-Solr-7.x-Solaris/solr/build/solr-core/test/J0/temp/solr.cloud.TestSolrCloudWithSecureImpersonation_AB163D8AFF236488-001/tempDir-001/node1/.
   [junit4]   2> 1384494 INFO  (jetty-launcher-1930-thread-2) [n:127.0.0.1:36381_solr    ] o.a.s.m.r.SolrJmxReporter JMX monitoring for 'solr_36381.solr.jvm' (registry 'solr.jvm') enabled at server: com.sun.jmx.mbeanserver.JmxMBeanServer@1dcaea79
   [junit4]   2> 1384494 INFO  (jetty-launcher-1930-thread-2) [n:127.0.0.1:36381_solr    ] o.a.s.m.r.SolrJmxReporter JMX monitoring for 'solr_36381.solr.jetty' (registry 'solr.jetty') enabled at server: com.sun.jmx.mbeanserver.JmxMBeanServer@1dcaea79
   [junit4]   2> 1384496 INFO  (jetty-launcher-1930-thread-2) [n:127.0.0.1:36381_solr    ] o.a.s.c.CorePropertiesLocator Found 0 core definitions underneath /export/home/jenkins/workspace/Lucene-Solr-7.x-Solaris/solr/build/solr-core/test/J0/temp/solr.cloud.TestSolrCloudWithSecureImpersonation_AB163D8AFF236488-001/tempDir-001/node2/.
   [junit4]   2> 1384708 INFO  (TEST-TestSolrCloudWithSecureImpersonation.testProxyNoConfigGroups-seed#[AB163D8AFF236488]) [    ] o.a.s.SolrTestCaseJ4 ###Starting testProxyNoConfigGroups
   [junit4]   2> 1384803 WARN  (TEST-TestSolrCloudWithSecureImpersonation.testProxyNoConfigGroups-seed#[AB163D8AFF236488]) [    ] o.a.h.c.p.ResponseProcessCookies Invalid cookie header: "Set-Cookie: hadoop.auth="u=noGroups&p=noGroups&t=test&e=1507070346853&s=xOVzj5ZPiOiHnU1dw2z83G89Avs="; Path=/; Domain=127.0.0.1; Expires=Mar, 03-Tet-2017 22:39:06 GMT; Secure; HttpOnly". Invalid 'expires' attribute: Mar, 03-Tet-2017 22:39:06 GMT
   [junit4]   2> 1384804 INFO  (TEST-TestSolrCloudWithSecureImpersonation.testProxyNoConfigGroups-seed#[AB163D8AFF236488]) [    ] o.a.s.SolrTestCaseJ4 ###Ending testProxyNoConfigGroups
   [junit4]   2> 1384898 INFO  (TEST-TestSolrCloudWithSecureImpersonation.testProxyWrongHost-seed#[AB163D8AFF236488]) [    ] o.a.s.SolrTestCaseJ4 ###Starting testProxyWrongHost
   [junit4]   2> 1399972 WARN  (jetty-launcher-1930-thread-1-SendThread(127.0.0.1:55939)) [n:127.0.0.1:57908_solr    ] o.a.z.ClientCnxn Client session timed out, have not heard from server in 15481ms for sessionid 0x15ee23f2e700006
   [junit4]   2> 1399972 WARN  (jetty-launcher-1930-thread-1-SendThread(127.0.0.1:55939)) [n:127.0.0.1:57908_solr    ] o.a.z.ClientCnxn Client session timed out, have not heard from server in 15574ms for sessionid 0x15ee23f2e700007
   [junit4]   2> 1399973 WARN  (NIOServerCxn.Factory:0.0.0.0/0.0.0.0:0) [    ] o.a.z.s.NIOServerCnxn caught end of stream exception
   [junit4]   2> EndOfStreamException: Unable to read additional data from client sessionid 0x15ee23f2e700007, likely client has closed socket
   [junit4]   2> 	at org.apache.zookeeper.server.NIOServerCnxn.doIO(NIOServerCnxn.java:239)
   [junit4]   2> 	at org.apache.zookeeper.server.NIOServerCnxnFactory.run(NIOServerCnxnFactory.java:203)
   [junit4]   2> 	at java.lang.Thread.run(Thread.java:748)
   [junit4]   2> 1399973 WARN  (jetty-launcher-1930-thread-2-SendThread(127.0.0.1:55939)) [n:127.0.0.1:36381_solr    ] o.a.z.ClientCnxn Client session timed out, have not heard from server in 15575ms for sessionid 0x15ee23f2e700008
   [junit4]   2> 1399973 WARN  (NIOServerCxn.Factory:0.0.0.0/0.0.0.0:0) [    ] o.a.z.s.NIOServerCnxn caught end of stream exception
   [junit4]   2> EndOfStreamException: Unable to read additional data from client sessionid 0x15ee23f2e700006, likely client has closed socket
   [junit4]   2> 	at org.apache.zookeeper.server.NIOServerCnxn.doIO(NIOServerCnxn.java:239)
   [junit4]   2> 	at org.apache.zookeeper.server.NIOServerCnxnFactory.run(NIOServerCnxnFactory.java:203)
   [junit4]   2> 	at java.lang.Thread.run(Thread.java:748)
   [junit4]   2> 1399973 WARN  (jetty-launcher-1930-thread-2-SendThread(127.0.0.1:55939)) [n:127.0.0.1:36381_solr    ] o.a.z.ClientCnxn Client session timed out, have not heard from server in 15474ms for sessionid 0x15ee23f2e700004
   [junit4]   2> 1399973 WARN  (NIOServerCxn.Factory:0.0.0.0/0.0.0.0:0) [    ] o.a.z.s.NIOServerCnxn caught end of stream exception
   [junit4]   2> EndOfStreamException: Unable to read additional data from client sessionid 0x15ee23f2e700008, likely client has closed socket
   [junit4]   2> 	at org.apache.zookeeper.server.NIOServerCnxn.doIO(NIOServerCnxn.java:239)
   [junit4]   2> 	at org.apache.zookeeper.server.NIOServerCnxnFactory.run(NIOServerCnxnFactory.java:203)
   [junit4]   2> 	at java.lang.Thread.run(Thread.java:748)
   [junit4]   2> 1399973 WARN  (NIOServerCxn.Factory:0.0.0.0/0.0.0.0:0) [    ] o.a.z.s.NIOServerCnxn caught end of stream exception
   [junit4]   2> EndOfStreamException: Unable to read additional data from client sessionid 0x15ee23f2e700004, likely client has closed socket
   [junit4]   2> 	at org.apache.zookeeper.server.NIOServerCnxn.doIO(NIOServerCnxn.java:239)
   [junit4]   2> 	at org.apache.zookeeper.server.NIOServerCnxnFactory.run(NIOServerCnxnFactory.java:203)
   [junit4]   2> 	at java.lang.Thread.run(Thread.java:748)
   [junit4]   2> 1399977 WARN  (TEST-TestSolrCloudWithSecureImpersonation.testProxyWrongHost-seed#[AB163D8AFF236488]) [    ] o.a.h.c.p.ResponseProcessCookies Invalid cookie header: "Set-Cookie: hadoop.auth="u=wrongHost&p=wrongHost&t=test&e=1507070346990&s=aOsWUG24ZpzPzys1zk04A5hL6o0="; Path=/; Domain=127.0.0.1; Expires=Mar, 03-Tet-2017 22:39:06 GMT; Secure; HttpOnly". Invalid 'expires' attribute: Mar, 03-Tet-2017 22:39:06 GMT
   [junit4]   2> 1399977 INFO  (TEST-TestSolrCloudWithSecureImpersonation.testProxyWrongHost-seed#[AB163D8AFF236488]) [    ] o.a.s.SolrTestCaseJ4 ###Ending testProxyWrongHost
   [junit4]   2> 1400009 INFO  (TEST-TestSolrCloudWithSecureImpersonation.testProxyValidateHost-seed#[AB163D8AFF236488]) [    ] o.a.s.SolrTestCaseJ4 ###Starting testProxyValidateHost
   [junit4]   2> 1400026 INFO  (qtp1495329247-11399) [n:127.0.0.1:36381_solr    ] o.a.s.h.a.CollectionsHandler Invoked Collection Action :list with params doAs=bar&action=LIST&wt=javabin&version=2 and sendToOCPQueue=true
   [junit4]   2> 1400026 INFO  (qtp1495329247-11399) [n:127.0.0.1:36381_solr    ] o.a.s.s.HttpSolrCall [admin] webapp=null path=/admin/collections params={doAs=bar&action=LIST&wt=javabin&version=2} status=0 QTime=0
   [junit4]   2> 1400028 WARN  (TEST-TestSolrCloudWithSecureImpersonation.testProxyValidateHost-seed#[AB163D8AFF236488]) [    ] o.a.h.c.p.ResponseProcessCookies Invalid cookie header: "Set-Cookie: hadoop.auth="u=localHostAnyGroup&p=localHostAnyGroup&t=test&e=1507070362108&s=rKgqVxKwTkdGyBGpiBdxI3efc2k="; Path=/; Domain=127.0.0.1; Expires=Mar, 03-Tet-2017 22:39:22 GMT; Secure; HttpOnly". Invalid 'expires' attribute: Mar, 03-Tet-2017 22:39:22 GMT
   [junit4]   2> 1400029 INFO  (TEST-TestSolrCloudWithSecureImpersonation.testProxyValidateHost-seed#[AB163D8AFF236488]) [    ] o.a.s.SolrTestCaseJ4 ###Ending testProxyValidateHost
   [junit4]   2> 1400070 INFO  (TEST-TestSolrCloudWithSecureImpersonation.testProxyNoConfigHosts-seed#[AB163D8AFF236488]) [    ] o.a.s.SolrTestCaseJ4 ###Starting testProxyNoConfigHosts
   [junit4]   2> 1400077 WARN  (zkCallback-1943-thread-3-processing-n:127.0.0.1:57908_solr) [n:127.0.0.1:57908_solr    ] o.a.s.c.c.ConnectionManager Watcher org.apache.solr.common.cloud.ConnectionManager@774efbc9 name: ZooKeeperConnection Watcher:127.0.0.1:55939/solr got event WatchedEvent state:Disconnected type:None path:null path: null type: None
   [junit4]   2> 1400077 WARN  (zkCallback-1943-thread-3-processing-n:127.0.0.1:57908_solr) [n:127.0.0.1:57908_solr    ] o.a.s.c.c.ConnectionManager zkClient has disconnected
   [junit4]   2> 1400078 INFO  (jetty-launcher-1930-thread-2-EventThread) [n:127.0.0.1:36381_solr    ] o.a.c.f.s.ConnectionStateManager State change: SUSPENDED
   [junit4]   2> 1400087 WARN  (zkCallback-1938-thread-4-processing-n:127.0.0.1:36381_solr) [n:127.0.0.1:36381_solr    ] o.a.s.c.c.ConnectionManager Watcher org.apache.solr.common.cloud.ConnectionManager@4b915665 name: ZooKeeperConnection Watcher:127.0.0.1:55939/solr got event WatchedEvent state:Disconnected type:None path:null path: null type: None
   [junit4]   2> 1400087 WARN  (zkCallback-1938-thread-4-processing-n:127.0.0.1:36381_solr) [n:127.0.0.1:36381_solr    ] o.a.s.c.c.ConnectionManager zkClient has disconnected
   [junit4]   2> 1400091 WARN  (TEST-TestSolrCloudWithSecureImpersonation.testProxyNoConfigHosts-seed#[AB163D8AFF236488]) [    ] o.a.h.c.p.ResponseProcessCookies Invalid cookie header: "Set-Cookie: hadoop.auth="u=noHosts&p=noHosts&t=test&e=1507070362165&s=vveYhKTqEdjPQ15pG5I+NtUhPuY="; Path=/; Domain=127.0.0.1; Expires=Mar, 03-Tet-2017 22:39:22 GMT; Secure; HttpOnly". Invalid 'expires' attribute: Mar, 03-Tet-2017 22:39:22 GMT
   [junit4]   2> 1400092 INFO  (TEST-TestSolrCloudWithSecureImpersonation.testProxyNoConfigHosts-seed#[AB163D8AFF236488]) [    ] o.a.s.SolrTestCaseJ4 ###Ending testProxyNoConfigHosts
   [junit4]   2> 1400160 INFO  (TEST-TestSolrCloudWithSecureImpersonation.testProxyInvalidGroup-seed#[AB163D8AFF236488]) [    ] o.a.s.SolrTestCaseJ4 ###Starting testProxyInvalidGroup
   [junit4]   2> 1400189 WARN  (qtp1495329247-11408) [    ] o.a.h.s.ShellBasedUnixGroupsMapping got exception trying to get groups for user bar: id: invalid user name: "bar"
   [junit4]   2> id: invalid user name: "bar"
   [junit4]   2> 
   [junit4]   2> 1400191 WARN  (TEST-TestSolrCloudWithSecureImpersonation.testProxyInvalidGroup-seed#[AB163D8AFF236488]) [    ] o.a.h.c.p.ResponseProcessCookies Invalid cookie header: "Set-Cookie: hadoop.auth="u=bogusGroup&p=bogusGroup&t=test&e=1507070362246&s=/awqrEEsMd41s5zI80LNEhSsW00="; Path=/; Domain=127.0.0.1; Expires=Mar, 03-Tet-2017 22:39:22 GMT; Secure; HttpOnly". Invalid 'expires' attribute: Mar, 03-Tet-2017 22:39:22 GMT
   [junit4]   2> 1400192 INFO  (TEST-TestSolrCloudWithSecureImpersonation.testProxyInvalidGroup-seed#[AB163D8AFF236488]) [    ] o.a.s.SolrTestCaseJ4 ###Ending testProxyInvalidGroup
   [junit4]   2> 1400266 INFO  (TEST-TestSolrCloudWithSecureImpersonation.testProxyInvalidProxyUser-seed#[AB163D8AFF236488]) [    ] o.a.s.SolrTestCaseJ4 ###Starting testProxyInvalidProxyUser
   [junit4]   2> 1400270 WARN  (TEST-TestSolrCloudWithSecureImpersonation.testProxyInvalidProxyUser-seed#[AB163D8AFF236488]) [    ] o.a.h.c.p.ResponseProcessCookies Invalid cookie header: "Set-Cookie: hadoop.auth="u=bar&p=bar&t=test&e=1507070362353&s=xp8FAlTGkBS6CtYIgUO8kFoEDjw="; Path=/; Domain=127.0.0.1; Expires=Mar, 03-Tet-2017 22:39:22 GMT; Secure; HttpOnly". Invalid 'expires' attribute: Mar, 03-Tet-2017 22:39:22 GMT
   [junit4]   2> 1400273 INFO  (TEST-TestSolrCloudWithSecureImpersonation.testProxyInvalidProxyUser-seed#[AB163D8AFF236488]) [    ] o.a.s.SolrTestCaseJ4 ###Ending testProxyInvalidProxyUser
   [junit4]   2> 1400325 INFO  (TEST-TestSolrCloudWithSecureImpersonation.testProxyInvalidRemote-seed#[AB163D8AFF236488]) [    ] o.a.s.SolrTestCaseJ4 ###Starting testProxyInvalidRemote
   [junit4]   2> 1400351 WARN  (TEST-TestSolrCloudWithSecureImpersonation.testProxyInvalidRemote-seed#[AB163D8AFF236488]) [    ] o.a.h.c.p.ResponseProcessCookies Invalid cookie header: "Set-Cookie: hadoop.auth="u=localHostAnyGroup&p=localHostAnyGroup&t=test&e=1507070362412&s=vSIb9xPnzmzYW5E/RHQnf+UPmdE="; Path=/; Domain=127.0.0.1; Expires=Mar, 03-Tet-2017 22:39:22 GMT; Secure; HttpOnly". Invalid 'expires' attribute: Mar, 03-Tet-2017 22:39:22 GMT
   [junit4]   2> 1400352 INFO  (TEST-TestSolrCloudWithSecureImpersonation.testProxyInvalidRemote-seed#[AB163D8AFF236488]) [    ] o.a.s.SolrTestCaseJ4 ###Ending testProxyInvalidRemote
   [junit4]   2> 1400485 INFO  (TEST-TestSolrCloudWithSecureImpersonation.testProxyValidateGroup-seed#[AB163D8AFF236488]) [    ] o.a.s.SolrTestCaseJ4 ###Starting testProxyValidateGroup
   [junit4]   2> 1400523 INFO  (qtp1495329247-11402) [n:127.0.0.1:36381_solr    ] o.a.s.h.a.CollectionsHandler Invoked Collection Action :list with params doAs=jenkins&action=LIST&wt=javabin&version=2 and sendToOCPQueue=true
   [junit4]   2> 1400523 INFO  (qtp1495329247-11402) [n:127.0.0.1:36381_solr    ] o.a.s.s.HttpSolrCall [admin] webapp=null path=/admin/collections params={doAs=jenkins&action=LIST&wt=javabin&version=2} status=0 QTime=0
   [junit4]   2> 1400525 WARN  (TEST-TestSolrCloudWithSecureImpersonation.testProxyValidateGroup-seed#[AB163D8AFF236488]) [    ] o.a.h.c.p.ResponseProcessCookies Invalid cookie header: "Set-Cookie: hadoop.auth="u=anyHostUsersGroup&p=anyHostUsersGroup&t=test&e=1507070362573&s=DSqCZYrHcg72mlrExQgwykbUC6M="; Path=/; Domain=127.0.0.1; Expires=Mar, 03-Tet-2017 22:39:22 GMT; Secure; HttpOnly". Invalid 'expires' attribute: Mar, 03-Tet-2017 22:39:22 GMT
   [junit4]   2> 1400525 INFO  (TEST-TestSolrCloudWithSecureImpersonation.testProxyValidateGroup-seed#[AB163D8AFF236488]) [    ] o.a.s.SolrTestCaseJ4 ###Ending testProxyValidateGroup
   [junit4]   2> 1400562 INFO  (TEST-TestSolrCloudWithSecureImpersonation.testProxyValidateAnyHostAnyUser-seed#[AB163D8AFF236488]) [    ] o.a.s.SolrTestCaseJ4 ###Starting testProxyValidateAnyHostAnyUser
   [junit4]   2> 1400563 INFO  (qtp1495329247-11406) [n:127.0.0.1:36381_solr    ] o.a.s.h.a.CollectionsHandler Invoked Collection Action :list with params doAs=bar&action=LIST&wt=javabin&version=2 and sendToOCPQueue=true
   [junit4]   2> 1400563 INFO  (qtp1495329247-11406) [n:127.0.0.1:36381_solr    ] o.a.s.s.HttpSolrCall [admin] webapp=null path=/admin/collections params={doAs=bar&action=LIST&wt=javabin&version=2} status=0 QTime=0
   [junit4]   2> 1400569 WARN  (TEST-TestSolrCloudWithSecureImpersonation.testProxyValidateAnyHostAnyUser-seed#[AB163D8AFF236488]) [    ] o.a.h.c.p.ResponseProcessCookies Invalid cookie header: "Set-Cookie: hadoop.auth="u=anyHostAnyUser&p=anyHostAnyUser&t=test&e=1507070362649&s=jNUfv9xcIA0rDtaQrMLbTWExScQ="; Path=/; Domain=127.0.0.1; Expires=Mar, 03-Tet-2017 22:39:22 GMT; Secure; HttpOnly". Invalid 'expires' attribute: Mar, 03-Tet-2017 22:39:22 GMT
   [junit4]   2> 1400569 INFO  (TEST-TestSolrCloudWithSecureImpersonation.testProxyValidateAnyHostAnyUser-seed#[AB163D8AFF236488]) [    ] o.a.s.SolrTestCaseJ4 ###Ending testProxyValidateAnyHostAnyUser
   [junit4]   2> 1400628 INFO  (TEST-TestSolrCloudWithSecureImpersonation.testProxyUnknownRemote-seed#[AB163D8AFF236488]) [    ] o.a.s.SolrTestCaseJ4 ###Starting testProxyUnknownRemote
   [junit4]   2> 1410733 WARN  (TEST-TestSolrCloudWithSecureImpersonation.testProxyUnknownRemote-seed#[AB163D8AFF236488]) [    ] o.a.h.c.p.ResponseProcessCookies Invalid cookie header: "Set-Cookie: hadoop.auth="u=localHostAnyGroup&p=localHostAnyGroup&t=test&e=1507070362715&s=tE1WUjTuqylnApRjh76R6urwy+g="; Path=/; Domain=127.0.0.1; Expires=Mar, 03-Tet-2017 22:39:22 GMT; Secure; HttpOnly". Invalid 'expires' attribute: Mar, 03-Tet-2017 22:39:22 GMT
   [junit4]   2> 1410733 INFO  (TEST-TestSolrCloudWithSecureImpersonation.testProxyUnknownRemote-seed#[AB163D8AFF236488]) [    ] o.a.s.SolrTestCaseJ4 ###Ending testProxyUnknownRemote
   [junit4]   2> 1410733 WARN  (jetty-launcher-1930-thread-1-SendThread(127.0.0.1:55939)) [n:127.0.0.1:57908_solr    ] o.a.z.ClientCnxn Unable to reconnect to ZooKeeper service, session 0x15ee23f2e700006 has expired
   [junit4]   2> 1410736 WARN  (jetty-launcher-1930-thread-1-SendThread(127.0.0.1:55939)) [n:127.0.0.1:57908_solr    ] o.a.z.ClientCnxn Unable to reconnect to ZooKeeper service, session 0x15ee23f2e700007 has expired
   [junit4]   2> 1410739 WARN  (zkCallback-1943-thread-7-processing-n:127.0.0.1:57908_solr) [n:127.0.0.1:57908_solr    ] o.a.s.c.c.ConnectionManager Watcher org.apache.solr.common.cloud.ConnectionManager@774efbc9 name: ZooKeeperConnection Watcher:127.0.0.1:55939/solr got event WatchedEvent state:Expired type:None path:null path: null type: None
   [junit4]   2> 1410740 WARN  (zkCallback-1943-thread-7-processing-n:127.0.0.1:57908_solr) [n:127.0.0.1:57908_solr    ] o.a.s.c.c.ConnectionManager Our previous ZooKeeper session was expired. Attempting to reconnect to recover relationship with ZooKeeper...
   [junit4]   2> 1410740 INFO  (zkCallback-1943-thread-7-processing-n:127.0.0.1:57908_solr) [n:127.0.0.1:57908_solr    ] o.a.s.c.TransientSolrCoreCacheDefault Allocating transient cache for 2147483647 transient cores
   [junit4]   2> 1410741 WARN  (zkCallback-1943-thread-7-processing-n:127.0.0.1:57908_solr) [n:127.0.0.1:57908_solr    ] o.a.s.c.c.DefaultConnectionStrategy Connection expired - starting a new one...
   [junit4]   2> 1410739 WARN  (jetty-launcher-1930-thread-2-SendThread(127.0.0.1:55939)) [n:127.0.0.1:36381_solr    ] o.a.z.ClientCnxn Unable to reconnect to ZooKeeper service, session 0x15ee23f2e700008 has expired
   [junit4]   2> 1410750 INFO  (zkCallback-1943-thread-7-processing-n:127.0.0.1:57908_solr) [n:127.0.0.1:57908_solr    ] o.a.s.c.c.ConnectionManager Connection with ZooKeeper reestablished.
   [junit4]   2> 1410750 INFO  (zkCallback-1938-thread-1-processing-n:127.0.0.1:36381_solr) [n:127.0.0.1:36381_solr    ] o.a.s.c.c.ZkStateReader Updated live nodes from ZooKeeper... (2) -> (1)
   [junit4]   2> 1410752 INFO  (zkCallback-1943-thread-7-processing-n:127.0.0.1:57908_solr) [n:127.0.0.1:57908_solr    ] o.a.s.c.ZkController ZooKeeper session re-connected ... refreshing core states after session expiration.
   [junit4]   2> 1410767 INFO  (zkCallback-1943-thread-7-processing-n:127.0.0.1:57908_solr) [n:127.0.0.1:57908_solr    ] o.a.s.c.c.ZkStateReader Updated live nodes from ZooKeeper... (2) -> (1)
   [junit4]   2> 1410774 INFO  (TEST-TestSolrCloudWithSecureImpersonation.testProxyNullProxyUser-seed#[AB163D8AFF236488]) [    ] o.a.s.SolrTestCaseJ4 ###Starting testProxyNullProxyUser
   [junit4]   2> 1410775 INFO  (qtp1495329247-11401) [    ] o.a.s.s.SolrDispatchFilter Error authenticating
   [junit4]   2> java.lang.IllegalArgumentException: userName is NULL, empty or contains a '&'
   [junit4]   2> 	at org.apache.hadoop.security.authentication.util.AuthToken.checkForIllegalArgument(AuthToken.java:87)
   [junit4]   2> 	at org.apache.hadoop.security.authentication.util.AuthToken.<init>(AuthToken.java:70)
   [junit4]   2> 	at org.apache.hadoop.security.authentication.server.AuthenticationToken.<init>(AuthenticationToken.java:58)
   [junit4]   2> 	at org.apache.solr.security.HttpParamDelegationTokenPlugin$HttpParamDelegationTokenAuthenticationHandler$HttpParamAuthenticationHandler.authenticate(HttpParamDelegationTokenPlugin.java:213)
   [junit4]   2> 	at org.apache.hadoop.security.token.delegation.web.DelegationTokenAuthenticationHandler.authenticate(DelegationTokenAuthenticationHandler.java:348)
   [junit4]   2> 	at org.apache.solr.security.RequestContinuesRecorderAuthenticationHandler.authenticate(RequestContinuesRecorderAuthenticationHandler.java:69)
   [junit4]   2> 	at org.apache.hadoop.security.authentication.server.AuthenticationFilter.doFilter(AuthenticationFilter.java:518)
   [junit4]   2> 	at org.apache.solr.security.DelegationTokenKerberosFilter.doFilter(DelegationTokenKerberosFilter.java:134)
   [junit4]   2> 	at org.apache.solr.security.HttpParamDelegationTokenPlugin$HttpParamToRequestFilter.doFilter(HttpParamDelegationTokenPlugin.java:245)
   [junit4]   2> 	at org.apache.solr.security.KerberosPlugin.doAuthenticate(KerberosPlugin.java:243)
   [junit4]   2> 	at org.apache.solr.servlet.SolrDispatchFilter.authenticateRequest(SolrDispatchFilter.java:451)
   [junit4]   2> 	at org.apache.solr.servlet.SolrDispatchFilter.doFilter(SolrDispatchFilter.java:347)
   [junit4]   2> 	at org.apache.solr.servlet.SolrDispatchFilter.doFilter(SolrDispatchFilter.java:326)
   [junit4]   2> 	at org.eclipse.jetty.servlet.ServletHandler$CachedChain.doFilter(ServletHandler.java:1759)
   [junit4]   2> 	at org.apache.solr.client.solrj.embedded.JettySolrRunner$DebugFilter.doFilter(JettySolrRunner.java:139)
   [junit4]   2> 	at org.eclipse.jetty.servlet.ServletHandler$CachedChain.doFilter(ServletHandler.java:1759)
   [junit4]   2> 	at org.eclipse.jetty.servlet.ServletHandler.doHandle(ServletHandler.java:582)
   [junit4]   2> 	at org.eclipse.jetty.server.session.SessionHandler.doHandle(SessionHandler.java:224)
   [junit4]   2> 	at org.eclipse.jetty.server.handler.ContextHandler.doHandle(ContextHandler.java:1180)
   [junit4]   2> 	at org.eclipse.jetty.servlet.ServletHandler.doScope(ServletHandler.java:512)
   [junit4]   2> 	at org.eclipse.jetty.server.session.SessionHandler.doScope(SessionHandler.java:185)
   [junit4]   2> 	at org.eclipse.jetty.server.handler.ContextHandler.doScope(ContextHandler.java:1112)
   [junit4]   2> 	at org.eclipse.jetty.server.handler.ScopedHandler.handle(ScopedHandler.java:141)
   [junit4]   2> 	at org.eclipse.jetty.server.handler.gzip.GzipHandler.handle(GzipHandler.java:493)
   [junit4]   2> 	at org.eclipse.jetty.server.handler.HandlerWrapper.handle(HandlerWrapper.java:134)
   [junit4]   2> 	at org.eclipse.jetty.server.Server.handle(Server.java:534)
   [junit4]   2> 	at org.eclipse.jetty.server.HttpChannel.handle(HttpChannel.java:320)
   [junit4]   2> 	at org.eclipse.jetty.server.HttpConnection.onFillable(HttpConnection.java:251)
   [junit4]   2> 	at org.eclipse.jetty.io.AbstractConnection$ReadCallback.succeeded(AbstractConnection.java:283)
   [junit4]   2> 	at org.eclipse.jetty.io.FillInterest.fillable(FillInterest.java:108)
   [junit4]   2> 	at org.eclipse.jetty.io.ssl.SslConnection.onFillable(SslConnection.java:251)
   [junit4]   2> 	at org.eclipse.jetty.io.AbstractConnection$ReadCallback.succeeded(AbstractConnection.java:283)
   [junit4]   2> 	at org.eclipse.jetty.io.FillInterest.fillable(FillInterest.java:108)
   [junit4]   2> 	at org.eclipse.jetty.io.SelectChannelEndPoint$2.run(SelectChannelEndPoint.java:93)
   [junit4]   2> 	at org.eclipse.jetty.util.thread.strategy.ExecuteProduceConsume.executeProduceConsume(ExecuteProduceConsume.java:303)
   [junit4]   2> 	at org.eclipse.jetty.util.thread.strategy.ExecuteProduceConsume.produceConsume(ExecuteProduceConsume.java:148)
   [junit4]   2> 	at org.eclipse.jetty.util.thread.strategy.ExecuteProduceConsume.run(ExecuteProduceConsume.java:136)
   [junit4]   2> 	at org.eclipse.jetty.util.thread.QueuedThreadPool.runJob(QueuedThreadPool.java:671)
   [junit4]   2> 	at org.eclipse.jetty.util.thread.QueuedThreadPool$2.run(QueuedThreadPool.java:589)
   [junit4]   2> 	at java.lang.Thread.run(Thread.java:748)
   [junit4]   2> 1410775 WARN  (qtp1495329247-11401) [    ] o.e.j.s.ServletHandler /solr/admin/collections
   [junit4]   2> org.apache.solr.common.SolrException: Error during request authentication, 
   [junit4]   2> 	at org.apache.solr.servlet.SolrDispatchFilter.authenticateRequest(SolrDispatchFilter.java:457)
   [junit4]   2> 	at org.apache.solr.servlet.SolrDispatchFilter.doFilter(SolrDispatchFilter.java:347)
   [junit4]   2> 	at org.apache.solr.servlet.SolrDispatchFilter.doFilter(SolrDispatchFilter.java:326)
   [junit4]   2> 	at org.eclipse.jetty.servlet.ServletHandler$CachedChain.doFilter(ServletHandler.java:1759)
   [junit4]   2> 	at org.apache.solr.client.solrj.embedded.JettySolrRunner$DebugFilter.doFilter(JettySolrRunner.java:139)
   [junit4]   2> 	at org.eclipse.jetty.servlet.ServletHandler$CachedChain.doFilter(ServletHandler.java:1759)
   [junit4]   2> 	at org.eclipse.jetty.servlet.ServletHandler.doHandle(ServletHandler.java:582)
   [junit4]   2> 	at org.eclipse.jetty.server.session.SessionHandler.doHandle(SessionHandler.java:224)
   [junit4]   2> 	at org.eclipse.jetty.server.handler.ContextHandler.doHandle(ContextHandler.java:1180)
   [junit4]   2> 	at org.eclipse.jetty.servlet.ServletHandler.doScope(ServletHandler.java:512)
   [junit4]   2> 	at org.eclipse.jetty.server.session.SessionHandler.doScope(SessionHandler.java:185)
   [junit4]   2> 	at org.eclipse.jetty.server.handler.ContextHandler.doScope(ContextHandler.java:1112)
   [junit4]   2> 	at org.eclipse.jetty.server.handler.ScopedHandler.handle(ScopedHandler.java:141)
   [junit4]   2> 	at org.eclipse.jetty.server.handler.gzip.GzipHandler.handle(GzipHandler.java:493)
   [junit4]   2> 	at org.eclipse.jetty.server.handler.HandlerWrapper.handle(HandlerWrapper.java:134)
   [junit4]   2> 	at org.eclipse.jetty.server.Server.handle(Server.java:534)
   [junit4]   2> 	at org.eclipse.jetty.server.HttpChannel.handle(HttpChannel.java:320)
   [junit4]   2> 	at org.eclipse.jetty.server.HttpConnection.onFillable(HttpConnection.java:251)
   [junit4]   2> 	at org.eclipse.jetty.io.AbstractConnection$ReadCallback.succeeded(AbstractConnection.java:283)
   [junit4]   2> 	at org.eclipse.jetty.io.FillInterest.fillable(FillInterest.java:108)
   [junit4]   2> 	at org.eclipse.jetty.io.ssl.SslConnection.onFillable(SslConnection.java:251)
   [junit4]   2> 	at org.eclipse.jetty.io.AbstractConnection$ReadCallback.succeeded(AbstractConnection.java:283)
   [junit4]   2> 	at org.eclipse.jetty.io.FillInterest.fillable(FillInterest.java:108)
   [junit4]   2> 	at org.eclipse.jetty.io.SelectChannelEndPoint$2.run(SelectChannelEndPoint.java:93)
   [junit4]   2> 	at org.eclipse.jetty.util.thread.strategy.ExecuteProduceConsume.executeProduceConsume(ExecuteProduceConsume.java:303)
   [junit4]   2> 	at org.eclipse.jetty.util.thread.strategy.ExecuteProduceConsume.produceConsume(ExecuteProduceConsume.java:148)
   [junit4]   2> 	at org.eclipse.jetty.util.thread.strategy.ExecuteProduceConsume.run(ExecuteProduceConsume.java:136)
   [junit4]   2> 	at org.eclipse.jetty.util.thread.QueuedThreadPool.runJob(QueuedThreadPool.java:671)
   [junit4]   2> 	at org.eclipse.jetty.util.thread.QueuedThreadPool$2.run(QueuedThreadPool.java:589)
   [junit4]   2> 	at java.lang.Thread.run(Thread.java:748)
   [junit4]   2> Caused by: java.lang.IllegalArgumentException: userName is NULL, empty or contains a '&'
   [junit4]   2> 	at org.apache.hadoop.security.authentication.util.AuthToken.checkForIllegalArgument(AuthToken.java:87)
   [junit4]   2> 	at org.apache.hadoop.security.authentication.util.AuthToken.<init>(AuthToken.java:70)
   [junit4]   2> 	at org.apache.hadoop.security.authentication.server.AuthenticationToken.<init>(AuthenticationToken.java:58)
   [junit4]   2> 	at org.apache.solr.security.HttpParamDelegationTokenPlugin$HttpParamDelegationTokenAuthenticationHandler$HttpParamAuthenticationHandler.authenticate(HttpParamDelegationTokenPlugin.java:213)
   [junit4]   2> 	at org.apache.hadoop.security.token.delegation.web.DelegationTokenAuthenticationHandler.authenticate(DelegationTokenAuthenticationHandler.java:348)
   [junit4]   2> 	at org.apache.solr.security.RequestContinuesRecorderAuthenticationHandler.authenticate(RequestContinuesRecorderAuthenticationHandler.java:69)
   [junit4]   2> 	at org.apache.hadoop.security.authentication.server.AuthenticationFilter.doFilter(AuthenticationFilter.java:518)
   [junit4]   2> 	at org.apache.solr.security.DelegationTokenKerberosFilter.doFilter(DelegationTokenKerberosFilter.java:134)
   [junit4]   2> 	at org.apache.solr.security.HttpParamDelegationTokenPlugin$HttpParamToRequestFilter.doFilter(HttpParamDelegationTokenPlugin.java:245)
   [junit4]   2> 	at org.apache.solr.security.KerberosPlugin.doAuthenticate(KerberosPlugin.java:243)
   [junit4]   2> 	at org.apache.solr.servlet.SolrDispatchFilter.authenticateRequest(SolrDispatchFilter.java:451)
   [junit4]   2> 	... 29 more
   [junit4]   2> 1410778 INFO  (TEST-TestSolrCloudWithSecureImpersonation.testProxyNullProxyUser-seed#[AB163D8AFF236488]) [    ] o.a.s.SolrTestCaseJ4 ###Ending testProxyNullProxyUser
   [junit4]   2> 1410809 INFO  (zkCallback-1943-thread-7-processing-n:127.0.0.1:57908_solr) [n:127.0.0.1:57908_solr    ] o.a.s.c.ZkController Register node as live in ZooKeeper:/live_nodes/127.0.0.1:57908_solr
   [junit4]   2> 1410814 INFO  (zkCallback-1943-thread-7-processing-n:127.0.0.1:57908_solr) [n:127.0.0.1:57908_solr    ] o.a.s.c.c.DefaultConnectionStrategy Reconnected to ZooKeeper
   [junit4]   2> 1410814 INFO  (zkCallback-1943-thread-7-processing-n:127.0.0.1:57908_solr) [n:127.0.0.1:57908_solr    ] o.a.s.c.c.ConnectionManager Connected:true
   [junit4]   2> 1410814 INFO  (zkCallback-1943-thread-5-processing-n:127.0.0.1:57908_solr) [n:127.0.0.1:57908_solr    ] o.a.s.c.c.ZkStateReader Updated live nodes from ZooKeeper... (1) -> (2)
   [junit4]   2> 1410818 INFO  (zkCallback-1938-thread-1-processing-n:127.0.0.1:36381_solr) [n:127.0.0.1:36381_solr    ] o.a.s.c.c.ZkStateReader Updated live nodes from ZooKeeper... (1) -> (2)
   [junit4]   2> 1410838 INFO  (TEST-TestSolrCloudWithSecureImpersonation.testForwarding-seed#[AB163D8AFF236488]) [    ] o.a.s.SolrTestCaseJ4 ###Starting testForwarding
   [junit4]   2> 1411893 INFO  (TEST-TestSolrCloudWithSecureImpersonation.testForwarding-seed#[AB163D8AFF236488]) [    ] o.a.s.c.c.ZkStateReader Updated live nodes from ZooKeeper... (0) -> (2)
   [junit4]   2> 1411894 INFO  (TEST-TestSolrCloudWithSecureImpersonation.testForwarding-seed#[AB163D8AFF236488]) [    ] o.a.s.c.s.i.ZkClientClusterStateProvider Cluster at 127.0.0.1:55939/solr ready
   [junit4]   2> 1411958 INFO  (qtp1606336230-11421) [n:127.0.0.1:57908_solr    ] o.a.s.h.a.CollectionsHandler Invoked Collection Action :create with params pullReplicas=0&replicationFactor=1&collection.configName=conf1&maxShardsPerNode=1&name=forwardingCollection&nrtReplicas=1&action=CREATE&numShards=1&tlogReplicas=0&wt=javabin&version=2 and sendToOCPQueue=true
   [junit4]   2> 1411974 INFO  (OverseerThreadFactory-3557-thread-1-processing-n:127.0.0.1:36381_solr) [n:127.0.0.1:36381_solr    ] o.a.s.c.CreateCollectionCmd Create collection forwardingCollection
   [junit4]   2> 1412095 INFO  (OverseerStateUpdate-98765002838638596-127.0.0.1:36381_solr-n_0000000000) [n:127.0.0.1:36381_solr    ] o.a.s.c.o.SliceMutator createReplica() {
   [junit4]   2>   "operation":"ADDREPLICA",
   [junit4]   2>   "collection":"forwardingCollection",
   [junit4]   2>   "shard":"shard1",
   [junit4]   2>   "core":"forwardingCollection_shard1_replica_n1",
   [junit4]   2>   "state":"down",
   [junit4]   2>   "base_url":"https://127.0.0.1:57908/solr",
   [junit4]   2>   "type":"NRT"} 
   [junit4]   2> 1412319 INFO  (qtp1606336230-11417) [n:127.0.0.1:57908_solr    ] o.a.s.h.a.CoreAdminOperation core create command qt=/admin/cores&coreNodeName=core_node2&collection.configName=conf1&newCollection=true&name=forwardingCollection_shard1_replica_n1&action=CREATE&numShards=1&collection=forwardingCollection&shard=shard1&wt=javabin&version=2&replicaType=NRT
   [junit4]   2> 1412441 INFO  (zkCallback-1943-thread-5-processing-n:127.0.0.1:57908_solr) [n:127.0.0.1:57908_solr    ] o.a.s.c.c.ZkStateReader A cluster state change: [WatchedEvent state:SyncConnected type:NodeDataChanged path:/collections/forwardingCollection/state.json] for collection [forwardingCollection] has occurred - updating... (live nodes size: [2])
   [junit4]   2> 1412441 INFO  (zkCallback-1943-thread-7-processing-n:127.0.0.1:57908_solr) [n:127.0.0.1:57908_solr    ] o.a.s.c.c.ZkStateReader A cluster state change: [WatchedEvent state:SyncConnected type:NodeDataChanged path:/collections/forwardingCollection/state.json] for collection [forwardingCollection] has occurred - updating... (live nodes size: [2])
   [junit4]   2> 1413360 INFO  (qtp1606336230-11417) [n:127.0.0.1:57908_solr c:forwardingCollection s:shard1 r:core_node2 x:forwardingCollection_shard1_replica_n1] o.a.s.c.SolrConfig Using Lucene MatchVersion: 7.1.0
   [junit4]   2> 1413411 INFO  (qtp1606336230-11417) [n:127.0.0.1:57908_solr c:forwardingCollection s:shard1 r:core_node2 x:forwardingCollection_shard1_replica_n1] o.a.s.s.IndexSchema [forwardingCollection_shard1_replica_n1] Schema name=test
   [junit4]   2> 1413516 INFO  (qtp1606336230-11417) [n:127.0.0.1:57908_solr c:forwardingCollection s:shard1 r:core_node2 x:forwardingCollection_shard1_replica_n1] o.a.s.s.IndexSchema Loaded schema test/1.0 with uniqueid field id
   [junit4]   2> 1413560 INFO  (qtp1606336230-11417) [n:127.0.0.1:57908_solr c:forwardingCollection s:shard1 r:core_node2 x:forwardingCollection_shard1_replica_n1] o.a.s.c.CoreContainer Creating SolrCore 'forwardingCollection_shard1_replica_n1' using configuration from collection forwardingCollection, trusted=true
   [junit4]   2> 1413560 INFO  (qtp1606336230-11417) [n:127.0.0.1:57908_solr c:forwardingCollection s:shard1 r:core_node2 x:forwardingCollection_shard1_replica_n1] o.a.s.m.r.SolrJmxReporter JMX monitoring for 'solr_57908.solr.core.forwardingCollection.shard1.replica_n1' (registry 'solr.core.forwardingCollection.shard1.replica_n1') enabled at server: com.sun.jmx.mbeanserver.JmxMBeanServer@1dcaea79
   [junit4]   2> 1413560 INFO  (qtp1606336230-11417) [n:127.0.0.1:57908_solr c:forwardingCollection s:shard1 r:core_node2 x:forwardingCollection_shard1_replica_n1] o.a.s.c.SolrCore solr.RecoveryStrategy.Builder
   [junit4]   2> 1413560 INFO  (qtp1606336230-11417) [n:127.0.0.1:57908_solr c:forwardingCollection s:shard1 r:core_node2 x:forwardingCollection_shard1_replica_n1] o.a.s.c.SolrCore [[forwardingCollection_shard1_replica_n1] ] Opening new SolrCore at [/export/home/jenkins/workspace/Lucene-Solr-7.x-Solaris/solr/build/solr-core/test/J0/temp/solr.cloud.TestSolrCloudWithSecureImpersonation_AB163D8AFF236488-001/tempDir-001/node1/forwardingCollection_shard1_replica_n1], dataDir=[/export/home/jenkins/workspace/Lucene-Solr-7.x-Solaris/solr/build/solr-core/test/J0/temp/solr.cloud.TestSolrCloudWithSecureImpersonation_AB163D8AFF236488-001/tempDir-001/node1/./forwardingCollection_shard1_replica_n1/data/]
   [junit4]   2> 1413565 INFO  (qtp1606336230-11417) [n:127.0.0.1:57908_solr c:forwardingCollection s:shard1 r:core_node2 x:forwardingCollection_shard1_replica_n1] o.a.s.u.RandomMergePolicy RandomMergePolicy wrapping class org.apache.lucene.index.TieredMergePolicy: [TieredMergePolicy: maxMergeAtOnce=15, maxMergeAtOnceExplicit=49, maxMergedSegmentMB=31.5283203125, floorSegmentMB=1.083984375, forceMergeDeletesPctAllowed=12.987634221022578, segmentsPerTier=20.0, maxCFSSegmentSizeMB=8.796093022207999E12, noCFSRatio=1.0
   [junit4]   2> 1413686 INFO  (qtp1606336230-11417) [n:127.0.0.1:57908_solr c:forwardingCollection s:shard1 r:core_node2 x:forwardingCollection_shard1_replica_n1] o.a.s.u.UpdateHandler Using UpdateLog implementation: org.apache.solr.update.UpdateLog
   [junit4]   2> 1413686 INFO  (qtp1606336230-11417) [n:127.0.0.1:57908_solr c:forwardingCollection s:shard1 r:core_node2 x:forwardingCollection_shard1_replica_n1] o.a.s.u.UpdateLog Initializing UpdateLog: dataDir= defaultSyncLevel=FLUSH numRecordsToKeep=100 maxNumLogsToKeep=10 numVersionBuckets=65536
   [junit4]   2> 1413688 INFO  (qtp1606336230-11417) [n:127.0.0.1:57908_solr c:forwardingCollection s:shard1 r:core_node2 x:forwardingCollection_shard1_replica_n1] o.a.s.u.CommitTracker Hard AutoCommit: disabled
   [junit4]   2> 1413688 INFO  (qtp1606336230-11417) [n:127.0.0.1:57908_solr c:forwardingCollection s:shard1 r:core_node2 x:forwardingCollection_shard1_replica_n1] o.a.s.u.CommitTracker Soft AutoCommit: disabled
   [junit4]   2> 1413689 INFO  (qtp1606336230-11417) [n:127.0.0.1:57908_solr c:forwardingCollection s:shard1 r:core_node2 x:forwardingCollection_shard1_replica_n1] o.a.s.u.RandomMergePolicy RandomMergePolicy wrapping class org.apache.lucene.index.MockRandomMergePolicy: org.apache.lucene.index.MockRandomMergePolicy@d0bb5c8
   [junit4]   2> 1413690 INFO  (qtp1606336230-11417) [n:127.0.0.1:57908_solr c:forwardingCollection s:shard1 r:core_node2 x:forwardingCollection_shard1_replica_n1] o.a.s.s.SolrIndexSearcher Opening [Searcher@4cbe9e34[forwardingCollection_shard1_replica_n1] main]
   [junit4]   2> 1413709 INFO  (qtp1606336230-11417) [n:127.0.0.1:57908_solr c:forwardingCollection s:shard1 r:core_node2 x:forwardingCollection_shard1_replica_n1] o.a.s.h.c.SpellCheckComponent Initializing spell checkers
   [junit4]   2> 1413717 INFO  (qtp1606336230-11417) [n:127.0.0.1:57908_solr c:forwardingCollection s:shard1 r:core_node2 x:forwardingCollection_shard1_replica_n1] o.a.s.s.DirectSolrSpellChecker init: {name=direct,classname=DirectSolrSpellChecker,field=lowerfilt,minQueryLength=3}
   [junit4]   2> 1413788 INFO  (qtp1606336230-11417) [n:127.0.0.1:57908_solr c:forwardingCollection s:shard1 r:core_node2 x:forwardingCollection_shard1_replica_n1] o.a.s.h.ReplicationHandler Commits will be reserved for 10000ms.
   [junit4]   2> 1413788 INFO  (searcherExecutor-3562-thread-1-processing-n:127.0.0.1:57908_solr x:forwardingCollection_shard1_replica_n1 s:shard1 c:forwardingCollection r:core_node2) [n:127.0.0.1:57908_solr c:forwardingCollection s:shard1 r:core_node2 x:forwardingCollection_shard1_replica_n1] o.a.s.h.c.SpellCheckComponent Loading spell index for spellchecker: default
   [junit4]   2> 1413788 INFO  (qtp1606336230-11417) [n:127.0.0.1:57908_solr c:forwardingCollection s:shard1 r:core_node2 x:forwardingCollection_shard1_replica_n1] o.a.s.u.UpdateLog Could not find max version in index or recent updates, using new clock 1580240077716455424
   [junit4]   2> 1413789 INFO  (searcherExecutor-3562-thread-1-processing-n:127.0.0.1:57908_solr x:forwardingCollection_shard1_replica_n1 s:shard1 c:forwardingCollection r:core_node2) [n:127.0.0.1:57908_solr c:forwardingCollection s:shard1 r:core_node2 x:forwardingCollection_shard1_replica_n1] o.a.s.h.c.SpellCheckComponent Loading spell index for spellchecker: direct
   [junit4]   2> 1413789 INFO  (searcherExecutor-3562-thread-1-processing-n:127.0.0.1:57908_solr x:forwardingCollection_shard1_replica_n1 s:shard1 c:forwardingCollection r:core_node2) [n:127.0.0.1:57908_solr c:forwardingCollection s:shard1 r:core_node2 x:forwardingCollection_shard1_replica_n1] o.a.s.h.c.SpellCheckComponent Loading spell index for spellchecker: wordbreak
   [junit4]   2> 1413789 INFO  (searcherExecutor-3562-thread-1-processing-n:127.0.0.1:57908_solr x:forwardingCollection_shard1_replica_n1 s:shard1 c:forwardingCollection r:core_node2) [n:127.0.0.1:57908_solr c:forwardingCollection s:shard1 r:core_node2 x:forwardingCollection_shard1_replica_n1] o.a.s.h.c.SpellCheckComponent Loading spell index for spellchecker: multipleFields
   [junit4]   2> 1413789 INFO  (searcherExecutor-3562-thread-1-processing-n:127.0.0.1:57908_solr x:forwardingCollection_shard1_replica_n1 s:shard1 c:forwardingCollection r:core_node2) [n:127.0.0.1:57908_solr c:forwardingCollection s:shard1 r:core_node2 x:forwardingCollection_shard1_replica_n1] o.a.s.h.c.SpellCheckComponent Loading spell index for spellchecker: jarowinkler
   [junit4]   2> 1413790 INFO  (searcherExecutor-3562-thread-1-processing-n:127.0.0.1:57908_solr x:forwardingCollection_shard1_replica_n1 s:shard1 c:forwardingCollection r:core_node2) [n:127.0.0.1:57908_solr c:forwardingCollection s:shard1 r:core_node2 x:forwardingCollection_shard1_replica_n1] o.a.s.h.c.SpellCheckComponent Loading spell index for spellchecker: external
   [junit4]   2> 1413803 INFO  (qtp1606336230-11417) [n:127.0.0.1:57908_solr c:forwardingCollection s:shard1 r:core_node2 x:forwardingCollection_shard1_replica_n1] o.a.s.c.ShardLeaderElectionContext Enough replicas found to continue.
   [junit4]   2> 1413803 INFO  (qtp1606336230-11417) [n:127.0.0.1:57908_solr c:forwardingCollection s:shard1 r:core_node2 x:forwardingCollection_shard1_replica_n1] o.a.s.c.ShardLeaderElectionContext I may be the new leader - try and sync
   [junit4]   2> 1413803 INFO  (qtp1606336230-11417) [n:127.0.0.1:57908_solr c:forwardingCollection s:shard1 r:core_node2 x:forwardingCollection_shard1_replica_n1] o.a.s.c.SyncStrategy Sync replicas to https://127.0.0.1:57908/solr/forwardingCollection_shard1_replica_n1/
   [junit4]   2> 1413803 INFO  (qtp1606336230-11417) [n:127.0.0.1:57908_solr c:forwardingCollection s:shard1 r:core_node2 x:forwardingCollection_shard1_replica_n1] o.a.s.c.SyncStrategy Sync Success - now sync replicas to me
   [junit4]   2> 1413803 INFO  (qtp1606336230-11417) [n:127.0.0.1:57908_solr c:forwardingCollection s:shard1 r:core_node2 x:forwardingCollection_shard1_replica_n1] o.a.s.c.SyncStrategy https://127.0.0.1:57908/solr/forwardingCollection_shard1_replica_n1/ has no replicas
   [junit4]   2> 1413803 INFO  (qtp1606336230-11417) [n:127.0.0.1:57908_solr c:forwardingCollection s:shard1 r:core_node2 x:forwardingCollection_shard1_replica_n1] o.a.s.c.ShardLeaderElectionContext Found all replicas participating in election, clear LIR
   [junit4]   2> 1413804 INFO  (searcherExecutor-3562-thread-1-processing-n:127.0.0.1:57908_solr x:forwardingCollection_shard1_replica_n1 s:shard1 c:forwardingCollection r:core_node2) [n:127.0.0.1:57908_solr c:forwardingCollection s:shard1 r:core_node2 x:forwardingCollection_shard1_replica_n1] o.a.s.h.c.SpellCheckComponent Loading spell index for spellchecker: freq
   [junit4]   2> 1413813 INFO  (qtp1606336230-11417) [n:127.0.0.1:57908_solr c:forwardingCollection s:shard1 r:core_node2 x:forwardingCollection_shard1_replica_n1] o.a.s.c.ShardLeaderElectionContext I am the new leader: https://127.0.0.1:57908/solr/forwardingCollection_shard1_replica_n1/ shard1
   [junit4]   2> 1413814 INFO  (searcherExecutor-3562-thread-1-processing-n:127.0.0.1:57908_solr x:forwardingCollection_shard1_replica_n1 s:shard1 c:forwardingCollection r:core_node2) [n:127.0.0.1:57908_solr c:forwardingCollection s:shard1 r:core_node2 x:forwardingCollection_shard1_replica_n1] o.a.s.h.c.SpellCheckComponent Loading spell index for spellchecker: fqcn
   [junit4]   2> 1413824 INFO  (searcherExecutor-3562-thread-1-processing-n:127.0.0.1:57908_solr x:forwardingCollection_shard1_replica_n1 s:shard1 c:forwardingCollection r:core_node2) [n:127.0.0.1:57908_solr c:forwardingCollection s:shard1 r:core_node2 x:forwardingCollection_shard1_replica_n1] o.a.s.h.c.SpellCheckComponent Loading spell index for spellchecker: perDict
   [junit4]   2> 1413825 INFO  (searcherExecutor-3562-thread-1-processing-n:127.0.0.1:57908_solr x:forwardingCollection_shard1_replica_n1 s:shard1 c:forwardingCollection r:core_node2) [n:127.0.0.1:57908_solr c:forwardingCollection s:shard1 r:core_node2 x:forwardingCollection_shard1_replica_n1] o.a.s.c.SolrCore [forwardingCollection_shard1_replica_n1] Registered new searcher Searcher@4cbe9e34[forwardingCollection_shard1_replica_n1] main{ExitableDirectoryReader(UninvertingDirectoryReader())}
   [junit4]   2> 1413943 INFO  (zkCallback-1943-thread-7-processing-n:127.0.0.1:57908_solr) [n:127.0.0.1:57908_solr    ] o.a.s.c.c.ZkStateReader A cluster state change: [WatchedEvent state:SyncConnected type:NodeDataChanged path:/collections/forwardingCollection/state.json] for collection [forwardingCollection] has occurred - updating... (live nodes size: [2])
   [junit4]   2> 1413943 INFO  (zkCallback-1943-thread-5-processing-n:127.0.0.1:57908_solr) [n:127.0.0.1:57908_solr    ] o.a.s.c.c.ZkStateReader A cluster state change: [WatchedEvent state:SyncConnected type:NodeDataChanged path:/collections/forwardingCollection/state.json] for collection [forwardingCollection] has occurred - updating... (live nodes size: [2])
   [junit4]   2> 1413987 INFO  (qtp1606336230-11417) [n:127.0.0.1:57908_solr c:forwardingCollection s:shard1 r:core_node2 x:forwardingCollection_shard1_replica_n1] o.a.s.c.ZkController I am the leader, no recovery necessary
   [junit4]   2> 1414027 INFO  (qtp1606336230-11417) [n:127.0.0.1:57908_solr c:forwardingCollection s:shard1 r:core_node2 x:forwardingCollection_shard1_replica_n1] o.a.s.s.HttpSolrCall [admin] webapp=null path=/admin/cores params={qt=/admin/cores&coreNodeName=core_node2&collection.configName=conf1&newCollection=true&name=forwardingCollection_shard1_replica_n1&action=CREATE&numShards=1&collection=forwardingCollection&shard=shard1&wt=javabin&version=2&replicaType=NRT} status=0 QTime=1709
   [junit4]   2> 1414028 WARN  (httpShardExecutor-3551-thread-1-processing-n:127.0.0.1:36381_solr [https:////127.0.0.1:57908//solr] https:////127.0.0.1:57908//solr) [n:127.0.0.1:36381_solr    ] o.a.h.c.p.ResponseProcessCookies Invalid cookie header: "Set-Cookie: hadoop.auth="u=$&p=$&t=test&e=1507070374403&s=RduNdP0o2r0UedcMxXDpN6gLERc="; Path=/; Domain=127.0.0.1; Expires=Mar, 03-Tet-2017 22:39:34 GMT; Secure; HttpOnly". Invalid 'expires' attribute: Mar, 03-Tet-2017 22:39:34 GMT
   [junit4]   2> 1414072 INFO  (qtp1606336230-11421) [n:127.0.0.1:57908_solr    ] o.a.s.h.a.CollectionsHandler Wait for new collection to be active for at most 30 seconds. Check all shard replicas
   [junit4]   2> 1414184 INFO  (zkCallback-1943-thread-7-processing-n:127.0.0.1:57908_solr) [n:127.0.0.1:57908_solr    ] o.a.s.c.c.ZkStateReader A cluster state change: [WatchedEvent state:SyncConnected type:NodeDataChanged path:/collections/forwardingCollection/state.json] for collection [forwardingCollection] has occurred - updating... (live nodes size: [2])
   [junit4]   2> 1414184 INFO  (zkCallback-1943-thread-5-processing-n:127.0.0.1:57908_solr) [n:127.0.0.1:57908_solr    ] o.a.s.c.c.ZkStateReader A cluster state change: [WatchedEvent state:SyncConnected type:NodeDataChanged path:/collections/forwardingCollection/state.json] for collection [forwardingCollection] has occurred - updating... (live nodes size: [2])
   [junit4]   2> 1415074 INFO  (qtp1606336230-11421) [n:127.0.0.1:57908_solr    ] o.a.s.s.HttpSolrCall [admin] webapp=null path=/admin/collections params={pullReplicas=0&replicationFactor=1&collection.configName=conf1&maxShardsPerNode=1&name=forwardingCollection&nrtReplicas=1&action=CREATE&numShards=1&tlogReplicas=0&wt=javabin&version=2} status=0 QTime=3117
   [junit4]   2> 1415079 WARN  (TEST-TestSolrCloudWithSecureImpersonation.testForwarding-seed#[AB163D8AFF236488]) [    ] o.a.h.c.p.ResponseProcessCookies Invalid cookie header: "Set-Cookie: hadoop.auth="u=user&p=user&t=test&e=1507070374043&s=MEDWcQMvEH05UL4HJ4gaR+yjEII="; Path=/; Domain=127.0.0.1; Expires=Mar, 03-Tet-2017 22:39:34 GMT; Secure; HttpOnly". Invalid 'expires' attribute: Mar, 03-Tet-2017 22:39:34 GMT
   [junit4]   2> 1415079 INFO  (TEST-TestSolrCloudWithSecureImpersonation.testForwarding-seed#[AB163D8AFF236488]) [    ] o.a.s.c.AbstractDistribZkTestBase Wait for recoveries to finish - collection: forwardingCollection failOnTimeout:true timeout (sec):100
   [junit4]   2> 1415080 INFO  (TEST-TestSolrCloudWithSecureImpersonation.testForwarding-seed#[AB163D8AFF236488]) [    ] o.a.s.c.AbstractDistribZkTestBase Recoveries finished - collection: forwardingCollection
   [junit4]   2> 1415086 INFO  (qtp1495329247-11408) [n:127.0.0.1:36381_solr    ] o.a.s.c.TransientSolrCoreCacheDefault Allocating transient cache for 2147483647 transient cores
   [junit4]   2> 1415092 INFO  (qtp1606336230-11413) [n:127.0.0.1:57908_solr c:forwardingCollection s:shard1 r:core_node2 x:forwardingCollection_shard1_replica_n1] o.a.s.c.S.Request [forwardingCollection_shard1_replica_n1]  webapp=/solr path=/select params={q=*:*&wt=javabin&version=2} hits=0 status=0 QTime=0
   [junit4]   2> 1415093 WARN  (qtp1495329247-11408) [n:127.0.0.1:36381_solr    ] o.a.h.c.p.ResponseProcessCookies Invalid cookie header: "Set-Cookie: hadoop.auth="u=$&p=$&t=test&e=1507070377178&s=l+tljfZDt2b1Tzj/aHGze1n0dtQ="; Path=/; Domain=127.0.0.1; Expires=Mar, 03-Tet-2017 22:39:37 GMT; Secure; HttpOnly". Invalid 'expires' attribute: Mar, 03-Tet-2017 22:39:37 GMT
   [junit4]   2> 1415093 WARN  (TEST-TestSolrCloudWithSecureImpersonation.testForwarding-seed#[AB163D8AFF236488]) [    ] o.a.h.c.p.ResponseProcessCookies Invalid cookie header: "Set-Cookie: hadoop.auth="u=user&p=user&t=test&e=1507070377172&s=7b7QABcupuFpv7DWybQbZygxtGQ="; Path=/; Domain=127.0.0.1; Expires=Mar, 03-Tet-2017 22:39:37 GMT; Secure; HttpOnly". Invalid 'expires' attribute: Mar, 03-Tet-2017 22:39:37 GMT
   [junit4]   2> 1415093 WARN  (TEST-TestSolrCloudWithSecureImpersonation.testForwarding-seed#[AB163D8AFF236488]) [    ] o.a.h.c.p.ResponseProcessCookies Invalid cookie header: "Set-Cookie: hadoop.auth="u=$&p=$&t=test&e=1507070377178&s=l+tljfZDt2b1Tzj/aHGze1n0dtQ="; Path=/; Domain=127.0.0.1; Expires=Mar, 03-Tet-2017 22:39:37 GMT; Secure; HttpOnly". Invalid 'expires' attribute: Mar, 03-Tet-2017 22:39:37 GMT
   [junit4]   2> 1415099 INFO  (qtp1606336230-11410) [n:127.0.0.1:57908_solr c:forwardingCollection s:shard1 r:core_node2 x:forwardingCollection_shard1_replica_n1] o.a.s.c.S.Request [forwardingCollection_shard1_replica_n1]  webapp=/solr path=/select params={q=*:*&wt=javabin&version=2} hits=0 status=0 QTime=0
   [junit4]   2> 1415099 WARN  (TEST-TestSolrCloudWithSecureImpersonation.testForwarding-seed#[AB163D8AFF236488]) [    ] o.a.h.c.p.ResponseProcessCookies Invalid cookie header: "Set-Cookie: hadoop.auth="u=user&p=user&t=test&e=1507070377184&s=Cw+MuWOCF4eWG03I5fDsulhDzqQ="; Path=/; Domain=127.0.0.1; Expires=Mar, 03-Tet-2017 22:39:37 GMT; Secure; HttpOnly". Invalid 'expires' attribute: Mar, 03-Tet-2017 22:39:37 GMT
   [junit4]   2> 1415099 INFO  (TEST-TestSolrCloudWithSecureImpersonation.testForwarding-seed#[AB163D8AFF236488]) [    ] o.a.s.SolrTestCaseJ4 ###Ending testForwarding
   [junit4]   2> 1415102 INFO  (jetty-closer-1931-thread-2) [    ] o.e.j.s.AbstractConnector Stopped ServerConnector@5007a3fd{SSL,[ssl, http/1.1]}{127.0.0.1:0}
   [junit4]   2> 1415103 INFO  (jetty-closer-1931-thread-2) [    ] o.a.s.c.CoreContainer Shutting down CoreContainer instance=901143553
   [junit4]   2> 1415103 INFO  (jetty-closer-1931-thread-2) [    ] o.a.s.m.SolrMetricManager Closing metric reporters for registry=solr.node, tag=null
   [junit4]   2> 1415104 INFO  (jetty-closer-1931-thread-2) [    ] o.a.s.m.r.SolrJmxReporter Closing reporter [org.apache.solr.metrics.reporters.SolrJmxReporter@b5c3058: rootName = solr_57908, domain = solr.node, service url = null, agent id = null] for registry solr.node / com.codahale.metrics.MetricRegistry@14a2ace1
   [junit4]   2> 1415109 INFO  (jetty-closer-1931-thread-2) [    ] o.a.s.m.SolrMetricManager Closing metric reporters for registry=solr.jvm, tag=null
   [junit4]   2> 1415109 INFO  (jetty-closer-1931-thread-2) [    ] o.a.s.m.r.SolrJmxReporter Closing reporter [org.apache.solr.metrics.reporters.SolrJmxReporter@23f40230: rootName = solr_57908, domain = solr.jvm, service url = null, agent id = null] for registry solr.jvm / com.codahale.metrics.MetricRegistry@b5f7a43
   [junit4]   2> 1415113 INFO  (jetty-closer-1931-thread-2) [    ] o.a.s.m.SolrMetricManager Closing metric reporters for registry=solr.jetty, tag=null
   [junit4]   2> 1415113 INFO  (jetty-closer-1931-thread-2) [    ] o.a.s.m.r.SolrJmxReporter Closing reporter [org.apache.solr.metrics.reporters.SolrJmxReporter@5b3ae457: rootName = solr_57908, domain = solr.jetty, service url = null, agent id = null] for registry solr.jetty / com.codahale.metrics.MetricRegistry@100b8f2c
   [junit4]   2> 1415113 INFO  (jetty-closer-1931-thread-1) [    ] o.e.j.s.AbstractConnector Stopped ServerConnector@6afb11e6{SSL,[ssl, http/1.1]}{127.0.0.1:0}
   [junit4]   2> 1415114 INFO  (jetty-closer-1931-thread-1) [    ] o.a.s.c.CoreContainer Shutting down CoreContainer instance=1383475513
   [junit4]   2> 1415114 INFO  (jetty-closer-1931-thread-1) [    ] o.a.s.m.SolrMetricManager Closing metric reporters for registry=solr.node, tag=null
   [junit4]   2> 1415114 INFO  (jetty-closer-1931-thread-1) [    ] o.a.s.m.r.SolrJmxReporter Closing reporter [org.apache.solr.metrics.reporters.SolrJmxReporter@bd3dbd1: rootName = solr_36381, domain = solr.node, service url = null, agent id = null] for registry solr.node / com.codahale.metrics.MetricRegistry@3ea6b2b4
   [junit4]   2> 1415119 INFO  (jetty-closer-1931-thread-1) [    ] o.a.s.m.SolrMetricManager Closing metric reporters for registry=solr.jvm, tag=null
   [junit4]   2> 1415119 INFO  (jetty-closer-1931-thread-1) [    ] o.a.s.m.r.SolrJmxReporter Closing reporter [org.apache.solr.metrics.reporters.SolrJmxReporter@61287013: rootName = solr_36381, domain = solr.jvm, service url = null, agent id = null] for registry solr.jvm / com.codahale.metrics.MetricRegistry@b5f7a43
   [junit4]   2> 1415124 INFO  (jetty-closer-1931-thread-1) [    ] o.a.s.m.SolrMetricManager Closing metric reporters for registry=solr.jetty, tag=null
   [junit4]   2> 1415124 INFO  (jetty-closer-1931-thread-1) [    ] o.a.s.m.r.SolrJmxReporter Closing reporter [org.apache.solr.metrics.reporters.SolrJmxReporter@50fc2411: rootName = solr_36381, domain = solr.jetty, service url = null, agent id = null] for registry solr.jetty / com.codahale.metrics.MetricRegistry@100b8f2c
   [junit4]   2> 1415125 INFO  (jetty-closer-1931-thread-1) [    ] o.a.s.m.SolrMetricManager Closing metric reporters for registry=solr.cluster, tag=null
   [junit4]   2> 1415128 INFO  (jetty-closer-1931-thread-1) [    ] o.a.s.c.Overseer Overseer (id=98765002838638596-127.0.0.1:36381_solr-n_0000000000) closing
   [junit4]   2> 1415128 INFO  (OverseerStateUpdate-98765002838638596-127.0.0.1:36381_solr-n_0000000000) [n:127.0.0.1:36381_solr    ] o.a.s.c.Overseer Overseer Loop exiting : 127.0.0.1:36381_solr
   [junit4]   2> 1415132 INFO  (jetty-closer-1931-thread-2) [    ] o.a.s.m.SolrMetricManager Closing metric reporters for registry=solr.cluster, tag=null
   [junit4]   2> 1415134 INFO  (coreCloseExecutor-3568-thread-1) [n:127.0.0.1:57908_solr c:forwardingCollection s:shard1 r:core_node2 x:forwardingCollection_shard1_replica_n1] o.a.s.c.SolrCore [forwardingCollection_shard1_replica_n1]  CLOSING SolrCore org.apache.solr.core.SolrCore@3e81025d
   [junit4]   2> 1415135 INFO  (coreCloseExecutor-3568-thread-1) [n:127.0.0.1:57908_solr c:forwardingCollection s:shard1 r:core_node2 x:forwardingCollection_shard1_replica_n1] o.a.s.m.SolrMetricManager Closing metric reporters for registry=solr.core.forwardingCollection.shard1.replica_n1, tag=1048642141
   [junit4]   2> 1415135 INFO  (coreCloseExecutor-3568-thread-1) [n:127.0.0.1:57908_solr c:forwardingCollection s:shard1 r:core_node2 x:forwardingCollection_shard1_replica_n1] o.a.s.m.r.SolrJmxReporter Closing reporter [org.apache.solr.metrics.reporters.SolrJmxReporter@52ac86e8: rootName = solr_57908, domain = solr.core.forwardingCollection.shard1.replica_n1, service url = null, agent id = null] for registry solr.core.forwardingCollection.shard1.replica_n1 / com.codahale.metrics.MetricRegistry@2fcac903
   [junit4]   2> 1415142 ERROR (Thread[Thread-1901,5,TGRP-TestSolrCloudWithSecureImpersonation]) [n:127.0.0.1:36381_solr    ] o.a.h.s.t.d.AbstractDelegationTokenSecretManager ExpiredTokenRemover received java.lang.InterruptedException: sleep interrupted
   [junit4]   2> 1415144 INFO  (zkCallback-1943-thread-5-processing-n:127.0.0.1:57908_solr) [n:127.0.0.1:57908_solr    ] o.a.s.c.OverseerElectionContext I am going to be the leader 127.0.0.1:57908_solr
   [junit4]   2> 1415148 INFO  (zkCallback-1943-thread-7-processing-n:127.0.0.1:57908_solr) [n:127.0.0.1:57908_solr    ] o.a.s.c.c.ZkStateReader Updated live nodes from ZooKeeper... (2) -> (1)
   [junit4]   2> 1415150 INFO  (coreCloseExecutor-3568-thread-1) [n:127.0.0.1:57908_solr c:forwardingCollection s:shard1 r:core_node2 x:forwardingCollection_shard1_replica_n1] o.a.s.m.SolrMetricManager Closing metric reporters for registry=solr.collection.forwardingCollection.shard1.leader, tag=1048642141
   [junit4]   2> 1415152 WARN  (zkCallback-1943-thread-7-processing-n:127.0.0.1:57908_solr) [n:127.0.0.1:57908_solr    ] o.a.s.c.c.ZkStateReader ZooKeeper watch triggered, but Solr cannot talk to ZK: [KeeperErrorCode = Session expired for /live_nodes]
   [junit4]   2> 1415154 ERROR (Thread[Thread-1899,5,TGRP-TestSolrCloudWithSecureImpersonation]) [n:127.0.0.1:57908_solr    ] o.a.h.s.t.d.AbstractDelegationTokenSecretManager ExpiredTokenRemover received java.lang.InterruptedException: sleep interrupted
   [junit4]   2> 1415160 INFO  (jetty-closer-1931-thread-2) [    ] o.e.j.s.h.ContextHandler Stopped o.e.j.s.ServletContextHandler@1b4096e7{/solr,null,UNAVAILABLE}
   [junit4]   2> 1415161 INFO  (jetty-closer-1931-thread-1) [    ] o.e.j.s.h.ContextHandler Stopped o.e.j.s.ServletContextHandler@26a6d61{/solr,null,UNAVAILABLE}
   [junit4]   2> 1415164 ERROR (SUITE-TestSolrCloudWithSecureImpersonation-seed#[AB163D8AFF236488]-worker) [    ] o.a.z.s.ZooKeeperServer ZKShutdownHandler is not registered, so ZooKeeper server won't take any action on ERROR or SHUTDOWN server state changes
   [junit4]   2> 1415165 INFO  (SUITE-TestSolrCloudWithSecureImpersonation-seed#[AB163D8AFF236488]-worker) [    ] o.a.s.c.ZkTestServer connecting to 127.0.0.1:55939 55939
   [junit4]   2> 1417966 INFO  (Thread-1876) [    ] o.a.s.c.ZkTestServer connecting to 127.0.0.1:55939 55939
   [junit4]   2> 1417971 WARN  (Thread-1876) [    ] o.a.s.c.ZkTestServer Watch limit violations: 
   [junit4]   2> Maximum concurrent create/delete watches above limit:
   [junit4]   2> 
   [junit4]   2> 	4	/solr/aliases.json
   [junit4]   2> 	3	/solr/security.json
   [junit4]   2> 
   [junit4]   2> Maximum concurrent data watches above limit:
   [junit4]   2> 
   [junit4]   2> 	5	/solr/collections/forwardingCollection/state.json
   [junit4]   2> 	4	/solr/clusterstate.json
   [junit4]   2> 	4	/solr/clusterprops.json
   [junit4]   2> 	3	/solr/security/zkdtsm/ZKDTSMRoot/ZKDTSMKeyIdRoot
   [junit4]   2> 	2	/solr/security/zkdtsm/ZKDTSMRoot/ZKDTSMMasterKeyRoot/DK_3
   [junit4]   2> 	2	/solr/security/zkdtsm/ZKDTSMRoot/ZKDTSMMasterKeyRoot/DK_2
   [junit4]   2> 	2	/solr/overseer_elect/election/98765002838638596-127.0.0.1:36381_solr-n_0000000000
   [junit4]   2> 	2	/solr/security/zkdtsm/ZKDTSMRoot/ZKDTSMMasterKeyRoot/DK_4
   [junit4]   2> 	2	/solr/security/zkdtsm/ZKDTSMRoot/ZKDTSMSeqNumRoot
   [junit4]   2> 
   [junit4]   2> Maximum concurrent children watches above limit:
   [junit4]   2> 
   [junit4]   2> 	4	/solr/live_nodes
   [junit4]   2> 	4	/solr/collections
   [junit4]   2> 	2	/solr/security/zkdtsm/ZKDTSMRoot/ZKDTSMMasterKeyRoot
   [junit4]   2> 	2	/solr/security/zkdtsm/ZKDTSMRoot/ZKDTSMTokensRoot
   [junit4]   2> 
   [junit4]   2> 1418018 INFO  (SUITE-TestSolrCloudWithSecureImpersonation-seed#[AB163D8AFF236488]-worker) [    ] o.a.s.SolrTestCaseJ4 ------------------------------------------------------- Done waiting for tracked resources to be released
   [junit4]   2> Oct 03, 2017 12:39:40 PM com.carrotsearch.randomizedtesting.ThreadLeakControl checkThreadLeaks
   [junit4]   2> WARNING: Will linger awaiting termination of 2 leaked thread(s).
   [junit4]   2> 1430192 ERROR (jetty-launcher-1930-thread-2-EventThread) [n:127.0.0.1:36381_solr    ] o.a.c.f.i.CuratorFrameworkImpl Watcher exception
   [junit4]   2> java.lang.IllegalStateException: Client is not started
   [junit4]   2> 	at com.google.common.base.Preconditions.checkState(Preconditions.java:149)
   [junit4]   2> 	at org.apache.curator.CuratorZookeeperClient.getZooKeeper(CuratorZookeeperClient.java:113)
   [junit4]   2> 	at org.apache.curator.framework.imps.CuratorFrameworkImpl.getZooKeeper(CuratorFrameworkImpl.java:477)
   [junit4]   2> 	at org.apache.curator.framework.imps.NamespaceFacade.getZooKeeper(NamespaceFacade.java:112)
   [junit4]   2> 	at org.apache.curator.framework.imps.GetDataBuilderImpl$4.call(GetDataBuilderImpl.java:302)
   [junit4]   2> 	at org.apache.curator.framework.imps.GetDataBuilderImpl$4.call(GetDataBuilderImpl.java:291)
   [junit4]   2> 	at org.apache.curator.RetryLoop.callWithRetry(RetryLoop.java:107)
   [junit4]   2> 	at org.apache.curator.framework.imps.GetDataBuilderImpl.pathInForeground(GetDataBuilderImpl.java:288)
   [junit4]   2> 	at org.apache.curator.framework.imps.GetDataBuilderImpl.forPath(GetDataBuilderImpl.java:279)
   [junit4]   2> 	at org.apache.curator.framework.imps.GetDataBuilderImpl.forPath(GetDataBuilderImpl.java:41)
   [junit4]   2> 	at org.apache.curator.framework.recipes.shared.SharedValue.readValue(SharedValue.java:244)
   [junit4]   2> 	at org.apache.curator.framework.recipes.shared.SharedValue.access$100(SharedValue.java:44)
   [junit4]   2> 	at org.apache.curator.framework.recipes.shared.SharedValue$1.process(SharedValue.java:61)
   [junit4]   2> 	at org.apache.curator.framework.imps.NamespaceWatcher.process(NamespaceWatcher.java:67)
   [junit4]   2> 	at org.apache.zookeeper.ClientCnxn$EventThread.processEvent(ClientCnxn.java:530)
   [junit4]   2> 	at org.apache.zookeeper.ClientCnxn$EventThread.run(ClientCnxn.java:505)
   [junit4]   2> 1430198 WARN  (jetty-launcher-1930-thread-2-EventThread) [n:127.0.0.1:36381_solr    ] o.a.c.ConnectionState Session expired event received
   [junit4]   2> 1430201 WARN  (jetty-launcher-1930-thread-2-SendThread(127.0.0.1:55939)) [n:127.0.0.1:36381_solr    ] o.a.z.ClientCnxn Session 0x0 for server null, unexpected error, closing socket connection and attempting reconnect
   [junit4]   2> java.net.ConnectException: Connection refused
   [junit4]   2> 	at sun.nio.ch.SocketChannelImpl.checkConnect(Native Method)
   [junit4]   2> 	at sun.nio.ch.SocketChannelImpl.finishConnect(SocketChannelImpl.java:717)
   [junit4]   2> 	at org.apache.zookeeper.ClientCnxnSocketNIO.doTransport(ClientCnxnSocketNIO.java:361)
   [junit4]   2> 	at org.apache.zookeeper.ClientCnxn$SendThread.run(ClientCnxn.java:1141)
   [junit4]   2> 1431303 WARN  (jetty-launcher-1930-thread-2-SendThread(127.0.0.1:55939)) [n:127.0.0.1:36381_solr    ] o.a.z.ClientCnxn Session 0x0 for server null, unexpected error, closing socket connection and attempting reconnect
   [junit4]   2> java.net.ConnectException: Connection refused
   [junit4]   2> 	at sun.nio.ch.SocketChannelImpl.checkConnect(Native Method)
   [junit4]   2> 	at sun.nio.ch.SocketChannelImpl.finishConnect(SocketChannelImpl.java:717)
   [junit4]   2> 	at org.apache.zookeeper.ClientCnxnSocketNIO.doTransport(ClientCnxnSocketNIO.java:361)
   [junit4]   2> 	at org.apache.zookeeper.ClientCnxn$SendThread.run(ClientCnxn.java:1141)
   [junit4]   2> 1432409 WARN  (jetty-launcher-1930-thread-2-SendThread(127.0.0.1:55939)) [n:127.0.0.1:36381_solr    ] o.a.z.ClientCnxn Session 0x0 for server null, unexpected error, closing socket connection and attempting reconnect
   [junit4]   2> java.net.ConnectException: Connection refused
   [junit4]   2> 	at sun.nio.ch.SocketChannelImpl.checkConnect(Native Method)
   [junit4]   2> 	at sun.nio.ch.SocketChannelImpl.finishConnect(SocketChannelImpl.java:717)
   [junit4]   2> 	at org.apache.zookeeper.ClientCnxnSocketNIO.doTransport(ClientCnxnSocketNIO.java:361)
   [junit4]   2> 	at org.apache.zookeeper.ClientCnxn$SendThread.run(ClientCnxn.java:1141)
   [junit4]   2> 1433511 WARN  (jetty-launcher-1930-thread-2-SendThread(127.0.0.1:55939)) [n:127.0.0.1:36381_solr    ] o.a.z.ClientCnxn Session 0x0 for server null, unexpected error, closing socket connection and attempting reconnect
   [junit4]   2> java.net.ConnectException: Connection refused
   [junit4]   2> 	at sun.nio.ch.SocketChannelImpl.checkConnect(Native Method)
   [junit4]   2> 	at sun.nio.ch.SocketChannelImpl.finishConnect(SocketChannelImpl.java:717)
   [junit4]   2> 	at org.apache.zookeeper.ClientCnxnSocketNIO.doTransport(ClientCnxnSocketNIO.java:361)
   [junit4]   2> 	at org.apache.zookeeper.ClientCnxn$SendThread.run(ClientCnxn.java:1141)
   [junit4]   2> 1434635 WARN  (jetty-launcher-1930-thread-2-SendThread(127.0.0.1:55939)) [n:127.0.0.1:36381_solr    ] o.a.z.ClientCnxn Session 0x0 for server null, unexpected error, closing socket connection and attempting reconnect
   [junit4]   2> java.net.ConnectException: Connection refused
   [junit4]   2> 	at sun.nio.ch.SocketChannelImpl.checkConnect(Native Method)
   [junit4]   2> 	at sun.nio.ch.SocketChannelImpl.finishConnect(SocketChannelImpl.java:717)
   [junit4]   2> 	at org.apache.zookeeper.ClientCnxnSocketNIO.doTransport(ClientCnxnSocketNIO.java:361)
   [junit4]   2> 	at org.apache.zookeeper.ClientCnxn$SendThread.run(ClientCnxn.java:1141)
   [junit4]   2> 1435738 WARN  (jetty-launcher-1930-thread-2-SendThread(127.0.0.1:55939)) [n:127.0.0.1:36381_solr    ] o.a.z.ClientCnxn Session 0x0 for server null, unexpected error, closing socket connection and attempting reconnect
   [junit4]   2> java.net.ConnectException: Connection refused
   [junit4]   2> 	at sun.nio.ch.SocketChannelImpl.checkConnect(Native Method)
   [junit4]   2> 	at sun.nio.ch.SocketChannelImpl.finishConnect(SocketChannelImpl.java:717)
   [junit4]   2> 	at org.apache.zookeeper.ClientCnxnSocketNIO.doTransport(ClientCnxnSocketNIO.java:361)
   [junit4]   2> 	at org.apache.zookeeper.ClientCnxn$SendThread.run(ClientCnxn.java:1141)
   [junit4]   2> 1436871 WARN  (jetty-launcher-1930-thread-2-SendThread(127.0.0.1:55939)) [n:127.0.0.1:36381_solr    ] o.a.z.ClientCnxn Session 0x0 for server null, unexpected error, closing socket connection and attempting reconnect
   [junit4]   2> java.net.ConnectException: Connection refused
   [junit4]   2> 	at sun.nio.ch.SocketChannelImpl.checkConnect(Native Method)
   [junit4]   2> 	at sun.nio.ch.SocketChannelImpl.finishConnect(SocketChannelImpl.java:717)
   [junit4]   2> 	at org.apache.zookeeper.ClientCnxnSocketNIO.doTransport(ClientCnxnSocketNIO.java:361)
   [junit4]   2> 	at org.apache.zookeeper.ClientCnxn$SendThread.run(ClientCnxn.java:1141)
   [junit4]   2> 1437973 WARN  (jetty-launcher-1930-thread-2-SendThread(127.0.0.1:55939)) [n:127.0.0.1:36381_solr    ] o.a.z.ClientCnxn Session 0x0 for server null, unexpected error, closing socket connection and attempting reconnect
   [junit4]   2> java.net.ConnectException: Connection refused
   [junit4]   2> 	at sun.nio.ch.SocketChannelImpl.checkConnect(Native Method)
   [junit4]   2> 	at sun.nio.ch.SocketChannelImpl.finishConnect(SocketChannelImpl.java:717)
   [junit4]   2> 	at org.apache.zookeeper.ClientCnxnSocketNIO.doTransport(ClientCnxnSocketNIO.java:361)
   [junit4]   2> 	at org.apache.zookeeper.ClientCnxn$SendThread.run(ClientCnxn.java:1141)
   [junit4]   2> Oct 03, 2017 12:40:00 PM com.carrotsearch.randomizedtesting.ThreadLeakControl checkThreadLeaks
   [junit4]   2> SEVERE: 3 threads leaked from SUITE scope at org.apache.solr.cloud.TestSolrCloudWithSecureImpersonation: 
   [junit4]   2>    1) Thread[id=11449, name=jetty-launcher-1930-thread-1-EventThread, state=TIMED_WAITING, group=TGRP-TestSolrCloudWithSecureImpersonation]
   [junit4]   2>         at sun.misc.Unsafe.park(Native Method)
   [junit4]   2>         at java.util.concurrent.locks.LockSupport.parkNanos(LockSupport.java:215)
   [junit4]   2>         at java.util.concurrent.locks.AbstractQueuedSynchronizer.doAcquireSharedNanos(AbstractQueuedSynchronizer.java:1037)
   [junit4]   2>         at java.util.concurrent.locks.AbstractQueuedSynchronizer.tryAcquireSharedNanos(AbstractQueuedSynchronizer.java:1328)
   [junit4]   2>         at java.util.concurrent.CountDownLatch.await(CountDownLatch.java:277)
   [junit4]   2>         at org.apache.curator.CuratorZookeeperClient.internalBlockUntilConnectedOrTimedOut(CuratorZookeeperClient.java:323)
   [junit4]   2>         at org.apache.curator.RetryLoop.callWithRetry(RetryLoop.java:105)
   [junit4]   2>         at org.apache.curator.framework.imps.GetDataBuilderImpl.pathInForeground(GetDataBuilderImpl.java:288)
   [junit4]   2>         at org.apache.curator.framework.imps.GetDataBuilderImpl.forPath(GetDataBuilderImpl.java:279)
   [junit4]   2>         at org.apache.curator.framework.imps.GetDataBuilderImpl.forPath(GetDataBuilderImpl.java:41)
   [junit4]   2>         at org.apache.curator.framework.recipes.shared.SharedValue.readValue(SharedValue.java:244)
   [junit4]   2>         at org.apache.curator.framework.recipes.shared.SharedValue.access$100(SharedValue.java:44)
   [junit4]   2>         at org.apache.curator.framework.recipes.shared.SharedValue$1.process(SharedValue.java:61)
   [junit4]   2>         at org.apache.curator.framework.imps.NamespaceWatcher.process(NamespaceWatcher.java:67)
   [junit4]   2>         at org.apache.zookeeper.ClientCnxn$EventThread.processEvent(ClientCnxn.java:530)
   [junit4]   2>         at org.apache.zookeeper.ClientCnxn$EventThread.run(ClientCnxn.java:505)
   [junit4]   2>    2) Thread[id=11515, name=jetty-launcher-1930-thread-2-SendThread(127.0.0.1:55939), state=TIMED_WAITING, group=TGRP-TestSolrCloudWithSecureImpersonation]
   [junit4]   2>         at java.lang.Thread.sleep(Native Method)
   [junit4]   2>         at org.apache.zookeeper.client.StaticHostProvider.next(StaticHostProvider.java:101)
   [junit4]   2>         at org.apache.zookeeper.ClientCnxn$SendThread.startConnect(ClientCnxn.java:997)
   [junit4]   2>         at org.apache.zookeeper.ClientCnxn$SendThread.run(ClientCnxn.java:1060)
   [junit4]   2>    3) Thread[id=11516, name=jetty-launcher-1930-thread-2-EventThread, state=WAITING, group=TGRP-TestSolrCloudWithSecureImpersonation]
   [junit4]   2>         at sun.misc.Unsafe.park(Native Method)
   [junit4]   2>         at java.util.concurrent.locks.LockSupport.park(LockSupport.java:175)
   [junit4]   2>         at java.util.concurrent.locks.AbstractQueuedSynchronizer$ConditionObject.await(AbstractQueuedSynchronizer.java:2039)
   [junit4]   2>         at java.util.concurrent.LinkedBlockingQueue.take(LinkedBlockingQueue.java:442)
   [junit4]   2>         at org.apache.zookeeper.ClientCnxn$EventThread.run(ClientCnxn.java:501)
   [junit4]   2> Oct 03, 2017 12:40:00 PM com.carrotsearch.randomizedtesting.ThreadLeakControl tryToInterruptAll
   [junit4]   2> INFO: Starting to interrupt leaked threads:
   [junit4]   2>    1) Thread[id=11449, name=jetty-launcher-1930-thread-1-EventThread, state=TIMED_WAITING, group=TGRP-TestSolrCloudWithSecureImpersonation]
   [junit4]   2>    2) Thread[id=11515, name=jetty-launcher-1930-thread-2-SendThread(127.0.0.1:55939), state=TIMED_WAITING, group=TGRP-TestSolrCloudWithSecureImpersonation]
   [junit4]   2>    3) Thread[id=11516, name=jetty-launcher-1930-thread-2-EventThread, state=WAITING, group=TGRP-TestSolrCloudWithSecureImpersonation]
   [junit4]   2> 1438287 ERROR (jetty-launcher-1930-thread-2-EventThread) [n:127.0.0.1:36381_solr    ] o.a.z.ClientCnxn Event thread exiting due to interruption
   [junit4]   2> java.lang.InterruptedException
   [junit4]   2> 	at java.util.concurrent.locks.AbstractQueuedSynchron

[...truncated too long message...]

nectException: Connection refused
   [junit4]   2> 	at sun.nio.ch.SocketChannelImpl.checkConnect(Native Method)
   [junit4]   2> 	at sun.nio.ch.SocketChannelImpl.finishConnect(SocketChannelImpl.java:717)
   [junit4]   2> 	at org.apache.zookeeper.ClientCnxnSocketNIO.doTransport(ClientCnxnSocketNIO.java:361)
   [junit4]   2> 	at org.apache.zookeeper.ClientCnxn$SendThread.run(ClientCnxn.java:1141)
   [junit4]   2> Oct 03, 2017 12:40:03 PM com.carrotsearch.randomizedtesting.ThreadLeakControl tryToInterruptAll
   [junit4]   2> SEVERE: There are still zombie threads that couldn't be terminated:
   [junit4]   2>    1) Thread[id=11515, name=jetty-launcher-1930-thread-2-SendThread(127.0.0.1:55939), state=TIMED_WAITING, group=TGRP-TestSolrCloudWithSecureImpersonation]
   [junit4]   2>         at java.lang.Thread.sleep(Native Method)
   [junit4]   2>         at org.apache.zookeeper.client.StaticHostProvider.next(StaticHostProvider.java:101)
   [junit4]   2>         at org.apache.zookeeper.ClientCnxn$SendThread.startConnect(ClientCnxn.java:997)
   [junit4]   2>         at org.apache.zookeeper.ClientCnxn$SendThread.run(ClientCnxn.java:1060)
   [junit4]   2> NOTE: test params are: codec=FastDecompressionCompressingStoredFields(storedFieldsFormat=CompressingStoredFieldsFormat(compressionMode=FAST_DECOMPRESSION, chunkSize=18076, maxDocsPerChunk=5, blockSize=7), termVectorsFormat=CompressingTermVectorsFormat(compressionMode=FAST_DECOMPRESSION, chunkSize=18076, blockSize=7)), sim=RandomSimilarity(queryNorm=false): {}, locale=sq-AL, timezone=Australia/Canberra
   [junit4]   2> NOTE: SunOS 5.11 amd64/Oracle Corporation 1.8.0_141 (64-bit)/cpus=3,threads=4,free=349350064,total=536870912
   [junit4]   2> NOTE: All tests run in this JVM: [RequestLoggingTest, AliasIntegrationTest, SolrMetricManagerTest, DistributedFacetExistsSmallTest, TestHdfsBackupRestoreCore, CustomCollectionTest, ReplicationFactorTest, NoCacheHeaderTest, TestSubQueryTransformer, MoveReplicaHDFSTest, SolrIndexSplitterTest, PKIAuthenticationIntegrationTest, TestXIncludeConfig, TestCloudPivotFacet, DefaultValueUpdateProcessorTest, ClassificationUpdateProcessorFactoryTest, TestSolrConfigHandler, OverriddenZkACLAndCredentialsProvidersTest, RemoteQueryErrorTest, TestFunctionQuery, TestLFUCache, ConnectionReuseTest, BasicDistributedZkTest, SpellCheckCollatorWithCollapseTest, TestCursorMarkWithoutUniqueKey, TestCodecSupport, CdcrReplicationDistributedZkTest, TestSha256AuthenticationProvider, LargeFieldTest, URLClassifyProcessorTest, HdfsWriteToMultipleCollectionsTest, SliceStateTest, QueryElevationComponentTest, AddBlockUpdateTest, TestNamedUpdateProcessors, OutputWriterTest, TestTrieFacet, TestComplexPhraseLeadingWildcard, PathHierarchyTokenizerFactoryTest, UnloadDistributedZkTest, TestNonDefinedSimilarityFactory, TestRawTransformer, TestUtils, TestMultiValuedNumericRangeQuery, VersionInfoTest, CoreAdminHandlerTest, HighlighterTest, TestSweetSpotSimilarityFactory, TestExclusionRuleCollectionAccess, DistributedQueueTest, TestFieldCollectionResource, BlockCacheTest, ZkFailoverTest, TestCustomSort, MigrateRouteKeyTest, TestGraphMLResponseWriter, TestLMDirichletSimilarityFactory, TestLegacyField, TestGroupingSearch, CollectionsAPIAsyncDistributedZkTest, TestMaxTokenLenTokenizer, TestOmitPositions, TestDistribDocBasedVersion, ConcurrentDeleteAndCreateCollectionTest, ExplicitHLLTest, TestDistributedSearch, LeaderInitiatedRecoveryOnCommitTest, TestSolrConfigHandlerCloud, RuleEngineTest, TestQuerySenderListener, TestCollectionsAPIViaSolrCloudCluster, SyncSliceTest, UUIDUpdateProcessorFallbackTest, TestEmbeddedSolrServerSchemaAPI, RankQueryTest, TestSolrCloudSnapshots, AnalyticsQueryTest, ResponseLogComponentTest, TestSolrCloudWithSecureImpersonation]
   [junit4]   2> NOTE: reproduce with: ant test  -Dtestcase=TestSolrCloudWithSecureImpersonation -Dtests.seed=AB163D8AFF236488 -Dtests.slow=true -Dtests.locale=sq-AL -Dtests.timezone=Australia/Canberra -Dtests.asserts=true -Dtests.file.encoding=UTF-8
   [junit4] ERROR   0.00s J0 | TestSolrCloudWithSecureImpersonation (suite) <<<
   [junit4]    > Throwable #1: com.carrotsearch.randomizedtesting.ThreadLeakError: 3 threads leaked from SUITE scope at org.apache.solr.cloud.TestSolrCloudWithSecureImpersonation: 
   [junit4]    >    1) Thread[id=11449, name=jetty-launcher-1930-thread-1-EventThread, state=TIMED_WAITING, group=TGRP-TestSolrCloudWithSecureImpersonation]
   [junit4]    >         at sun.misc.Unsafe.park(Native Method)
   [junit4]    >         at java.util.concurrent.locks.LockSupport.parkNanos(LockSupport.java:215)
   [junit4]    >         at java.util.concurrent.locks.AbstractQueuedSynchronizer.doAcquireSharedNanos(AbstractQueuedSynchronizer.java:1037)
   [junit4]    >         at java.util.concurrent.locks.AbstractQueuedSynchronizer.tryAcquireSharedNanos(AbstractQueuedSynchronizer.java:1328)
   [junit4]    >         at java.util.concurrent.CountDownLatch.await(CountDownLatch.java:277)
   [junit4]    >         at org.apache.curator.CuratorZookeeperClient.internalBlockUntilConnectedOrTimedOut(CuratorZookeeperClient.java:323)
   [junit4]    >         at org.apache.curator.RetryLoop.callWithRetry(RetryLoop.java:105)
   [junit4]    >         at org.apache.curator.framework.imps.GetDataBuilderImpl.pathInForeground(GetDataBuilderImpl.java:288)
   [junit4]    >         at org.apache.curator.framework.imps.GetDataBuilderImpl.forPath(GetDataBuilderImpl.java:279)
   [junit4]    >         at org.apache.curator.framework.imps.GetDataBuilderImpl.forPath(GetDataBuilderImpl.java:41)
   [junit4]    >         at org.apache.curator.framework.recipes.shared.SharedValue.readValue(SharedValue.java:244)
   [junit4]    >         at org.apache.curator.framework.recipes.shared.SharedValue.access$100(SharedValue.java:44)
   [junit4]    >         at org.apache.curator.framework.recipes.shared.SharedValue$1.process(SharedValue.java:61)
   [junit4]    >         at org.apache.curator.framework.imps.NamespaceWatcher.process(NamespaceWatcher.java:67)
   [junit4]    >         at org.apache.zookeeper.ClientCnxn$EventThread.processEvent(ClientCnxn.java:530)
   [junit4]    >         at org.apache.zookeeper.ClientCnxn$EventThread.run(ClientCnxn.java:505)
   [junit4]    >    2) Thread[id=11515, name=jetty-launcher-1930-thread-2-SendThread(127.0.0.1:55939), state=TIMED_WAITING, group=TGRP-TestSolrCloudWithSecureImpersonation]
   [junit4]    >         at java.lang.Thread.sleep(Native Method)
   [junit4]    >         at org.apache.zookeeper.client.StaticHostProvider.next(StaticHostProvider.java:101)
   [junit4]    >         at org.apache.zookeeper.ClientCnxn$SendThread.startConnect(ClientCnxn.java:997)
   [junit4]    >         at org.apache.zookeeper.ClientCnxn$SendThread.run(ClientCnxn.java:1060)
   [junit4]    >    3) Thread[id=11516, name=jetty-launcher-1930-thread-2-EventThread, state=WAITING, group=TGRP-TestSolrCloudWithSecureImpersonation]
   [junit4]    >         at sun.misc.Unsafe.park(Native Method)
   [junit4]    >         at java.util.concurrent.locks.LockSupport.park(LockSupport.java:175)
   [junit4]    >         at java.util.concurrent.locks.AbstractQueuedSynchronizer$ConditionObject.await(AbstractQueuedSynchronizer.java:2039)
   [junit4]    >         at java.util.concurrent.LinkedBlockingQueue.take(LinkedBlockingQueue.java:442)
   [junit4]    >         at org.apache.zookeeper.ClientCnxn$EventThread.run(ClientCnxn.java:501)
   [junit4]    > 	at __randomizedtesting.SeedInfo.seed([AB163D8AFF236488]:0)Throwable #2: com.carrotsearch.randomizedtesting.ThreadLeakError: There are still zombie threads that couldn't be terminated:
   [junit4]    >    1) Thread[id=11515, name=jetty-launcher-1930-thread-2-SendThread(127.0.0.1:55939), state=TIMED_WAITING, group=TGRP-TestSolrCloudWithSecureImpersonation]
   [junit4]    >         at java.lang.Thread.sleep(Native Method)
   [junit4]    >         at org.apache.zookeeper.client.StaticHostProvider.next(StaticHostProvider.java:101)
   [junit4]    >         at org.apache.zookeeper.ClientCnxn$SendThread.startConnect(ClientCnxn.java:997)
   [junit4]    >         at org.apache.zookeeper.ClientCnxn$SendThread.run(ClientCnxn.java:1060)
   [junit4]    > 	at __randomizedtesting.SeedInfo.seed([AB163D8AFF236488]:0)
   [junit4] Completed [169/733 (1!)] on J0 in 58.51s, 12 tests, 2 errors <<< FAILURES!

[...truncated 48290 lines...]
-documentation-lint:
    [jtidy] Checking for broken html (such as invalid tags)...
   [delete] Deleting directory /export/home/jenkins/workspace/Lucene-Solr-7.x-Solaris/lucene/build/jtidy_tmp
     [echo] Checking for broken links...
     [exec] 
     [exec] Crawl/parse...
     [exec] 
     [exec] Verify...
     [exec] 
     [exec] file:///export/home/jenkins/workspace/Lucene-Solr-7.x-Solaris/solr/build/docs/quickstart.html
     [exec]   BAD EXTERNAL LINK: https://lucene.apache.org/solr/guide/solr-tutorial.html
     [exec] 
     [exec] Broken javadocs links were found! Common root causes:
     [exec] * A typo of some sort for manually created links.
     [exec] * Public methods referencing non-public classes in their signature.

BUILD FAILED
/export/home/jenkins/workspace/Lucene-Solr-7.x-Solaris/build.xml:826: The following error occurred while executing this line:
/export/home/jenkins/workspace/Lucene-Solr-7.x-Solaris/build.xml:101: The following error occurred while executing this line:
/export/home/jenkins/workspace/Lucene-Solr-7.x-Solaris/solr/build.xml:669: The following error occurred while executing this line:
/export/home/jenkins/workspace/Lucene-Solr-7.x-Solaris/solr/build.xml:682: The following error occurred while executing this line:
/export/home/jenkins/workspace/Lucene-Solr-7.x-Solaris/lucene/common-build.xml:2570: exec returned: 1

Total time: 72 minutes 43 seconds
Build step 'Invoke Ant' marked build as failure
Archiving artifacts
[WARNINGS] Skipping publisher since build result is FAILURE
Recording test results
Email was triggered for: Failure - Any
Sending email for trigger: Failure - Any

Mime
View raw message