lucene-dev mailing list archives

Site index · List index
Message view « Date » · « Thread »
Top « Date » · « Thread »
From Policeman Jenkins Server <jenk...@thetaphi.de>
Subject [JENKINS] Lucene-Solr-7.x-Linux (32bit/jdk1.8.0_144) - Build # 707 - Still Unstable!
Date Tue, 31 Oct 2017 02:15:35 GMT
Build: https://jenkins.thetaphi.de/job/Lucene-Solr-7.x-Linux/707/
Java: 32bit/jdk1.8.0_144 -server -XX:+UseG1GC

1 tests failed.
FAILED:  org.apache.solr.handler.admin.AutoscalingHistoryHandlerTest.testHistory

Error Message:
replica never fully recovered

Stack Trace:
java.lang.AssertionError: replica never fully recovered
	at __randomizedtesting.SeedInfo.seed([DA0EEED0D7C161CC:B7F24A2D6D899ECB]:0)
	at org.junit.Assert.fail(Assert.java:93)
	at org.junit.Assert.assertTrue(Assert.java:43)
	at org.apache.solr.handler.admin.AutoscalingHistoryHandlerTest.waitForRecovery(AutoscalingHistoryHandlerTest.java:303)
	at org.apache.solr.handler.admin.AutoscalingHistoryHandlerTest.testHistory(AutoscalingHistoryHandlerTest.java:255)
	at sun.reflect.NativeMethodAccessorImpl.invoke0(Native Method)
	at sun.reflect.NativeMethodAccessorImpl.invoke(NativeMethodAccessorImpl.java:62)
	at sun.reflect.DelegatingMethodAccessorImpl.invoke(DelegatingMethodAccessorImpl.java:43)
	at java.lang.reflect.Method.invoke(Method.java:498)
	at com.carrotsearch.randomizedtesting.RandomizedRunner.invoke(RandomizedRunner.java:1737)
	at com.carrotsearch.randomizedtesting.RandomizedRunner$8.evaluate(RandomizedRunner.java:934)
	at com.carrotsearch.randomizedtesting.RandomizedRunner$9.evaluate(RandomizedRunner.java:970)
	at com.carrotsearch.randomizedtesting.RandomizedRunner$10.evaluate(RandomizedRunner.java:984)
	at com.carrotsearch.randomizedtesting.rules.SystemPropertiesRestoreRule$1.evaluate(SystemPropertiesRestoreRule.java:57)
	at org.apache.lucene.util.TestRuleSetupTeardownChained$1.evaluate(TestRuleSetupTeardownChained.java:49)
	at org.apache.lucene.util.AbstractBeforeAfterRule$1.evaluate(AbstractBeforeAfterRule.java:45)
	at org.apache.lucene.util.TestRuleThreadAndTestName$1.evaluate(TestRuleThreadAndTestName.java:48)
	at org.apache.lucene.util.TestRuleIgnoreAfterMaxFailures$1.evaluate(TestRuleIgnoreAfterMaxFailures.java:64)
	at org.apache.lucene.util.TestRuleMarkFailure$1.evaluate(TestRuleMarkFailure.java:47)
	at com.carrotsearch.randomizedtesting.rules.StatementAdapter.evaluate(StatementAdapter.java:36)
	at com.carrotsearch.randomizedtesting.ThreadLeakControl$StatementRunner.run(ThreadLeakControl.java:368)
	at com.carrotsearch.randomizedtesting.ThreadLeakControl.forkTimeoutingTask(ThreadLeakControl.java:817)
	at com.carrotsearch.randomizedtesting.ThreadLeakControl$3.evaluate(ThreadLeakControl.java:468)
	at com.carrotsearch.randomizedtesting.RandomizedRunner.runSingleTest(RandomizedRunner.java:943)
	at com.carrotsearch.randomizedtesting.RandomizedRunner$5.evaluate(RandomizedRunner.java:829)
	at com.carrotsearch.randomizedtesting.RandomizedRunner$6.evaluate(RandomizedRunner.java:879)
	at com.carrotsearch.randomizedtesting.RandomizedRunner$7.evaluate(RandomizedRunner.java:890)
	at com.carrotsearch.randomizedtesting.rules.StatementAdapter.evaluate(StatementAdapter.java:36)
	at com.carrotsearch.randomizedtesting.rules.SystemPropertiesRestoreRule$1.evaluate(SystemPropertiesRestoreRule.java:57)
	at org.apache.lucene.util.AbstractBeforeAfterRule$1.evaluate(AbstractBeforeAfterRule.java:45)
	at com.carrotsearch.randomizedtesting.rules.StatementAdapter.evaluate(StatementAdapter.java:36)
	at org.apache.lucene.util.TestRuleStoreClassName$1.evaluate(TestRuleStoreClassName.java:41)
	at com.carrotsearch.randomizedtesting.rules.NoShadowingOrOverridesOnMethodsRule$1.evaluate(NoShadowingOrOverridesOnMethodsRule.java:40)
	at com.carrotsearch.randomizedtesting.rules.NoShadowingOrOverridesOnMethodsRule$1.evaluate(NoShadowingOrOverridesOnMethodsRule.java:40)
	at com.carrotsearch.randomizedtesting.rules.StatementAdapter.evaluate(StatementAdapter.java:36)
	at com.carrotsearch.randomizedtesting.rules.StatementAdapter.evaluate(StatementAdapter.java:36)
	at com.carrotsearch.randomizedtesting.rules.StatementAdapter.evaluate(StatementAdapter.java:36)
	at org.apache.lucene.util.TestRuleAssertionsRequired$1.evaluate(TestRuleAssertionsRequired.java:53)
	at org.apache.lucene.util.TestRuleMarkFailure$1.evaluate(TestRuleMarkFailure.java:47)
	at org.apache.lucene.util.TestRuleIgnoreAfterMaxFailures$1.evaluate(TestRuleIgnoreAfterMaxFailures.java:64)
	at org.apache.lucene.util.TestRuleIgnoreTestSuites$1.evaluate(TestRuleIgnoreTestSuites.java:54)
	at com.carrotsearch.randomizedtesting.rules.StatementAdapter.evaluate(StatementAdapter.java:36)
	at com.carrotsearch.randomizedtesting.ThreadLeakControl$StatementRunner.run(ThreadLeakControl.java:368)
	at java.lang.Thread.run(Thread.java:748)




Build Log:
[...truncated 12338 lines...]
   [junit4] Suite: org.apache.solr.handler.admin.AutoscalingHistoryHandlerTest
   [junit4]   2> Creating dataDir: /home/jenkins/workspace/Lucene-Solr-7.x-Linux/solr/build/solr-core/test/J2/temp/solr.handler.admin.AutoscalingHistoryHandlerTest_DA0EEED0D7C161CC-001/init-core-data-001
   [junit4]   2> 285771 WARN  (SUITE-AutoscalingHistoryHandlerTest-seed#[DA0EEED0D7C161CC]-worker) [    ] o.a.s.SolrTestCaseJ4 startTrackingSearchers: numOpens=3 numCloses=3
   [junit4]   2> 285771 INFO  (SUITE-AutoscalingHistoryHandlerTest-seed#[DA0EEED0D7C161CC]-worker) [    ] o.a.s.SolrTestCaseJ4 Using PointFields (NUMERIC_POINTS_SYSPROP=true) w/NUMERIC_DOCVALUES_SYSPROP=true
   [junit4]   2> 285772 INFO  (SUITE-AutoscalingHistoryHandlerTest-seed#[DA0EEED0D7C161CC]-worker) [    ] o.a.s.SolrTestCaseJ4 Randomized ssl (true) and clientAuth (true) via: @org.apache.solr.util.RandomizeSSL(reason=, ssl=NaN, value=NaN, clientAuth=NaN)
   [junit4]   2> 285773 INFO  (SUITE-AutoscalingHistoryHandlerTest-seed#[DA0EEED0D7C161CC]-worker) [    ] o.a.s.SolrTestCaseJ4 SecureRandom sanity checks: test.solr.allowed.securerandom=null & java.security.egd=file:/dev/./urandom
   [junit4]   2> 285774 INFO  (SUITE-AutoscalingHistoryHandlerTest-seed#[DA0EEED0D7C161CC]-worker) [    ] o.a.s.c.MiniSolrCloudCluster Starting cluster of 3 servers in /home/jenkins/workspace/Lucene-Solr-7.x-Linux/solr/build/solr-core/test/J2/temp/solr.handler.admin.AutoscalingHistoryHandlerTest_DA0EEED0D7C161CC-001/tempDir-001
   [junit4]   2> 285774 INFO  (SUITE-AutoscalingHistoryHandlerTest-seed#[DA0EEED0D7C161CC]-worker) [    ] o.a.s.c.ZkTestServer STARTING ZK TEST SERVER
   [junit4]   2> 285774 INFO  (Thread-2484) [    ] o.a.s.c.ZkTestServer client port:0.0.0.0/0.0.0.0:0
   [junit4]   2> 285774 INFO  (Thread-2484) [    ] o.a.s.c.ZkTestServer Starting server
   [junit4]   2> 285775 ERROR (Thread-2484) [    ] o.a.z.s.ZooKeeperServer ZKShutdownHandler is not registered, so ZooKeeper server won't take any action on ERROR or SHUTDOWN server state changes
   [junit4]   2> 285874 INFO  (SUITE-AutoscalingHistoryHandlerTest-seed#[DA0EEED0D7C161CC]-worker) [    ] o.a.s.c.ZkTestServer start zk server on port:37089
   [junit4]   2> 285879 INFO  (jetty-launcher-571-thread-3) [    ] o.e.j.s.Server jetty-9.3.20.v20170531
   [junit4]   2> 285879 INFO  (jetty-launcher-571-thread-1) [    ] o.e.j.s.Server jetty-9.3.20.v20170531
   [junit4]   2> 285879 INFO  (jetty-launcher-571-thread-2) [    ] o.e.j.s.Server jetty-9.3.20.v20170531
   [junit4]   2> 285890 INFO  (jetty-launcher-571-thread-2) [    ] o.e.j.s.h.ContextHandler Started o.e.j.s.ServletContextHandler@148af0a{/solr,null,AVAILABLE}
   [junit4]   2> 285890 INFO  (jetty-launcher-571-thread-3) [    ] o.e.j.s.h.ContextHandler Started o.e.j.s.ServletContextHandler@33633a{/solr,null,AVAILABLE}
   [junit4]   2> 285891 INFO  (jetty-launcher-571-thread-1) [    ] o.e.j.s.h.ContextHandler Started o.e.j.s.ServletContextHandler@1960d8b{/solr,null,AVAILABLE}
   [junit4]   2> 285892 INFO  (jetty-launcher-571-thread-1) [    ] o.e.j.s.AbstractConnector Started ServerConnector@f0c4d5{SSL,[ssl, http/1.1]}{127.0.0.1:44303}
   [junit4]   2> 285892 INFO  (jetty-launcher-571-thread-2) [    ] o.e.j.s.AbstractConnector Started ServerConnector@d2e033{SSL,[ssl, http/1.1]}{127.0.0.1:43349}
   [junit4]   2> 285892 INFO  (jetty-launcher-571-thread-3) [    ] o.e.j.s.AbstractConnector Started ServerConnector@1cc1385{SSL,[ssl, http/1.1]}{127.0.0.1:39685}
   [junit4]   2> 285892 INFO  (jetty-launcher-571-thread-2) [    ] o.e.j.s.Server Started @287496ms
   [junit4]   2> 285892 INFO  (jetty-launcher-571-thread-3) [    ] o.e.j.s.Server Started @287496ms
   [junit4]   2> 285892 INFO  (jetty-launcher-571-thread-1) [    ] o.e.j.s.Server Started @287496ms
   [junit4]   2> 285892 INFO  (jetty-launcher-571-thread-2) [    ] o.a.s.c.s.e.JettySolrRunner Jetty properties: {hostContext=/solr, hostPort=43349}
   [junit4]   2> 285892 INFO  (jetty-launcher-571-thread-1) [    ] o.a.s.c.s.e.JettySolrRunner Jetty properties: {hostContext=/solr, hostPort=44303}
   [junit4]   2> 285892 INFO  (jetty-launcher-571-thread-3) [    ] o.a.s.c.s.e.JettySolrRunner Jetty properties: {hostContext=/solr, hostPort=39685}
   [junit4]   2> 285892 ERROR (jetty-launcher-571-thread-1) [    ] o.a.s.u.StartupLoggingUtils Missing Java Option solr.log.dir. Logging may be missing or incomplete.
   [junit4]   2> 285892 ERROR (jetty-launcher-571-thread-3) [    ] o.a.s.u.StartupLoggingUtils Missing Java Option solr.log.dir. Logging may be missing or incomplete.
   [junit4]   2> 285893 INFO  (jetty-launcher-571-thread-1) [    ] o.a.s.s.SolrDispatchFilter  ___      _       Welcome to Apache Solr™ version 7.2.0
   [junit4]   2> 285893 ERROR (jetty-launcher-571-thread-2) [    ] o.a.s.u.StartupLoggingUtils Missing Java Option solr.log.dir. Logging may be missing or incomplete.
   [junit4]   2> 285893 INFO  (jetty-launcher-571-thread-3) [    ] o.a.s.s.SolrDispatchFilter  ___      _       Welcome to Apache Solr™ version 7.2.0
   [junit4]   2> 285893 INFO  (jetty-launcher-571-thread-1) [    ] o.a.s.s.SolrDispatchFilter / __| ___| |_ _   Starting in cloud mode on port null
   [junit4]   2> 285893 INFO  (jetty-launcher-571-thread-3) [    ] o.a.s.s.SolrDispatchFilter / __| ___| |_ _   Starting in cloud mode on port null
   [junit4]   2> 285893 INFO  (jetty-launcher-571-thread-1) [    ] o.a.s.s.SolrDispatchFilter \__ \/ _ \ | '_|  Install dir: null
   [junit4]   2> 285894 INFO  (jetty-launcher-571-thread-3) [    ] o.a.s.s.SolrDispatchFilter \__ \/ _ \ | '_|  Install dir: null
   [junit4]   2> 285894 INFO  (jetty-launcher-571-thread-1) [    ] o.a.s.s.SolrDispatchFilter |___/\___/_|_|    Start time: 2017-10-31T01:17:51.106Z
   [junit4]   2> 285894 INFO  (jetty-launcher-571-thread-3) [    ] o.a.s.s.SolrDispatchFilter |___/\___/_|_|    Start time: 2017-10-31T01:17:51.106Z
   [junit4]   2> 285893 INFO  (jetty-launcher-571-thread-2) [    ] o.a.s.s.SolrDispatchFilter  ___      _       Welcome to Apache Solr™ version 7.2.0
   [junit4]   2> 285894 INFO  (jetty-launcher-571-thread-2) [    ] o.a.s.s.SolrDispatchFilter / __| ___| |_ _   Starting in cloud mode on port null
   [junit4]   2> 285894 INFO  (jetty-launcher-571-thread-2) [    ] o.a.s.s.SolrDispatchFilter \__ \/ _ \ | '_|  Install dir: null
   [junit4]   2> 285894 INFO  (jetty-launcher-571-thread-2) [    ] o.a.s.s.SolrDispatchFilter |___/\___/_|_|    Start time: 2017-10-31T01:17:51.106Z
   [junit4]   2> 285904 INFO  (jetty-launcher-571-thread-2) [    ] o.a.s.s.SolrDispatchFilter solr.xml found in ZooKeeper. Loading...
   [junit4]   2> 285904 INFO  (jetty-launcher-571-thread-1) [    ] o.a.s.s.SolrDispatchFilter solr.xml found in ZooKeeper. Loading...
   [junit4]   2> 285905 INFO  (jetty-launcher-571-thread-3) [    ] o.a.s.s.SolrDispatchFilter solr.xml found in ZooKeeper. Loading...
   [junit4]   2> 285913 INFO  (jetty-launcher-571-thread-2) [    ] o.a.s.c.ZkContainer Zookeeper client=127.0.0.1:37089/solr
   [junit4]   2> 285914 INFO  (jetty-launcher-571-thread-1) [    ] o.a.s.c.ZkContainer Zookeeper client=127.0.0.1:37089/solr
   [junit4]   2> 285917 INFO  (jetty-launcher-571-thread-3) [    ] o.a.s.c.ZkContainer Zookeeper client=127.0.0.1:37089/solr
   [junit4]   2> 285934 INFO  (jetty-launcher-571-thread-3) [n:127.0.0.1:39685_solr    ] o.a.s.c.Overseer Overseer (id=null) closing
   [junit4]   2> 285935 INFO  (jetty-launcher-571-thread-3) [n:127.0.0.1:39685_solr    ] o.a.s.c.OverseerElectionContext I am going to be the leader 127.0.0.1:39685_solr
   [junit4]   2> 285935 INFO  (jetty-launcher-571-thread-2) [n:127.0.0.1:43349_solr    ] o.a.s.c.Overseer Overseer (id=null) closing
   [junit4]   2> 285936 INFO  (jetty-launcher-571-thread-3) [n:127.0.0.1:39685_solr    ] o.a.s.c.Overseer Overseer (id=98920868805804041-127.0.0.1:39685_solr-n_0000000000) starting
   [junit4]   2> 285936 INFO  (jetty-launcher-571-thread-2) [n:127.0.0.1:43349_solr    ] o.a.s.c.ZkController Register node as live in ZooKeeper:/live_nodes/127.0.0.1:43349_solr
   [junit4]   2> 285937 INFO  (zkCallback-586-thread-1-processing-n:127.0.0.1:43349_solr) [n:127.0.0.1:43349_solr    ] o.a.s.c.c.ZkStateReader Updated live nodes from ZooKeeper... (0) -> (1)
   [junit4]   2> 285937 INFO  (zkCallback-588-thread-1-processing-n:127.0.0.1:39685_solr) [n:127.0.0.1:39685_solr    ] o.a.s.c.c.ZkStateReader Updated live nodes from ZooKeeper... (0) -> (1)
   [junit4]   2> 285941 DEBUG (OverseerStateUpdate-98920868805804041-127.0.0.1:39685_solr-n_0000000000) [n:127.0.0.1:39685_solr    ] o.a.s.c.Overseer Starting to work on the main queue
   [junit4]   2> 285954 INFO  (jetty-launcher-571-thread-3) [n:127.0.0.1:39685_solr    ] o.a.s.c.ZkController Register node as live in ZooKeeper:/live_nodes/127.0.0.1:39685_solr
   [junit4]   2> 285954 DEBUG (OverseerAutoScalingTriggerThread-98920868805804041-127.0.0.1:39685_solr-n_0000000000) [n:127.0.0.1:39685_solr    ] o.a.s.c.a.OverseerTriggerThread Adding .autoAddReplicas trigger
   [junit4]   2> 285955 INFO  (zkCallback-586-thread-1-processing-n:127.0.0.1:43349_solr) [n:127.0.0.1:43349_solr    ] o.a.s.c.c.ZkStateReader Updated live nodes from ZooKeeper... (1) -> (2)
   [junit4]   2> 285955 INFO  (zkCallback-588-thread-1-processing-n:127.0.0.1:39685_solr) [n:127.0.0.1:39685_solr    ] o.a.s.c.c.ZkStateReader Updated live nodes from ZooKeeper... (1) -> (2)
   [junit4]   2> 285956 DEBUG (OverseerAutoScalingTriggerThread-98920868805804041-127.0.0.1:39685_solr-n_0000000000) [n:127.0.0.1:39685_solr    ] o.a.s.c.a.OverseerTriggerThread Refreshing /autoscaling.json with znode version 1
   [junit4]   2> 285957 DEBUG (OverseerStateUpdate-98920868805804041-127.0.0.1:39685_solr-n_0000000000) [n:127.0.0.1:39685_solr    ] o.a.s.c.Overseer processMessage: queueSize: 1, message = {
   [junit4]   2>   "operation":"downnode",
   [junit4]   2>   "node_name":"127.0.0.1:39685_solr"} current state version: 0
   [junit4]   2> 285957 DEBUG (OverseerStateUpdate-98920868805804041-127.0.0.1:39685_solr-n_0000000000) [n:127.0.0.1:39685_solr    ] o.a.s.c.o.NodeMutator DownNode state invoked for node: 127.0.0.1:39685_solr
   [junit4]   2> 285957 DEBUG (OverseerAutoScalingTriggerThread-98920868805804041-127.0.0.1:39685_solr-n_0000000000) [n:127.0.0.1:39685_solr    ] o.a.s.c.a.NodeLostTrigger Initial livenodes: [127.0.0.1:39685_solr, 127.0.0.1:43349_solr]
   [junit4]   2> 285957 DEBUG (OverseerAutoScalingTriggerThread-98920868805804041-127.0.0.1:39685_solr-n_0000000000) [n:127.0.0.1:39685_solr    ] o.a.s.c.a.OverseerTriggerThread Current znodeVersion 1, lastZnodeVersion -1
   [junit4]   2> 285957 DEBUG (OverseerAutoScalingTriggerThread-98920868805804041-127.0.0.1:39685_solr-n_0000000000) [n:127.0.0.1:39685_solr    ] o.a.s.c.a.OverseerTriggerThread Processed trigger updates upto znodeVersion 1
   [junit4]   2> 285973 DEBUG (OverseerAutoScalingTriggerThread-98920868805804041-127.0.0.1:39685_solr-n_0000000000) [n:127.0.0.1:39685_solr    ] o.a.s.c.a.OverseerTriggerThread -- clean old nodeAdded markers
   [junit4]   2> 285974 DEBUG (OverseerAutoScalingTriggerThread-98920868805804041-127.0.0.1:39685_solr-n_0000000000) [n:127.0.0.1:39685_solr    ] o.a.s.c.a.OverseerTriggerThread Current znodeVersion 1, lastZnodeVersion 1
   [junit4]   2> 285974 DEBUG (ScheduledTrigger-1392-thread-1) [n:127.0.0.1:39685_solr    ] o.a.s.c.a.NodeLostTrigger Running NodeLostTrigger: .auto_add_replicas with currently live nodes: [127.0.0.1:39685_solr, 127.0.0.1:43349_solr]
   [junit4]   2> 286006 INFO  (jetty-launcher-571-thread-1) [n:127.0.0.1:44303_solr    ] o.a.s.c.c.ZkStateReader Updated live nodes from ZooKeeper... (0) -> (2)
   [junit4]   2> 286007 INFO  (jetty-launcher-571-thread-1) [n:127.0.0.1:44303_solr    ] o.a.s.c.Overseer Overseer (id=null) closing
   [junit4]   2> 286008 INFO  (jetty-launcher-571-thread-1) [n:127.0.0.1:44303_solr    ] o.a.s.c.ZkController Register node as live in ZooKeeper:/live_nodes/127.0.0.1:44303_solr
   [junit4]   2> 286008 INFO  (zkCallback-588-thread-1-processing-n:127.0.0.1:39685_solr) [n:127.0.0.1:39685_solr    ] o.a.s.c.c.ZkStateReader Updated live nodes from ZooKeeper... (2) -> (3)
   [junit4]   2> 286011 INFO  (zkCallback-586-thread-1-processing-n:127.0.0.1:43349_solr) [n:127.0.0.1:43349_solr    ] o.a.s.c.c.ZkStateReader Updated live nodes from ZooKeeper... (2) -> (3)
   [junit4]   2> 286011 DEBUG (OverseerStateUpdate-98920868805804041-127.0.0.1:39685_solr-n_0000000000) [n:127.0.0.1:39685_solr    ] o.a.s.c.Overseer processMessage: queueSize: 2, message = {
   [junit4]   2>   "operation":"downnode",
   [junit4]   2>   "node_name":"127.0.0.1:44303_solr"} current state version: 0
   [junit4]   2> 286011 DEBUG (OverseerStateUpdate-98920868805804041-127.0.0.1:39685_solr-n_0000000000) [n:127.0.0.1:39685_solr    ] o.a.s.c.o.NodeMutator DownNode state invoked for node: 127.0.0.1:44303_solr
   [junit4]   2> 286017 INFO  (zkCallback-587-thread-1-processing-n:127.0.0.1:44303_solr) [n:127.0.0.1:44303_solr    ] o.a.s.c.c.ZkStateReader Updated live nodes from ZooKeeper... (2) -> (3)
   [junit4]   2> 286035 INFO  (jetty-launcher-571-thread-2) [n:127.0.0.1:43349_solr    ] o.a.s.m.r.SolrJmxReporter JMX monitoring for 'solr_43349.solr.node' (registry 'solr.node') enabled at server: com.sun.jmx.mbeanserver.JmxMBeanServer@1a9c34a
   [junit4]   2> 286043 INFO  (jetty-launcher-571-thread-2) [n:127.0.0.1:43349_solr    ] o.a.s.m.r.SolrJmxReporter JMX monitoring for 'solr_43349.solr.jvm' (registry 'solr.jvm') enabled at server: com.sun.jmx.mbeanserver.JmxMBeanServer@1a9c34a
   [junit4]   2> 286048 INFO  (jetty-launcher-571-thread-2) [n:127.0.0.1:43349_solr    ] o.a.s.m.r.SolrJmxReporter JMX monitoring for 'solr_43349.solr.jetty' (registry 'solr.jetty') enabled at server: com.sun.jmx.mbeanserver.JmxMBeanServer@1a9c34a
   [junit4]   2> 286049 INFO  (jetty-launcher-571-thread-2) [n:127.0.0.1:43349_solr    ] o.a.s.c.CorePropertiesLocator Found 0 core definitions underneath /home/jenkins/workspace/Lucene-Solr-7.x-Linux/solr/build/solr-core/test/J2/temp/solr.handler.admin.AutoscalingHistoryHandlerTest_DA0EEED0D7C161CC-001/tempDir-001/node2/.
   [junit4]   2> 286112 INFO  (jetty-launcher-571-thread-1) [n:127.0.0.1:44303_solr    ] o.a.s.m.r.SolrJmxReporter JMX monitoring for 'solr_44303.solr.node' (registry 'solr.node') enabled at server: com.sun.jmx.mbeanserver.JmxMBeanServer@1a9c34a
   [junit4]   2> 286120 INFO  (jetty-launcher-571-thread-1) [n:127.0.0.1:44303_solr    ] o.a.s.m.r.SolrJmxReporter JMX monitoring for 'solr_44303.solr.jvm' (registry 'solr.jvm') enabled at server: com.sun.jmx.mbeanserver.JmxMBeanServer@1a9c34a
   [junit4]   2> 286120 INFO  (jetty-launcher-571-thread-1) [n:127.0.0.1:44303_solr    ] o.a.s.m.r.SolrJmxReporter JMX monitoring for 'solr_44303.solr.jetty' (registry 'solr.jetty') enabled at server: com.sun.jmx.mbeanserver.JmxMBeanServer@1a9c34a
   [junit4]   2> 286121 INFO  (jetty-launcher-571-thread-1) [n:127.0.0.1:44303_solr    ] o.a.s.c.CorePropertiesLocator Found 0 core definitions underneath /home/jenkins/workspace/Lucene-Solr-7.x-Linux/solr/build/solr-core/test/J2/temp/solr.handler.admin.AutoscalingHistoryHandlerTest_DA0EEED0D7C161CC-001/tempDir-001/node1/.
   [junit4]   2> 286180 INFO  (jetty-launcher-571-thread-3) [n:127.0.0.1:39685_solr    ] o.a.s.m.r.SolrJmxReporter JMX monitoring for 'solr_39685.solr.node' (registry 'solr.node') enabled at server: com.sun.jmx.mbeanserver.JmxMBeanServer@1a9c34a
   [junit4]   2> 286189 INFO  (jetty-launcher-571-thread-3) [n:127.0.0.1:39685_solr    ] o.a.s.m.r.SolrJmxReporter JMX monitoring for 'solr_39685.solr.jvm' (registry 'solr.jvm') enabled at server: com.sun.jmx.mbeanserver.JmxMBeanServer@1a9c34a
   [junit4]   2> 286189 INFO  (jetty-launcher-571-thread-3) [n:127.0.0.1:39685_solr    ] o.a.s.m.r.SolrJmxReporter JMX monitoring for 'solr_39685.solr.jetty' (registry 'solr.jetty') enabled at server: com.sun.jmx.mbeanserver.JmxMBeanServer@1a9c34a
   [junit4]   2> 286190 INFO  (jetty-launcher-571-thread-3) [n:127.0.0.1:39685_solr    ] o.a.s.c.CorePropertiesLocator Found 0 core definitions underneath /home/jenkins/workspace/Lucene-Solr-7.x-Linux/solr/build/solr-core/test/J2/temp/solr.handler.admin.AutoscalingHistoryHandlerTest_DA0EEED0D7C161CC-001/tempDir-001/node3/.
   [junit4]   2> 286218 INFO  (SUITE-AutoscalingHistoryHandlerTest-seed#[DA0EEED0D7C161CC]-worker) [    ] o.a.s.c.c.ZkStateReader Updated live nodes from ZooKeeper... (0) -> (3)
   [junit4]   2> 286218 INFO  (SUITE-AutoscalingHistoryHandlerTest-seed#[DA0EEED0D7C161CC]-worker) [    ] o.a.s.c.s.i.ZkClientClusterStateProvider Cluster at 127.0.0.1:37089/solr ready
   [junit4]   2> 286254 INFO  (qtp2117947-5183) [n:127.0.0.1:43349_solr    ] o.a.s.h.a.CollectionsHandler Invoked Collection Action :create with params replicationFactor=3&name=AutoscalingHistoryHandlerTest_collection&nrtReplicas=3&action=CREATE&numShards=1&wt=javabin&version=2 and sendToOCPQueue=true
   [junit4]   2> 286256 INFO  (OverseerThreadFactory-1394-thread-1-processing-n:127.0.0.1:39685_solr) [n:127.0.0.1:39685_solr    ] o.a.s.c.CreateCollectionCmd Create collection AutoscalingHistoryHandlerTest_collection
   [junit4]   2> 286256 INFO  (OverseerThreadFactory-1394-thread-1-processing-n:127.0.0.1:39685_solr) [n:127.0.0.1:39685_solr    ] o.a.s.c.CreateCollectionCmd Only _default config set found, using it.
   [junit4]   2> 286256 INFO  (OverseerThreadFactory-1394-thread-1-processing-n:127.0.0.1:39685_solr) [n:127.0.0.1:39685_solr    ] o.a.s.c.c.ZkConfigManager Copying zk node /configs/_default/protwords.txt to /configs/AutoscalingHistoryHandlerTest_collection/protwords.txt
   [junit4]   2> 286257 INFO  (OverseerThreadFactory-1394-thread-1-processing-n:127.0.0.1:39685_solr) [n:127.0.0.1:39685_solr    ] o.a.s.c.c.ZkConfigManager Copying zk node /configs/_default/managed-schema to /configs/AutoscalingHistoryHandlerTest_collection/managed-schema
   [junit4]   2> 286258 INFO  (OverseerThreadFactory-1394-thread-1-processing-n:127.0.0.1:39685_solr) [n:127.0.0.1:39685_solr    ] o.a.s.c.c.ZkConfigManager Copying zk node /configs/_default/solrconfig.xml to /configs/AutoscalingHistoryHandlerTest_collection/solrconfig.xml
   [junit4]   2> 286259 INFO  (OverseerThreadFactory-1394-thread-1-processing-n:127.0.0.1:39685_solr) [n:127.0.0.1:39685_solr    ] o.a.s.c.c.ZkConfigManager Copying zk node /configs/_default/synonyms.txt to /configs/AutoscalingHistoryHandlerTest_collection/synonyms.txt
   [junit4]   2> 286259 INFO  (OverseerThreadFactory-1394-thread-1-processing-n:127.0.0.1:39685_solr) [n:127.0.0.1:39685_solr    ] o.a.s.c.c.ZkConfigManager Copying zk node /configs/_default/stopwords.txt to /configs/AutoscalingHistoryHandlerTest_collection/stopwords.txt
   [junit4]   2> 286260 INFO  (OverseerThreadFactory-1394-thread-1-processing-n:127.0.0.1:39685_solr) [n:127.0.0.1:39685_solr    ] o.a.s.c.c.ZkConfigManager Copying zk node /configs/_default/lang/contractions_it.txt to /configs/AutoscalingHistoryHandlerTest_collection/lang/contractions_it.txt
   [junit4]   2> 286261 INFO  (OverseerThreadFactory-1394-thread-1-processing-n:127.0.0.1:39685_solr) [n:127.0.0.1:39685_solr    ] o.a.s.c.c.ZkConfigManager Copying zk node /configs/_default/lang/stemdict_nl.txt to /configs/AutoscalingHistoryHandlerTest_collection/lang/stemdict_nl.txt
   [junit4]   2> 286261 INFO  (OverseerThreadFactory-1394-thread-1-processing-n:127.0.0.1:39685_solr) [n:127.0.0.1:39685_solr    ] o.a.s.c.c.ZkConfigManager Copying zk node /configs/_default/lang/stopwords_hy.txt to /configs/AutoscalingHistoryHandlerTest_collection/lang/stopwords_hy.txt
   [junit4]   2> 286262 INFO  (OverseerThreadFactory-1394-thread-1-processing-n:127.0.0.1:39685_solr) [n:127.0.0.1:39685_solr    ] o.a.s.c.c.ZkConfigManager Copying zk node /configs/_default/lang/stopwords_no.txt to /configs/AutoscalingHistoryHandlerTest_collection/lang/stopwords_no.txt
   [junit4]   2> 286262 INFO  (OverseerThreadFactory-1394-thread-1-processing-n:127.0.0.1:39685_solr) [n:127.0.0.1:39685_solr    ] o.a.s.c.c.ZkConfigManager Copying zk node /configs/_default/lang/contractions_ca.txt to /configs/AutoscalingHistoryHandlerTest_collection/lang/contractions_ca.txt
   [junit4]   2> 286265 INFO  (OverseerThreadFactory-1394-thread-1-processing-n:127.0.0.1:39685_solr) [n:127.0.0.1:39685_solr    ] o.a.s.c.c.ZkConfigManager Copying zk node /configs/_default/lang/stopwords_id.txt to /configs/AutoscalingHistoryHandlerTest_collection/lang/stopwords_id.txt
   [junit4]   2> 286266 INFO  (OverseerThreadFactory-1394-thread-1-processing-n:127.0.0.1:39685_solr) [n:127.0.0.1:39685_solr    ] o.a.s.c.c.ZkConfigManager Copying zk node /configs/_default/lang/stopwords_ga.txt to /configs/AutoscalingHistoryHandlerTest_collection/lang/stopwords_ga.txt
   [junit4]   2> 286267 INFO  (OverseerThreadFactory-1394-thread-1-processing-n:127.0.0.1:39685_solr) [n:127.0.0.1:39685_solr    ] o.a.s.c.c.ZkConfigManager Copying zk node /configs/_default/lang/stopwords_hi.txt to /configs/AutoscalingHistoryHandlerTest_collection/lang/stopwords_hi.txt
   [junit4]   2> 286267 INFO  (OverseerThreadFactory-1394-thread-1-processing-n:127.0.0.1:39685_solr) [n:127.0.0.1:39685_solr    ] o.a.s.c.c.ZkConfigManager Copying zk node /configs/_default/lang/stopwords_da.txt to /configs/AutoscalingHistoryHandlerTest_collection/lang/stopwords_da.txt
   [junit4]   2> 286268 INFO  (OverseerThreadFactory-1394-thread-1-processing-n:127.0.0.1:39685_solr) [n:127.0.0.1:39685_solr    ] o.a.s.c.c.ZkConfigManager Copying zk node /configs/_default/lang/stopwords_ja.txt to /configs/AutoscalingHistoryHandlerTest_collection/lang/stopwords_ja.txt
   [junit4]   2> 286268 INFO  (OverseerThreadFactory-1394-thread-1-processing-n:127.0.0.1:39685_solr) [n:127.0.0.1:39685_solr    ] o.a.s.c.c.ZkConfigManager Copying zk node /configs/_default/lang/stopwords_pt.txt to /configs/AutoscalingHistoryHandlerTest_collection/lang/stopwords_pt.txt
   [junit4]   2> 286269 INFO  (OverseerThreadFactory-1394-thread-1-processing-n:127.0.0.1:39685_solr) [n:127.0.0.1:39685_solr    ] o.a.s.c.c.ZkConfigManager Copying zk node /configs/_default/lang/stopwords_hu.txt to /configs/AutoscalingHistoryHandlerTest_collection/lang/stopwords_hu.txt
   [junit4]   2> 286269 INFO  (OverseerThreadFactory-1394-thread-1-processing-n:127.0.0.1:39685_solr) [n:127.0.0.1:39685_solr    ] o.a.s.c.c.ZkConfigManager Copying zk node /configs/_default/lang/stopwords_el.txt to /configs/AutoscalingHistoryHandlerTest_collection/lang/stopwords_el.txt
   [junit4]   2> 286270 INFO  (OverseerThreadFactory-1394-thread-1-processing-n:127.0.0.1:39685_solr) [n:127.0.0.1:39685_solr    ] o.a.s.c.c.ZkConfigManager Copying zk node /configs/_default/lang/stopwords_ru.txt to /configs/AutoscalingHistoryHandlerTest_collection/lang/stopwords_ru.txt
   [junit4]   2> 286270 INFO  (OverseerThreadFactory-1394-thread-1-processing-n:127.0.0.1:39685_solr) [n:127.0.0.1:39685_solr    ] o.a.s.c.c.ZkConfigManager Copying zk node /configs/_default/lang/stopwords_tr.txt to /configs/AutoscalingHistoryHandlerTest_collection/lang/stopwords_tr.txt
   [junit4]   2> 286271 INFO  (OverseerThreadFactory-1394-thread-1-processing-n:127.0.0.1:39685_solr) [n:127.0.0.1:39685_solr    ] o.a.s.c.c.ZkConfigManager Copying zk node /configs/_default/lang/stopwords_ar.txt to /configs/AutoscalingHistoryHandlerTest_collection/lang/stopwords_ar.txt
   [junit4]   2> 286271 INFO  (OverseerThreadFactory-1394-thread-1-processing-n:127.0.0.1:39685_solr) [n:127.0.0.1:39685_solr    ] o.a.s.c.c.ZkConfigManager Copying zk node /configs/_default/lang/userdict_ja.txt to /configs/AutoscalingHistoryHandlerTest_collection/lang/userdict_ja.txt
   [junit4]   2> 286272 INFO  (OverseerThreadFactory-1394-thread-1-processing-n:127.0.0.1:39685_solr) [n:127.0.0.1:39685_solr    ] o.a.s.c.c.ZkConfigManager Copying zk node /configs/_default/lang/stopwords_eu.txt to /configs/AutoscalingHistoryHandlerTest_collection/lang/stopwords_eu.txt
   [junit4]   2> 286273 INFO  (OverseerThreadFactory-1394-thread-1-processing-n:127.0.0.1:39685_solr) [n:127.0.0.1:39685_solr    ] o.a.s.c.c.ZkConfigManager Copying zk node /configs/_default/lang/stopwords_it.txt to /configs/AutoscalingHistoryHandlerTest_collection/lang/stopwords_it.txt
   [junit4]   2> 286273 INFO  (OverseerThreadFactory-1394-thread-1-processing-n:127.0.0.1:39685_solr) [n:127.0.0.1:39685_solr    ] o.a.s.c.c.ZkConfigManager Copying zk node /configs/_default/lang/stopwords_cz.txt to /configs/AutoscalingHistoryHandlerTest_collection/lang/stopwords_cz.txt
   [junit4]   2> 286274 INFO  (OverseerThreadFactory-1394-thread-1-processing-n:127.0.0.1:39685_solr) [n:127.0.0.1:39685_solr    ] o.a.s.c.c.ZkConfigManager Copying zk node /configs/_default/lang/stoptags_ja.txt to /configs/AutoscalingHistoryHandlerTest_collection/lang/stoptags_ja.txt
   [junit4]   2> 286274 INFO  (OverseerThreadFactory-1394-thread-1-processing-n:127.0.0.1:39685_solr) [n:127.0.0.1:39685_solr    ] o.a.s.c.c.ZkConfigManager Copying zk node /configs/_default/lang/contractions_fr.txt to /configs/AutoscalingHistoryHandlerTest_collection/lang/contractions_fr.txt
   [junit4]   2> 286275 INFO  (OverseerThreadFactory-1394-thread-1-processing-n:127.0.0.1:39685_solr) [n:127.0.0.1:39685_solr    ] o.a.s.c.c.ZkConfigManager Copying zk node /configs/_default/lang/stopwords_de.txt to /configs/AutoscalingHistoryHandlerTest_collection/lang/stopwords_de.txt
   [junit4]   2> 286275 INFO  (OverseerThreadFactory-1394-thread-1-processing-n:127.0.0.1:39685_solr) [n:127.0.0.1:39685_solr    ] o.a.s.c.c.ZkConfigManager Copying zk node /configs/_default/lang/stopwords_fa.txt to /configs/AutoscalingHistoryHandlerTest_collection/lang/stopwords_fa.txt
   [junit4]   2> 286276 INFO  (OverseerThreadFactory-1394-thread-1-processing-n:127.0.0.1:39685_solr) [n:127.0.0.1:39685_solr    ] o.a.s.c.c.ZkConfigManager Copying zk node /configs/_default/lang/contractions_ga.txt to /configs/AutoscalingHistoryHandlerTest_collection/lang/contractions_ga.txt
   [junit4]   2> 286276 INFO  (OverseerThreadFactory-1394-thread-1-processing-n:127.0.0.1:39685_solr) [n:127.0.0.1:39685_solr    ] o.a.s.c.c.ZkConfigManager Copying zk node /configs/_default/lang/stopwords_ca.txt to /configs/AutoscalingHistoryHandlerTest_collection/lang/stopwords_ca.txt
   [junit4]   2> 286277 INFO  (OverseerThreadFactory-1394-thread-1-processing-n:127.0.0.1:39685_solr) [n:127.0.0.1:39685_solr    ] o.a.s.c.c.ZkConfigManager Copying zk node /configs/_default/lang/stopwords_nl.txt to /configs/AutoscalingHistoryHandlerTest_collection/lang/stopwords_nl.txt
   [junit4]   2> 286277 INFO  (OverseerThreadFactory-1394-thread-1-processing-n:127.0.0.1:39685_solr) [n:127.0.0.1:39685_solr    ] o.a.s.c.c.ZkConfigManager Copying zk node /configs/_default/lang/stopwords_bg.txt to /configs/AutoscalingHistoryHandlerTest_collection/lang/stopwords_bg.txt
   [junit4]   2> 286278 INFO  (OverseerThreadFactory-1394-thread-1-processing-n:127.0.0.1:39685_solr) [n:127.0.0.1:39685_solr    ] o.a.s.c.c.ZkConfigManager Copying zk node /configs/_default/lang/stopwords_lv.txt to /configs/AutoscalingHistoryHandlerTest_collection/lang/stopwords_lv.txt
   [junit4]   2> 286278 INFO  (OverseerThreadFactory-1394-thread-1-processing-n:127.0.0.1:39685_solr) [n:127.0.0.1:39685_solr    ] o.a.s.c.c.ZkConfigManager Copying zk node /configs/_default/lang/stopwords_en.txt to /configs/AutoscalingHistoryHandlerTest_collection/lang/stopwords_en.txt
   [junit4]   2> 286279 INFO  (OverseerThreadFactory-1394-thread-1-processing-n:127.0.0.1:39685_solr) [n:127.0.0.1:39685_solr    ] o.a.s.c.c.ZkConfigManager Copying zk node /configs/_default/lang/stopwords_es.txt to /configs/AutoscalingHistoryHandlerTest_collection/lang/stopwords_es.txt
   [junit4]   2> 286279 INFO  (OverseerThreadFactory-1394-thread-1-processing-n:127.0.0.1:39685_solr) [n:127.0.0.1:39685_solr    ] o.a.s.c.c.ZkConfigManager Copying zk node /configs/_default/lang/stopwords_th.txt to /configs/AutoscalingHistoryHandlerTest_collection/lang/stopwords_th.txt
   [junit4]   2> 286280 INFO  (OverseerThreadFactory-1394-thread-1-processing-n:127.0.0.1:39685_solr) [n:127.0.0.1:39685_solr    ] o.a.s.c.c.ZkConfigManager Copying zk node /configs/_default/lang/stopwords_ro.txt to /configs/AutoscalingHistoryHandlerTest_collection/lang/stopwords_ro.txt
   [junit4]   2> 286280 INFO  (OverseerThreadFactory-1394-thread-1-processing-n:127.0.0.1:39685_solr) [n:127.0.0.1:39685_solr    ] o.a.s.c.c.ZkConfigManager Copying zk node /configs/_default/lang/stopwords_fr.txt to /configs/AutoscalingHistoryHandlerTest_collection/lang/stopwords_fr.txt
   [junit4]   2> 286281 INFO  (OverseerThreadFactory-1394-thread-1-processing-n:127.0.0.1:39685_solr) [n:127.0.0.1:39685_solr    ] o.a.s.c.c.ZkConfigManager Copying zk node /configs/_default/lang/stopwords_sv.txt to /configs/AutoscalingHistoryHandlerTest_collection/lang/stopwords_sv.txt
   [junit4]   2> 286282 INFO  (OverseerThreadFactory-1394-thread-1-processing-n:127.0.0.1:39685_solr) [n:127.0.0.1:39685_solr    ] o.a.s.c.c.ZkConfigManager Copying zk node /configs/_default/lang/stopwords_fi.txt to /configs/AutoscalingHistoryHandlerTest_collection/lang/stopwords_fi.txt
   [junit4]   2> 286285 INFO  (OverseerThreadFactory-1394-thread-1-processing-n:127.0.0.1:39685_solr) [n:127.0.0.1:39685_solr    ] o.a.s.c.c.ZkConfigManager Copying zk node /configs/_default/lang/hyphenations_ga.txt to /configs/AutoscalingHistoryHandlerTest_collection/lang/hyphenations_ga.txt
   [junit4]   2> 286286 INFO  (OverseerThreadFactory-1394-thread-1-processing-n:127.0.0.1:39685_solr) [n:127.0.0.1:39685_solr    ] o.a.s.c.c.ZkConfigManager Copying zk node /configs/_default/lang/stopwords_gl.txt to /configs/AutoscalingHistoryHandlerTest_collection/lang/stopwords_gl.txt
   [junit4]   2> 286287 INFO  (OverseerThreadFactory-1394-thread-1-processing-n:127.0.0.1:39685_solr) [n:127.0.0.1:39685_solr    ] o.a.s.c.c.ZkConfigManager Copying zk node /configs/_default/params.json to /configs/AutoscalingHistoryHandlerTest_collection/params.json
   [junit4]   2> 286289 DEBUG (OverseerStateUpdate-98920868805804041-127.0.0.1:39685_solr-n_0000000000) [n:127.0.0.1:39685_solr    ] o.a.s.c.Overseer processMessage: queueSize: 1, message = {
   [junit4]   2>   "name":"AutoscalingHistoryHandlerTest_collection",
   [junit4]   2>   "fromApi":"true",
   [junit4]   2>   "replicationFactor":"3",
   [junit4]   2>   "numShards":"1",
   [junit4]   2>   "nrtReplicas":"3",
   [junit4]   2>   "stateFormat":"2",
   [junit4]   2>   "operation":"create"} current state version: 0
   [junit4]   2> 286289 DEBUG (OverseerStateUpdate-98920868805804041-127.0.0.1:39685_solr-n_0000000000) [n:127.0.0.1:39685_solr    ] o.a.s.c.o.ClusterStateMutator building a new cName: AutoscalingHistoryHandlerTest_collection
   [junit4]   2> 286289 DEBUG (OverseerStateUpdate-98920868805804041-127.0.0.1:39685_solr-n_0000000000) [n:127.0.0.1:39685_solr    ] o.a.s.c.o.ZkStateWriter going to create_collection /collections/AutoscalingHistoryHandlerTest_collection/state.json
   [junit4]   2> 286392 DEBUG (OverseerStateUpdate-98920868805804041-127.0.0.1:39685_solr-n_0000000000) [n:127.0.0.1:39685_solr    ] o.a.s.c.Overseer processMessage: queueSize: 1, message = {
   [junit4]   2>   "operation":"ADDREPLICA",
   [junit4]   2>   "collection":"AutoscalingHistoryHandlerTest_collection",
   [junit4]   2>   "shard":"shard1",
   [junit4]   2>   "core":"AutoscalingHistoryHandlerTest_collection_shard1_replica_n1",
   [junit4]   2>   "state":"down",
   [junit4]   2>   "base_url":"https://127.0.0.1:43349/solr",
   [junit4]   2>   "type":"NRT",
   [junit4]   2>   "waitForFinalState":"false"} current state version: 0
   [junit4]   2> 286392 INFO  (OverseerStateUpdate-98920868805804041-127.0.0.1:39685_solr-n_0000000000) [n:127.0.0.1:39685_solr    ] o.a.s.c.o.SliceMutator createReplica() {
   [junit4]   2>   "operation":"ADDREPLICA",
   [junit4]   2>   "collection":"AutoscalingHistoryHandlerTest_collection",
   [junit4]   2>   "shard":"shard1",
   [junit4]   2>   "core":"AutoscalingHistoryHandlerTest_collection_shard1_replica_n1",
   [junit4]   2>   "state":"down",
   [junit4]   2>   "base_url":"https://127.0.0.1:43349/solr",
   [junit4]   2>   "type":"NRT",
   [junit4]   2>   "waitForFinalState":"false"} 
   [junit4]   2> 286392 DEBUG (OverseerStateUpdate-98920868805804041-127.0.0.1:39685_solr-n_0000000000) [n:127.0.0.1:39685_solr    ] o.a.s.c.o.SliceMutator Old Slice: shard1:{
   [junit4]   2>   "range":"80000000-7fffffff",
   [junit4]   2>   "state":"active",
   [junit4]   2>   "replicas":{}}
   [junit4]   2> 286392 DEBUG (OverseerStateUpdate-98920868805804041-127.0.0.1:39685_solr-n_0000000000) [n:127.0.0.1:39685_solr    ] o.a.s.c.o.SliceMutator New Slice: shard1:{
   [junit4]   2>   "range":"80000000-7fffffff",
   [junit4]   2>   "state":"active",
   [junit4]   2>   "replicas":{"core_node3":{
   [junit4]   2>       "core":"AutoscalingHistoryHandlerTest_collection_shard1_replica_n1",
   [junit4]   2>       "base_url":"https://127.0.0.1:43349/solr",
   [junit4]   2>       "state":"down",
   [junit4]   2>       "node_name":null,
   [junit4]   2>       "type":"NRT"}}}
   [junit4]   2> 286393 DEBUG (OverseerStateUpdate-98920868805804041-127.0.0.1:39685_solr-n_0000000000) [n:127.0.0.1:39685_solr    ] o.a.s.c.Overseer processMessage: queueSize: 2, message = {
   [junit4]   2>   "operation":"ADDREPLICA",
   [junit4]   2>   "collection":"AutoscalingHistoryHandlerTest_collection",
   [junit4]   2>   "shard":"shard1",
   [junit4]   2>   "core":"AutoscalingHistoryHandlerTest_collection_shard1_replica_n2",
   [junit4]   2>   "state":"down",
   [junit4]   2>   "base_url":"https://127.0.0.1:44303/solr",
   [junit4]   2>   "type":"NRT",
   [junit4]   2>   "waitForFinalState":"false"} current state version: 0
   [junit4]   2> 286393 INFO  (OverseerStateUpdate-98920868805804041-127.0.0.1:39685_solr-n_0000000000) [n:127.0.0.1:39685_solr    ] o.a.s.c.o.SliceMutator createReplica() {
   [junit4]   2>   "operation":"ADDREPLICA",
   [junit4]   2>   "collection":"AutoscalingHistoryHandlerTest_collection",
   [junit4]   2>   "shard":"shard1",
   [junit4]   2>   "core":"AutoscalingHistoryHandlerTest_collection_shard1_replica_n2",
   [junit4]   2>   "state":"down",
   [junit4]   2>   "base_url":"https://127.0.0.1:44303/solr",
   [junit4]   2>   "type":"NRT",
   [junit4]   2>   "waitForFinalState":"false"} 
   [junit4]   2> 286393 DEBUG (OverseerStateUpdate-98920868805804041-127.0.0.1:39685_solr-n_0000000000) [n:127.0.0.1:39685_solr    ] o.a.s.c.o.SliceMutator Old Slice: shard1:{
   [junit4]   2>   "range":"80000000-7fffffff",
   [junit4]   2>   "state":"active",
   [junit4]   2>   "replicas":{"core_node3":{
   [junit4]   2>       "core":"AutoscalingHistoryHandlerTest_collection_shard1_replica_n1",
   [junit4]   2>       "base_url":"https://127.0.0.1:43349/solr",
   [junit4]   2>       "state":"down",
   [junit4]   2>       "node_name":null,
   [junit4]   2>       "type":"NRT"}}}
   [junit4]   2> 286393 DEBUG (OverseerStateUpdate-98920868805804041-127.0.0.1:39685_solr-n_0000000000) [n:127.0.0.1:39685_solr    ] o.a.s.c.o.SliceMutator New Slice: shard1:{
   [junit4]   2>   "range":"80000000-7fffffff",
   [junit4]   2>   "state":"active",
   [junit4]   2>   "replicas":{
   [junit4]   2>     "core_node3":{
   [junit4]   2>       "core":"AutoscalingHistoryHandlerTest_collection_shard1_replica_n1",
   [junit4]   2>       "base_url":"https://127.0.0.1:43349/solr",
   [junit4]   2>       "state":"down",
   [junit4]   2>       "node_name":null,
   [junit4]   2>       "type":"NRT"},
   [junit4]   2>     "core_node5":{
   [junit4]   2>       "core":"AutoscalingHistoryHandlerTest_collection_shard1_replica_n2",
   [junit4]   2>       "base_url":"https://127.0.0.1:44303/solr",
   [junit4]   2>       "state":"down",
   [junit4]   2>       "node_name":null,
   [junit4]   2>       "type":"NRT"}}}
   [junit4]   2> 286393 DEBUG (OverseerStateUpdate-98920868805804041-127.0.0.1:39685_solr-n_0000000000) [n:127.0.0.1:39685_solr    ] o.a.s.c.Overseer processMessage: queueSize: 3, message = {
   [junit4]   2>   "operation":"ADDREPLICA",
   [junit4]   2>   "collection":"AutoscalingHistoryHandlerTest_collection",
   [junit4]   2>   "shard":"shard1",
   [junit4]   2>   "core":"AutoscalingHistoryHandlerTest_collection_shard1_replica_n4",
   [junit4]   2>   "state":"down",
   [junit4]   2>   "base_url":"https://127.0.0.1:39685/solr",
   [junit4]   2>   "type":"NRT",
   [junit4]   2>   "waitForFinalState":"false"} current state version: 0
   [junit4]   2> 286393 INFO  (OverseerStateUpdate-98920868805804041-127.0.0.1:39685_solr-n_0000000000) [n:127.0.0.1:39685_solr    ] o.a.s.c.o.SliceMutator createReplica() {
   [junit4]   2>   "operation":"ADDREPLICA",
   [junit4]   2>   "collection":"AutoscalingHistoryHandlerTest_collection",
   [junit4]   2>   "shard":"shard1",
   [junit4]   2>   "core":"AutoscalingHistoryHandlerTest_collection_shard1_replica_n4",
   [junit4]   2>   "state":"down",
   [junit4]   2>   "base_url":"https://127.0.0.1:39685/solr",
   [junit4]   2>   "type":"NRT",
   [junit4]   2>   "waitForFinalState":"false"} 
   [junit4]   2> 286394 DEBUG (OverseerStateUpdate-98920868805804041-127.0.0.1:39685_solr-n_0000000000) [n:127.0.0.1:39685_solr    ] o.a.s.c.o.SliceMutator Old Slice: shard1:{
   [junit4]   2>   "range":"80000000-7fffffff",
   [junit4]   2>   "state":"active",
   [junit4]   2>   "replicas":{
   [junit4]   2>     "core_node3":{
   [junit4]   2>       "core":"AutoscalingHistoryHandlerTest_collection_shard1_replica_n1",
   [junit4]   2>       "base_url":"https://127.0.0.1:43349/solr",
   [junit4]   2>       "state":"down",
   [junit4]   2>       "node_name":null,
   [junit4]   2>       "type":"NRT"},
   [junit4]   2>     "core_node5":{
   [junit4]   2>       "core":"AutoscalingHistoryHandlerTest_collection_shard1_replica_n2",
   [junit4]   2>       "base_url":"https://127.0.0.1:44303/solr",
   [junit4]   2>       "state":"down",
   [junit4]   2>       "node_name":null,
   [junit4]   2>       "type":"NRT"}}}
   [junit4]   2> 286394 DEBUG (OverseerStateUpdate-98920868805804041-127.0.0.1:39685_solr-n_0000000000) [n:127.0.0.1:39685_solr    ] o.a.s.c.o.SliceMutator New Slice: shard1:{
   [junit4]   2>   "range":"80000000-7fffffff",
   [junit4]   2>   "state":"active",
   [junit4]   2>   "replicas":{
   [junit4]   2>     "core_node3":{
   [junit4]   2>       "core":"AutoscalingHistoryHandlerTest_collection_shard1_replica_n1",
   [junit4]   2>       "base_url":"https://127.0.0.1:43349/solr",
   [junit4]   2>       "state":"down",
   [junit4]   2>       "node_name":null,
   [junit4]   2>       "type":"NRT"},
   [junit4]   2>     "core_node5":{
   [junit4]   2>       "core":"AutoscalingHistoryHandlerTest_collection_shard1_replica_n2",
   [junit4]   2>       "base_url":"https://127.0.0.1:44303/solr",
   [junit4]   2>       "state":"down",
   [junit4]   2>       "node_name":null,
   [junit4]   2>       "type":"NRT"},
   [junit4]   2>     "core_node6":{
   [junit4]   2>       "core":"AutoscalingHistoryHandlerTest_collection_shard1_replica_n4",
   [junit4]   2>       "base_url":"https://127.0.0.1:39685/solr",
   [junit4]   2>       "state":"down",
   [junit4]   2>       "node_name":null,
   [junit4]   2>       "type":"NRT"}}}
   [junit4]   2> 286494 DEBUG (OverseerStateUpdate-98920868805804041-127.0.0.1:39685_solr-n_0000000000) [n:127.0.0.1:39685_solr    ] o.a.s.c.o.ZkStateWriter going to update_collection /collections/AutoscalingHistoryHandlerTest_collection/state.json version: 0
   [junit4]   2> 286609 INFO  (qtp2117947-5187) [n:127.0.0.1:43349_solr    ] o.a.s.h.a.CoreAdminOperation core create command qt=/admin/cores&coreNodeName=core_node3&collection.configName=AutoscalingHistoryHandlerTest_collection&newCollection=true&name=AutoscalingHistoryHandlerTest_collection_shard1_replica_n1&action=CREATE&numShards=1&collection=AutoscalingHistoryHandlerTest_collection&shard=shard1&wt=javabin&version=2&replicaType=NRT
   [junit4]   2> 286610 INFO  (qtp2117947-5187) [n:127.0.0.1:43349_solr    ] o.a.s.c.TransientSolrCoreCacheDefault Allocating transient cache for 2147483647 transient cores
   [junit4]   2> 286618 DEBUG (OverseerStateUpdate-98920868805804041-127.0.0.1:39685_solr-n_0000000000) [n:127.0.0.1:39685_solr    ] o.a.s.c.Overseer processMessage: queueSize: 1, message = {
   [junit4]   2>   "core":"AutoscalingHistoryHandlerTest_collection_shard1_replica_n1",
   [junit4]   2>   "core_node_name":"core_node3",
   [junit4]   2>   "roles":null,
   [junit4]   2>   "base_url":"https://127.0.0.1:43349/solr",
   [junit4]   2>   "node_name":"127.0.0.1:43349_solr",
   [junit4]   2>   "numShards":"1",
   [junit4]   2>   "state":"down",
   [junit4]   2>   "shard":"shard1",
   [junit4]   2>   "collection":"AutoscalingHistoryHandlerTest_collection",
   [junit4]   2>   "type":"NRT",
   [junit4]   2>   "operation":"state"} current state version: 0
   [junit4]   2> 286618 DEBUG (OverseerStateUpdate-98920868805804041-127.0.0.1:39685_solr-n_0000000000) [n:127.0.0.1:39685_solr    ] o.a.s.c.o.ReplicaMutator Update state numShards=1 message={
   [junit4]   2>   "core":"AutoscalingHistoryHandlerTest_collection_shard1_replica_n1",
   [junit4]   2>   "core_node_name":"core_node3",
   [junit4]   2>   "roles":null,
   [junit4]   2>   "base_url":"https://127.0.0.1:43349/solr",
   [junit4]   2>   "node_name":"127.0.0.1:43349_solr",
   [junit4]   2>   "numShards":"1",
   [junit4]   2>   "state":"down",
   [junit4]   2>   "shard":"shard1",
   [junit4]   2>   "collection":"AutoscalingHistoryHandlerTest_collection",
   [junit4]   2>   "type":"NRT",
   [junit4]   2>   "operation":"state"}
   [junit4]   2> 286618 DEBUG (OverseerStateUpdate-98920868805804041-127.0.0.1:39685_solr-n_0000000000) [n:127.0.0.1:39685_solr    ] o.a.s.c.o.ReplicaMutator Will update state for replica: core_node3:{"core":"AutoscalingHistoryHandlerTest_collection_shard1_replica_n1","base_url":"https://127.0.0.1:43349/solr","node_name":"127.0.0.1:43349_solr","state":"down","type":"NRT"}
   [junit4]   2> 286618 DEBUG (OverseerStateUpdate-98920868805804041-127.0.0.1:39685_solr-n_0000000000) [n:127.0.0.1:39685_solr    ] o.a.s.c.o.ReplicaMutator Collection is now: DocCollection(AutoscalingHistoryHandlerTest_collection//collections/AutoscalingHistoryHandlerTest_collection/state.json/1)={
   [junit4]   2>   "pullReplicas":"0",
   [junit4]   2>   "replicationFactor":"3",
   [junit4]   2>   "router":{"name":"compositeId"},
   [junit4]   2>   "maxShardsPerNode":"1",
   [junit4]   2>   "autoAddReplicas":"false",
   [junit4]   2>   "nrtReplicas":"3",
   [junit4]   2>   "tlogReplicas":"0",
   [junit4]   2>   "shards":{"shard1":{
   [junit4]   2>       "range":"80000000-7fffffff",
   [junit4]   2>       "state":"active",
   [junit4]   2>       "replicas":{
   [junit4]   2>         "core_node3":{
   [junit4]   2>           "core":"AutoscalingHistoryHandlerTest_collection_shard1_replica_n1",
   [junit4]   2>           "base_url":"https://127.0.0.1:43349/solr",
   [junit4]   2>           "node_name":"127.0.0.1:43349_solr",
   [junit4]   2>           "state":"down",
   [junit4]   2>           "type":"NRT"},
   [junit4]   2>         "core_node5":{
   [junit4]   2>           "core":"AutoscalingHistoryHandlerTest_collection_shard1_replica_n2",
   [junit4]   2>           "base_url":"https://127.0.0.1:44303/solr",
   [junit4]   2>           "state":"down",
   [junit4]   2>           "node_name":null,
   [junit4]   2>           "type":"NRT"},
   [junit4]   2>         "core_node6":{
   [junit4]   2>           "core":"AutoscalingHistoryHandlerTest_collection_shard1_replica_n4",
   [junit4]   2>           "base_url":"https://127.0.0.1:39685/solr",
   [junit4]   2>           "state":"down",
   [junit4]   2>           "node_name":null,
   [junit4]   2>           "type":"NRT"}}}}}
   [junit4]   2> 286658 INFO  (qtp5844531-5182) [n:127.0.0.1:39685_solr    ] o.a.s.h.a.CoreAdminOperation core create command qt=/admin/cores&coreNodeName=core_node6&collection.configName=AutoscalingHistoryHandlerTest_collection&newCollection=true&name=AutoscalingHistoryHandlerTest_collection_shard1_replica_n4&action=CREATE&numShards=1&collection=AutoscalingHistoryHandlerTest_collection&shard=shard1&wt=javabin&version=2&replicaType=NRT
   [junit4]   2> 286659 INFO  (qtp5844531-5182) [n:127.0.0.1:39685_solr    ] o.a.s.c.TransientSolrCoreCacheDefault Allocating transient cache for 2147483647 transient cores
   [junit4]   2> 286663 INFO  (qtp33509775-5185) [n:127.0.0.1:44303_solr    ] o.a.s.h.a.CoreAdminOperation core create command qt=/admin/cores&coreNodeName=core_node5&collection.configName=AutoscalingHistoryHandlerTest_collection&newCollection=true&name=AutoscalingHistoryHandlerTest_collection_shard1_replica_n2&action=CREATE&numShards=1&collection=AutoscalingHistoryHandlerTest_collection&shard=shard1&wt=javabin&version=2&replicaType=NRT
   [junit4]   2> 286663 INFO  (qtp33509775-5185) [n:127.0.0.1:44303_solr    ] o.a.s.c.TransientSolrCoreCacheDefault Allocating transient cache for 2147483647 transient cores
   [junit4]   2> 286664 DEBUG (OverseerStateUpdate-98920868805804041-127.0.0.1:39685_solr-n_0000000000) [n:127.0.0.1:39685_solr    ] o.a.s.c.Overseer processMessage: queueSize: 2, message = {
   [junit4]   2>   "core":"AutoscalingHistoryHandlerTest_collection_shard1_replica_n4",
   [junit4]   2>   "core_node_name":"core_node6",
   [junit4]   2>   "roles":null,
   [junit4]   2>   "base_url":"https://127.0.0.1:39685/solr",
   [junit4]   2>   "node_name":"127.0.0.1:39685_solr",
   [junit4]   2>   "numShards":"1",
   [junit4]   2>   "state":"down",
   [junit4]   2>   "shard":"shard1",
   [junit4]   2>   "collection":"AutoscalingHistoryHandlerTest_collection",
   [junit4]   2>   "type":"NRT",
   [junit4]   2>   "operation":"state"} current state version: 0
   [junit4]   2> 286664 DEBUG (OverseerStateUpdate-98920868805804041-127.0.0.1:39685_solr-n_0000000000) [n:127.0.0.1:39685_solr    ] o.a.s.c.o.ReplicaMutator Update state numShards=1 message={
   [junit4]   2>   "core":"AutoscalingHistoryHandlerTest_collection_shard1_replica_n4",
   [junit4]   2>   "core_node_name":"core_node6",
   [junit4]   2>   "roles":null,
   [junit4]   2>   "base_url":"https://127.0.0.1:39685/solr",
   [junit4]   2>   "node_name":"127.0.0.1:39685_solr",
   [junit4]   2>   "numShards":"1",
   [junit4]   2>   "state":"down",
   [junit4]   2>   "shard":"shard1",
   [junit4]   2>   "collection":"AutoscalingHistoryHandlerTest_collection",
   [junit4]   2>   "type":"NRT",
   [junit4]   2>   "operation":"state"}
   [junit4]   2> 286664 DEBUG (OverseerStateUpdate-98920868805804041-127.0.0.1:39685_solr-n_0000000000) [n:127.0.0.1:39685_solr    ] o.a.s.c.o.ReplicaMutator Will update state for replica: core_node6:{"core":"AutoscalingHistoryHandlerTest_collection_shard1_replica_n4","base_url":"https://127.0.0.1:39685/solr","node_name":"127.0.0.1:39685_solr","state":"down","type":"NRT"}
   [junit4]   2> 286664 DEBUG (OverseerStateUpdate-98920868805804041-127.0.0.1:39685_solr-n_0000000000) [n:127.0.0.1:39685_solr    ] o.a.s.c.o.ReplicaMutator Collection is now: DocCollection(AutoscalingHistoryHandlerTest_collection//collections/AutoscalingHistoryHandlerTest_collection/state.json/1)={
   [junit4]   2>   "pullReplicas":"0",
   [junit4]   2>   "replicationFactor":"3",
   [junit4]   2>   "router":{"name":"compositeId"},
   [junit4]   2>   "maxShardsPerNode":"1",
   [junit4]   2>   "autoAddReplicas":"false",
   [junit4]   2>   "nrtReplicas":"3",
   [junit4]   2>   "tlogReplicas":"0",
   [junit4]   2>   "shards":{"shard1":{
   [junit4]   2>       "range":"80000000-7fffffff",
   [junit4]   2>       "state":"active",
   [junit4]   2>       "replicas":{
   [junit4]   2>         "core_node3":{
   [junit4]   2>           "core":"AutoscalingHistoryHandlerTest_collection_shard1_replica_n1",
   [junit4]   2>           "base_url":"https://127.0.0.1:43349/solr",
   [junit4]   2>           "node_name":"127.0.0.1:43349_solr",
   [junit4]   2>           "state":"down",
   [junit4]   2>           "type":"NRT"},
   [junit4]   2>         "core_node5":{
   [junit4]   2>           "core":"AutoscalingHistoryHandlerTest_collection_shard1_replica_n2",
   [junit4]   2>           "base_url":"https://127.0.0.1:44303/solr",
   [junit4]   2>           "state":"down",
   [junit4]   2>           "node_name":null,
   [junit4]   2>           "type":"NRT"},
   [junit4]   2>         "core_node6":{
   [junit4]   2>           "core":"AutoscalingHistoryHandlerTest_collection_shard1_replica_n4",
   [junit4]   2>           "base_url":"https://127.0.0.1:39685/solr",
   [junit4]   2>           "node_name":"127.0.0.1:39685_solr",
   [junit4]   2>           "state":"down",
   [junit4]   2>           "type":"NRT"}}}}}
   [junit4]   2> 286666 DEBUG (OverseerStateUpdate-98920868805804041-127.0.0.1:39685_solr-n_0000000000) [n:127.0.0.1:39685_solr    ] o.a.s.c.Overseer processMessage: queueSize: 3, message = {
   [junit4]   2>   "core":"AutoscalingHistoryHandlerTest_collection_shard1_replica_n2",
   [junit4]   2>   "core_node_name":"core_node5",
   [junit4]   2>   "roles":null,
   [junit4]   2>   "base_url":"https://127.0.0.1:44303/solr",
   [junit4]   2>   "node_name":"127.0.0.1:44303_solr",
   [junit4]   2>   "numShards":"1",
   [junit4]   2>   "state":"down",
   [junit4]   2>   "shard":"shard1",
   [junit4]   2>   "collection":"AutoscalingHistoryHandlerTest_collection",
   [junit4]   2>   "type":"NRT",
   [junit4]   2>   "operation":"state"} current state version: 0
   [junit4]   2> 286666 DEBUG (OverseerStateUpdate-98920868805804041-127.0.0.1:39685_solr-n_0000000000) [n:127.0.0.1:39685_solr    ] o.a.s.c.o.ReplicaMutator Update state numShards=1 message={
   [junit4]   2>   "core":"AutoscalingHistoryHandlerTest_collection_shard1_replica_n2",
   [junit4]   2>   "core_node_name":"core_node5",
   [junit4]   2>   "roles":null,
   [junit4]   2>   "base_url":"https://127.0.0.1:44303/solr",
   [junit4]   2>   "node_name":"127.0.0.1:44303_solr",
   [junit4]   2>   "numShards":"1",
   [junit4]   2>   "state":"down",
   [junit4]   2>   "shard":"shard1",
   [junit4]   2>   "collection":"AutoscalingHistoryHandlerTest_collection",
   [junit4]   2>   "type":"NRT",
   [junit4]   2>   "operation":"state"}
   [junit4]   2> 286666 DEBUG (OverseerStateUpdate-98920868805804041-127.0.0.1:39685_solr-n_0000000000) [n:127.0.0.1:39685_solr    ] o.a.s.c.o.ReplicaMutator Will update state for replica: core_node5:{"core":"AutoscalingHistoryHandlerTest_collection_shard1_replica_n2","base_url":"https://127.0.0.1:44303/solr","node_name":"127.0.0.1:44303_solr","state":"down","type":"NRT"}
   [junit4]   2> 286666 DEBUG (OverseerStateUpdate-98920868805804041-127.0.0.1:39685_solr-n_0000000000) [n:127.0.0.1:39685_solr    ] o.a.s.c.o.ReplicaMutator Collection is now: DocCollection(AutoscalingHistoryHandlerTest_collection//collections/AutoscalingHistoryHandlerTest_collection/state.json/1)={
   [junit4]   2>   "pullReplicas":"0",
   [junit4]   2>   "replicationFactor":"3",
   [junit4]   2>   "router":{"name":"compositeId"},
   [junit4]   2>   "maxShardsPerNode":"1",
   [junit4]   2>   "autoAddReplicas":"false",
   [junit4]   2>   "nrtReplicas":"3",
   [junit4]   2>   "tlogReplicas":"0",
   [junit4]   2>   "shards":{"shard1":{
   [junit4]   2>       "range":"80000000-7fffffff",
   [junit4]   2>       "state":"active",
   [junit4]   2>       "replicas":{
   [junit4]   2>         "core_node3":{
   [junit4]   2>           "core":"AutoscalingHistoryHandlerTest_collection_shard1_replica_n1",
   [junit4]   2>           "base_url":"https://127.0.0.1:43349/solr",
   [junit4]   2>           "node_name":"127.0.0.1:43349_solr",
   [junit4]   2>           "state":"down",
   [junit4]   2>           "type":"NRT"},
   [junit4]   2>         "core_node5":{
   [junit4]   2>           "core":"AutoscalingHistoryHandlerTest_collection_shard1_replica_n2",
   [junit4]   2>           "base_url":"https://127.0.0.1:44303/solr",
   [junit4]   2>           "node_name":"127.0.0.1:44303_solr",
   [junit4]   2>           "state":"down",
   [junit4]   2>           "type":"NRT"},
   [junit4]   2>         "core_node6":{
   [junit4]   2>           "core":"AutoscalingHistoryHandlerTest_collection_shard1_replica_n4",
   [junit4]   2>           "base_url":"https://127.0.0.1:39685/solr",
   [junit4]   2>           "node_name":"127.0.0.1:39685_solr",
   [junit4]   2>           "state":"down",
   [junit4]   2>           "type":"NRT"}}}}}
   [junit4]   2> 286766 DEBUG (OverseerStateUpdate-98920868805804041-127.0.0.1:39685_solr-n_0000000000) [n:127.0.0.1:39685_solr    ] o.a.s.c.o.ZkStateWriter going to update_collection /collections/AutoscalingHistoryHandlerTest_collection/state.json version: 1
   [junit4]   2> 286767 INFO  (zkCallback-588-thread-1-processing-n:127.0.0.1:39685_solr) [n:127.0.0.1:39685_solr    ] o.a.s.c.c.ZkStateReader A cluster state change: [WatchedEvent state:SyncConnected type:NodeDataChanged path:/collections/AutoscalingHistoryHandlerTest_collection/state.json] for collection [AutoscalingHistoryHandlerTest_collection] has occurred - updating... (live nodes size: [3])
   [junit4]   2> 286767 INFO  (zkCallback-586-thread-1-processing-n:127.0.0.1:43349_solr) [n:127.0.0.1:43349_solr    ] o.a.s.c.c.ZkStateReader A cluster state change: [WatchedEvent state:SyncConnected type:NodeDataChanged path:/collections/AutoscalingHistoryHandlerTest_collection/state.json] for collection [AutoscalingHistoryHandlerTest_collection] has occurred - updating... (live nodes size: [3])
   [junit4]   2> 286767 INFO  (zkCallback-587-thread-1-processing-n:127.0.0.1:44303_solr) [n:127.0.0.1:44303_solr    ] o.a.s.c.c.ZkStateReader A cluster state change: [WatchedEvent state:SyncConnected type:NodeDataChanged path:/collections/AutoscalingHistoryHandlerTest_collection/state.json] for collection [AutoscalingHistoryHandlerTest_collection] has occurred - updating... (live nodes size: [3])
   [junit4]   2> 286767 INFO  (zkCallback-586-thread-2-processing-n:127.0.0.1:43349_solr) [n:127.0.0.1:43349_solr    ] o.a.s.c.c.ZkStateReader A cluster state change: [WatchedEvent state:SyncConnected type:NodeDataChanged path:/collections/AutoscalingHistoryHandlerTest_collection/state.json] for collection [AutoscalingHistoryHandlerTest_collection] has occurred - updating... (live nodes size: [3])
   [junit4]   2> 286767 INFO  (zkCallback-588-thread-2-processing-n:127.0.0.1:39685_solr) [n:127.0.0.1:39685_solr    ] o.a.s.c.c.ZkStateReader A cluster state change: [WatchedEvent state:SyncConnected type:NodeDataChanged path:/collections/AutoscalingHistoryHandlerTest_collection/state.json] for collection [AutoscalingHistoryHandlerTest_collection] has occurred - updating... (live nodes size: [3])
   [junit4]   2> 286767 INFO  (zkCallback-587-thread-2-processing-n:127.0.0.1:44303_solr) [n:127.0.0.1:44303_solr    ] o.a.s.c.c.ZkStateReader A cluster state change: [WatchedEvent state:SyncConnected type:NodeDataChanged path:/collections/AutoscalingHistoryHandlerTest_collection/state.json] for collection [AutoscalingHistoryHandlerTest_collection] has occurred - updating... (live nodes size: [3])
   [junit4]   2> 286985 DEBUG (ScheduledTrigger-1392-thread-1) [n:127.0.0.1:39685_solr    ] o.a.s.c.a.NodeLostTrigger Running NodeLostTrigger: .auto_add_replicas with currently live nodes: [127.0.0.1:39685_solr, 127.0.0.1:43349_solr, 127.0.0.1:44303_solr]
   [junit4]   2> 287633 INFO  (qtp2117947-5187) [n:127.0.0.1:43349_solr c:AutoscalingHistoryHandlerTest_collection s:shard1 r:core_node3 x:AutoscalingHistoryHandlerTest_collection_shard1_replica_n1] o.a.s.c.RequestParams conf resource params.json loaded . version : 0 
   [junit4]   2> 287633 INFO  (qtp2117947-5187) [n:127.0.0.1:43349_solr c:AutoscalingHistoryHandlerTest_collection s:shard1 r:core_node3 x:AutoscalingHistoryHandlerTest_collection_shard1_replica_n1] o.a.s.c.RequestParams request params refreshed to version 0
   [junit4]   2> 287635 WARN  (qtp2117947-5187) [n:127.0.0.1:43349_solr c:AutoscalingHistoryHandlerTest_collection s:shard1 r:core_node3 x:AutoscalingHistoryHandlerTest_collection_shard1_replica_n1] o.a.s.c.SolrConfig Couldn't add files from /home/jenkins/workspace/Lucene-Solr-7.x-Linux/solr/build/solr-core/test/J2/temp/solr.handler.admin.AutoscalingHistoryHandlerTest_DA0EEED0D7C161CC-001/tempDir-001/node2/AutoscalingHistoryHandlerTest_collection_shard1_replica_n1/../../../../contrib/extraction/lib filtered by .*\.jar to classpath: /home/jenkins/workspace/Lucene-Solr-7.x-Linux/solr/build/solr-core/test/J2/temp/solr.handler.admin.AutoscalingHistoryHandlerTest_DA0EEED0D7C161CC-001/tempDir-001/node2/AutoscalingHistoryHandlerTest_collection_shard1_replica_n1/../../../../contrib/extraction/lib
   [junit4]   2> 287636 WARN  (qtp2117947-5187) [n:127.0.0.1:43349_solr c:AutoscalingHistoryHandlerTest_collection s:shard1 r:core_node3 x:AutoscalingHistoryHandlerTest_collection_shard1_replica_n1] o.a.s.c.SolrConfig Couldn't add files from /home/jenkins/workspace/Lucene-Solr-7.x-Linux/solr/build/solr-core/test/J2/temp/solr.handler.admin.AutoscalingHistoryHandlerTest_DA0EEED0D7C161CC-001/tempDir-001/node2/AutoscalingHistoryHandlerTest_collection_shard1_replica_n1/../../../../dist filtered by solr-cell-\d.*\.jar to classpath: /home/jenkins/workspace/Lucene-Solr-7.x-Linux/solr/build/solr-core/test/J2/temp/solr.handler.admin.AutoscalingHistoryHandlerTest_DA0EEED0D7C161CC-001/tempDir-001/node2/AutoscalingHistoryHandlerTest_collection_shard1_replica_n1/../../../../dist
   [junit4]   2> 287636 WARN  (qtp2117947-5187) [n:127.0.0.1:43349_solr c:AutoscalingHistoryHandlerTest_collection s:shard1 r:core_node3 x:AutoscalingHistoryHandlerTest_collection_shard1_replica_n1] o.a.s.c.SolrConfig Couldn't add files from /home/jenkins/workspace/Lucene-Solr-7.x-Linux/solr/build/solr-core/test/J2/temp/solr.handler.admin.AutoscalingHistoryHandlerTest_DA0EEED0D7C161CC-001/tempDir-001/node2/AutoscalingHistoryHandlerTest_collection_shard1_replica_n1/../../../../contrib/clustering/lib filtered by .*\.jar to classpath: /home/jenkins/workspace/Lucene-Solr-7.x-Linux/solr/build/solr-core/test/J2/temp/solr.handler.admin.AutoscalingHistoryHandlerTest_DA0EEED0D7C161CC-001/tempDir-001/node2/AutoscalingHistoryHandlerTest_collection_shard1_replica_n1/../../../../contrib/clustering/lib
   [junit4]   2> 287636 WARN  (qtp2117947-5187) [n:127.0.0.1:43349_solr c:AutoscalingHistoryHandlerTest_collection s:shard1 r:core_node3 x:AutoscalingHistoryHandlerTest_collection_shard1_replica_n1] o.a.s.c.SolrConfig Couldn't add files from /home/jenkins/workspace/Lucene-Solr-7.x-Linux/solr/build/solr-core/test/J2/temp/solr.handler.admin.AutoscalingHistoryHandlerTest_DA0EEED0D7C161CC-001/tempDir-001/node2/AutoscalingHistoryHandlerTest_collection_shard1_replica_n1/../../../../dist filtered by solr-clustering-\d.*\.jar to classpath: /home/jenkins/workspace/Lucene-Solr-7.x-Linux/solr/build/solr-core/test/J2/temp/solr.handler.admin.AutoscalingHistoryHandlerTest_DA0EEED0D7C161CC-001/tempDir-001/node2/AutoscalingHistoryHandlerTest_collection_shard1_replica_n1/../../../../dist
   [junit4]   2> 287636 WARN  (qtp2117947-5187) [n:127.0.0.1:43349_solr c:AutoscalingHistoryHandlerTest_collection s:shard1 r:core_node3 x:AutoscalingHistoryHandlerTest_collection_shard1_replica_n1] o.a.s.c.SolrConfig Couldn't add files from /home/jenkins/workspace/Lucene-Solr-7.x-Linux/solr/build/solr-core/test/J2/temp/solr.handler.admin.AutoscalingHistoryHandlerTest_DA0EEED0D7C161CC-001/tempDir-001/node2/AutoscalingHistoryHandlerTest_collection_shard1_replica_n1/../../../../contrib/langid/lib filtered by .*\.jar to classpath: /home/jenkins/workspace/Lucene-Solr-7.x-Linux/solr/build/solr-core/test/J2/temp/solr.handler.admin.AutoscalingHistoryHandlerTest_DA0EEED0D7C161CC-001/tempDir-001/node2/AutoscalingHistoryHandlerTest_collection_shard1_replica_n1/../../../../contrib/langid/lib
   [junit4]   2> 287637 WARN  (qtp2117947-5187) [n:127.0.0.1:43349_solr c:AutoscalingHistoryHandlerTest_collection s:shard1 r:core_node3 x:AutoscalingHistoryHandlerTest_collection_shard1_replica_n1] o.a.s.c.SolrConfig Couldn't add files from /home/jenkins/workspace/Lucene-Solr-7.x-Linux/solr/build/solr-core/test/J2/temp/solr.handler.admin.AutoscalingHistoryHandlerTest_DA0EEED0D7C161CC-001/tempDir-001/node2/AutoscalingHistoryHandlerTest_collection_shard1_replica_n1/../../../../dist filtered by solr-langid-\d.*\.jar to classpath: /home/jenkins/workspace/Lucene-Solr-7.x-Linux/solr/build/solr-core/test/J2/temp/solr.handler.admin.AutoscalingHistoryHandlerTest_DA0EEED0D7C161CC-001/tempDir-001/node2/AutoscalingHistoryHandlerTest_collection_shard1_replica_n1/../../../../dist
   [junit4]   2> 287637 WARN  (qtp2117947-5187) [n:127.0.0.1:43349_solr c:AutoscalingHistoryHandlerTest_collection s:shard1 r:core_node3 x:AutoscalingHistoryHandlerTest_collection_shard1_replica_n1] o.a.s.c.SolrConfig Couldn't add files from /home/jenkins/workspace/Lucene-Solr-7.x-Linux/solr/build/solr-core/test/J2/temp/solr.handler.admin.AutoscalingHistoryHandlerTest_DA0EEED0D7C161CC-001/tempDir-001/node2/AutoscalingHistoryHandlerTest_collection_shard1_replica_n1/../../../../contrib/velocity/lib filtered by .*\.jar to classpath: /home/jenkins/workspace/Lucene-Solr-7.x-Linux/solr/build/solr-core/test/J2/temp/solr.handler.admin.AutoscalingHistoryHandlerTest_DA0EEED0D7C161CC-001/tempDir-001/node2/AutoscalingHistoryHandlerTest_collection_shard1_replica_n1/../../../../contrib/velocity/lib
   [junit4]   2> 287637 WARN  (qtp2117947-5187) [n:127.0.0.1:43349_solr c:AutoscalingHistoryHandlerTest_collection s:shard1 r:core_node3 x:AutoscalingHistoryHandlerTest_collection_shard1_replica_n1] o.a.s.c.SolrConfig Couldn't add files from /home/jenkins/workspace/Lucene-Solr-7.x-Linux/solr/build/solr-core/test/J2/temp/solr.handler.admin.AutoscalingHistoryHandlerTest_DA0EEED0D7C161CC-001/tempDir-001/node2/AutoscalingHistoryHandlerTest_collection_shard1_replica_n1/../../../../dist filtered by solr-velocity-\d.*\.jar to classpath: /home/jenkins/workspace/Lucene-Solr-7.x-Linux/solr/build/solr-core/test/J2/temp/solr.handler.admin.AutoscalingHistoryHandlerTest_DA0EEED0D7C161CC-001/tempDir-001/node2/AutoscalingHistoryHandlerTest_collection_shard1_replica_n1/../../../../dist
   [junit4]   2> 287647 INFO  (qtp2117947-5187) [n:127.0.0.1:43349_solr c:AutoscalingHistoryHandlerTest_collection s:shard1 r:core_node3 x:AutoscalingHistoryHandlerTest_collection_shard1_replica_n1] o.a.s.c.SolrConfig Using Lucene MatchVersion: 7.2.0
   [junit4]   2> 287675 INFO  (qtp2117947-5187) [n:127.0.0.1:43349_solr c:AutoscalingHistoryHandlerTest_collection s:shard1 r:core_node3 x:AutoscalingHistoryHandlerTest_collection_shard1_replica_n1] o.a.s.s.IndexSchema [AutoscalingHistoryHandlerTest_collection_shard1_replica_n1] Schema name=default-config
   [junit4]   2> 287675 INFO  (qtp33509775-5185) [n:127.0.0.1:44303_solr c:AutoscalingHistoryHandlerTest_collection s:shard1 r:core_node5 x:AutoscalingHistoryHandlerTest_collection_shard1_replica_n2] o.a.s.c.RequestParams conf resource params.json loaded . version : 0 
   [junit4]   2> 287675 INFO  (qtp33509775-5185) [n:127.0.0.1:44303_solr c:AutoscalingHistoryHandlerTest_collection s:shard1 r:core_node5 x:AutoscalingHistoryHandlerTest_collection_shard1_replica_n2] o.a.s.c.RequestParams request params refreshed to version 0
   [junit4]   2> 287676 WARN  (qtp33509775-5185) [n:127.0.0.1:44303_solr c:AutoscalingHistoryHandlerTest_collection s:shard1 r:core_node5 x:AutoscalingHistoryHandlerTest_collection_shard1_replica_n2] o.a.s.c.SolrConfig Couldn't add files from /home/jenkins/workspace/Lucene-Solr-7.x-Linux/solr/build/solr-core/test/J2/temp/solr.handler.admin.AutoscalingHistoryHandlerTest_DA0EEED0D7C161CC-001/tempDir-001/node1/AutoscalingHistoryHandlerTest_collection_shard1_replica_n2/../../../../contrib/extraction/lib filtered by .*\.jar to classpath: /home/jenkins/workspace/Lucene-Solr-7.x-Linux/solr/build/solr-core/test/J2/temp/solr.handler.admin.AutoscalingHistoryHandlerTest_DA0EEED0D7C161CC-001/tempDir-001/node1/AutoscalingHistoryHandlerTest_collection_shard1_replica_n2/../../../../contrib/extraction/lib
   [junit4]   2> 287677 WARN  (qtp33509775-5185) [n:127.0.0.1:44303_solr c:AutoscalingHistoryHandlerTest_collection s:shard1 r:core_node5 x:AutoscalingHistoryHandlerTest_collection_shard1_replica_n2] o.a.s.c.SolrConfig Couldn't add files from /home/jenkins/workspace/Lucene-Solr-7.x-Linux/solr/build/solr-core/test/J2/temp/solr.handler.admin.AutoscalingHistoryHandlerTest_DA0EEED0D7C161CC-001/tempDir-001/node1/AutoscalingHistoryHandlerTest_collection_shard1_replica_n2/../../../../dist filtered by solr-cell-\d.*\.jar to classpath: /home/jenkins/workspace/Lucene-Solr-7.x-Linux/solr/build/solr-core/test/J2/temp/solr.handler.admin.AutoscalingHistoryHandlerTest_DA0EEED0D7C161CC-001/tempDir-001/node1/AutoscalingHistoryHandlerTest_collection_shard1_replica_n2/../../../../dist
   [junit4]   2> 287678 WARN  (qtp33509775-5185) [n:127.0.0.1:44303_solr c:AutoscalingHistoryHandlerTest_collection s:shard1 r:core_node5 x:AutoscalingHistoryHandlerTest_collection_shard1_replica_n2] o.a.s.c.SolrConfig Couldn't add files from /home/jenkins/workspace/Lucene-Solr-7.x-Linux/solr/build/solr-core/test/J2/temp/solr.handler.admin.AutoscalingHistoryHandlerTest_DA0EEED0D7C161CC-001/tempDir-001/node1/AutoscalingHistoryHandlerTest_collection_shard1_replica_n2/../../../../contrib/clustering/lib filtered by .*\.jar to classpath: /home/jenkins/workspace/Lucene-Solr-7.x-Linux/solr/build/solr-core/test/J2/temp/solr.handler.admin.AutoscalingHistoryHandlerTest_DA0EEED0D7C161CC-001/tempDir-001/node1/AutoscalingHistoryHandlerTest_collection_shard1_replica_n2/../../../../contrib/clustering/lib
   [junit4]   2> 287678 WARN  (qtp33509775-5185) [n:127.0.0.1:44303_solr c:AutoscalingHistoryHandlerTest_collection s:shard1 r:core_node5 x:AutoscalingHistoryHandlerTest_collection_shard1_replica_n2] o.a.s.c.SolrConfig Couldn't add files from /home/jenkins/workspace/Lucene-Solr-7.x-Linux/solr/build/solr-core/test/J2/temp/solr.handler.admin.AutoscalingHistoryHandlerTest_DA0EEED0D7C161CC-001/tempDir-001/node1/AutoscalingHistoryHandlerTest_collection_shard1_replica_n2/../../../../dist filtered by solr-clustering-\d.*\.jar to classpath: /home/jenkins/workspace/Lucene-Solr-7.x-Linux/solr/build/solr-core/test/J2/temp/solr.handler.admin.AutoscalingHistoryHandlerTest_DA0EEED0D7C161CC-001/tempDir-001/node1/AutoscalingHistoryHandlerTest_collection_shard1_replica_n2/../../../../dist
   [junit4]   2> 287678 WARN  (qtp33509775-5185) [n:127.0.0.1:44303_solr c:AutoscalingHistoryHandlerTest_collection s:shard1 r:core_node5 x:AutoscalingHistoryHandlerTest_collection_shard1_replica_n2] o.a.s.c.SolrConfig Couldn't add files from /home/jenkins/workspace/Lucene-Solr-7.x-Linux/solr/build/solr-core/test/J2/temp/solr.handler.admin.AutoscalingHistoryHandlerTest_DA0EEED0D7C161CC-001/tempDir-001/node1/AutoscalingHistoryHandlerTest_collection_shard1_replica_n2/../../../../contrib/langid/lib filtered by .*\.jar to classpath: /home/jenkins/workspace/Lucene-Solr-7.x-Linux/solr/build/solr-core/test/J2/temp/solr.handler.admin.AutoscalingHistoryHandlerTest_DA0EEED0D7C161CC-001/tempDir-001/node1/AutoscalingHistoryHandlerTest_collection_shard1_replica_n2/../../../../contrib/langid/lib
   [junit4]   2> 287678 INFO  (qtp5844531-5182) [n:127.0.0.1:39685_solr c:AutoscalingHistoryHandlerTest_collection s:shard1 r:core_node6 x:AutoscalingHistoryHandlerTest_collection_shard1_replica_n4] o.a.s.c.RequestParams conf resource params.json loaded . version : 0 
   [junit4]   2> 287678 WARN  (qtp33509775-5185) [n:127.0.0.1:44303_solr c:AutoscalingHistoryHandlerTest_collection s:shard1 r:core_node5 x:AutoscalingHistoryHandlerTest_collection_shard1_replica_n2] o.a.s.c.SolrConfig Couldn't add files from /home/jenkins/workspace/Lucene-Solr-7.x-Linux/solr/build/solr-core/test/J2/temp/solr.handler.admin.AutoscalingHistoryHandlerTest_DA0EEED0D7C161CC-001/tempDir-001/node1/AutoscalingHistoryHandlerTest_collection_shard1_replica_n2/../../../../dist filtered by solr-langid-\d.*\.jar to classpath: /home/jenkins/workspace/Lucene-Solr-7.x-Linux/solr/build/solr-core/test/J2/temp/solr.handler.admin.AutoscalingHistoryHandlerTest_DA0EEED0D7C161CC-001/tempDir-001/node1/AutoscalingHistoryHandlerTest_collection_shard1_replica_n2/../../../../dist
   [junit4]   2> 287678 INFO  (qtp5844531-5182) [n:127.0.0.1:39685_solr c:AutoscalingHistoryHandlerTest_collection s:shard1 r:core_node6 x:AutoscalingHistoryHandlerTest_collection_shard1_replica_n4] o.a.s.c.RequestParams request params refreshed to version 0
   [junit4]   2> 287678 WARN  (qtp33509775-5185) [n:127.0.0.1:44303_solr c:AutoscalingHistoryHandlerTest_collection s:shard1 r:core_node5 x:AutoscalingHistoryHandlerTest_collection_shard1_replica_n2] o.a.s.c.SolrConfig Couldn't add files from /home/jenkins/workspace/Lucene-Solr-7.x-Linux/solr/build/solr-core/test/J2/temp/solr.handler.admin.AutoscalingHistoryHandlerTest_DA0EEED0D7C161CC-001/tempDir-001/node1/AutoscalingHistoryHandlerTest_collection_shard1_replica_n2/../../../../contrib/velocity/lib filtered by .*\.jar to classpath: /home/jenkins/workspace/Lucene-Solr-7.x-Linux/solr/build/solr-core/test/J2/temp/solr.handler.admin.AutoscalingHistoryHandlerTest_DA0EEED0D7C161CC-001/tempDir-001/node1/AutoscalingHistoryHandlerTest_collection_shard1_replica_n2/../../../../contrib/velocity/lib
   [junit4]   2> 287678 WARN  (qtp33509775-5185) [n:127.0.0.1:44303_solr c:AutoscalingHistoryHandlerTest_collection s:shard1 r:core_node5 x:AutoscalingHistoryHandlerTest_collection_shard1_replica_n2] o.a.s.c.SolrConfig Couldn't add files from /home/jenkins/workspace/Lucene-Solr-7.x-Linux/solr/build/solr-core/test/J2/temp/solr.handler.admin.AutoscalingHistoryHandlerTest_DA0EEED0D7C161CC-001/tempDir-001/node1/AutoscalingHistoryHandlerTest_collection_shard1_replica_n2/../../../../dist filtered by solr-velocity-\d.*\.jar to classpath: /home/jenkins/workspace/Lucene-Solr-7.x-Linux/solr/build/solr-core/test/J2/temp/solr.handler.admin.AutoscalingHistoryHandlerTest_DA0EEED0D7C161CC-001/tempDir-001/node1/AutoscalingHistoryHandlerTest_collection_shard1_replica_n2/../../../../dist
   [junit4]   2> 287679 WARN  (qtp5844531-5182) [n:127.0.0.1:39685_solr c:AutoscalingHistoryHandlerTest_collection s:shard1 r:core_node6 x:AutoscalingHistoryHandlerTest_collection_shard1_replica_n4] o.a.s.c.SolrConfig Couldn't add files from /home/jenkins/workspace/Lucene-Solr-7.x-Linux/solr/build/solr-core/test/J2/temp/solr.handler.admin.AutoscalingHistoryHandlerTest_DA0EEED0D7C161CC-001/tempDir-001/node3/AutoscalingHistoryHandlerTest_collection_shard1_replica_n4/../../../../contrib/extraction/lib filtered by .*\.jar to classpath: /home/jenkins/workspace/Lucene-Solr-7.x-Linux/solr/build/solr-core/test/J2/temp/solr.handler.admin.AutoscalingHistoryHandlerTest_DA0EEED0D7C161CC-001/tempDir-001/node3/AutoscalingHistoryHandlerTest_collection_shard1_replica_n4/../../../../contrib/extraction/lib
   [junit4]   2> 287680 WARN  (qtp5844531-5182) [n:127.0.0.1:39685_solr c:AutoscalingHistoryHandlerTest_collection s:shard1 r:core_node6 x:AutoscalingHistoryHandlerTest_collection_shard1_replica_n4] o.a.s.c.SolrConfig Couldn't add files from /home/jenkins/workspace/Lucene-Solr-7.x-Linux/solr/build/solr-core/test/J2/temp/solr.handler.admin.AutoscalingHistoryHandlerTest_DA0EEED0D7C161CC-001/tempDir-001/node3/AutoscalingHistoryHandlerTest_collection_shard1_replica_n4/../../../../dist filtered by solr-cell-\d.*\.jar to classpath: /home/jenkins/workspace/Lucene-Solr-7.x-Linux/solr/build/solr-core/test/J2/temp/solr.handler.admin.AutoscalingHistoryHandlerTest_DA0EEED0D7C161CC-001/tempDir-001/node3/AutoscalingHistoryHandlerTest_collection_shard1_replica_n4/../../../../dist
   [junit4]   2> 287680 WARN  (qtp5844531-5182) [n:127.0.0.1:39685_solr c:AutoscalingHistoryHandlerTest_collection s:shard1 r:core_node6 x:AutoscalingHistoryHandlerTest_collection_shard1_replica_n4] o.a.s.c.SolrConfig Couldn't add files from /home/jenkins/workspace/Lucene-Solr-7.x-Linux/solr/build/solr-core/test/J2/temp/solr.handler.admin.AutoscalingHistoryHandlerTest_DA0EEED0D7C161CC-001/tempDir-001/node3/AutoscalingHistoryHandlerTest_collection_shard1_replica_n4/../../../../contrib/clustering/lib filtered by .*\.jar to classpath: /home/jenkins/workspace/Lucene-Solr-7.x-Linux/solr/build/solr-core/test/J2/temp/solr.handler.admin.AutoscalingHistoryHandlerTest_DA0EEED0D7C161CC-001/tempDir-001/node3/AutoscalingHistoryHandlerTest_collection_shard1_replica_n4/../../../../contrib/clustering/lib
   [junit4]   2> 287680 WARN  (qtp5844531-5182) [n:127.0.0.1:39685_solr c:AutoscalingHistoryHandlerTest_collection s:shard1 r:core_node6 x:AutoscalingHistoryHandlerTest_collection_shard1_replica_n4] o.a.s.c.SolrConfig Couldn't add files from /home/jenkins/workspace/Lucene-Solr-7.x-Linux/solr/build/solr-core/test/J2/temp/solr.handler.admin.AutoscalingHistoryHandlerTest_DA0EEED0D7C161CC-001/tempDir-001/node3/AutoscalingHistoryHandlerTest_collection_shard1_replica_n4/../../../../dist filtered by solr-clustering-\d.*\.jar to classpath: /home/jenkins/workspace/Lucene-Solr-7.x-Linux/solr/build/solr-core/test/J2/temp/solr.handler.admin.AutoscalingHistoryHandlerTest_DA0EEED0D7C161CC-001/tempDir-001/node3/AutoscalingHistoryHandlerTest_collection_shard1_replica_n4/../../../../dist
   [junit4]   2> 287681 WARN  (qtp5844531-5182) [n:127.0.0.1:39685_solr c:AutoscalingHistoryHandlerTest_collection s:shard1 r:core_node6 x:AutoscalingHistoryHandlerTest_collection_shard1_replica_n4] o.a.s.c.SolrConfig Couldn't add files from /home/jenkins/workspace/Lucene-Solr-7.x-Linux/solr/build/solr-core/test/J2/temp/solr.handler.admin.AutoscalingHistoryHandlerTest_DA0EEED0D7C161CC-001/tempDir-001/node3/AutoscalingHistoryHandlerTest_collection_shard1_replica_n4/../../../../contrib/langid/lib filtered by .*\.jar to classpath: /home/jenkins/workspace/Lucene-Solr-7.x-Linux/solr/build/solr-core/test/J2/temp/solr.handler.admin.AutoscalingHistoryHandlerTest_DA0EEED0D7C161CC-001/tempDir-001/node3/AutoscalingHistoryHandlerTest_collection_shard1_replica_n4/../../../../contrib/langid/lib
   [junit4]   2> 287681 WARN  (qtp5844531-5182) [n:127.0.0.1:39685_solr c:AutoscalingHistoryHandlerTest_collection s:shard1 r:core_node6 x:AutoscalingHistoryHandlerTest_collection_shard1_replica_n4] o.a.s.c.SolrConfig Couldn't add files from /home/jenkins/workspace/Lucene-Solr-7.x-Linux/solr/build/solr-core/test/J2/temp/solr.handler.admin.AutoscalingHistoryHandlerTest_DA0EEED0D7C161CC-001/tempDir-001/node3/AutoscalingHistoryHandlerTest_collection_shard1_replica_n4/../../../../dist filtered by solr-langid-\d.*\.jar to classpath: /home/jenkins/workspace/Lucene-Solr-7.x-Linux/solr/build/solr-core/test/J2/temp/solr.handler.admin.AutoscalingHistoryHandlerTest_DA0EEED0D7C161CC-001/tempDir-001/node3/AutoscalingHistoryHandlerTest_collection_shard1_replica_n4/../../../../dist
   [junit4]   2> 287681 WARN  (qtp5844531-5182) [n:127.0.0.1:39685_solr c:AutoscalingHistoryHandlerTest_collection s:shard1 r:core_node6 x:AutoscalingHistoryHandlerTest_collection_shard1_replica_n4] o.a.s.c.SolrConfig Couldn't add files from /home/jenkins/workspace/Lucene-Solr-7.x-Linux/solr/build/solr-core/test/J2/temp/solr.handler.admin.AutoscalingHistoryHandlerTest_DA0EEED0D7C161CC-001/tempDir-001/node3/AutoscalingHistoryHandlerTest_collection_shard1_replica_n4/../../../../contrib/velocity/lib filtered by .*\.jar to classpath: /home/jenkins/workspace/Lucene-Solr-7.x-Linux/solr/build/solr-core/test/J2/temp/solr.handler.admin.AutoscalingHistoryHandlerTest_DA0EEED0D7C161CC-001/tempDir-001/node3/AutoscalingHistoryHandlerTest_collection_shard1_replica_n4/../../../../contrib/velocity/lib
   [junit4]   2> 287681 WARN  (qtp5844531-5182) [n:127.0.0.1:39685_solr c:AutoscalingHistoryHandlerTest_collection s:shard1 r:core_node6 x:AutoscalingHistoryHandlerTest_collection_shard1_replica_n4] o.a.s.c.SolrConfig Couldn't add files from /home/jenkins/workspace/Lucene-Solr-7.x-Linux/solr/build/solr-core/test/J2/temp/solr.handler.admin.AutoscalingHistoryHandlerTest_DA0EEED0D7C161CC-001/tempDir-001/node3/AutoscalingHistoryHandlerTest_collection_shard1_replica_n4/../../../../dist filtered by solr-velocity-\d.*\.jar to classpath: /home/jenkins/workspace/Lucene-Solr-7.x-Linux/solr/build/solr-core/test/J2/temp/solr.handler.admin.AutoscalingHistoryHandlerTest_DA0EEED0D7C161CC-001/tempDir-001/node3/AutoscalingHistoryHandlerTest_collection_shard1_replica_n4/../../../../dist
   [junit4]   2> 287714 INFO  (qtp33509775-5185) [n:127.0.0.1:44303_solr c:AutoscalingHistoryHandlerTest_collection s:shard1 r:core_node5 x:AutoscalingHistoryHandlerTest_collection_shard1_replica_n2] o.a.s.c.SolrConfig Using Lucene MatchVersion: 7.2.0
   [junit4]   2> 287715 INFO  (qtp5844531-5182) [n:127.0.0.1:39685_solr c:AutoscalingHistoryHandlerTest_collection s:shard1 r:core_node6 x:AutoscalingHistoryHandlerTest_collection_shard1_replica_n4] o.a.s.c.SolrConfig Using Lucene MatchVersion: 7.2.0
   [junit4]   2> 287742 INFO  (qtp5844531-5182) [n:127.0.0.1:39685_solr c:AutoscalingHistoryHandlerTest_collection s:shard1 r:core_node6 x:AutoscalingHistoryHandlerTest_collection_shard1_replica_n4] o.a.s.s.IndexSchema [AutoscalingHistoryHandlerTest_collection_shard1_replica_n4] Schema name=default-config
   [junit4]   2> 287742 INFO  (qtp33509775-5185) [n:127.0.0.1:44303_solr c:AutoscalingHistoryHandlerTest_collection s:shard1 r:core_node5 x:AutoscalingHistoryHandlerTest_collection_shard1_replica_n2] o.a.s.s.IndexSchema [AutoscalingHistoryHandlerTest_collection_shard1_replica_n2] Schema name=default-config
   [junit4]   2> 287937 INFO  (qtp2117947-5187) [n:127.0.0.1:43349_solr c:AutoscalingHistoryHandlerTest_collection s:shard1 r:core_node3 x:AutoscalingHistoryHandlerTest_collection_shard1_replica_n1] o.a.s.s.IndexSchema Loaded schema default-config/1.6 with uniqueid field id
   [junit4]   2> 287937 INFO  (qtp5844531-5182) [n:127.0.0.1:39685_solr c:AutoscalingHistoryHandlerTest_collection s:shard1 r:core_node6 x:AutoscalingHistoryHandlerTest_collection_shard1_replica_n4] o.a.s.s.IndexSchema Loaded schema default-config/1.6 with uniqueid field id
   [junit4]   2> 287937 INFO  (qtp33509775-5185) [n:127.0.0.1:44303_solr c:AutoscalingHistoryHandlerTest_collection s:shard1 r:core_node5 x:AutoscalingHistoryHandlerTest_collection_shard1_replica_n2] o.a.s.s.IndexSchema Loaded schema default-config/1.6 with uniqueid field id
   [junit4]   2> 287956 INFO  (qtp2117947-5187) [n:127.0.0.1:43349_solr c:AutoscalingHistoryHandlerTest_collection s:shard1 r:core_node3 x:AutoscalingHistoryHandlerTest_collection_shard1_replica_n1] o.a.s.c.CoreContainer Creating SolrCore 'AutoscalingHistoryHandlerTest_collection_shard1_replica_n1' using configuration from collection AutoscalingHistoryHandlerTest_collection, trusted=true
   [junit4]   2> 287956 INFO  (qtp2117947-5187) [n:127.0.0.1:43349_solr c:AutoscalingHistoryHandlerTest_collection s:shard1 r:core_node3 x:AutoscalingHistoryHandlerTest_collection_shard1_replica_n1] o.a.s.m.r.SolrJmxReporter JMX monitoring for 'solr_43349.solr.core.AutoscalingHistoryHandlerTest_collection.shard1.replica_n1' (registry 'solr.core.AutoscalingHistoryHandlerTest_collection.shard1.replica_n1') enabled at server: com.sun.jmx.mbeanserver.JmxMBeanServer@1a9c34a
   [junit4]   2> 287956 INFO  (qtp2117947-5187) [n:127.0.0.1:43349_solr c:AutoscalingHistoryHandlerTest_collection s:shard1 r:core_node3 x:AutoscalingHistoryHandlerTest_collection_shard1_replica_n1] o.a.s.c.SolrCore solr.RecoveryStrategy.Builder
   [junit4]   2> 287957 INFO  (qtp2117947-5187) [n:127.0.0.1:43349_solr c:AutoscalingHistoryHandlerTest_collection s:shard1 r:core_node3 x:AutoscalingHistoryHandlerTest_collection_shard1_replica_n1] o.a.s.c.SolrCore [[AutoscalingHistoryHandlerTest_collection_shard1_replica_n1] ] Opening new SolrCore at [/home/jenkins/workspace/Lucene-Solr-7.x-Linux/solr/build/solr-core/test/J2/temp/solr.handler.admin.AutoscalingHistoryHandlerTest_DA0EEED0D7C161CC-001/tempDir-001/node2/AutoscalingHistoryHandlerTest_collection_shard1_replica_n1], dataDir=[/home/jenkins/workspace/Lucene-Solr-7.x-Linux/solr/build/solr-core/test/J2/temp/solr.handler.admin.AutoscalingHistoryHandlerTest_DA0EEED0D7C161CC-001/tempDir-001/node2/./AutoscalingHistoryHandlerTest_collection_shard1_replica_n1/data/]
   [junit4]   2> 287958 INFO  (qtp5844531-5182) [n:127.0.0.1:39685_solr c:AutoscalingHistoryHandlerTest_collection s:shard1 r:core_node6 x:AutoscalingHistoryHandlerTest_collection_shard1_replica_n4] o.a.s.c.CoreContainer Creating SolrCore 'AutoscalingHistoryHandlerTest_collection_shard1_replica_n4' using configuration from collection AutoscalingHistoryHandlerTest_collection, trusted=true
   [junit4]   2> 287959 INFO  (qtp5844531-5182) [n:127.0.0.1:39685_solr c:AutoscalingHistoryHandlerTest_collection s:shard1 r:core_node6 x:AutoscalingHistoryHandlerTest_collection_shard1_replica_n4] o.a.s.m.r.SolrJmxReporter JMX monitoring for 'solr_39685.solr.core.AutoscalingHistoryHandlerTest_collection.shard1.replica_n4' (registry 'solr.core.AutoscalingHistoryHandlerTest_collection.shard1.replica_n4') enabled at server: com.sun.jmx.mbeanserver.JmxMBeanServer@1a9c34a
   [junit4]   2> 287959 INFO  (qtp5844531-5182) [n:127.0.0.1:39685_solr c:AutoscalingHistoryHandlerTest_collection s:shard1 r:core_node6 x:AutoscalingHistoryHandlerTest_collection_shard1_replica_n4] o.a.s.c.SolrCore solr.RecoveryStrategy.Builder
   [junit4]   2> 287959 INFO  (qtp5844531-5182) [n:127.0.0.1:39685_solr c:AutoscalingHistoryHandlerTest_collection s:shard1 r:core_node6 x:AutoscalingHistoryHandlerTest_collection_shard1_replica_n4] o.a.s.c.SolrCore [[AutoscalingHistoryHandlerTest_collection_shard1_replica_n4] ] Opening new SolrCore at [/home/jenkins/workspace/Lucene-Solr-7.x-Linux/solr/build/solr-core/test/J2/temp/solr.handler.admin.AutoscalingHistoryHandlerTest_DA0EEED0D7C161CC-001/tempDir-001/node3/AutoscalingHistoryHandlerTest_collection_shard1_replica_n4], dataDir=[/home/jenkins/workspace/Lucene-Solr-7.x-Linux/solr/build/solr-core/test/J2/temp/solr.handler.admin.AutoscalingHistoryHandlerTest_DA0EEED0D7C161CC-001/tempDir-001/node3/./AutoscalingHistoryHandlerTest_collection_shard1_replica_n4/data/]
   [junit4]   2> 287961 INFO  (qtp33509775-5185) [n:127.0.0.1:44303_solr c:AutoscalingHistoryHandlerTest_collection s:shard1 r:core_node5 x:AutoscalingHistoryHandlerTest_collection_shard1_replica_n2] o.a.s.c.CoreContainer Creating SolrCore 'AutoscalingHistoryHandlerTest_collection_shard1_replica_n2' using configuration from collection AutoscalingHistoryHandlerTest_collection, trusted=true
   [junit4]   2> 287961 INFO  (qtp33509775-5185) [n:127.0.0.1:44303_solr c:AutoscalingHistoryHandlerTest_collection s:shard1 r:core_node5 x:AutoscalingHistoryHandlerTest_collection_shard1_replica_n2] o.a.s.m.r.SolrJmxReporter JMX monitoring for 'solr_44303.solr.core.AutoscalingHistoryHandlerTest_collection.shard1.replica_n2' (registry 'solr.core.AutoscalingHistoryHandlerTest_collection.shard1.replica_n2') enabled at server: com.sun.jmx.mbeanserver.JmxMBeanServer@1a9c34a
   [junit4]   2> 287961 INFO  (qtp33509775-5185) [n:127.0.0.1:44303_solr c:AutoscalingHistoryHandlerTest_collection s:shard1 r:core_node5 x:AutoscalingHistoryHandlerTest_collection_shard1_replica_n2] o.a.s.c.SolrCore solr.RecoveryStrategy.Builder
   [junit4]   2> 287961 INFO  (qtp33509775-5185) [n:127.0.0.1:44303_solr c:AutoscalingHistoryHandlerTest_collection s:shard1 r:core_node5 x:AutoscalingHistoryHandlerTest_collection_shard1_replica_n2] o.a.s.c.SolrCore [[AutoscalingHistoryHandlerTest_collection_shard1_replica_n2] ] Opening new SolrCore at [/home/jenkins/workspace/Lucene-Solr-7.x-Linux/solr/build/solr-core/test/J2/temp/solr.handler.admin.AutoscalingHistoryHandlerTest_DA0EEED0D7C161CC-001/tempDir-001/node1/AutoscalingHistoryHandlerTest_collection_shard1_replica_n2], dataDir=[/home/jenkins/workspace/Lucene-Solr-7.x-Linux/solr/build/solr-core/test/J2/temp/solr.handler.admin.AutoscalingHistoryHandlerTest_DA0EEED0D7C161CC-001/tempDir-001/node1/./AutoscalingHistoryHandlerTest_collection_shard1_replica_n2/data/]
   [junit4]   2> 287986 DEBUG (ScheduledTrigger-1392-thread-2) [n:127.0.0.1:39685_solr    ] o.a.s.c.a.NodeLostTrigger Running NodeLostTrigger: .auto_add_replicas with currently live nodes: [127.0.0.1:39685_solr, 127.0.0.1:43349_solr, 127.0.0.1:44303_solr]
   [junit4]   2> 287995 INFO  (qtp5844531-5182) [n:127.0.0.1:39685_solr c:AutoscalingHistoryHandlerTest_collection s:shard1 r:core_node6 x:AutoscalingHistoryHandlerTest_collection_shard1_replica_n4] o.a.s.r.XSLTResponseWriter xsltCacheLifetimeSeconds=5
   [junit4]   2> 287995 INFO  (qtp33509775-5185) [n:127.0.0.1:44303_solr c:AutoscalingHistoryHandlerTest_collection s:shard1 r:core_node5 x:AutoscalingHistoryHandlerTest_collection_shard1_replica_n2] o.a.s.r.XSLTResponseWriter xsltCacheLifetimeSeconds=5
   [junit4]   2> 287998 INFO  (qtp2117947-5187) [n:127.0.0.1:43349_solr c:AutoscalingHistoryHandlerTest_collection s:shard1 r:core_node3 x:AutoscalingHistoryHandlerTest_collection_shard1_replica_n1] o.a.s.r.XSLTResponseWriter xsltCacheLifetimeSeconds=5
   [junit4]   2> 288158 INFO  (qtp5844531-5182) [n:127.0.0.1:39685_solr c:AutoscalingHistoryHandlerTest_collection s:shard1 r:core_node6 x:AutoscalingHistoryHandlerTest_collection_shard1_replica_n4] o.a.s.u.UpdateHandler Using UpdateLog implementation: org.apache.solr.update.UpdateLog
   [junit4]   2> 288158 INFO  (qtp5844531-5182) [n:127.0.0.1:39685_solr c:AutoscalingHistoryHandlerTest_collection s:shard1 r:core_node6 x:AutoscalingHistoryHandlerTest_collection_shard1_replica_n4] o.a.s.u.UpdateLog Initializing Update

[...truncated too long message...]

onnection refused (Connection refused)
   [junit4]   2> 	at java.net.PlainSocketImpl.socketConnect(Native Method)
   [junit4]   2> 	at java.net.AbstractPlainSocketImpl.doConnect(AbstractPlainSocketImpl.java:350)
   [junit4]   2> 	at java.net.AbstractPlainSocketImpl.connectToAddress(AbstractPlainSocketImpl.java:206)
   [junit4]   2> 	at java.net.AbstractPlainSocketImpl.connect(AbstractPlainSocketImpl.java:188)
   [junit4]   2> 	at java.net.SocksSocketImpl.connect(SocksSocketImpl.java:392)
   [junit4]   2> 	at java.net.Socket.connect(Socket.java:589)
   [junit4]   2> 	at org.apache.http.conn.ssl.SSLConnectionSocketFactory.connectSocket(SSLConnectionSocketFactory.java:339)
   [junit4]   2> 	at org.apache.http.impl.conn.DefaultHttpClientConnectionOperator.connect(DefaultHttpClientConnectionOperator.java:142)
   [junit4]   2> 	... 20 more
   [junit4]   2> 943164 DEBUG (AutoscalingActionExecutor-1393-thread-1-processing-n:127.0.0.1:39685_solr) [n:127.0.0.1:39685_solr    ] o.a.s.c.a.ScheduledTriggers -- processing actions for {
   [junit4]   2>   "id":"14f2836cc7f58340Tdt4bntucwjb0npmi9l38uz774",
   [junit4]   2>   "source":"AutoscalingHistoryHandlerTest_node_lost_trigger",
   [junit4]   2>   "eventTime":1509413328357000000,
   [junit4]   2>   "eventType":"NODELOST",
   [junit4]   2>   "properties":{
   [junit4]   2>     "eventTimes":[
   [junit4]   2>       1509413328357000000,
   [junit4]   2>       1509413328357000000,
   [junit4]   2>       1509413328357000000],
   [junit4]   2>     "_enqueue_time_":1509413328357000000,
   [junit4]   2>     "nodeNames":[
   [junit4]   2>       "127.0.0.1:39685_solr",
   [junit4]   2>       "127.0.0.1:33019_solr",
   [junit4]   2>       "127.0.0.1:44303_solr"]}}
   [junit4]   2> 943165 INFO  (AutoscalingActionExecutor-1393-thread-1-processing-n:127.0.0.1:39685_solr) [n:127.0.0.1:39685_solr    ] o.a.s.c.ActionThrottle The last action attempt started 601116ms ago.
   [junit4]   2> 943165 DEBUG (AutoscalingActionExecutor-1393-thread-1-processing-n:127.0.0.1:39685_solr) [n:127.0.0.1:39685_solr    ] o.a.s.c.a.ScheduledTriggers Found pending task with requestid=AutoscalingHistoryHandlerTest_node_lost_trigger/14f282e052625a40Tdt4bntucwjb0npmi9l38uz76p/0
   [junit4]   2> 943166 ERROR (AutoscalingActionExecutor-1393-thread-1-processing-n:127.0.0.1:39685_solr) [n:127.0.0.1:39685_solr    ] o.a.s.c.a.ExecutePlanAction Unexpected Exception while querying status of requestId=AutoscalingHistoryHandlerTest_node_lost_trigger/14f282e052625a40Tdt4bntucwjb0npmi9l38uz76p/0
   [junit4]   2> java.io.IOException: org.apache.solr.client.solrj.SolrServerException: No live SolrServers available to handle this request
   [junit4]   2> 	at org.apache.solr.client.solrj.impl.SolrClientCloudManager.request(SolrClientCloudManager.java:101)
   [junit4]   2> 	at org.apache.solr.cloud.autoscaling.ExecutePlanAction.waitForTaskToFinish(ExecutePlanAction.java:130)
   [junit4]   2> 	at org.apache.solr.cloud.autoscaling.ScheduledTriggers.waitForPendingTasks(ScheduledTriggers.java:289)
   [junit4]   2> 	at org.apache.solr.cloud.autoscaling.ScheduledTriggers.lambda$null$2(ScheduledTriggers.java:221)
   [junit4]   2> 	at java.util.concurrent.Executors$RunnableAdapter.call(Executors.java:511)
   [junit4]   2> 	at java.util.concurrent.FutureTask.run(FutureTask.java:266)
   [junit4]   2> 	at org.apache.solr.common.util.ExecutorUtil$MDCAwareThreadPoolExecutor.lambda$execute$0(ExecutorUtil.java:188)
   [junit4]   2> 	at java.util.concurrent.ThreadPoolExecutor.runWorker(ThreadPoolExecutor.java:1149)
   [junit4]   2> 	at java.util.concurrent.ThreadPoolExecutor$Worker.run(ThreadPoolExecutor.java:624)
   [junit4]   2> 	at java.lang.Thread.run(Thread.java:748)
   [junit4]   2> Caused by: org.apache.solr.client.solrj.SolrServerException: No live SolrServers available to handle this request
   [junit4]   2> 	at org.apache.solr.client.solrj.impl.LBHttpSolrClient.request(LBHttpSolrClient.java:460)
   [junit4]   2> 	at org.apache.solr.client.solrj.impl.CloudSolrClient.sendRequest(CloudSolrClient.java:1096)
   [junit4]   2> 	at org.apache.solr.client.solrj.impl.CloudSolrClient.requestWithRetryOnStaleState(CloudSolrClient.java:875)
   [junit4]   2> 	at org.apache.solr.client.solrj.impl.CloudSolrClient.request(CloudSolrClient.java:808)
   [junit4]   2> 	at org.apache.solr.client.solrj.SolrRequest.process(SolrRequest.java:178)
   [junit4]   2> 	at org.apache.solr.client.solrj.SolrRequest.process(SolrRequest.java:195)
   [junit4]   2> 	at org.apache.solr.client.solrj.impl.SolrClientCloudManager.request(SolrClientCloudManager.java:99)
   [junit4]   2> 	... 9 more
   [junit4]   2> 943295 WARN  (OverseerThreadFactory-1394-thread-5-processing-n:127.0.0.1:39685_solr) [n:127.0.0.1:39685_solr    ] o.a.s.c.MoveReplicaCmd Timed out waiting for leader's replica to recover, collection=.system shard=shard1 on node=127.0.0.1:33019_solr
   [junit4]   2> 943299 INFO  (OverseerThreadFactory-1394-thread-5-processing-n:127.0.0.1:39685_solr) [n:127.0.0.1:39685_solr    ] o.a.s.c.OverseerTaskQueue Response ZK path: /overseer/collection-queue-work/qnr-0000000006 doesn't exist.  Requestor may have disconnected from ZooKeeper
   [junit4]   2> 943299 WARN  (OverseerAutoScalingTriggerThread-98920868805804041-127.0.0.1:39685_solr-n_0000000000) [n:127.0.0.1:39685_solr    ] o.a.s.c.a.OverseerTriggerThread OverseerTriggerThread woken up but we are closed, exiting.
   [junit4]   2> 943299 DEBUG (jetty-closer-572-thread-2) [    ] o.a.s.c.a.OverseerTriggerThread OverseerTriggerThread has been closed explicitly
   [junit4]   2> 943300 INFO  (jetty-closer-572-thread-2) [    ] o.e.j.s.h.ContextHandler Stopped o.e.j.s.ServletContextHandler@33633a{/solr,null,UNAVAILABLE}
   [junit4]   2> 943300 ERROR (SUITE-AutoscalingHistoryHandlerTest-seed#[DA0EEED0D7C161CC]-worker) [    ] o.a.z.s.ZooKeeperServer ZKShutdownHandler is not registered, so ZooKeeper server won't take any action on ERROR or SHUTDOWN server state changes
   [junit4]   2> 943300 INFO  (SUITE-AutoscalingHistoryHandlerTest-seed#[DA0EEED0D7C161CC]-worker) [    ] o.a.s.c.ZkTestServer connecting to 127.0.0.1:37089 37089
   [junit4]   2> 944081 INFO  (Thread-2484) [    ] o.a.s.c.ZkTestServer connecting to 127.0.0.1:37089 37089
   [junit4]   2> 944082 WARN  (Thread-2484) [    ] o.a.s.c.ZkTestServer Watch limit violations: 
   [junit4]   2> Maximum concurrent create/delete watches above limit:
   [junit4]   2> 
   [junit4]   2> 	17	/solr/aliases.json
   [junit4]   2> 	5	/solr/configs/.system/managed-schema
   [junit4]   2> 	4	/solr/configs/.system
   [junit4]   2> 	4	/solr/security.json
   [junit4]   2> 	3	/solr/configs/AutoscalingHistoryHandlerTest_collection
   [junit4]   2> 	3	/solr/configs/AutoscalingHistoryHandlerTest_collection/managed-schema
   [junit4]   2> 
   [junit4]   2> Maximum concurrent data watches above limit:
   [junit4]   2> 
   [junit4]   2> 	82	/solr/collections/.system/state.json
   [junit4]   2> 	31	/solr/collections/AutoscalingHistoryHandlerTest_collection/state.json
   [junit4]   2> 	17	/solr/clusterprops.json
   [junit4]   2> 	17	/solr/clusterstate.json
   [junit4]   2> 	2	/solr/overseer_elect/election/98920868805804041-127.0.0.1:39685_solr-n_0000000000
   [junit4]   2> 	2	/solr/collections/.system/leader_elect/shard1/election/98920868805804040-core_node5-n_0000000001
   [junit4]   2> 
   [junit4]   2> Maximum concurrent children watches above limit:
   [junit4]   2> 
   [junit4]   2> 	17	/solr/live_nodes
   [junit4]   2> 	17	/solr/collections
   [junit4]   2> 
   [junit4]   2> NOTE: leaving temporary files on disk at: /home/jenkins/workspace/Lucene-Solr-7.x-Linux/solr/build/solr-core/test/J2/temp/solr.handler.admin.AutoscalingHistoryHandlerTest_DA0EEED0D7C161CC-001
   [junit4]   2> NOTE: test params are: codec=Asserting(Lucene70): {action_s=BlockTreeOrds(blocksize=128), event.source_s=PostingsFormat(name=Direct), type=FST50, before.actions_ss=PostingsFormat(name=LuceneVarGapFixedInterval), event.property._enqueue_time__ss=BlockTreeOrds(blocksize=128), after.actions_ss=BlockTreeOrds(blocksize=128), stage_s=BlockTreeOrds(blocksize=128), event.id_s=PostingsFormat(name=Direct), event.property.eventTimes_ss=FST50, source_s=PostingsFormat(name=Direct), event.type_s=FST50, responses_ts=BlockTreeOrds(blocksize=128), id=PostingsFormat(name=Direct), collections_ss=FST50, operations.params_ts=BlockTreeOrds(blocksize=128), event.property.nodeNames_ss=FST50}, docValues:{_version_=DocValuesFormat(name=Lucene70), event.time_l=DocValuesFormat(name=Asserting), timestamp=DocValuesFormat(name=Asserting)}, maxPointsInLeafNode=1969, maxMBSortInHeap=7.989295089160229, sim=RandomSimilarity(queryNorm=false): {}, locale=es-GT, timezone=America/Indiana/Winamac
   [junit4]   2> NOTE: Linux 4.10.0-37-generic i386/Oracle Corporation 1.8.0_144 (32-bit)/cpus=8,threads=1,free=380749288,total=536870912
   [junit4]   2> NOTE: All tests run in this JVM: [TestFieldCollectionResource, TestCryptoKeys, SpellPossibilityIteratorTest, TestPartialUpdateDeduplication, TestClassicSimilarityFactory, BJQParserTest, TestDistributedMissingSort, FullSolrCloudDistribCmdsTest, RuleEngineTest, CdcrVersionReplicationTest, PreAnalyzedFieldManagedSchemaCloudTest, TestUniqueKeyFieldResource, HdfsDirectoryTest, TlogReplayBufferedWhileIndexingTest, ChaosMonkeyNothingIsSafeTest, TestXmlQParserPlugin, TestValueSourceCache, XmlUpdateRequestHandlerTest, TestQueryTypes, UniqFieldsUpdateProcessorFactoryTest, MetricsConfigTest, SaslZkACLProviderTest, TestLegacyFieldCache, BlockCacheTest, DocValuesNotIndexedTest, WrapperMergePolicyFactoryTest, UpdateLogTest, TestDynamicLoading, StatsReloadRaceTest, TestStressUserVersions, DocValuesMissingTest, SuggestComponentContextFilterQueryTest, TestCustomDocTransformer, DistributedSuggestComponentTest, RankQueryTest, TestHdfsUpdateLog, XsltUpdateRequestHandlerTest, TestCustomSort, AutoscalingHistoryHandlerTest]
   [junit4] Completed [240/745 (1!)] on J2 in 658.37s, 1 test, 1 failure <<< FAILURES!

[...truncated 44757 lines...]

Mime
View raw message