lucene-dev mailing list archives

Site index · List index
Message view « Date » · « Thread »
Top « Date » · « Thread »
From Policeman Jenkins Server <jenk...@thetaphi.de>
Subject [JENKINS] Lucene-Solr-5.5-Windows (32bit/jdk1.7.0_80) - Build # 148 - Still Unstable!
Date Fri, 20 Oct 2017 21:48:36 GMT
Build: https://jenkins.thetaphi.de/job/Lucene-Solr-5.5-Windows/148/
Java: 32bit/jdk1.7.0_80 -server -XX:+UseConcMarkSweepGC

1 tests failed.
FAILED:  junit.framework.TestSuite.org.apache.solr.handler.TestSolrConfigHandlerCloud

Error Message:
1 thread leaked from SUITE scope at org.apache.solr.handler.TestSolrConfigHandlerCloud:     1) Thread[id=23488, name=Thread-8464, state=TIMED_WAITING, group=TGRP-TestSolrConfigHandlerCloud]         at java.lang.Thread.sleep(Native Method)         at org.apache.solr.cloud.ZkSolrResourceLoader.openResource(ZkSolrResourceLoader.java:101)         at org.apache.solr.core.SolrResourceLoader.openSchema(SolrResourceLoader.java:355)         at org.apache.solr.schema.IndexSchemaFactory.create(IndexSchemaFactory.java:48)         at org.apache.solr.schema.IndexSchemaFactory.buildIndexSchema(IndexSchemaFactory.java:70)         at org.apache.solr.core.ConfigSetService.createIndexSchema(ConfigSetService.java:108)         at org.apache.solr.core.ConfigSetService.getConfig(ConfigSetService.java:79)         at org.apache.solr.core.CoreContainer.reload(CoreContainer.java:920)         at org.apache.solr.core.SolrCore$11.run(SolrCore.java:2623)         at org.apache.solr.cloud.ZkController$5.run(ZkController.java:2480)

Stack Trace:
com.carrotsearch.randomizedtesting.ThreadLeakError: 1 thread leaked from SUITE scope at org.apache.solr.handler.TestSolrConfigHandlerCloud: 
   1) Thread[id=23488, name=Thread-8464, state=TIMED_WAITING, group=TGRP-TestSolrConfigHandlerCloud]
        at java.lang.Thread.sleep(Native Method)
        at org.apache.solr.cloud.ZkSolrResourceLoader.openResource(ZkSolrResourceLoader.java:101)
        at org.apache.solr.core.SolrResourceLoader.openSchema(SolrResourceLoader.java:355)
        at org.apache.solr.schema.IndexSchemaFactory.create(IndexSchemaFactory.java:48)
        at org.apache.solr.schema.IndexSchemaFactory.buildIndexSchema(IndexSchemaFactory.java:70)
        at org.apache.solr.core.ConfigSetService.createIndexSchema(ConfigSetService.java:108)
        at org.apache.solr.core.ConfigSetService.getConfig(ConfigSetService.java:79)
        at org.apache.solr.core.CoreContainer.reload(CoreContainer.java:920)
        at org.apache.solr.core.SolrCore$11.run(SolrCore.java:2623)
        at org.apache.solr.cloud.ZkController$5.run(ZkController.java:2480)
	at __randomizedtesting.SeedInfo.seed([6A210696BB2E619E]:0)




Build Log:
[...truncated 12225 lines...]
   [junit4] Suite: org.apache.solr.handler.TestSolrConfigHandlerCloud
   [junit4]   2> Creating dataDir: C:\Users\jenkins\workspace\Lucene-Solr-5.5-Windows\solr\build\solr-core\test\J0\temp\solr.handler.TestSolrConfigHandlerCloud_6A210696BB2E619E-001\init-core-data-001
   [junit4]   2> 2729505 INFO  (SUITE-TestSolrConfigHandlerCloud-seed#[6A210696BB2E619E]-worker) [    ] o.a.s.SolrTestCaseJ4 Randomized ssl (false) and clientAuth (false)
   [junit4]   2> 2729505 INFO  (SUITE-TestSolrConfigHandlerCloud-seed#[6A210696BB2E619E]-worker) [    ] o.a.s.BaseDistributedSearchTestCase Setting hostContext system property: /
   [junit4]   2> 2729510 INFO  (TEST-TestSolrConfigHandlerCloud.test-seed#[6A210696BB2E619E]) [    ] o.a.s.c.ZkTestServer STARTING ZK TEST SERVER
   [junit4]   2> 2729510 INFO  (Thread-8298) [    ] o.a.s.c.ZkTestServer client port:0.0.0.0/0.0.0.0:0
   [junit4]   2> 2729510 INFO  (Thread-8298) [    ] o.a.s.c.ZkTestServer Starting server
   [junit4]   2> 2729611 INFO  (TEST-TestSolrConfigHandlerCloud.test-seed#[6A210696BB2E619E]) [    ] o.a.s.c.ZkTestServer start zk server on port:60158
   [junit4]   2> 2729611 INFO  (TEST-TestSolrConfigHandlerCloud.test-seed#[6A210696BB2E619E]) [    ] o.a.s.c.c.SolrZkClient Using default ZkCredentialsProvider
   [junit4]   2> 2729612 INFO  (TEST-TestSolrConfigHandlerCloud.test-seed#[6A210696BB2E619E]) [    ] o.a.s.c.c.ConnectionManager Waiting for client to connect to ZooKeeper
   [junit4]   2> 2729619 INFO  (zkCallback-3018-thread-1) [    ] o.a.s.c.c.ConnectionManager Watcher org.apache.solr.common.cloud.ConnectionManager@53efdc name:ZooKeeperConnection Watcher:127.0.0.1:60158 got event WatchedEvent state:SyncConnected type:None path:null path:null type:None
   [junit4]   2> 2729619 INFO  (TEST-TestSolrConfigHandlerCloud.test-seed#[6A210696BB2E619E]) [    ] o.a.s.c.c.ConnectionManager Client is connected to ZooKeeper
   [junit4]   2> 2729619 INFO  (TEST-TestSolrConfigHandlerCloud.test-seed#[6A210696BB2E619E]) [    ] o.a.s.c.c.SolrZkClient Using default ZkACLProvider
   [junit4]   2> 2729620 INFO  (TEST-TestSolrConfigHandlerCloud.test-seed#[6A210696BB2E619E]) [    ] o.a.s.c.c.SolrZkClient makePath: /solr
   [junit4]   2> 2729624 INFO  (TEST-TestSolrConfigHandlerCloud.test-seed#[6A210696BB2E619E]) [    ] o.a.s.c.c.SolrZkClient Using default ZkCredentialsProvider
   [junit4]   2> 2729626 INFO  (TEST-TestSolrConfigHandlerCloud.test-seed#[6A210696BB2E619E]) [    ] o.a.s.c.c.ConnectionManager Waiting for client to connect to ZooKeeper
   [junit4]   2> 2729629 INFO  (zkCallback-3019-thread-1) [    ] o.a.s.c.c.ConnectionManager Watcher org.apache.solr.common.cloud.ConnectionManager@209353 name:ZooKeeperConnection Watcher:127.0.0.1:60158/solr got event WatchedEvent state:SyncConnected type:None path:null path:null type:None
   [junit4]   2> 2729629 INFO  (TEST-TestSolrConfigHandlerCloud.test-seed#[6A210696BB2E619E]) [    ] o.a.s.c.c.ConnectionManager Client is connected to ZooKeeper
   [junit4]   2> 2729629 INFO  (TEST-TestSolrConfigHandlerCloud.test-seed#[6A210696BB2E619E]) [    ] o.a.s.c.c.SolrZkClient Using default ZkACLProvider
   [junit4]   2> 2729629 INFO  (TEST-TestSolrConfigHandlerCloud.test-seed#[6A210696BB2E619E]) [    ] o.a.s.c.c.SolrZkClient makePath: /collections/collection1
   [junit4]   2> 2729634 INFO  (TEST-TestSolrConfigHandlerCloud.test-seed#[6A210696BB2E619E]) [    ] o.a.s.c.c.SolrZkClient makePath: /collections/collection1/shards
   [junit4]   2> 2729638 INFO  (TEST-TestSolrConfigHandlerCloud.test-seed#[6A210696BB2E619E]) [    ] o.a.s.c.c.SolrZkClient makePath: /collections/control_collection
   [junit4]   2> 2729640 INFO  (TEST-TestSolrConfigHandlerCloud.test-seed#[6A210696BB2E619E]) [    ] o.a.s.c.c.SolrZkClient makePath: /collections/control_collection/shards
   [junit4]   2> 2729645 INFO  (TEST-TestSolrConfigHandlerCloud.test-seed#[6A210696BB2E619E]) [    ] o.a.s.c.AbstractZkTestCase put C:\Users\jenkins\workspace\Lucene-Solr-5.5-Windows\solr\core\src\test-files\solr\collection1\conf\solrconfig-tlog.xml to /configs/conf1/solrconfig.xml
   [junit4]   2> 2729645 INFO  (TEST-TestSolrConfigHandlerCloud.test-seed#[6A210696BB2E619E]) [    ] o.a.s.c.c.SolrZkClient makePath: /configs/conf1/solrconfig.xml
   [junit4]   2> 2729651 INFO  (TEST-TestSolrConfigHandlerCloud.test-seed#[6A210696BB2E619E]) [    ] o.a.s.c.AbstractZkTestCase put C:\Users\jenkins\workspace\Lucene-Solr-5.5-Windows\solr\core\src\test-files\solr\collection1\conf\schema.xml to /configs/conf1/schema.xml
   [junit4]   2> 2729651 INFO  (TEST-TestSolrConfigHandlerCloud.test-seed#[6A210696BB2E619E]) [    ] o.a.s.c.c.SolrZkClient makePath: /configs/conf1/schema.xml
   [junit4]   2> 2729655 INFO  (TEST-TestSolrConfigHandlerCloud.test-seed#[6A210696BB2E619E]) [    ] o.a.s.c.AbstractZkTestCase put C:\Users\jenkins\workspace\Lucene-Solr-5.5-Windows\solr\core\src\test-files\solr\collection1\conf\solrconfig.snippet.randomindexconfig.xml to /configs/conf1/solrconfig.snippet.randomindexconfig.xml
   [junit4]   2> 2729656 INFO  (TEST-TestSolrConfigHandlerCloud.test-seed#[6A210696BB2E619E]) [    ] o.a.s.c.c.SolrZkClient makePath: /configs/conf1/solrconfig.snippet.randomindexconfig.xml
   [junit4]   2> 2729659 INFO  (TEST-TestSolrConfigHandlerCloud.test-seed#[6A210696BB2E619E]) [    ] o.a.s.c.AbstractZkTestCase put C:\Users\jenkins\workspace\Lucene-Solr-5.5-Windows\solr\core\src\test-files\solr\collection1\conf\stopwords.txt to /configs/conf1/stopwords.txt
   [junit4]   2> 2729660 INFO  (TEST-TestSolrConfigHandlerCloud.test-seed#[6A210696BB2E619E]) [    ] o.a.s.c.c.SolrZkClient makePath: /configs/conf1/stopwords.txt
   [junit4]   2> 2729663 INFO  (TEST-TestSolrConfigHandlerCloud.test-seed#[6A210696BB2E619E]) [    ] o.a.s.c.AbstractZkTestCase put C:\Users\jenkins\workspace\Lucene-Solr-5.5-Windows\solr\core\src\test-files\solr\collection1\conf\protwords.txt to /configs/conf1/protwords.txt
   [junit4]   2> 2729663 INFO  (TEST-TestSolrConfigHandlerCloud.test-seed#[6A210696BB2E619E]) [    ] o.a.s.c.c.SolrZkClient makePath: /configs/conf1/protwords.txt
   [junit4]   2> 2729667 INFO  (TEST-TestSolrConfigHandlerCloud.test-seed#[6A210696BB2E619E]) [    ] o.a.s.c.AbstractZkTestCase put C:\Users\jenkins\workspace\Lucene-Solr-5.5-Windows\solr\core\src\test-files\solr\collection1\conf\currency.xml to /configs/conf1/currency.xml
   [junit4]   2> 2729667 INFO  (TEST-TestSolrConfigHandlerCloud.test-seed#[6A210696BB2E619E]) [    ] o.a.s.c.c.SolrZkClient makePath: /configs/conf1/currency.xml
   [junit4]   2> 2729671 INFO  (TEST-TestSolrConfigHandlerCloud.test-seed#[6A210696BB2E619E]) [    ] o.a.s.c.AbstractZkTestCase put C:\Users\jenkins\workspace\Lucene-Solr-5.5-Windows\solr\core\src\test-files\solr\collection1\conf\enumsConfig.xml to /configs/conf1/enumsConfig.xml
   [junit4]   2> 2729672 INFO  (TEST-TestSolrConfigHandlerCloud.test-seed#[6A210696BB2E619E]) [    ] o.a.s.c.c.SolrZkClient makePath: /configs/conf1/enumsConfig.xml
   [junit4]   2> 2729675 INFO  (TEST-TestSolrConfigHandlerCloud.test-seed#[6A210696BB2E619E]) [    ] o.a.s.c.AbstractZkTestCase put C:\Users\jenkins\workspace\Lucene-Solr-5.5-Windows\solr\core\src\test-files\solr\collection1\conf\open-exchange-rates.json to /configs/conf1/open-exchange-rates.json
   [junit4]   2> 2729676 INFO  (TEST-TestSolrConfigHandlerCloud.test-seed#[6A210696BB2E619E]) [    ] o.a.s.c.c.SolrZkClient makePath: /configs/conf1/open-exchange-rates.json
   [junit4]   2> 2729679 INFO  (TEST-TestSolrConfigHandlerCloud.test-seed#[6A210696BB2E619E]) [    ] o.a.s.c.AbstractZkTestCase put C:\Users\jenkins\workspace\Lucene-Solr-5.5-Windows\solr\core\src\test-files\solr\collection1\conf\mapping-ISOLatin1Accent.txt to /configs/conf1/mapping-ISOLatin1Accent.txt
   [junit4]   2> 2729680 INFO  (TEST-TestSolrConfigHandlerCloud.test-seed#[6A210696BB2E619E]) [    ] o.a.s.c.c.SolrZkClient makePath: /configs/conf1/mapping-ISOLatin1Accent.txt
   [junit4]   2> 2729683 INFO  (TEST-TestSolrConfigHandlerCloud.test-seed#[6A210696BB2E619E]) [    ] o.a.s.c.AbstractZkTestCase put C:\Users\jenkins\workspace\Lucene-Solr-5.5-Windows\solr\core\src\test-files\solr\collection1\conf\old_synonyms.txt to /configs/conf1/old_synonyms.txt
   [junit4]   2> 2729684 INFO  (TEST-TestSolrConfigHandlerCloud.test-seed#[6A210696BB2E619E]) [    ] o.a.s.c.c.SolrZkClient makePath: /configs/conf1/old_synonyms.txt
   [junit4]   2> 2729687 INFO  (TEST-TestSolrConfigHandlerCloud.test-seed#[6A210696BB2E619E]) [    ] o.a.s.c.AbstractZkTestCase put C:\Users\jenkins\workspace\Lucene-Solr-5.5-Windows\solr\core\src\test-files\solr\collection1\conf\synonyms.txt to /configs/conf1/synonyms.txt
   [junit4]   2> 2729687 INFO  (TEST-TestSolrConfigHandlerCloud.test-seed#[6A210696BB2E619E]) [    ] o.a.s.c.c.SolrZkClient makePath: /configs/conf1/synonyms.txt
   [junit4]   2> 2729973 INFO  (TEST-TestSolrConfigHandlerCloud.test-seed#[6A210696BB2E619E]) [    ] o.a.s.SolrTestCaseJ4 Writing core.properties file to C:\Users\jenkins\workspace\Lucene-Solr-5.5-Windows\solr\build\solr-core\test\J0\temp\solr.handler.TestSolrConfigHandlerCloud_6A210696BB2E619E-001\control-001\cores\collection1
   [junit4]   2> 2729975 INFO  (TEST-TestSolrConfigHandlerCloud.test-seed#[6A210696BB2E619E]) [    ] o.e.j.s.Server jetty-9.2.13.v20150730
   [junit4]   2> 2729976 INFO  (TEST-TestSolrConfigHandlerCloud.test-seed#[6A210696BB2E619E]) [    ] o.e.j.s.h.ContextHandler Started o.e.j.s.ServletContextHandler@16947b5{/,null,AVAILABLE}
   [junit4]   2> 2729977 INFO  (TEST-TestSolrConfigHandlerCloud.test-seed#[6A210696BB2E619E]) [    ] o.e.j.s.ServerConnector Started ServerConnector@e2ce3c{HTTP/1.1}{127.0.0.1:60165}
   [junit4]   2> 2729977 INFO  (TEST-TestSolrConfigHandlerCloud.test-seed#[6A210696BB2E619E]) [    ] o.e.j.s.Server Started @2732810ms
   [junit4]   2> 2729977 INFO  (TEST-TestSolrConfigHandlerCloud.test-seed#[6A210696BB2E619E]) [    ] o.a.s.c.s.e.JettySolrRunner Jetty properties: {solr.data.dir=C:\Users\jenkins\workspace\Lucene-Solr-5.5-Windows\solr\build\solr-core\test\J0\temp\solr.handler.TestSolrConfigHandlerCloud_6A210696BB2E619E-001\tempDir-001/control/data, hostContext=/, coreRootDirectory=C:\Users\jenkins\workspace\Lucene-Solr-5.5-Windows\solr\build\solr-core\test\J0\..\..\..\..\..\..\..\..\..\Users\jenkins\workspace\Lucene-Solr-5.5-Windows\solr\build\solr-core\test\J0\temp\solr.handler.TestSolrConfigHandlerCloud_6A210696BB2E619E-001\control-001\cores, hostPort=60165}
   [junit4]   2> 2729977 INFO  (TEST-TestSolrConfigHandlerCloud.test-seed#[6A210696BB2E619E]) [    ] o.a.s.s.SolrDispatchFilter SolrDispatchFilter.init(): sun.misc.Launcher$AppClassLoader@1ed7524
   [junit4]   2> 2729977 INFO  (TEST-TestSolrConfigHandlerCloud.test-seed#[6A210696BB2E619E]) [    ] o.a.s.c.SolrResourceLoader new SolrResourceLoader for directory: 'C:\Users\jenkins\workspace\Lucene-Solr-5.5-Windows\solr\build\solr-core\test\J0\temp\solr.handler.TestSolrConfigHandlerCloud_6A210696BB2E619E-001\control-001'
   [junit4]   2> 2729977 INFO  (TEST-TestSolrConfigHandlerCloud.test-seed#[6A210696BB2E619E]) [    ] o.a.s.c.SolrResourceLoader JNDI not configured for solr (NoInitialContextEx)
   [junit4]   2> 2729977 INFO  (TEST-TestSolrConfigHandlerCloud.test-seed#[6A210696BB2E619E]) [    ] o.a.s.c.SolrResourceLoader solr home defaulted to 'solr/' (could not find system property or JNDI)
   [junit4]   2> 2729978 INFO  (TEST-TestSolrConfigHandlerCloud.test-seed#[6A210696BB2E619E]) [    ] o.a.s.c.c.SolrZkClient Using default ZkCredentialsProvider
   [junit4]   2> 2729978 INFO  (TEST-TestSolrConfigHandlerCloud.test-seed#[6A210696BB2E619E]) [    ] o.a.s.c.c.ConnectionManager Waiting for client to connect to ZooKeeper
   [junit4]   2> 2729980 INFO  (zkCallback-3020-thread-1) [    ] o.a.s.c.c.ConnectionManager Watcher org.apache.solr.common.cloud.ConnectionManager@4da7a3 name:ZooKeeperConnection Watcher:127.0.0.1:60158/solr got event WatchedEvent state:SyncConnected type:None path:null path:null type:None
   [junit4]   2> 2729980 INFO  (TEST-TestSolrConfigHandlerCloud.test-seed#[6A210696BB2E619E]) [    ] o.a.s.c.c.ConnectionManager Client is connected to ZooKeeper
   [junit4]   2> 2729980 INFO  (TEST-TestSolrConfigHandlerCloud.test-seed#[6A210696BB2E619E]) [    ] o.a.s.c.c.SolrZkClient Using default ZkACLProvider
   [junit4]   2> 2729981 INFO  (TEST-TestSolrConfigHandlerCloud.test-seed#[6A210696BB2E619E]) [    ] o.a.s.s.SolrDispatchFilter Loading solr.xml from SolrHome (not found in ZooKeeper)
   [junit4]   2> 2729981 INFO  (TEST-TestSolrConfigHandlerCloud.test-seed#[6A210696BB2E619E]) [    ] o.a.s.c.SolrXmlConfig Loading container configuration from C:\Users\jenkins\workspace\Lucene-Solr-5.5-Windows\solr\build\solr-core\test\J0\temp\solr.handler.TestSolrConfigHandlerCloud_6A210696BB2E619E-001\control-001\solr.xml
   [junit4]   2> 2730004 INFO  (TEST-TestSolrConfigHandlerCloud.test-seed#[6A210696BB2E619E]) [    ] o.a.s.c.CorePropertiesLocator Config-defined core root directory: C:\Users\jenkins\workspace\Lucene-Solr-5.5-Windows\solr\build\solr-core\test\J0\..\..\..\..\..\..\..\..\..\Users\jenkins\workspace\Lucene-Solr-5.5-Windows\solr\build\solr-core\test\J0\temp\solr.handler.TestSolrConfigHandlerCloud_6A210696BB2E619E-001\control-001\cores
   [junit4]   2> 2730004 INFO  (TEST-TestSolrConfigHandlerCloud.test-seed#[6A210696BB2E619E]) [    ] o.a.s.c.CoreContainer New CoreContainer 11724722
   [junit4]   2> 2730004 INFO  (TEST-TestSolrConfigHandlerCloud.test-seed#[6A210696BB2E619E]) [    ] o.a.s.c.CoreContainer Loading cores into CoreContainer [instanceDir=C:\Users\jenkins\workspace\Lucene-Solr-5.5-Windows\solr\build\solr-core\test\J0\temp\solr.handler.TestSolrConfigHandlerCloud_6A210696BB2E619E-001\control-001]
   [junit4]   2> 2730004 WARN  (TEST-TestSolrConfigHandlerCloud.test-seed#[6A210696BB2E619E]) [    ] o.a.s.c.CoreContainer Couldn't add files from C:\Users\jenkins\workspace\Lucene-Solr-5.5-Windows\solr\build\solr-core\test\J0\temp\solr.handler.TestSolrConfigHandlerCloud_6A210696BB2E619E-001\control-001\lib to classpath: C:\Users\jenkins\workspace\Lucene-Solr-5.5-Windows\solr\build\solr-core\test\J0\temp\solr.handler.TestSolrConfigHandlerCloud_6A210696BB2E619E-001\control-001\lib
   [junit4]   2> 2730005 INFO  (TEST-TestSolrConfigHandlerCloud.test-seed#[6A210696BB2E619E]) [    ] o.a.s.h.c.HttpShardHandlerFactory created with socketTimeout : 90000,urlScheme : ,connTimeout : 15000,maxConnectionsPerHost : 20,maxConnections : 10000,corePoolSize : 0,maximumPoolSize : 2147483647,maxThreadIdleTime : 5,sizeOfQueue : -1,fairnessPolicy : false,useRetries : false,connectionsEvictorSleepDelay : 5000,maxConnectionIdleTime : 40000,
   [junit4]   2> 2730008 INFO  (TEST-TestSolrConfigHandlerCloud.test-seed#[6A210696BB2E619E]) [    ] o.a.s.u.UpdateShardHandler Creating UpdateShardHandler HTTP client with params: socketTimeout=340000&connTimeout=45000&retry=true
   [junit4]   2> 2730009 INFO  (TEST-TestSolrConfigHandlerCloud.test-seed#[6A210696BB2E619E]) [    ] o.a.s.l.LogWatcher SLF4J impl is org.slf4j.impl.Log4jLoggerFactory
   [junit4]   2> 2730009 INFO  (TEST-TestSolrConfigHandlerCloud.test-seed#[6A210696BB2E619E]) [    ] o.a.s.l.LogWatcher Registering Log Listener [Log4j (org.slf4j.impl.Log4jLoggerFactory)]
   [junit4]   2> 2730009 INFO  (TEST-TestSolrConfigHandlerCloud.test-seed#[6A210696BB2E619E]) [    ] o.a.s.c.ZkContainer Zookeeper client=127.0.0.1:60158/solr
   [junit4]   2> 2730009 INFO  (TEST-TestSolrConfigHandlerCloud.test-seed#[6A210696BB2E619E]) [    ] o.a.s.c.ZkController zkHost includes chroot
   [junit4]   2> 2730009 INFO  (TEST-TestSolrConfigHandlerCloud.test-seed#[6A210696BB2E619E]) [    ] o.a.s.c.c.SolrZkClient Using default ZkCredentialsProvider
   [junit4]   2> 2730010 INFO  (TEST-TestSolrConfigHandlerCloud.test-seed#[6A210696BB2E619E]) [    ] o.a.s.c.c.ConnectionManager Waiting for client to connect to ZooKeeper
   [junit4]   2> 2730011 INFO  (zkCallback-3023-thread-1) [    ] o.a.s.c.c.ConnectionManager Watcher org.apache.solr.common.cloud.ConnectionManager@165f8f name:ZooKeeperConnection Watcher:127.0.0.1:60158 got event WatchedEvent state:SyncConnected type:None path:null path:null type:None
   [junit4]   2> 2730011 INFO  (TEST-TestSolrConfigHandlerCloud.test-seed#[6A210696BB2E619E]) [    ] o.a.s.c.c.ConnectionManager Client is connected to ZooKeeper
   [junit4]   2> 2730012 INFO  (TEST-TestSolrConfigHandlerCloud.test-seed#[6A210696BB2E619E]) [    ] o.a.s.c.c.SolrZkClient Using default ZkACLProvider
   [junit4]   2> 2730013 INFO  (TEST-TestSolrConfigHandlerCloud.test-seed#[6A210696BB2E619E]) [n:127.0.0.1:60165_    ] o.a.s.c.ZkController Added new OnReconnect listener org.apache.solr.cloud.ZkController$6@febda0
   [junit4]   2> 2730014 INFO  (TEST-TestSolrConfigHandlerCloud.test-seed#[6A210696BB2E619E]) [n:127.0.0.1:60165_    ] o.a.s.c.c.ConnectionManager Waiting for client to connect to ZooKeeper
   [junit4]   2> 2730015 INFO  (zkCallback-3024-thread-1-processing-n:127.0.0.1:60165_) [n:127.0.0.1:60165_    ] o.a.s.c.c.ConnectionManager Watcher org.apache.solr.common.cloud.ConnectionManager@1261c2b name:ZooKeeperConnection Watcher:127.0.0.1:60158/solr got event WatchedEvent state:SyncConnected type:None path:null path:null type:None
   [junit4]   2> 2730015 INFO  (TEST-TestSolrConfigHandlerCloud.test-seed#[6A210696BB2E619E]) [n:127.0.0.1:60165_    ] o.a.s.c.c.ConnectionManager Client is connected to ZooKeeper
   [junit4]   2> 2730017 INFO  (TEST-TestSolrConfigHandlerCloud.test-seed#[6A210696BB2E619E]) [n:127.0.0.1:60165_    ] o.a.s.c.c.SolrZkClient makePath: /overseer/queue
   [junit4]   2> 2730019 INFO  (TEST-TestSolrConfigHandlerCloud.test-seed#[6A210696BB2E619E]) [n:127.0.0.1:60165_    ] o.a.s.c.c.SolrZkClient makePath: /overseer/collection-queue-work
   [junit4]   2> 2730022 INFO  (TEST-TestSolrConfigHandlerCloud.test-seed#[6A210696BB2E619E]) [n:127.0.0.1:60165_    ] o.a.s.c.c.SolrZkClient makePath: /overseer/collection-map-running
   [junit4]   2> 2730023 INFO  (TEST-TestSolrConfigHandlerCloud.test-seed#[6A210696BB2E619E]) [n:127.0.0.1:60165_    ] o.a.s.c.c.SolrZkClient makePath: /overseer/collection-map-completed
   [junit4]   2> 2730025 INFO  (TEST-TestSolrConfigHandlerCloud.test-seed#[6A210696BB2E619E]) [n:127.0.0.1:60165_    ] o.a.s.c.c.SolrZkClient makePath: /overseer/collection-map-failure
   [junit4]   2> 2730026 INFO  (TEST-TestSolrConfigHandlerCloud.test-seed#[6A210696BB2E619E]) [n:127.0.0.1:60165_    ] o.a.s.c.c.SolrZkClient makePath: /live_nodes
   [junit4]   2> 2730028 INFO  (TEST-TestSolrConfigHandlerCloud.test-seed#[6A210696BB2E619E]) [n:127.0.0.1:60165_    ] o.a.s.c.c.SolrZkClient makePath: /aliases.json
   [junit4]   2> 2730029 INFO  (TEST-TestSolrConfigHandlerCloud.test-seed#[6A210696BB2E619E]) [n:127.0.0.1:60165_    ] o.a.s.c.c.SolrZkClient makePath: /clusterstate.json
   [junit4]   2> 2730030 INFO  (TEST-TestSolrConfigHandlerCloud.test-seed#[6A210696BB2E619E]) [n:127.0.0.1:60165_    ] o.a.s.c.c.SolrZkClient makePath: /security.json
   [junit4]   2> 2730031 INFO  (TEST-TestSolrConfigHandlerCloud.test-seed#[6A210696BB2E619E]) [n:127.0.0.1:60165_    ] o.a.s.c.ZkController Register node as live in ZooKeeper:/live_nodes/127.0.0.1:60165_
   [junit4]   2> 2730031 INFO  (TEST-TestSolrConfigHandlerCloud.test-seed#[6A210696BB2E619E]) [n:127.0.0.1:60165_    ] o.a.s.c.c.SolrZkClient makePath: /live_nodes/127.0.0.1:60165_
   [junit4]   2> 2730032 INFO  (TEST-TestSolrConfigHandlerCloud.test-seed#[6A210696BB2E619E]) [n:127.0.0.1:60165_    ] o.a.s.c.c.SolrZkClient makePath: /overseer_elect
   [junit4]   2> 2730033 INFO  (TEST-TestSolrConfigHandlerCloud.test-seed#[6A210696BB2E619E]) [n:127.0.0.1:60165_    ] o.a.s.c.c.SolrZkClient makePath: /overseer_elect/election
   [junit4]   2> 2730034 INFO  (TEST-TestSolrConfigHandlerCloud.test-seed#[6A210696BB2E619E]) [n:127.0.0.1:60165_    ] o.a.s.c.Overseer Overseer (id=null) closing
   [junit4]   2> 2730035 INFO  (TEST-TestSolrConfigHandlerCloud.test-seed#[6A210696BB2E619E]) [n:127.0.0.1:60165_    ] o.a.s.c.LeaderElector Joined leadership election with path: /overseer_elect/election/98863339229151236-127.0.0.1:60165_-n_0000000000
   [junit4]   2> 2730035 INFO  (TEST-TestSolrConfigHandlerCloud.test-seed#[6A210696BB2E619E]) [n:127.0.0.1:60165_    ] o.a.s.c.OverseerElectionContext I am going to be the leader 127.0.0.1:60165_
   [junit4]   2> 2730035 INFO  (TEST-TestSolrConfigHandlerCloud.test-seed#[6A210696BB2E619E]) [n:127.0.0.1:60165_    ] o.a.s.c.c.SolrZkClient makePath: /overseer_elect/leader
   [junit4]   2> 2730036 INFO  (TEST-TestSolrConfigHandlerCloud.test-seed#[6A210696BB2E619E]) [n:127.0.0.1:60165_    ] o.a.s.c.Overseer Overseer (id=98863339229151236-127.0.0.1:60165_-n_0000000000) starting
   [junit4]   2> 2730037 INFO  (TEST-TestSolrConfigHandlerCloud.test-seed#[6A210696BB2E619E]) [n:127.0.0.1:60165_    ] o.a.s.c.c.SolrZkClient makePath: /overseer/queue-work
   [junit4]   2> 2730042 INFO  (TEST-TestSolrConfigHandlerCloud.test-seed#[6A210696BB2E619E]) [n:127.0.0.1:60165_    ] o.a.s.c.OverseerAutoReplicaFailoverThread Starting OverseerAutoReplicaFailoverThread autoReplicaFailoverWorkLoopDelay=10000 autoReplicaFailoverWaitAfterExpiration=30000 autoReplicaFailoverBadNodeExpiration=60000
   [junit4]   2> 2730042 INFO  (TEST-TestSolrConfigHandlerCloud.test-seed#[6A210696BB2E619E]) [n:127.0.0.1:60165_    ] o.a.s.c.c.ZkStateReader Updating cluster state from ZooKeeper... 
   [junit4]   2> 2730043 INFO  (OverseerStateUpdate-98863339229151236-127.0.0.1:60165_-n_0000000000) [n:127.0.0.1:60165_    ] o.a.s.c.Overseer Starting to work on the main queue
   [junit4]   2> 2730044 INFO  (OverseerCollectionConfigSetProcessor-98863339229151236-127.0.0.1:60165_-n_0000000000) [n:127.0.0.1:60165_    ] o.a.s.c.OverseerTaskProcessor Process current queue of overseer operations
   [junit4]   2> 2730051 INFO  (TEST-TestSolrConfigHandlerCloud.test-seed#[6A210696BB2E619E]) [n:127.0.0.1:60165_    ] o.a.s.c.CoreContainer Security conf doesn't exist. Skipping setup for authorization module.
   [junit4]   2> 2730052 INFO  (TEST-TestSolrConfigHandlerCloud.test-seed#[6A210696BB2E619E]) [n:127.0.0.1:60165_    ] o.a.s.c.CoreContainer No authentication plugin used.
   [junit4]   2> 2730053 INFO  (TEST-TestSolrConfigHandlerCloud.test-seed#[6A210696BB2E619E]) [n:127.0.0.1:60165_    ] o.a.s.c.CorePropertiesLocator Looking for core definitions underneath C:\Users\jenkins\workspace\Lucene-Solr-5.5-Windows\solr\build\solr-core\test\J0\..\..\..\..\..\..\..\..\..\Users\jenkins\workspace\Lucene-Solr-5.5-Windows\solr\build\solr-core\test\J0\temp\solr.handler.TestSolrConfigHandlerCloud_6A210696BB2E619E-001\control-001\cores
   [junit4]   2> 2730056 INFO  (TEST-TestSolrConfigHandlerCloud.test-seed#[6A210696BB2E619E]) [n:127.0.0.1:60165_    ] o.a.s.c.CoreDescriptor Created CoreDescriptor: {transient=false, loadOnStartup=true, coreNodeName=, shard=, configSetProperties=configsetprops.json, name=collection1, dataDir=data\, config=solrconfig.xml, collection=control_collection, schema=schema.xml}
   [junit4]   2> 2730056 INFO  (TEST-TestSolrConfigHandlerCloud.test-seed#[6A210696BB2E619E]) [n:127.0.0.1:60165_    ] o.a.s.c.CorePropertiesLocator Found core collection1 in C:\Users\jenkins\workspace\Lucene-Solr-5.5-Windows\solr\build\solr-core\test\J0\..\..\..\..\..\..\..\..\..\Users\jenkins\workspace\Lucene-Solr-5.5-Windows\solr\build\solr-core\test\J0\temp\solr.handler.TestSolrConfigHandlerCloud_6A210696BB2E619E-001\control-001\cores\collection1
   [junit4]   2> 2730056 INFO  (TEST-TestSolrConfigHandlerCloud.test-seed#[6A210696BB2E619E]) [n:127.0.0.1:60165_    ] o.a.s.c.CorePropertiesLocator Found 1 core definitions
   [junit4]   2> 2730056 INFO  (TEST-TestSolrConfigHandlerCloud.test-seed#[6A210696BB2E619E]) [n:127.0.0.1:60165_    ] o.a.s.s.SolrDispatchFilter user.dir=C:\Users\jenkins\workspace\Lucene-Solr-5.5-Windows\solr\build\solr-core\test\J0
   [junit4]   2> 2730057 INFO  (TEST-TestSolrConfigHandlerCloud.test-seed#[6A210696BB2E619E]) [n:127.0.0.1:60165_    ] o.a.s.s.SolrDispatchFilter SolrDispatchFilter.init() done
   [junit4]   2> 2730057 INFO  (coreLoadExecutor-9584-thread-1-processing-n:127.0.0.1:60165_) [n:127.0.0.1:60165_ c:control_collection   x:collection1] o.a.s.c.ZkController publishing state=down
   [junit4]   2> 2730057 INFO  (coreLoadExecutor-9584-thread-1-processing-n:127.0.0.1:60165_) [n:127.0.0.1:60165_ c:control_collection   x:collection1] o.a.s.c.ZkController numShards not found on descriptor - reading it from system property
   [junit4]   2> 2730058 INFO  (coreLoadExecutor-9584-thread-1-processing-n:127.0.0.1:60165_) [n:127.0.0.1:60165_ c:control_collection   x:collection1] o.a.s.c.ZkController Collection control_collection not visible yet, but flagging it so a watch is registered when it becomes visible
   [junit4]   2> 2730058 INFO  (coreLoadExecutor-9584-thread-1-processing-n:127.0.0.1:60165_) [n:127.0.0.1:60165_ c:control_collection   x:collection1] o.a.s.c.c.ZkStateReader addZkWatch [control_collection]
   [junit4]   2> 2730059 INFO  (OverseerStateUpdate-98863339229151236-127.0.0.1:60165_-n_0000000000) [n:127.0.0.1:60165_    ] o.a.s.c.Overseer processMessage: queueSize: 1, message = {
   [junit4]   2>   "operation":"state",
   [junit4]   2>   "base_url":"http://127.0.0.1:60165",
   [junit4]   2>   "state":"down",
   [junit4]   2>   "shard":null,
   [junit4]   2>   "collection":"control_collection",
   [junit4]   2>   "node_name":"127.0.0.1:60165_",
   [junit4]   2>   "numShards":"1",
   [junit4]   2>   "core":"collection1",
   [junit4]   2>   "roles":null} current state version: 0
   [junit4]   2> 2730059 INFO  (coreLoadExecutor-9584-thread-1-processing-n:127.0.0.1:60165_) [n:127.0.0.1:60165_ c:control_collection   x:collection1] o.a.s.c.c.ZkStateReader Deleting data for [control_collection]
   [junit4]   2> 2730059 INFO  (OverseerStateUpdate-98863339229151236-127.0.0.1:60165_-n_0000000000) [n:127.0.0.1:60165_    ] o.a.s.c.o.ReplicaMutator Update state numShards=1 message={
   [junit4]   2>   "operation":"state",
   [junit4]   2>   "base_url":"http://127.0.0.1:60165",
   [junit4]   2>   "state":"down",
   [junit4]   2>   "shard":null,
   [junit4]   2>   "collection":"control_collection",
   [junit4]   2>   "node_name":"127.0.0.1:60165_",
   [junit4]   2>   "numShards":"1",
   [junit4]   2>   "core":"collection1",
   [junit4]   2>   "roles":null}
   [junit4]   2> 2730060 INFO  (OverseerStateUpdate-98863339229151236-127.0.0.1:60165_-n_0000000000) [n:127.0.0.1:60165_    ] o.a.s.c.o.ClusterStateMutator building a new cName: control_collection
   [junit4]   2> 2730060 INFO  (OverseerStateUpdate-98863339229151236-127.0.0.1:60165_-n_0000000000) [n:127.0.0.1:60165_    ] o.a.s.c.o.ReplicaMutator Assigning new node to shard shard=shard1
   [junit4]   2> 2730060 INFO  (coreLoadExecutor-9584-thread-1-processing-n:127.0.0.1:60165_) [n:127.0.0.1:60165_ c:control_collection   x:collection1] o.a.s.c.ZkController look for our core node name
   [junit4]   2> 2730061 INFO  (zkCallback-3024-thread-1-processing-n:127.0.0.1:60165_) [n:127.0.0.1:60165_    ] o.a.s.c.c.ZkStateReader A cluster state change: [WatchedEvent state:SyncConnected type:NodeDataChanged path:/clusterstate.json], has occurred - updating... (live nodes size: [1])
   [junit4]   2> 2731062 INFO  (coreLoadExecutor-9584-thread-1-processing-n:127.0.0.1:60165_) [n:127.0.0.1:60165_ c:control_collection   x:collection1] o.a.s.c.ZkController waiting to find shard id in clusterstate for collection1
   [junit4]   2> 2731062 INFO  (coreLoadExecutor-9584-thread-1-processing-n:127.0.0.1:60165_) [n:127.0.0.1:60165_ c:control_collection   x:collection1] o.a.s.c.ZkController Check for collection zkNode:control_collection
   [junit4]   2> 2731062 INFO  (coreLoadExecutor-9584-thread-1-processing-n:127.0.0.1:60165_) [n:127.0.0.1:60165_ c:control_collection   x:collection1] o.a.s.c.ZkController Collection zkNode exists
   [junit4]   2> 2731062 INFO  (coreLoadExecutor-9584-thread-1-processing-n:127.0.0.1:60165_) [n:127.0.0.1:60165_ c:control_collection   x:collection1] o.a.s.c.c.ZkStateReader Load collection config from: [/collections/control_collection]
   [junit4]   2> 2731063 INFO  (coreLoadExecutor-9584-thread-1-processing-n:127.0.0.1:60165_) [n:127.0.0.1:60165_ c:control_collection   x:collection1] o.a.s.c.c.ZkStateReader path=[/collections/control_collection] [configName]=[conf1] specified config exists in ZooKeeper
   [junit4]   2> 2731063 INFO  (coreLoadExecutor-9584-thread-1-processing-n:127.0.0.1:60165_) [n:127.0.0.1:60165_ c:control_collection   x:collection1] o.a.s.c.SolrResourceLoader new SolrResourceLoader for directory: 'C:\Users\jenkins\workspace\Lucene-Solr-5.5-Windows\solr\build\solr-core\test\J0\temp\solr.handler.TestSolrConfigHandlerCloud_6A210696BB2E619E-001\control-001\cores\collection1'
   [junit4]   2> 2731063 INFO  (coreLoadExecutor-9584-thread-1-processing-n:127.0.0.1:60165_) [n:127.0.0.1:60165_ c:control_collection   x:collection1] o.a.s.c.SolrResourceLoader JNDI not configured for solr (NoInitialContextEx)
   [junit4]   2> 2731063 INFO  (coreLoadExecutor-9584-thread-1-processing-n:127.0.0.1:60165_) [n:127.0.0.1:60165_ c:control_collection   x:collection1] o.a.s.c.SolrResourceLoader solr home defaulted to 'solr/' (could not find system property or JNDI)
   [junit4]   2> 2731065 INFO  (coreLoadExecutor-9584-thread-1-processing-n:127.0.0.1:60165_) [n:127.0.0.1:60165_ c:control_collection   x:collection1] o.a.s.c.Config loaded config solrconfig.xml with version 0 
   [junit4]   2> 2731075 INFO  (coreLoadExecutor-9584-thread-1-processing-n:127.0.0.1:60165_) [n:127.0.0.1:60165_ c:control_collection   x:collection1] o.a.s.c.SolrConfig current version of requestparams : -1
   [junit4]   2> 2731084 WARN  (coreLoadExecutor-9584-thread-1-processing-n:127.0.0.1:60165_) [n:127.0.0.1:60165_ c:control_collection   x:collection1] o.a.s.c.Config Beginning with Solr 5.5, <mergePolicy> is deprecated, use <mergePolicyFactory> instead.
   [junit4]   2> 2731086 INFO  (coreLoadExecutor-9584-thread-1-processing-n:127.0.0.1:60165_) [n:127.0.0.1:60165_ c:control_collection   x:collection1] o.a.s.c.SolrConfig Using Lucene MatchVersion: 5.5.5
   [junit4]   2> 2731113 INFO  (coreLoadExecutor-9584-thread-1-processing-n:127.0.0.1:60165_) [n:127.0.0.1:60165_ c:control_collection   x:collection1] o.a.s.c.SolrConfig Loaded SolrConfig: solrconfig.xml
   [junit4]   2> 2731120 INFO  (coreLoadExecutor-9584-thread-1-processing-n:127.0.0.1:60165_) [n:127.0.0.1:60165_ c:control_collection   x:collection1] o.a.s.s.IndexSchema [collection1] Schema name=test
   [junit4]   2> 2731317 INFO  (coreLoadExecutor-9584-thread-1-processing-n:127.0.0.1:60165_) [n:127.0.0.1:60165_ c:control_collection   x:collection1] o.a.s.s.OpenExchangeRatesOrgProvider Initialized with rates=open-exchange-rates.json, refreshInterval=1440.
   [junit4]   2> 2731325 INFO  (coreLoadExecutor-9584-thread-1-processing-n:127.0.0.1:60165_) [n:127.0.0.1:60165_ c:control_collection   x:collection1] o.a.s.s.IndexSchema default search field in schema is text
   [junit4]   2> 2731327 INFO  (coreLoadExecutor-9584-thread-1-processing-n:127.0.0.1:60165_) [n:127.0.0.1:60165_ c:control_collection   x:collection1] o.a.s.s.IndexSchema unique key field: id
   [junit4]   2> 2731333 INFO  (coreLoadExecutor-9584-thread-1-processing-n:127.0.0.1:60165_) [n:127.0.0.1:60165_ c:control_collection   x:collection1] o.a.s.s.FileExchangeRateProvider Reloading exchange rates from file currency.xml
   [junit4]   2> 2731336 INFO  (coreLoadExecutor-9584-thread-1-processing-n:127.0.0.1:60165_) [n:127.0.0.1:60165_ c:control_collection   x:collection1] o.a.s.s.FileExchangeRateProvider Reloading exchange rates from file currency.xml
   [junit4]   2> 2731339 INFO  (coreLoadExecutor-9584-thread-1-processing-n:127.0.0.1:60165_) [n:127.0.0.1:60165_ c:control_collection   x:collection1] o.a.s.s.OpenExchangeRatesOrgProvider Reloading exchange rates from open-exchange-rates.json
   [junit4]   2> 2731340 INFO  (coreLoadExecutor-9584-thread-1-processing-n:127.0.0.1:60165_) [n:127.0.0.1:60165_ c:control_collection   x:collection1] o.a.s.s.OpenExchangeRatesOrgProvider Reloading exchange rates from open-exchange-rates.json
   [junit4]   2> 2731343 INFO  (coreLoadExecutor-9584-thread-1-processing-n:127.0.0.1:60165_) [n:127.0.0.1:60165_ c:control_collection   x:collection1] o.a.s.c.ConfigSetProperties Did not find ConfigSet properties, assuming default properties: Can't find resource 'configsetprops.json' in classpath or '/configs/conf1', cwd=C:\Users\jenkins\workspace\Lucene-Solr-5.5-Windows\solr\build\solr-core\test\J0
   [junit4]   2> 2731343 INFO  (coreLoadExecutor-9584-thread-1-processing-n:127.0.0.1:60165_) [n:127.0.0.1:60165_ c:control_collection   x:collection1] o.a.s.c.CoreContainer Creating SolrCore 'collection1' using configuration from collection control_collection
   [junit4]   2> 2731343 INFO  (coreLoadExecutor-9584-thread-1-processing-n:127.0.0.1:60165_) [n:127.0.0.1:60165_ c:control_collection s:shard1 r:core_node1 x:collection1] o.a.s.c.SolrCore org.apache.solr.core.MockDirectoryFactory
   [junit4]   2> 2731344 INFO  (coreLoadExecutor-9584-thread-1-processing-n:127.0.0.1:60165_) [n:127.0.0.1:60165_ c:control_collection s:shard1 r:core_node1 x:collection1] o.a.s.c.SolrCore [[collection1] ] Opening new SolrCore at [C:\Users\jenkins\workspace\Lucene-Solr-5.5-Windows\solr\build\solr-core\test\J0\temp\solr.handler.TestSolrConfigHandlerCloud_6A210696BB2E619E-001\control-001\cores\collection1], dataDir=[C:\Users\jenkins\workspace\Lucene-Solr-5.5-Windows\solr\build\solr-core\test\J0\..\..\..\..\..\..\..\..\..\Users\jenkins\workspace\Lucene-Solr-5.5-Windows\solr\build\solr-core\test\J0\temp\solr.handler.TestSolrConfigHandlerCloud_6A210696BB2E619E-001\control-001\cores\collection1\data\]
   [junit4]   2> 2731344 INFO  (coreLoadExecutor-9584-thread-1-processing-n:127.0.0.1:60165_) [n:127.0.0.1:60165_ c:control_collection s:shard1 r:core_node1 x:collection1] o.a.s.c.JmxMonitoredMap JMX monitoring is enabled. Adding Solr mbeans to JMX Server: com.sun.jmx.mbeanserver.JmxMBeanServer@1aa2dec
   [junit4]   2> 2731344 INFO  (coreLoadExecutor-9584-thread-1-processing-n:127.0.0.1:60165_) [n:127.0.0.1:60165_ c:control_collection s:shard1 r:core_node1 x:collection1] o.a.s.c.CachingDirectoryFactory return new directory for C:\Users\jenkins\workspace\Lucene-Solr-5.5-Windows\solr\build\solr-core\test\J0\..\..\..\..\..\..\..\..\..\Users\jenkins\workspace\Lucene-Solr-5.5-Windows\solr\build\solr-core\test\J0\temp\solr.handler.TestSolrConfigHandlerCloud_6A210696BB2E619E-001\control-001\cores\collection1\data\
   [junit4]   2> 2731344 INFO  (coreLoadExecutor-9584-thread-1-processing-n:127.0.0.1:60165_) [n:127.0.0.1:60165_ c:control_collection s:shard1 r:core_node1 x:collection1] o.a.s.c.SolrCore New index directory detected: old=null new=C:\Users\jenkins\workspace\Lucene-Solr-5.5-Windows\solr\build\solr-core\test\J0\..\..\..\..\..\..\..\..\..\Users\jenkins\workspace\Lucene-Solr-5.5-Windows\solr\build\solr-core\test\J0\temp\solr.handler.TestSolrConfigHandlerCloud_6A210696BB2E619E-001\control-001\cores\collection1\data\index/
   [junit4]   2> 2731344 WARN  (coreLoadExecutor-9584-thread-1-processing-n:127.0.0.1:60165_) [n:127.0.0.1:60165_ c:control_collection s:shard1 r:core_node1 x:collection1] o.a.s.c.SolrCore [collection1] Solr index directory 'C:\Users\jenkins\workspace\Lucene-Solr-5.5-Windows\solr\build\solr-core\test\J0\..\..\..\..\..\..\..\..\..\Users\jenkins\workspace\Lucene-Solr-5.5-Windows\solr\build\solr-core\test\J0\temp\solr.handler.TestSolrConfigHandlerCloud_6A210696BB2E619E-001\control-001\cores\collection1\data\index' doesn't exist. Creating new index...
   [junit4]   2> 2731345 INFO  (coreLoadExecutor-9584-thread-1-processing-n:127.0.0.1:60165_) [n:127.0.0.1:60165_ c:control_collection s:shard1 r:core_node1 x:collection1] o.a.s.c.CachingDirectoryFactory return new directory for C:\Users\jenkins\workspace\Lucene-Solr-5.5-Windows\solr\build\solr-core\test\J0\..\..\..\..\..\..\..\..\..\Users\jenkins\workspace\Lucene-Solr-5.5-Windows\solr\build\solr-core\test\J0\temp\solr.handler.TestSolrConfigHandlerCloud_6A210696BB2E619E-001\control-001\cores\collection1\data\index
   [junit4]   2> 2731345 INFO  (coreLoadExecutor-9584-thread-1-processing-n:127.0.0.1:60165_) [n:127.0.0.1:60165_ c:control_collection s:shard1 r:core_node1 x:collection1] o.a.s.u.RandomMergePolicy RandomMergePolicy wrapping class org.apache.lucene.index.AlcoholicMergePolicy: [AlcoholicMergePolicy: minMergeSize=0, mergeFactor=10, maxMergeSize=201056802, maxMergeSizeForForcedMerge=9223372036854775807, calibrateSizeByDeletes=true, maxMergeDocs=2147483647, maxCFSSegmentSizeMB=8.796093022207999E12, noCFSRatio=0.1]
   [junit4]   2> 2731345 INFO  (coreLoadExecutor-9584-thread-1-processing-n:127.0.0.1:60165_) [n:127.0.0.1:60165_ c:control_collection s:shard1 r:core_node1 x:collection1] o.a.s.c.SolrDeletionPolicy SolrDeletionPolicy.onCommit: commits: num=1
   [junit4]   2> 	commit{dir=MockDirectoryWrapper(RAMDirectory@b6fefd lockFactory=org.apache.lucene.store.SingleInstanceLockFactory@1e9c9d),segFN=segments_1,generation=1}
   [junit4]   2> 2731345 INFO  (coreLoadExecutor-9584-thread-1-processing-n:127.0.0.1:60165_) [n:127.0.0.1:60165_ c:control_collection s:shard1 r:core_node1 x:collection1] o.a.s.c.SolrDeletionPolicy newest commit generation = 1
   [junit4]   2> 2731346 INFO  (OldIndexDirectoryCleanupThreadForCore-collection1) [n:127.0.0.1:60165_ c:control_collection s:shard1 r:core_node1 x:collection1] o.a.s.c.SolrCore Looking for old index directories to cleanup for core collection1 in C:\Users\jenkins\workspace\Lucene-Solr-5.5-Windows\solr\build\solr-core\test\J0\..\..\..\..\..\..\..\..\..\Users\jenkins\workspace\Lucene-Solr-5.5-Windows\solr\build\solr-core\test\J0\temp\solr.handler.TestSolrConfigHandlerCloud_6A210696BB2E619E-001\control-001\cores\collection1\data\
   [junit4]   2> 2731346 WARN  (OldIndexDirectoryCleanupThreadForCore-collection1) [n:127.0.0.1:60165_ c:control_collection s:shard1 r:core_node1 x:collection1] o.a.s.c.DirectoryFactory C:\Users\jenkins\workspace\Lucene-Solr-5.5-Windows\solr\build\solr-core\test\J0\..\..\..\..\..\..\..\..\..\Users\jenkins\workspace\Lucene-Solr-5.5-Windows\solr\build\solr-core\test\J0\temp\solr.handler.TestSolrConfigHandlerCloud_6A210696BB2E619E-001\control-001\cores\collection1\data\ does not point to a valid data directory; skipping clean-up of old index directories.
   [junit4]   2> 2731347 INFO  (coreLoadExecutor-9584-thread-1-processing-n:127.0.0.1:60165_) [n:127.0.0.1:60165_ c:control_collection s:shard1 r:core_node1 x:collection1] o.a.s.u.p.UpdateRequestProcessorChain creating updateRequestProcessorChain "nodistrib"
   [junit4]   2> 2731347 INFO  (coreLoadExecutor-9584-thread-1-processing-n:127.0.0.1:60165_) [n:127.0.0.1:60165_ c:control_collection s:shard1 r:core_node1 x:collection1] o.a.s.u.p.UpdateRequestProcessorChain creating updateRequestProcessorChain "dedupe"
   [junit4]   2> 2731347 INFO  (coreLoadExecutor-9584-thread-1-processing-n:127.0.0.1:60165_) [n:127.0.0.1:60165_ c:control_collection s:shard1 r:core_node1 x:collection1] o.a.s.u.p.UpdateRequestProcessorChain inserting DistributedUpdateProcessorFactory into updateRequestProcessorChain "dedupe"
   [junit4]   2> 2731347 INFO  (coreLoadExecutor-9584-thread-1-processing-n:127.0.0.1:60165_) [n:127.0.0.1:60165_ c:control_collection s:shard1 r:core_node1 x:collection1] o.a.s.u.p.UpdateRequestProcessorChain creating updateRequestProcessorChain "stored_sig"
   [junit4]   2> 2731347 INFO  (coreLoadExecutor-9584-thread-1-processing-n:127.0.0.1:60165_) [n:127.0.0.1:60165_ c:control_collection s:shard1 r:core_node1 x:collection1] o.a.s.u.p.UpdateRequestProcessorChain inserting DistributedUpdateProcessorFactory into updateRequestProcessorChain "stored_sig"
   [junit4]   2> 2731348 INFO  (coreLoadExecutor-9584-thread-1-processing-n:127.0.0.1:60165_) [n:127.0.0.1:60165_ c:control_collection s:shard1 r:core_node1 x:collection1] o.a.s.u.p.UpdateRequestProcessorChain creating updateRequestProcessorChain "distrib-dup-test-chain-explicit"
   [junit4]   2> 2731348 INFO  (coreLoadExecutor-9584-thread-1-processing-n:127.0.0.1:60165_) [n:127.0.0.1:60165_ c:control_collection s:shard1 r:core_node1 x:collection1] o.a.s.u.p.UpdateRequestProcessorChain creating updateRequestProcessorChain "distrib-dup-test-chain-implicit"
   [junit4]   2> 2731348 INFO  (coreLoadExecutor-9584-thread-1-processing-n:127.0.0.1:60165_) [n:127.0.0.1:60165_ c:control_collection s:shard1 r:core_node1 x:collection1] o.a.s.u.p.UpdateRequestProcessorChain inserting DistributedUpdateProcessorFactory into updateRequestProcessorChain "distrib-dup-test-chain-implicit"
   [junit4]   2> 2731348 INFO  (coreLoadExecutor-9584-thread-1-processing-n:127.0.0.1:60165_) [n:127.0.0.1:60165_ c:control_collection s:shard1 r:core_node1 x:collection1] o.a.s.c.SolrCore no updateRequestProcessorChain defined as default, creating implicit default
   [junit4]   2> 2731348 WARN  (coreLoadExecutor-9584-thread-1-processing-n:127.0.0.1:60165_) [n:127.0.0.1:60165_ c:control_collection s:shard1 r:core_node1 x:collection1] o.a.s.c.RequestHandlers INVALID paramSet a in requestHandler {type = requestHandler,name = /dump,class = DumpRequestHandler,args = {defaults={a=A,b=B}}}
   [junit4]   2> 2731355 INFO  (coreLoadExecutor-9584-thread-1-processing-n:127.0.0.1:60165_) [n:127.0.0.1:60165_ c:control_collection s:shard1 r:core_node1 x:collection1] o.a.s.h.l.XMLLoader xsltCacheLifetimeSeconds=60
   [junit4]   2> 2731355 INFO  (coreLoadExecutor-9584-thread-1-processing-n:127.0.0.1:60165_) [n:127.0.0.1:60165_ c:control_collection s:shard1 r:core_node1 x:collection1] o.a.s.h.l.XMLLoader xsltCacheLifetimeSeconds=60
   [junit4]   2> 2731357 INFO  (coreLoadExecutor-9584-thread-1-processing-n:127.0.0.1:60165_) [n:127.0.0.1:60165_ c:control_collection s:shard1 r:core_node1 x:collection1] o.a.s.h.l.XMLLoader xsltCacheLifetimeSeconds=60
   [junit4]   2> 2731358 INFO  (coreLoadExecutor-9584-thread-1-processing-n:127.0.0.1:60165_) [n:127.0.0.1:60165_ c:control_collection s:shard1 r:core_node1 x:collection1] o.a.s.h.l.XMLLoader xsltCacheLifetimeSeconds=60
   [junit4]   2> 2731360 INFO  (coreLoadExecutor-9584-thread-1-processing-n:127.0.0.1:60165_) [n:127.0.0.1:60165_ c:control_collection s:shard1 r:core_node1 x:collection1] o.a.s.c.RequestHandlers Registered paths: /config,standard,/admin/file,/admin/threads,/update/json,/admin/system,/admin/properties,/admin/luke,/schema,/get,/admin/ping,/admin/plugins,/dump,/admin/segments,/replication,/update,/admin/mbeans,/update/json/docs,/update/csv,/admin/logging
   [junit4]   2> 2731361 INFO  (coreLoadExecutor-9584-thread-1-processing-n:127.0.0.1:60165_) [n:127.0.0.1:60165_ c:control_collection s:shard1 r:core_node1 x:collection1] o.a.s.c.SolrCore Using default statsCache cache: org.apache.solr.search.stats.LocalStatsCache
   [junit4]   2> 2731362 INFO  (coreLoadExecutor-9584-thread-1-processing-n:127.0.0.1:60165_) [n:127.0.0.1:60165_ c:control_collection s:shard1 r:core_node1 x:collection1] o.a.s.u.UpdateHandler Using UpdateLog implementation: org.apache.solr.update.UpdateLog
   [junit4]   2> 2731362 INFO  (coreLoadExecutor-9584-thread-1-processing-n:127.0.0.1:60165_) [n:127.0.0.1:60165_ c:control_collection s:shard1 r:core_node1 x:collection1] o.a.s.u.UpdateLog Initializing UpdateLog: dataDir= defaultSyncLevel=FLUSH numRecordsToKeep=100 maxNumLogsToKeep=10 numVersionBuckets=65536
   [junit4]   2> 2731364 INFO  (coreLoadExecutor-9584-thread-1-processing-n:127.0.0.1:60165_) [n:127.0.0.1:60165_ c:control_collection s:shard1 r:core_node1 x:collection1] o.a.s.u.CommitTracker Hard AutoCommit: disabled
   [junit4]   2> 2731364 INFO  (coreLoadExecutor-9584-thread-1-processing-n:127.0.0.1:60165_) [n:127.0.0.1:60165_ c:control_collection s:shard1 r:core_node1 x:collection1] o.a.s.u.CommitTracker Soft AutoCommit: disabled
   [junit4]   2> 2731365 INFO  (coreLoadExecutor-9584-thread-1-processing-n:127.0.0.1:60165_) [n:127.0.0.1:60165_ c:control_collection s:shard1 r:core_node1 x:collection1] o.a.s.u.RandomMergePolicy RandomMergePolicy wrapping class org.apache.lucene.index.LogByteSizeMergePolicy: [LogByteSizeMergePolicy: minMergeSize=1677721, mergeFactor=45, maxMergeSize=2147483648, maxMergeSizeForForcedMerge=9223372036854775807, calibrateSizeByDeletes=true, maxMergeDocs=2147483647, maxCFSSegmentSizeMB=8.796093022207999E12, noCFSRatio=0.31344167412458757]
   [junit4]   2> 2731365 INFO  (coreLoadExecutor-9584-thread-1-processing-n:127.0.0.1:60165_) [n:127.0.0.1:60165_ c:control_collection s:shard1 r:core_node1 x:collection1] o.a.s.c.SolrDeletionPolicy SolrDeletionPolicy.onInit: commits: num=1
   [junit4]   2> 	commit{dir=MockDirectoryWrapper(RAMDirectory@b6fefd lockFactory=org.apache.lucene.store.SingleInstanceLockFactory@1e9c9d),segFN=segments_1,generation=1}
   [junit4]   2> 2731365 INFO  (coreLoadExecutor-9584-thread-1-processing-n:127.0.0.1:60165_) [n:127.0.0.1:60165_ c:control_collection s:shard1 r:core_node1 x:collection1] o.a.s.c.SolrDeletionPolicy newest commit generation = 1
   [junit4]   2> 2731365 INFO  (coreLoadExecutor-9584-thread-1-processing-n:127.0.0.1:60165_) [n:127.0.0.1:60165_ c:control_collection s:shard1 r:core_node1 x:collection1] o.a.s.s.SolrIndexSearcher Opening Searcher@14b22e[collection1] main
   [junit4]   2> 2731365 INFO  (coreLoadExecutor-9584-thread-1-processing-n:127.0.0.1:60165_) [n:127.0.0.1:60165_ c:control_collection s:shard1 r:core_node1 x:collection1] o.a.s.c.c.ZkStateReader Load collection config from: [/collections/control_collection]
   [junit4]   2> 2731365 INFO  (coreLoadExecutor-9584-thread-1-processing-n:127.0.0.1:60165_) [n:127.0.0.1:60165_ c:control_collection s:shard1 r:core_node1 x:collection1] o.a.s.c.c.ZkStateReader path=[/collections/control_collection] [configName]=[conf1] specified config exists in ZooKeeper
   [junit4]   2> 2731365 INFO  (coreLoadExecutor-9584-thread-1-processing-n:127.0.0.1:60165_) [n:127.0.0.1:60165_ c:control_collection s:shard1 r:core_node1 x:collection1] o.a.s.r.ManagedResourceStorage Setting up ZooKeeper-based storage for the RestManager with znodeBase: /configs/conf1
   [junit4]   2> 2731365 INFO  (coreLoadExecutor-9584-thread-1-processing-n:127.0.0.1:60165_) [n:127.0.0.1:60165_ c:control_collection s:shard1 r:core_node1 x:collection1] o.a.s.r.ManagedResourceStorage Configured ZooKeeperStorageIO with znodeBase: /configs/conf1
   [junit4]   2> 2731365 INFO  (coreLoadExecutor-9584-thread-1-processing-n:127.0.0.1:60165_) [n:127.0.0.1:60165_ c:control_collection s:shard1 r:core_node1 x:collection1] o.a.s.r.RestManager Initializing RestManager with initArgs: {}
   [junit4]   2> 2731365 INFO  (coreLoadExecutor-9584-thread-1-processing-n:127.0.0.1:60165_) [n:127.0.0.1:60165_ c:control_collection s:shard1 r:core_node1 x:collection1] o.a.s.r.ManagedResourceStorage Reading _rest_managed.json using ZooKeeperStorageIO:path=/configs/conf1
   [junit4]   2> 2731367 INFO  (coreLoadExecutor-9584-thread-1-processing-n:127.0.0.1:60165_) [n:127.0.0.1:60165_ c:control_collection s:shard1 r:core_node1 x:collection1] o.a.s.r.ManagedResourceStorage No data found for znode /configs/conf1/_rest_managed.json
   [junit4]   2> 2731367 INFO  (coreLoadExecutor-9584-thread-1-processing-n:127.0.0.1:60165_) [n:127.0.0.1:60165_ c:control_collection s:shard1 r:core_node1 x:collection1] o.a.s.r.ManagedResourceStorage Loaded null at path _rest_managed.json using ZooKeeperStorageIO:path=/configs/conf1
   [junit4]   2> 2731367 INFO  (coreLoadExecutor-9584-thread-1-processing-n:127.0.0.1:60165_) [n:127.0.0.1:60165_ c:control_collection s:shard1 r:core_node1 x:collection1] o.a.s.r.RestManager Initializing 0 registered ManagedResources
   [junit4]   2> 2731367 INFO  (coreLoadExecutor-9584-thread-1-processing-n:127.0.0.1:60165_) [n:127.0.0.1:60165_ c:control_collection s:shard1 r:core_node1 x:collection1] o.a.s.h.ReplicationHandler Commits will be reserved for  10000
   [junit4]   2> 2731367 INFO  (searcherExecutor-9585-thread-1-processing-s:shard1 n:127.0.0.1:60165_ c:control_collection r:core_node1 x:collection1) [n:127.0.0.1:60165_ c:control_collection s:shard1 r:core_node1 x:collection1] o.a.s.c.SolrCore [collection1] Registered new searcher Searcher@14b22e[collection1] main{ExitableDirectoryReader(UninvertingDirectoryReader())}
   [junit4]   2> 2731368 INFO  (coreLoadExecutor-9584-thread-1-processing-n:127.0.0.1:60165_) [n:127.0.0.1:60165_ c:control_collection s:shard1 r:core_node1 x:collection1] o.a.s.u.UpdateLog Looking up max value of version field to seed version buckets
   [junit4]   2> 2731368 INFO  (coreLoadExecutor-9584-thread-1-processing-n:127.0.0.1:60165_) [n:127.0.0.1:60165_ c:control_collection s:shard1 r:core_node1 x:collection1] o.a.s.u.VersionInfo Refreshing highest value of _version_ for 65536 version buckets from index
   [junit4]   2> 2731368 INFO  (coreLoadExecutor-9584-thread-1-processing-n:127.0.0.1:60165_) [n:127.0.0.1:60165_ c:control_collection s:shard1 r:core_node1 x:collection1] o.a.s.u.VersionInfo No terms found for _version_, cannot seed version bucket highest value from index
   [junit4]   2> 2731368 INFO  (coreLoadExecutor-9584-thread-1-processing-n:127.0.0.1:60165_) [n:127.0.0.1:60165_ c:control_collection s:shard1 r:core_node1 x:collection1] o.a.s.u.UpdateLog Could not find max version in index or recent updates, using new clock 1581813429609431040
   [junit4]   2> 2731369 INFO  (coreLoadExecutor-9584-thread-1-processing-n:127.0.0.1:60165_) [n:127.0.0.1:60165_ c:control_collection s:shard1 r:core_node1 x:collection1] o.a.s.u.UpdateLog Took 1.0ms to seed version buckets with highest version 1581813429609431040
   [junit4]   2> 2731369 INFO  (coreLoadExecutor-9584-thread-1-processing-n:127.0.0.1:60165_) [n:127.0.0.1:60165_ c:control_collection s:shard1 r:core_node1 x:collection1] o.a.s.c.ZkController watch zkdir /configs/conf1
   [junit4]   2> 2731369 INFO  (coreLoadExecutor-9584-thread-1-processing-n:127.0.0.1:60165_) [n:127.0.0.1:60165_ c:control_collection s:shard1 r:core_node1 x:collection1] o.a.s.c.CoreContainer registering core: collection1
   [junit4]   2> 2731369 INFO  (coreZkRegister-9578-thread-1-processing-s:shard1 n:127.0.0.1:60165_ c:control_collection r:core_node1 x:collection1) [n:127.0.0.1:60165_ c:control_collection s:shard1 r:core_node1 x:collection1] o.a.s.c.ZkController Register replica - core:collection1 address:http://127.0.0.1:60165 collection:control_collection shard:shard1
   [junit4]   2> 2731370 INFO  (coreZkRegister-9578-thread-1-processing-s:shard1 n:127.0.0.1:60165_ c:control_collection r:core_node1 x:collection1) [n:127.0.0.1:60165_ c:control_collection s:shard1 r:core_node1 x:collection1] o.a.s.c.c.SolrZkClient makePath: /collections/control_collection/leader_elect/shard1/election
   [junit4]   2> 2731372 INFO  (coreZkRegister-9578-thread-1-processing-s:shard1 n:127.0.0.1:60165_ c:control_collection r:core_node1 x:collection1) [n:127.0.0.1:60165_ c:control_collection s:shard1 r:core_node1 x:collection1] o.a.s.c.LeaderElector Joined leadership election with path: /collections/control_collection/leader_elect/shard1/election/98863339229151236-core_node1-n_0000000000
   [junit4]   2> 2731373 INFO  (coreZkRegister-9578-thread-1-processing-s:shard1 n:127.0.0.1:60165_ c:control_collection r:core_node1 x:collection1) [n:127.0.0.1:60165_ c:control_collection s:shard1 r:core_node1 x:collection1] o.a.s.c.ShardLeaderElectionContext Running the leader process for shard=shard1 and weAreReplacement=false and leaderVoteWait=10000
   [junit4]   2> 2731374 INFO  (coreZkRegister-9578-thread-1-processing-s:shard1 n:127.0.0.1:60165_ c:control_collection r:core_node1 x:collection1) [n:127.0.0.1:60165_ c:control_collection s:shard1 r:core_node1 x:collection1] o.a.s.c.ShardLeaderElectionContext Enough replicas found to continue.
   [junit4]   2> 2731374 INFO  (coreZkRegister-9578-thread-1-processing-s:shard1 n:127.0.0.1:60165_ c:control_collection r:core_node1 x:collection1) [n:127.0.0.1:60165_ c:control_collection s:shard1 r:core_node1 x:collection1] o.a.s.c.ShardLeaderElectionContext I may be the new leader - try and sync
   [junit4]   2> 2731374 INFO  (coreZkRegister-9578-thread-1-processing-s:shard1 n:127.0.0.1:60165_ c:control_collection r:core_node1 x:collection1) [n:127.0.0.1:60165_ c:control_collection s:shard1 r:core_node1 x:collection1] o.a.s.c.SyncStrategy Sync replicas to http://127.0.0.1:60165/collection1/
   [junit4]   2> 2731374 INFO  (coreZkRegister-9578-thread-1-processing-s:shard1 n:127.0.0.1:60165_ c:control_collection r:core_node1 x:collection1) [n:127.0.0.1:60165_ c:control_collection s:shard1 r:core_node1 x:collection1] o.a.s.c.SyncStrategy Sync Success - now sync replicas to me
   [junit4]   2> 2731374 INFO  (coreZkRegister-9578-thread-1-processing-s:shard1 n:127.0.0.1:60165_ c:control_collection r:core_node1 x:collection1) [n:127.0.0.1:60165_ c:control_collection s:shard1 r:core_node1 x:collection1] o.a.s.c.SyncStrategy http://127.0.0.1:60165/collection1/ has no replicas
   [junit4]   2> 2731374 INFO  (OverseerStateUpdate-98863339229151236-127.0.0.1:60165_-n_0000000000) [n:127.0.0.1:60165_    ] o.a.s.c.Overseer processMessage: queueSize: 1, message = {
   [junit4]   2>   "operation":"leader",
   [junit4]   2>   "shard":"shard1",
   [junit4]   2>   "collection":"control_collection"} current state version: 1
   [junit4]   2> 2731374 INFO  (coreZkRegister-9578-thread-1-processing-s:shard1 n:127.0.0.1:60165_ c:control_collection r:core_node1 x:collection1) [n:127.0.0.1:60165_ c:control_collection s:shard1 r:core_node1 x:collection1] o.a.s.c.c.SolrZkClient makePath: /collections/control_collection/leaders/shard1
   [junit4]   2> 2731377 INFO  (coreZkRegister-9578-thread-1-processing-s:shard1 n:127.0.0.1:60165_ c:control_collection r:core_node1 x:collection1) [n:127.0.0.1:60165_ c:control_collection s:shard1 r:core_node1 x:collection1] o.a.s.c.ShardLeaderElectionContextBase Creating leader registration node /collections/control_collection/leaders/shard1/leader after winning as /collections/control_collection/leader_elect/shard1/election/98863339229151236-core_node1-n_0000000000
   [junit4]   2> 2731378 INFO  (coreZkRegister-9578-thread-1-processing-s:shard1 n:127.0.0.1:60165_ c:control_collection r:core_node1 x:collection1) [n:127.0.0.1:60165_ c:control_collection s:shard1 r:core_node1 x:collection1] o.a.s.c.ShardLeaderElectionContext I am the new leader: http://127.0.0.1:60165/collection1/ shard1
   [junit4]   2> 2731379 INFO  (OverseerStateUpdate-98863339229151236-127.0.0.1:60165_-n_0000000000) [n:127.0.0.1:60165_    ] o.a.s.c.Overseer processMessage: queueSize: 1, message = {
   [junit4]   2>   "operation":"leader",
   [junit4]   2>   "shard":"shard1",
   [junit4]   2>   "collection":"control_collection",
   [junit4]   2>   "base_url":"http://127.0.0.1:60165",
   [junit4]   2>   "core":"collection1",
   [junit4]   2>   "state":"active"} current state version: 1
   [junit4]   2> 2731481 INFO  (zkCallback-3024-thread-1-processing-n:127.0.0.1:60165_) [n:127.0.0.1:60165_    ] o.a.s.c.c.ZkStateReader A cluster state change: [WatchedEvent state:SyncConnected type:NodeDataChanged path:/clusterstate.json], has occurred - updating... (live nodes size: [1])
   [junit4]   2> 2731530 INFO  (coreZkRegister-9578-thread-1-processing-s:shard1 n:127.0.0.1:60165_ c:control_collection r:core_node1 x:collection1) [n:127.0.0.1:60165_ c:control_collection s:shard1 r:core_node1 x:collection1] o.a.s.c.ZkController We are http://127.0.0.1:60165/collection1/ and leader is http://127.0.0.1:60165/collection1/
   [junit4]   2> 2731530 INFO  (coreZkRegister-9578-thread-1-processing-s:shard1 n:127.0.0.1:60165_ c:control_collection r:core_node1 x:collection1) [n:127.0.0.1:60165_ c:control_collection s:shard1 r:core_node1 x:collection1] o.a.s.c.ZkController No LogReplay needed for core=collection1 baseURL=http://127.0.0.1:60165
   [junit4]   2> 2731530 INFO  (coreZkRegister-9578-thread-1-processing-s:shard1 n:127.0.0.1:60165_ c:control_collection r:core_node1 x:collection1) [n:127.0.0.1:60165_ c:control_collection s:shard1 r:core_node1 x:collection1] o.a.s.c.ZkController I am the leader, no recovery necessary
   [junit4]   2> 2731530 INFO  (coreZkRegister-9578-thread-1-processing-s:shard1 n:127.0.0.1:60165_ c:control_collection r:core_node1 x:collection1) [n:127.0.0.1:60165_ c:control_collection s:shard1 r:core_node1 x:collection1] o.a.s.c.ZkController publishing state=active
   [junit4]   2> 2731530 INFO  (coreZkRegister-9578-thread-1-processing-s:shard1 n:127.0.0.1:60165_ c:control_collection r:core_node1 x:collection1) [n:127.0.0.1:60165_ c:control_collection s:shard1 r:core_node1 x:collection1] o.a.s.c.ZkController numShards not found on descriptor - reading it from system property
   [junit4]   2> 2731531 INFO  (OverseerStateUpdate-98863339229151236-127.0.0.1:60165_-n_0000000000) [n:127.0.0.1:60165_    ] o.a.s.c.Overseer processMessage: queueSize: 1, message = {
   [junit4]   2>   "operation":"state",
   [junit4]   2>   "core_node_name":"core_node1",
   [junit4]   2>   "base_url":"http://127.0.0.1:60165",
   [junit4]   2>   "state":"active",
   [junit4]   2>   "shard":"shard1",
   [junit4]   2>   "collection":"control_collection",
   [junit4]   2>   "node_name":"127.0.0.1:60165_",
   [junit4]   2>   "numShards":"1",
   [junit4]   2>   "core":"collection1",
   [junit4]   2>   "roles":null} current state version: 2
   [junit4]   2> 2731531 INFO  (OverseerStateUpdate-98863339229151236-127.0.0.1:60165_-n_0000000000) [n:127.0.0.1:60165_    ] o.a.s.c.o.ReplicaMutator Update state numShards=1 message={
   [junit4]   2>   "operation":"state",
   [junit4]   2>   "core_node_name":"core_node1",
   [junit4]   2>   "base_url":"http://127.0.0.1:60165",
   [junit4]   2>   "state":"active",
   [junit4]   2>   "shard":"shard1",
   [junit4]   2>   "collection":"control_collection",
   [junit4]   2>   "node_name":"127.0.0.1:60165_",
   [junit4]   2>   "numShards":"1",
   [junit4]   2>   "core":"collection1",
   [junit4]   2>   "roles":null}
   [junit4]   2> 2731558 INFO  (TEST-TestSolrConfigHandlerCloud.test-seed#[6A210696BB2E619E]) [    ] o.a.s.c.c.SolrZkClient Using default ZkCredentialsProvider
   [junit4]   2> 2731559 INFO  (TEST-TestSolrConfigHandlerCloud.test-seed#[6A210696BB2E619E]) [    ] o.a.s.c.c.ConnectionManager Waiting for client to connect to ZooKeeper
   [junit4]   2> 2731561 INFO  (zkCallback-3026-thread-1) [    ] o.a.s.c.c.ConnectionManager Watcher org.apache.solr.common.cloud.ConnectionManager@b91a55 name:ZooKeeperConnection Watcher:127.0.0.1:60158/solr got event WatchedEvent state:SyncConnected type:None path:null path:null type:None
   [junit4]   2> 2731562 INFO  (TEST-TestSolrConfigHandlerCloud.test-seed#[6A210696BB2E619E]) [    ] o.a.s.c.c.ConnectionManager Client is connected to ZooKeeper
   [junit4]   2> 2731562 INFO  (TEST-TestSolrConfigHandlerCloud.test-seed#[6A210696BB2E619E]) [    ] o.a.s.c.c.SolrZkClient Using default ZkACLProvider
   [junit4]   2> 2731562 INFO  (TEST-TestSolrConfigHandlerCloud.test-seed#[6A210696BB2E619E]) [    ] o.a.s.c.c.ZkStateReader Updating cluster state from ZooKeeper... 
   [junit4]   2> 2731564 INFO  (TEST-TestSolrConfigHandlerCloud.test-seed#[6A210696BB2E619E]) [    ] o.a.s.c.ChaosMonkey monkey: init - expire sessions:false cause connection loss:false
   [junit4]   2> 2731634 INFO  (zkCallback-3026-thread-1) [    ] o.a.s.c.c.ZkStateReader A cluster state change: [WatchedEvent state:SyncConnected type:NodeDataChanged path:/clusterstate.json], has occurred - updating... (live nodes size: [1])
   [junit4]   2> 2731634 INFO  (zkCallback-3024-thread-1-processing-n:127.0.0.1:60165_) [n:127.0.0.1:60165_    ] o.a.s.c.c.ZkStateReader A cluster state change: [WatchedEvent state:SyncConnected type:NodeDataChanged path:/clusterstate.json], has occurred - updating... (live nodes size: [1])
   [junit4]   2> 2731824 INFO  (TEST-TestSolrConfigHandlerCloud.test-seed#[6A210696BB2E619E]) [    ] o.a.s.SolrTestCaseJ4 Writing core.properties file to C:\Users\jenkins\workspace\Lucene-Solr-5.5-Windows\solr\build\solr-core\test\J0\temp\solr.handler.TestSolrConfigHandlerCloud_6A210696BB2E619E-001\shard-1-001\cores\collection1
   [junit4]   2> 2731826 INFO  (TEST-TestSolrConfigHandlerCloud.test-seed#[6A210696BB2E619E]) [    ] o.a.s.c.AbstractFullDistribZkTestBase create jetty 1 in directory C:\Users\jenkins\workspace\Lucene-Solr-5.5-Windows\solr\build\solr-core\test\J0\temp\solr.handler.TestSolrConfigHandlerCloud_6A210696BB2E619E-001\shard-1-001
   [junit4]   2> 2731827 INFO  (TEST-TestSolrConfigHandlerCloud.test-seed#[6A210696BB2E619E]) [    ] o.e.j.s.Server jetty-9.2.13.v20150730
   [junit4]   2> 2731828 INFO  (TEST-TestSolrConfigHandlerCloud.test-seed#[6A210696BB2E619E]) [    ] o.e.j.s.h.ContextHandler Started o.e.j.s.ServletContextHandler@c957d4{/,null,AVAILABLE}
   [junit4]   2> 2731828 INFO  (TEST-TestSolrConfigHandlerCloud.test-seed#[6A210696BB2E619E]) [    ] o.e.j.s.ServerConnector Started ServerConnector@a53a5f{HTTP/1.1}{127.0.0.1:60181}
   [junit4]   2> 2731828 INFO  (TEST-TestSolrConfigHandlerCloud.test-seed#[6A210696BB2E619E]) [    ] o.e.j.s.Server Started @2734661ms
   [junit4]   2> 2731828 INFO  (TEST-TestSolrConfigHandlerCloud.test-seed#[6A210696BB2E619E]) [    ] o.a.s.c.s.e.JettySolrRunner Jetty properties: {hostPort=60181, coreRootDirectory=C:\Users\jenkins\workspace\Lucene-Solr-5.5-Windows\solr\build\solr-core\test\J0\..\..\..\..\..\..\..\..\..\Users\jenkins\workspace\Lucene-Solr-5.5-Windows\solr\build\solr-core\test\J0\temp\solr.handler.TestSolrConfigHandlerCloud_6A210696BB2E619E-001\shard-1-001\cores, solr.data.dir=C:\Users\jenkins\workspace\Lucene-Solr-5.5-Windows\solr\build\solr-core\test\J0\temp\solr.handler.TestSolrConfigHandlerCloud_6A210696BB2E619E-001\tempDir-001/jetty1, solrconfig=solrconfig.xml, hostContext=/}
   [junit4]   2> 2731828 INFO  (TEST-TestSolrConfigHandlerCloud.test-seed#[6A210696BB2E619E]) [    ] o.a.s.s.SolrDispatchFilter SolrDispatchFilter.init(): sun.misc.Launcher$AppClassLoader@1ed7524
   [junit4]   2> 2731829 INFO  (TEST-TestSolrConfigHandlerCloud.test-seed#[6A210696BB2E619E]) [    ] o.a.s.c.SolrResourceLoader new SolrResourceLoader for directory: 'C:\Users\jenkins\workspace\Lucene-Solr-5.5-Windows\solr\build\solr-core\test\J0\temp\solr.handler.TestSolrConfigHandlerCloud_6A210696BB2E619E-001\shard-1-001'
   [junit4]   2> 2731829 INFO  (TEST-TestSolrConfigHandlerCloud.test-seed#[6A210696BB2E619E]) [    ] o.a.s.c.SolrResourceLoader JNDI not configured for solr (NoInitialContextEx)
   [junit4]   2> 2731829 INFO  (TEST-TestSolrConfigHandlerCloud.test-seed#[6A210696BB2E619E]) [    ] o.a.s.c.SolrResourceLoader solr home defaulted to 'solr/' (could not find system property or JNDI)
   [junit4]   2> 2731829 INFO  (TEST-TestSolrConfigHandlerCloud.test-seed#[6A210696BB2E619E]) [    ] o.a.s.c.c.SolrZkClient Using default ZkCredentialsProvider
   [junit4]   2> 2731830 INFO  (TEST-TestSolrConfigHandlerCloud.test-seed#[6A210696BB2E619E]) [    ] o.a.s.c.c.ConnectionManager Waiting for client to connect to ZooKeeper
   [junit4]   2> 2731831 INFO  (zkCallback-3027-thread-1) [    ] o.a.s.c.c.ConnectionManager Watcher org.apache.solr.common.cloud.ConnectionManager@6fed07 name:ZooKeeperConnection Watcher:127.0.0.1:60158/solr got event WatchedEvent state:SyncConnected type:None path:null path:null type:None
   [junit4]   2> 2731831 INFO  (TEST-TestSolrConfigHandlerCloud.test-seed#[6A210696BB2E619E]) [    ] o.a.s.c.c.ConnectionManager Client is connected to ZooKeeper
   [junit4]   2> 2731832 INFO  (TEST-TestSolrConfigHandlerCloud.test-seed#[6A210696BB2E619E]) [    ] o.a.s.c.c.SolrZkClient Using default ZkACLProvider
   [junit4]   2> 2731832 INFO  (TEST-TestSolrConfigHandlerCloud.test-seed#[6A210696BB2E619E]) [    ] o.a.s.s.SolrDispatchFilter Loading solr.xml from SolrHome (not found in ZooKeeper)
   [junit4]   2> 2731832 INFO  (TEST-TestSolrConfigHandlerCloud.test-seed#[6A210696BB2E619E]) [    ] o.a.s.c.SolrXmlConfig Loading container configuration from C:\Users\jenkins\workspace\Lucene-Solr-5.5-Windows\solr\build\solr-core\test\J0\temp\solr.handler.TestSolrConfigHandlerCloud_6A210696BB2E619E-001\shard-1-001\solr.xml
   [junit4]   2> 2731854 INFO  (TEST-TestSolrConfigHandlerCloud.test-seed#[6A210696BB2E619E]) [    ] o.a.s.c.CorePropertiesLocator Config-defined core root directory: C:\Users\jenkins\workspace\Lucene-Solr-5.5-Windows\solr\build\solr-core\test\J0\..\..\..\..\..\..\..\..\..\Users\jenkins\workspace\Lucene-Solr-5.5-Windows\solr\build\solr-core\test\J0\temp\solr.handler.TestSolrConfigHandlerCloud_6A210696BB2E619E-001\shard-1-001\cores
   [junit4]   2> 2731854 INFO  (TEST-TestSolrConfigHandlerCloud.test-seed#[6A210696BB2E619E]) [    ] o.a.s.c.CoreContainer New CoreContainer 15536339
   [junit4]   2> 2731855 INFO  (TEST-TestSolrConfigHandlerCloud.test-seed#[6A210696BB2E619E]) [    ] o.a.s.c.CoreContainer Loading cores into CoreContainer [instanceDir=C:\Users\jenkins\workspace\Lucene-Solr-5.5-Windows\solr\build\solr-core\test\J0\temp\solr.handler.TestSolrConfigHandlerCloud_6A210696BB2E619E-001\shard-1-001]
   [junit4]   2> 2731855 WARN  (TEST-TestSolrConfigHandlerCloud.test-seed#[6A210696BB2E619E]) [    ] o.a.s.c.CoreContainer Couldn't add files from C:\Users\jenkins\workspace\Lucene-Solr-5.5-Windows\solr\build\solr-core\test\J0\temp\solr.handler.TestSolrConfigHandlerCloud_6A210696BB2E619E-001\shard-1-001\lib to classpath: C:\Users\jenkins\workspace\Lucene-Solr-5.5-Windows\solr\build\solr-core\test\J0\temp\solr.handler.TestSolrConfigHandlerCloud_6A210696BB2E619E-001\shard-1-001\lib
   [junit4]   2> 2731855 INFO  (TEST-TestSolrConfigHandlerCloud.test-seed#[6A210696BB2E619E]) [    ] o.a.s.h.c.HttpShardHandlerFactory created with socketTimeout : 90000,urlScheme : ,connTimeout : 15000,maxConnectionsPerHost : 20,maxConnections : 10000,corePoolSize : 0,maximumPoolSize : 2147483647,maxThreadIdleTime : 5,sizeOfQueue : -1,fairnessPolicy : false,useRetries : false,connectionsEvictorSleepDelay : 5000,maxConnectionIdleTime : 40000,
   [junit4]   2> 2731856 INFO  (TEST-TestSolrConfigHandlerCloud.test-seed#[6A210696BB2E619E]) [    ] o.a.s.u.UpdateShardHandler Creating UpdateShardHandler HTTP client with params: socketTimeout=340000&connTimeout=45000&retry=true
   [junit4]   2> 2731857 INFO  (TEST-TestSolrConfigHandlerCloud.test-seed#[6A210696BB2E619E]) [    ] o.a.s.l.LogWatcher SLF4J impl is org.slf4j.impl.Log4jLoggerFactory
   [junit4]   2> 2731857 INFO  (TEST-TestSolrConfigHandlerCloud.test-seed#[6A210696BB2E619E]) [    ] o.a.s.l.LogWatcher Registering Log Listener [Log4j (org.slf4j.impl.Log4jLoggerFactory)]
   [junit4]   2> 2731857 INFO  (TEST-TestSolrConfigHandlerCloud.test-seed#[6A210696BB2E619E]) [    ] o.a.s.c.ZkContainer Zookeeper client=127.0.0.1:60158/solr
   [junit4]   2> 2731857 INFO  (TEST-TestSolrConfigHandlerCloud.test-seed#[6A210696BB2E619E]) [    ] o.a.s.c.ZkController zkHost includes chroot
   [junit4]   2> 2731857 INFO  (TEST-TestSolrConfigHandlerCloud.test-seed#[6A210696BB2E619E]) [    ] o.a.s.c.c.SolrZkClient Using default ZkCredentialsProvider
   [junit4]   2> 2731859 INFO  (TEST-TestSolrConfigHandlerCloud.test-seed#[6A210696BB2E619E]) [    ] o.a.s.c.c.ConnectionManager Waiting for client to connect to ZooKeeper
   [junit4]   2> 2731860 INFO  (zkCallback-3030-thread-1) [    ] o.a.s.c.c.ConnectionManager Watcher org.apache.solr.common.cloud.ConnectionManager@17aa605 name:ZooKeeperConnection Watcher:127.0.0.1:60158 got event WatchedEvent state:SyncConnected type:None path:null path:null type:None
   [junit4]   2> 2731860 INFO  (TEST-TestSolrConfigHandlerCloud.test-seed#[6A210696BB2E619E]) [    ] o.a.s.c.c.ConnectionManager Client is connected to ZooKeeper
   [junit4]   2> 2731861 INFO  (TEST-TestSolrConfigHandlerCloud.test-seed#[6A210696BB2E619E]) [    ] o.a.s.c.c.SolrZkClient Using default ZkACLProvider
   [junit4]   2> 2731861 INFO  (TEST-TestSolrConfigHandlerCloud.test-seed#[6A210696BB2E619E]) [n:127.0.0.1:60181_    ] o.a.s.c.ZkController Added new OnReconnect listener org.apache.solr.cloud.ZkController$6@128dcd4
   [junit4]   2> 2731862 INFO  (TEST-TestSolrConfigHandlerCloud.test-seed#[6A210696BB2E619E]) [n:127.0.0.1:60181_    ] o.a.s.c.c.ConnectionManager Waiting for client to connect to ZooKeeper
   [junit4]   2> 2731863 INFO  (zkCallback-3031-thread-1-processing-n:127.0.0.1:60181_) [n:127.0.0.1:60181_    ] o.a.s.c.c.ConnectionManager Watcher org.apache.solr.common.cloud.ConnectionManager@14bab7d name:ZooKeeperConnection Watcher:127.0.0.1:60158/solr got event WatchedEvent state:SyncConnected type:None path:null path:null type:None
   [junit4]   2> 2731863 INFO  (TEST-TestSolrConfigHandlerCloud.test-seed#[6A210696BB2E619E]) [n:127.0.0.1:60181_    ] o.a.s.c.c.ConnectionManager Client is connected to ZooKeeper
   [junit4]   2> 2731867 INFO  (TEST-TestSolrConfigHandlerCloud.test-seed#[6A210696BB2E619E]) [n:127.0.0.1:60181_    ] o.a.s.c.c.ZkStateReader Updating cluster state from ZooKeeper... 
   [junit4]   2> 2732871 INFO  (TEST-TestSolrConfigHandlerCloud.test-seed#[6A210696BB2E619E]) [n:127.0.0.1:60181_    ] o.a.s.c.ZkController Register node as live in ZooKeeper:/live_nodes/127.0.0.1:60181_
   [junit4]   2> 2732871 INFO  (TEST-TestSolrConfigHandlerCloud.test-seed#[6A210696BB2E619E]) [n:127.0.0.1:60181_    ] o.a.s.c.c.SolrZkClient makePath: /live_nodes/127.0.0.1:60181_
   [junit4]   2> 2732872 INFO  (zkCallback-3026-thread-1) [    ] o.a.s.c.c.ZkStateReader A live node change: [WatchedEvent state:SyncConnected type:NodeChildrenChanged path:/live_nodes], has occurred - updating... (live nodes size: [1])
   [junit4]   2> 2732872 INFO  (zkCallback-3024-thread-1-processing-n:127.0.0.1:60165_) [n:127.0.0.1:60165_    ] o.a.s.c.c.ZkStateReader A live node change: [WatchedEvent state:SyncConnected type:NodeChildrenChanged path:/live_nodes], has occurred - updating... (live nodes size: [1])
   [junit4]   2> 2732872 INFO  (zkCallback-3031-thread-1-processing-n:127.0.0.1:60181_) [n:127.0.0.1:60181_    ] o.a.s.c.c.ZkStateReader A live node change: [WatchedEvent state:SyncConnected type:NodeChildrenChanged path:/live_nodes], has occurred - updating... (live nodes size: [1])
   [junit4]   2> 2732873 INFO  (TEST-TestSolrConfigHandlerCloud.test-seed#[6A210696BB2E619E]) [n:127.0.0.1:60181_    ] o.a.s.c.Overseer Overseer (id=null) closing
   [junit4]   2> 2732873 INFO  (TEST-TestSolrConfigHandlerCloud.test-seed#[6A210696BB2E619E]) [n:127.0.0.1:60181_    ] o.a.s.c.LeaderElector Joined leadership election with path: /overseer_elect/election/98863339229151240-127.0.0.1:60181_-n_0000000001
   [junit4]   2> 2732874 INFO  (TEST-TestSolrConfigHandlerCloud.test-seed#[6A210696BB2E619E]) [n:127.0.0.1:60181_    ] o.a.s.c.LeaderElector Watching path /overseer_elect/election/98863339229151236-127.0.0.1:60165_-n_0000000000 to know if I could be the leader
   [junit4]   2> 2732890 INFO  (TEST-TestSolrConfigHandlerCloud.test-seed#[6A210696BB2E619E]) [n:127.0.0.1:60181_    ] o.a.s.c.CoreContainer Security conf doesn't exist. Skipping setup for authorization module.
   [junit4]   2> 2732890 INFO  (TEST-TestSolrConfigHandlerCloud.test-seed#[6A210696BB2E619E]) [n:127.0.0.1:60181_    ] o.a.s.c.CoreContainer No authentication plugin used.
   [junit4]   2> 2732891 INFO  (TEST-TestSolrConfigHandlerCloud.test-seed#[6A210696BB2E619E]) [n:127.0.0.1:60181_    ] o.a.s.c.CorePropertiesLocator Looking for core definitions underneath C:\Users\jenkins\workspace\Lucene-Solr-5.5-Windows\solr\build\solr-core\test\J0\..\..\..\..\..\..\..\..\..\Users\jenkins\workspace\Lucene-Solr-5.5-Windows\solr\build\solr-core\test\J0\temp\solr.handler.TestSolrConfigHandlerCloud_6A210696BB2E619E-001\shard-1-001\cores
   [junit4]   2> 2732893 INFO  (TEST-TestSolrConfigHandlerCloud.test-seed#[6A210696BB2E619E]) [n:127.0.0.1:60181_    ] o.a.s.c.CoreDescriptor Created CoreDescriptor: {loadOnStartup=true, transient=false, shard=, configSetProperties=configsetprops.json, collection=collection1, schema=schema.xml, coreNodeName=, config=solrconfig.xml, dataDir=data\, name=collection1}
   [junit4]   2> 2732893 INFO  (TEST-TestSolrConfigHandlerCloud.test-seed#[6A210696BB2E619E]) [n:127.0.0.1:60181_    ] o.a.s.c.CorePropertiesLocator Found core collection1 in C:\Users\jenkins\workspace\Lucene-Solr-5.5-Windows\solr\build\solr-core\test\J0\..\..\..\..\..\..\..\..\..\Users\jenkins\workspace\Lucene-Solr-5.5-Windows\solr\build\solr-core\test\J0\temp\solr.handler.TestSolrConfigHandlerCloud_6A210696BB2E619E-001\shard-1-001\cores\collection1
   [junit4]   2> 2732893 INFO  (TEST-TestSolrConfigHandlerCloud.test-seed#[6A210696BB2E619E]) [n:127.0.0.1:60181_    ] o.a.s.c.CorePropertiesLocator Found 1 core definitions
   [junit4]   2> 2732894 INFO  (TEST-TestSolrConfigHandlerCloud.test-seed#[6A210696BB2E619E]) [n:127.0.0.1:60181_    ] o.a.s.s.SolrDispatchFilter user.dir=C:\Users\jenkins\workspace\Lucene-Solr-5.5-Windows\solr\build\solr-core\test\J0
   [junit4]   2> 2732894 INFO  (TEST-TestSolrConfigHandlerCloud.test-seed#[6A210696BB2E619E]) [n:127.0.0.1:60181_    ] o.a.s.s.SolrDispatchFilter SolrDispatchFilter.init() done
   [junit4]   2> 2732894 INFO  (coreLoadExecutor-9595-thread-1-processing-n:127.0.0.1:60181_) [n:127.0.0.1:60181_ c:collection1   x:collection1] o.a.s.c.ZkController publishing state=down
   [junit4]   2> 2732894 INFO  (coreLoadExecutor-9595-thread-1-processing-n:127.0.0.1:60181_) [n:127.0.0.1:60181_ c:collection1   x:collection1] o.a.s.c.ZkController numShards not found on descriptor - reading it from system property
   [junit4]   2> 2732895 INFO  (coreLoadExecutor-9595-thread-1-processing-n:127.0.0.1:60181_) [n:127.0.0.1:60181_ c:collection1   x:collection1] o.a.s.c.ZkController Collection collection1 not visible yet, but flagging it so a watch is registered when it becomes visible
   [junit4]   2> 2732895 INFO  (coreLoadExecutor-9595-thread-1-processing-n:127.0.0.1:60181_) [n:127.0.0.1:60181_ c:collection1   x:collection1] o.a.s.c.c.ZkStateReader addZkWatch [collection1]
   [junit4]   2> 2732895 INFO  (OverseerStateUpdate-98863339229151236-127.0.0.1:60165_-n_0000000000) [n:127.0.0.1:60165_    ] o.a.s.c.Overseer processMessage: queueSize: 1, message = {
   [junit4]   2>   "operation":"state",
   [junit4]   2>   "base_url":"http://127.0.0.1:60181",
   [junit4]   2>   "state":"down",
   [junit4]   2>   "shard":null,
   [junit4]   2>   "collection":"collection1",
   [junit4]   2>   "node_name":"127.0.0.1:60181_",
   [junit4]   2>   "numShards":"2",
   [junit4]   2>   "core":"collection1",
   [junit4]   2>   "roles":null} current state version: 3
   [junit4]   2> 2732896 INFO  (coreLoadExecutor-9595-thread-1-processing-n:127.0.0.1:60181_) [n:127.0.0.1:60181_ c:collection1   x:collection1] o.a.s.c.c.ZkStateReader Deleting data for [collection1]
   [junit4]   2> 2732896 INFO  (OverseerStateUpdate-98863339229151236-127.0.0.1:60165_-n_0000000000) [n:127.0.0.1:60165_    ] o.a.s.c.o.ReplicaMutator Update state numShards=2 message={
   [junit4]   2>   "operation":"state",
   [junit4]   2>   "base_url":"http://127.0.0.1:60181",
   [junit4]   2>   "state":"down",
   [junit4]   2>   "shard":null,
   [junit4]   2>   "collection":"collection1",
   [junit4]   2>   "node_name":"127.0.0.1:60181_",
   [junit4]   2>   "numShards":"2",
   [junit4]   2>   "core":"collection1",
   [junit4]   2>   "roles":null}
   [junit4]   2> 2732896 INFO  (OverseerStateUpdate-98863339229151236-127.0.0.1:60165_-n_0000000000) [n:127.0.0.1:60165_    ] o.a.s.c.o.ClusterStateMutator building a new cName: collection1
   [junit4]   2> 2732896 INFO  (OverseerStateUpdate-98863339229151236-127.0.0.1:60165_-n_0000000000) [n:127.0.0.1:60165_    ] o.a.s.c.o.ReplicaMutator Assigning new node to shard shard=shard1
   [junit4]   2> 2732896 INFO  (coreLoadExecutor-9595-thread-1-processing-n:127.0.0.1:60181_) [n:127.0.0.1:60181_ c:collection1   x:collection1] o.a.s.c.ZkController look for our core node name
   [junit4]   2> 2732998 INFO  (zkCallback-3031-thread-1-processing-n:127.0.0.1:60181_) [n:127.0.0.1:60181_    ] o.a.s.c.c.ZkStateReader A cluster state change: [WatchedEvent state:SyncConnected type:NodeDataChanged path:/clusterstate.json], has occurred - updating... (live nodes size: [2])
   [junit4]   2> 2732998 INFO  (zkCallback-3026-thread-1) [    ] o.a.s.c.c.ZkStateReader A cluster state change: [WatchedEvent state:SyncConnected type:NodeDataChanged path:/clusterstate.json], has occurred - updating... (live nodes size: [2])
   [junit4]   2> 2732998 INFO  (zkCallback-3024-thread-1-processing-n:127.0.0.1:60165_) [n:127.0.0.1:60165_    ] o.a.s.c.c.ZkStateReader A cluster state change: [WatchedEvent state:SyncConnected type:NodeDataChanged path:/clusterstate.json], has occurred - updating... (live nodes size: [2])
   [junit4]   2> 2733896 INFO  (coreLoadExecutor-9595-thread-1-processing-n:127.0.0.1:60181_) [n:127.0.0.1:60181_ c:collection1   x:collection1] o.a.s.c.ZkController waiting to find shard id in clusterstate for collection1
   [junit4]   2> 2733896 INFO  (coreLoadExecutor-9595-thread-1-processing-n:127.0.0.1:60181_) [n:127.0.0.1:60181_ c:collection1   x:collection1] o.a.s.c.ZkController Check for collection zkNode:collection1
   [junit4]   2> 2733896 INFO  (coreLoadExecutor-9595-thread-1-processing-n:127.0.0.1:60181_) [n:127.0.0.1:60181_ c:collection1   x:collection1] o.a.s.c.ZkController Collection zkNode exists
   [junit4]   2> 2733897 INFO  (coreLoadExecutor-9595-thread-1-processing-n:127.0.0.1:60181_) [n:127.0.0.1:60181_ c:collection1   x:collection1] o.a.s.c.c.ZkStateReader Load collection config from: [/collections/collection1]
   [junit4]   2> 2733897 INFO  (coreLoadExecutor-9595-thread-1-processing-n:127.0.0.1:60181_) [n:127.0.0.1:60181_ c:collection1   x:collection1] o.a.s.c.c.ZkStateReader path=[/collections/collection1] [configName]=[conf1] specified config exists in ZooKeeper
   [junit4]   2> 2733897 INFO  (coreLoadExecutor-9595-thread-1-processing-n:127.0.0.1:60181_) [n:127.0.0.1:60181_ c:collection1   x:collection1] o.a.s.c.SolrResourceLoader new SolrResourceLoader for directory: 'C:\Users\jenkins\workspace\Lucene-Solr-5.5-Windows\solr\build\solr-core\test\J0\temp\solr.handler.TestSolrConfigHandlerCloud_6A210696BB2E619E-001\shard-1-001\cores\collection1'
   [junit4]   2> 2733898 INFO  (coreLoadExecutor-9595-thread-1-processing-n:127.0.0.1:60181_) [n:127.0.0.1:60181_ c:collection1   x:collection1] o.a.s.c.SolrResourceLoader JNDI not configured for solr (NoInitialContextEx)
   [junit4]   2> 2733898 INFO  (coreLoadExecutor-9595-thread-1-processing-n:127.0.0.1:60181_) [n:127.0.0.1:60181_ c:collection1   x:collection1] o.a.s.c.SolrResourceLoader solr home defaulted to 'solr/' (could not find system property or JNDI)
   [junit4]   2> 2733900 INFO  (coreLoadExecutor-9595-thread-1-processing-n:127.0.0.1:60181_) [n:127.0.0.1:60181_ c:collection1   x:collection1] o.a.s.c.Config loaded config solrconfig.xml with version 0 
   [junit4]   2> 2733908 INFO  (coreLoadExecutor-9595-thread-1-processing-n:127.0.0.1:60181_) [n:127.0.0.1:60181_ c:collection1   x:collection1] o.a.s.c.SolrConfig current version of requestparams : -1
   [junit4]   2> 2733918 WARN  (coreLoadExecutor-9595-thread-1-processing-n:127.0.0.1:60181_) [n:127.0.0.1:60181_ c:collection1   x:collection1] o.a.s.c.Config Beginning with Solr 5.5, <mergePolicy> is deprecated, use <mergePolicyFactory> instead.
   [junit4]   2> 2733921 INFO  (coreLoadExecutor-9595-thread-1-processing-n:127.0.0.1:60181_) [n:127.0.0.1:60181_ c:collection1   x:collection1] o.a.s.c.SolrConfig Using Lucene MatchVersion: 5.5.5
   [junit4]   2> 2733944 INFO  (coreLoadExecutor-9595-thread-1-processing-n:127.0.0.1:60181_) [n:127.0.0.1:60181_ c:collection1   x:collection1] o.a.s.c.SolrConfig Loaded SolrConfig: solrconfig.xml
   [junit4]   2> 2733951 INFO  (coreLoadExecutor-9595-thread-1-processing-n:127.0.0.1:60181_) [n:127.0.0.1:60181_ c:collection1   x:collection1] o.a.s.s.IndexSchema [collection1] Schema name=test
   [junit4]   2> 2734148 INFO  (coreLoadExecutor-9595-thread-1-processing-n:127.0.0.1:60181_) [n:127.0.0.1:60181_ c:collection1   x:collection1] o.a.s.s.OpenExchangeRatesOrgProvider Initialized with rates=open-exchange-rates.json, refreshInterval=1440.
   [junit4]   2> 2734155 INFO  (coreLoadExecutor-9595-thread-1-processing-n:127.0.0.1:60181_) [n:127.0.0.1:60181_ c:collection1   x:collection1] o.a.s.s.IndexSchema default search field in schema is text
   [junit4]   2> 2734157 INFO  (coreLoadExecutor-9595-thread-1-processing-n:127.0.0.1:60181_) [n:127.0.0.1:60181_ c:collection1   x:collection1] o.a.s.s.IndexSchema unique key field: id
   [junit4]   2> 2734164 INFO  (coreLoadExecutor-9595-thread-1-processing-n:127.0.0.1:60181_) [n:127.0.0.1:60181_ c:collection1   x:collection1] o.a.s.s.FileExchangeRateProvider Reloading exchange rates from file currency.xml
   [junit4]   2> 2734166 INFO  (coreLoadExecutor-9595-thread-1-processing-n:127.0.0.1:60181_) [n:127.0.0.1:60181_ c:collection1   x:collection1] o.a.s.s.FileExchangeRateProvider Reloading exchange rates from file currency.xml
   [junit4]   2> 2734170 INFO  (coreLoadExecutor-9595-thread-1-processing-n:127.0.0.1:60181_) [n:127.0.0.1:60181_ c:collection1   x:collection1] o.a.s.s.OpenExchangeRatesOrgProvider Reloading exchange rates from open-exchange-rates.json
   [junit4]   2> 2734171 INFO  (coreLoadExecutor-9595-thread-1-processing-n:127.0.0.1:60181_) [n:127.0.0.1:60181_ c:collection1   x:collection1] o.a.s.s.OpenExchangeRatesOrgProvider Reloading exchange rates from open-exchange-rates.json
   [junit4]   2> 2734174 INFO  (coreLoadExecutor-9595-thread-1-processing-n:127.0.0.1:60181_) [n:127.0.0.1:60181_ c:collection1   x:collection1] o.a.s.c.ConfigSetProperties Did not find ConfigSet properties, assuming default properties: Can't find resource 'configsetprops.json' in classpath or '/configs/conf1', cwd=C:\Users\jenkins\workspace\Lucene-Solr-5.5-Windows\solr\build\solr-core\test\J0
   [junit4]   2> 2734174 INFO  (coreLoadExecutor-9595-thread-1-processing-n:127.0.0.1:60181_) [n:127.0.0.1:60181_ c:collection1   x:collection1] o.a.s.c.CoreContainer Creating SolrCore 'collection1' using configuration from collection collection1
   [junit4]   2> 2734174 INFO  (coreLoadExecutor-9595-thread-1-processing-n:127.0.0.1:60181_) [n:127.0.0.1:60181_ c:collection1 s:shard1 r:core_node1 x:collection1] o.a.s.c.SolrCore org.apache.solr.core.MockDirectoryFactory
   [junit4]   2> 2734175 INFO  (coreLoadExecutor-9595-thread-1-processing-n:127.0.0.1:60181_) [n:127.0.0.1:60181_ c:collection1 s:shard1 r:core_node1 x:collection1] o.a.s.c.SolrCore [[collection1] ] Opening new SolrCore at [C:\Users\jenkins\workspace\Lucene-Solr-5.5-Windows\solr\build\solr-core\test\J0\temp\solr.handler.TestSolrConfigHandlerCloud_6A210696BB2E619E-001\shard-1-001\cores\collection1], dataDir=[C:\Users\jenkins\workspace\Lucene-Solr-5.5-Windows\solr\build\solr-core\test\J0\..\..\..\..\..\..\..\..\..\Users\jenkins\workspace\Lucene-Solr-5.5-Windows\solr\build\solr-core\test\J0\temp\solr.handler.TestSolrConfigHandlerCloud_6A210696BB2E619E-001\shard-1-001\cores\collection1\data\]
   [junit4]   2> 2734175 INFO  (coreLoadExecutor-9595-thread-1-processing-n:127.0.0.1:60181_) [n:127.0.0.1:60181_ c:collection1 s:shard1 r:core_node1 x:collection1] o.a.s.c.JmxMonitoredMap JMX monitoring is enabled. Adding Solr mbeans to JMX Server: com.sun.jmx.mbeanserver.JmxMBeanServer@1aa2dec
   [junit4]   2> 2734175 INFO  (coreLoadExecutor-9595-thread-1-processing-n:127.0.0.1:60181_) [n:127.0.0.1:60181_ c:collection1 s:shard1 r:core_node1 x:collection1] o.a.s.c.CachingDirectoryFactory return new directory for C:\Users\jenkins\workspace\Lucene-Solr-5.5-Windows\solr\build\solr-core\test\J0\..\..\..\..\..\..\..\..\..\Users\jenkins\workspace\Lucene-Solr-5.5-Windows\solr\build\solr-core\test\J0\temp\solr.handler.TestSolrConfigHandlerCloud_6A210696BB2E619E-001\shard-1-001\cores\collection1\data\
   [junit4]   2> 2734175 INFO  (coreLoadExecutor-9595-thread-1-processing-n:127.0.0.1:60181_) [n:127.0.0.1:60181_ c:collection1 s:shard1 r:core_node1 x:collection1] o.a.s.c.SolrCore New index directory detected: old=null new=C:\Users\jenkins\workspace\Lucene-Solr-5.5-Windows\solr\build\solr-core\test\J0\..\..\..\..\..\..\..\..\..\Users\jenkins\workspace\Lucene-Solr-5.5-Windows\solr\build\solr-core\test\J0\temp\solr.handler.TestSolrConfigHandlerCloud_6A210696BB2E619E-001\shard-1-001\cores\collection1\data\index/
   [junit4]   2> 2734175 WARN  (coreLoadExecutor-9595-thread-1-processing-n:127.0.0.1:60181_) [n:127.0.0.1:60181_ c:collection1 s:shard1 r:core_node1 x:collection1] o.a.s.c.SolrCore [collection1] Solr index directory 'C:\Users\jenkins\workspace\Lucene-Solr-5.5-Windows\solr\build\solr-core\test\J0\..\..\..\..\..\..\..\..\..\Users\jenkins\workspace\Lucene-Solr-5.5-Windows\solr\build\solr-core\test\J0\temp\solr.handler.TestSolrConfigHandlerCloud_6A210696BB2E619E-001\shard-1-001\cores\collection1\data\index' doesn't exist. Creating new index...
   [junit4]   2> 2734176 INFO  (coreLoadExecutor-9595-thread-1-processing-n:127.0.0.1:60181_) [n:127.0.0.1:60181_ c:collection1 s:shard1 r:core_node1 x:collection1] o.a.s.c.CachingDirectoryFactory return new directory for C:\Users\jenkins\workspace\Lucene-Solr-5.5-Windows\solr\build\solr-core\test\J0\..\..\..\..\..\..\..\..\..\Users\jenkins\workspace\Lucene-Solr-5.5-Windows\solr\build\solr-core\test\J0\temp\solr.handler.TestSolrConfigHandlerCloud_6A210696BB2E619E-001\shard-1-001\cores\collection1\data\index
   [junit4]   2> 2734177 INFO  (coreLoadExecutor-9595-thread-1-processing-n:127.0.0.1:60181_) [n:127.0.0.1:60181_ c:collection1 s:shard1 r:core_node1 x:collection1] o.a.s.u.RandomMergePolicy RandomMergePolicy wrapping class org.apache.lucene.index.AlcoholicMergePolicy: [AlcoholicMergePolicy: minMergeSize=0, mergeFactor=10, maxMergeSize=201056802, maxMergeSizeForForcedMerge=9223372036854775807, calibrateSizeByDeletes=true, maxMergeDocs=2147483647, maxCFSSegmentSizeMB=8.796093022207999E12, noCFSRatio=0.1]
   [junit4]   2> 2734177 INFO  (coreLoadExecutor-9595-thread-1-processing-n:127.0.0.1:60181_) [n:127.0.0.1:60181_ c:collection1 s:shard1 r:core_node1 x:collection1] o.a.s.c.SolrDeletionPolicy SolrDeletionPolicy.onCommit: commits: num=1
   [junit4]   2> 	commit{dir=MockDirectoryWrapper(RAMDirectory@fafc43 lockFactory=org.apache.lucene.store.SingleInstanceLockFactory@1c7b616),segFN=segments_1,generation=1}
   [junit4]   2> 2734177 INFO  (coreLoadExecutor-9595-thread-1-processing-n:127.0.0.1:60181_) [n:127.0.0.1:60181_ c:collection1 s:shard1 r:core_node1 x:collection1] o.a.s.c.SolrDeletionPolicy newest commit generation = 1
   [junit4]   2> 2734177 INFO  (OldIndexDirectoryCleanupThreadForCore-collection1) [n:127.0.0.1:60181_ c:collection1 s:shard1 r:core_node1 x:collection1] o.a.s.c.SolrCore Looking for old index directories to cleanup for core collection1 in C:\Users\jenkins\workspace\Lucene-Solr-5.5-Windows\solr\build\solr-core\test\J0\..\..\..\..\..\..\..\..\..\Users\jenkins\workspace\Lucene-Solr-5.5-Windows\solr\build\solr-core\test\J0\temp\solr.handler.TestSolrConfigHandlerCloud_6A210696BB2E619E-001\shard-1-001\cores\collection1\data\
   [junit4]   2> 2734178 WARN  (OldIndexDirectoryCleanupThreadForCore-collection1) [n:127.0.0.1:60181_ 

[...truncated too long message...]


   [junit4]   2> 	... 8 more
   [junit4]   2> 2816019 WARN  (Thread-8464) [n:127.0.0.1:60223_    ] o.a.s.c.SolrCores Tried to remove core collection1 from pendingCoreOps and it wasn't there. 
   [junit4]   2> 2816021 WARN  (Thread-8464) [n:127.0.0.1:60223_    ] o.a.s.c.ZkController listener throws error
   [junit4]   2> org.apache.solr.common.SolrException: Unable to reload core [collection1]
   [junit4]   2> 	at org.apache.solr.core.CoreContainer.reload(CoreContainer.java:927)
   [junit4]   2> 	at org.apache.solr.core.SolrCore$11.run(SolrCore.java:2623)
   [junit4]   2> 	at org.apache.solr.cloud.ZkController$5.run(ZkController.java:2480)
   [junit4]   2> Caused by: org.apache.solr.common.SolrException: Could not load conf for core collection1: Error loading schema resource schema.xml
   [junit4]   2> 	at org.apache.solr.core.ConfigSetService.getConfig(ConfigSetService.java:84)
   [junit4]   2> 	at org.apache.solr.core.CoreContainer.reload(CoreContainer.java:920)
   [junit4]   2> 	... 2 more
   [junit4]   2> Caused by: org.apache.solr.common.SolrException: Error loading schema resource schema.xml
   [junit4]   2> 	at org.apache.solr.schema.IndexSchemaFactory.create(IndexSchemaFactory.java:52)
   [junit4]   2> 	at org.apache.solr.schema.IndexSchemaFactory.buildIndexSchema(IndexSchemaFactory.java:70)
   [junit4]   2> 	at org.apache.solr.core.ConfigSetService.createIndexSchema(ConfigSetService.java:108)
   [junit4]   2> 	at org.apache.solr.core.ConfigSetService.getConfig(ConfigSetService.java:79)
   [junit4]   2> 	... 3 more
   [junit4]   2> Caused by: java.io.IOException: Could not load resource=schema.xml
   [junit4]   2> 	at org.apache.solr.cloud.ZkSolrResourceLoader.openResource(ZkSolrResourceLoader.java:105)
   [junit4]   2> 	at org.apache.solr.core.SolrResourceLoader.openSchema(SolrResourceLoader.java:355)
   [junit4]   2> 	at org.apache.solr.schema.IndexSchemaFactory.create(IndexSchemaFactory.java:48)
   [junit4]   2> 	... 6 more
   [junit4]   2> Caused by: java.lang.InterruptedException: sleep interrupted
   [junit4]   2> 	at java.lang.Thread.sleep(Native Method)
   [junit4]   2> 	at org.apache.solr.cloud.ZkSolrResourceLoader.openResource(ZkSolrResourceLoader.java:101)
   [junit4]   2> 	... 8 more
   [junit4]   2> Oct 20, 2017 9:28:45 PM com.carrotsearch.randomizedtesting.ThreadLeakControl tryToInterruptAll
   [junit4]   2> INFO: All leaked threads terminated.
   [junit4]   2> NOTE: test params are: codec=FastCompressingStoredFields(storedFieldsFormat=CompressingStoredFieldsFormat(compressionMode=FAST, chunkSize=5, maxDocsPerChunk=109, blockSize=432), termVectorsFormat=CompressingTermVectorsFormat(compressionMode=FAST, chunkSize=5, blockSize=432)), sim=DefaultSimilarity, locale=be, timezone=Europe/Busingen
   [junit4]   2> NOTE: Windows 8.1 6.3 x86/Oracle Corporation 1.7.0_80 (32-bit)/cpus=3,threads=1,free=126259240,total=518979584
   [junit4]   2> NOTE: All tests run in this JVM: [TestStressLucene, HdfsChaosMonkeyNothingIsSafeTest, AnalyticsQueryTest, TestFieldResource, LeaderInitiatedRecoveryOnShardRestartTest, DistributedSuggestComponentTest, RecoveryZkTest, SharedFSAutoReplicaFailoverTest, SpatialFilterTest, ReplicationFactorTest, AddSchemaFieldsUpdateProcessorFactoryTest, HighlighterTest, SimpleMLTQParserTest, DistributedFacetPivotSmallTest, CheckHdfsIndexTest, TestRequestStatusCollectionAPI, TestHighlightDedupGrouping, TestUniqueKeyFieldResource, TestSort, TestExtendedDismaxParser, BadComponentTest, BitVectorTest, DistributedQueryElevationComponentTest, TestManagedSchemaFieldResource, TestSolrQueryResponse, SchemaVersionSpecificBehaviorTest, TestFieldSortValues, TestJmxMonitoredMap, TestManagedResource, OverriddenZkACLAndCredentialsProvidersTest, TestConfigSetsAPIZkFailure, CoreSorterTest, TestReplicationHandlerBackup, TestReplicaProperties, ConfigSetsAPITest, TestXIncludeConfig, TestBlobHandler, QueryResultKeyTest, IndexBasedSpellCheckerTest, TestStressReorder, QueryElevationComponentTest, SaslZkACLProviderTest, XmlUpdateRequestHandlerTest, SuggesterFSTTest, ExitableDirectoryReaderTest, TestChildDocTransformer, ForceLeaderTest, MBeansHandlerTest, ChaosMonkeyNothingIsSafeTest, AsyncMigrateRouteKeyTest, TestUpdate, TestHdfsUpdateLog, TestScoreJoinQPNoScore, TestRestManager, TestRandomDVFaceting, TestReplicationHandler, DeleteInactiveReplicaTest, TestRemoteStreaming, TestStressVersions, TestElisionMultitermQuery, ClusterStateTest, UUIDFieldTest, BufferStoreTest, SolrIndexConfigTest, TestSolrConfigHandlerConcurrent, TestPKIAuthenticationPlugin, DistributedFacetPivotLongTailTest, SpatialRPTFieldTypeTest, PolyFieldTest, HdfsWriteToMultipleCollectionsTest, DOMUtilTest, TermsComponentTest, TestConfigSetsAPI, TestSchemaVersionResource, TestDFRSimilarityFactory, DocValuesMissingTest, TestManagedSynonymFilterFactory, DeleteReplicaTest, DirectUpdateHandlerTest, TestFunctionQuery, TestInitQParser, ScriptEngineTest, DistribDocExpirationUpdateProcessorTest, ShardRoutingTest, TestSolrDeletionPolicy1, TestSchemaResource, TestPartialUpdateDeduplication, BasicDistributedZkTest, TestDistribDocBasedVersion, SliceStateTest, HdfsThreadLeakTest, TestSolrXml, ClusterStateUpdateTest, TestCloudManagedSchema, MergeStrategyTest, TestMissingGroups, TestRemoveLastDynamicCopyField, TestImplicitCoreProperties, HdfsCollectionsAPIDistributedZkTest, TestIBSimilarityFactory, DocumentBuilderTest, SampleTest, DeleteStatusTest, TestPhraseSuggestions, TriLevelCompositeIdRoutingTest, TestDocSet, TestTrieFacet, RecoveryAfterSoftCommitTest, TestCoreContainer, TestDistributedSearch, TestFastLRUCache, TestPostingsSolrHighlighter, TestHashPartitioner, TestJsonRequest, TestArbitraryIndexDir, TestPerFieldSimilarityWithDefaultOverride, PrimUtilsTest, LeaderElectionTest, RegexBoostProcessorTest, RollingRestartTest, TestMiniSolrCloudClusterSSL, CircularListTest, BlockCacheTest, InfoHandlerTest, TestOrdValues, TestExclusionRuleCollectionAccess, SegmentsInfoRequestHandlerTest, XsltUpdateRequestHandlerTest, HdfsLockFactoryTest, SpatialHeatmapFacetsTest, TestLMDirichletSimilarityFactory, TestFieldTypeResource, TestConfigSetImmutable, QueryEqualityTest, TestSchemaManager, TestDocumentBuilder, RulesTest, PrimitiveFieldTypeTest, TestSolrConfigHandler, CursorPagingTest, AnalysisErrorHandlingTest, UpdateParamsTest, ChaosMonkeySafeLeaderTest, UnloadDistributedZkTest, SyncSliceTest, OverseerTest, BasicZkTest, FullSolrCloudDistribCmdsTest, ZkCLITest, TestFaceting, DistributedSpellCheckComponentTest, TestJoin, HardAutoCommitTest, SimpleFacetsTest, SolrCoreTest, SpellCheckComponentTest, TestGroupingSearch, SolrCmdDistributorTest, PeerSyncTest, ConvertedLegacyTest, TestFiltering, TestLazyCores, TestIndexSearcher, SoftAutoCommitTest, CurrencyFieldXmlFileTest, SimplePostToolTest, TestCoreDiscovery, SignatureUpdateProcessorFactoryTest, CoreAdminHandlerTest, DocValuesTest, LoggingHandlerTest, TestCollationField, ReturnFieldsTest, JSONWriterTest, JsonLoaderTest, TestPHPSerializedResponseWriter, CSVRequestHandlerTest, TestComponentsName, SearchHandlerTest, TestLFUCache, SOLR749Test, TestQuerySenderListener, AlternateDirectoryTest, TestSolrIndexConfig, TestQuerySenderNoQuery, TestMergePolicyConfig, MinimalSchemaTest, OutputWriterTest, DirectSolrConnectionTest, NotRequiredUniqueKeyTest, SpellPossibilityIteratorTest, EchoParamsTest, TestSweetSpotSimilarityFactory, TestPerFieldSimilarity, TimeZoneUtilsTest, ResourceLoaderTest, URLClassifyProcessorTest, PreAnalyzedFieldTest, TestLRUCache, SystemInfoHandlerTest, SolrTestCaseJ4Test, TestCursorMarkWithoutUniqueKey, TestDistributedMissingSort, TestSimpleTrackingShardHandler, ConnectionReuseTest, AssignTest, CleanupOldIndexTest, CollectionTooManyReplicasTest, ConcurrentDeleteAndCreateCollectionTest, CreateCollectionCleanupTest, DeleteShardTest, DistribCursorPagingTest, DistribJoinFromCollectionTest, DistributedQueueTest, LeaderFailoverAfterPartitionTest, MultiThreadedOCPTest, OverseerStatusTest, OverseerTaskQueueTest, SSLMigrationTest, SimpleCollectionCreateDeleteTest, SolrCloudExampleTest, SolrXmlInZkTest, TestCloudDeleteByQuery, TestCollectionAPI, TestMiniSolrCloudCluster, TestRandomRequestDistribution, TestSolrConfigHandlerCloud]
   [junit4]   2> NOTE: reproduce with: ant test  -Dtestcase=TestSolrConfigHandlerCloud -Dtests.seed=6A210696BB2E619E -Dtests.slow=true -Dtests.locale=be -Dtests.timezone=Europe/Busingen -Dtests.asserts=true -Dtests.file.encoding=US-ASCII
   [junit4] ERROR   0.00s J0 | TestSolrConfigHandlerCloud (suite) <<<
   [junit4]    > Throwable #1: com.carrotsearch.randomizedtesting.ThreadLeakError: 1 thread leaked from SUITE scope at org.apache.solr.handler.TestSolrConfigHandlerCloud: 
   [junit4]    >    1) Thread[id=23488, name=Thread-8464, state=TIMED_WAITING, group=TGRP-TestSolrConfigHandlerCloud]
   [junit4]    >         at java.lang.Thread.sleep(Native Method)
   [junit4]    >         at org.apache.solr.cloud.ZkSolrResourceLoader.openResource(ZkSolrResourceLoader.java:101)
   [junit4]    >         at org.apache.solr.core.SolrResourceLoader.openSchema(SolrResourceLoader.java:355)
   [junit4]    >         at org.apache.solr.schema.IndexSchemaFactory.create(IndexSchemaFactory.java:48)
   [junit4]    >         at org.apache.solr.schema.IndexSchemaFactory.buildIndexSchema(IndexSchemaFactory.java:70)
   [junit4]    >         at org.apache.solr.core.ConfigSetService.createIndexSchema(ConfigSetService.java:108)
   [junit4]    >         at org.apache.solr.core.ConfigSetService.getConfig(ConfigSetService.java:79)
   [junit4]    >         at org.apache.solr.core.CoreContainer.reload(CoreContainer.java:920)
   [junit4]    >         at org.apache.solr.core.SolrCore$11.run(SolrCore.java:2623)
   [junit4]    >         at org.apache.solr.cloud.ZkController$5.run(ZkController.java:2480)
   [junit4]    > 	at __randomizedtesting.SeedInfo.seed([6A210696BB2E619E]:0)
   [junit4] Completed [518/575 (1!)] on J0 in 86.54s, 1 test, 1 error <<< FAILURES!

[...truncated 49301 lines...]

Mime
View raw message