lucene-dev mailing list archives

Site index · List index
Message view « Date » · « Thread »
Top « Date » · « Thread »
From Policeman Jenkins Server <jenk...@thetaphi.de>
Subject [JENKINS] Lucene-Solr-master-Linux (64bit/jdk1.8.0_144) - Build # 20620 - Still Failing!
Date Sat, 07 Oct 2017 00:44:30 GMT
Build: https://jenkins.thetaphi.de/job/Lucene-Solr-master-Linux/20620/
Java: 64bit/jdk1.8.0_144 -XX:+UseCompressedOops -XX:+UseG1GC

1 tests failed.
FAILED:  org.apache.solr.handler.admin.AutoscalingHistoryHandlerTest.testHistory

Error Message:
replica never fully recovered

Stack Trace:
java.lang.AssertionError: replica never fully recovered
	at __randomizedtesting.SeedInfo.seed([8E102D73904FB4A1:E3EC898E2A074BA6]:0)
	at org.junit.Assert.fail(Assert.java:93)
	at org.junit.Assert.assertTrue(Assert.java:43)
	at org.apache.solr.handler.admin.AutoscalingHistoryHandlerTest.waitForRecovery(AutoscalingHistoryHandlerTest.java:303)
	at org.apache.solr.handler.admin.AutoscalingHistoryHandlerTest.testHistory(AutoscalingHistoryHandlerTest.java:255)
	at sun.reflect.NativeMethodAccessorImpl.invoke0(Native Method)
	at sun.reflect.NativeMethodAccessorImpl.invoke(NativeMethodAccessorImpl.java:62)
	at sun.reflect.DelegatingMethodAccessorImpl.invoke(DelegatingMethodAccessorImpl.java:43)
	at java.lang.reflect.Method.invoke(Method.java:498)
	at com.carrotsearch.randomizedtesting.RandomizedRunner.invoke(RandomizedRunner.java:1737)
	at com.carrotsearch.randomizedtesting.RandomizedRunner$8.evaluate(RandomizedRunner.java:934)
	at com.carrotsearch.randomizedtesting.RandomizedRunner$9.evaluate(RandomizedRunner.java:970)
	at com.carrotsearch.randomizedtesting.RandomizedRunner$10.evaluate(RandomizedRunner.java:984)
	at com.carrotsearch.randomizedtesting.rules.SystemPropertiesRestoreRule$1.evaluate(SystemPropertiesRestoreRule.java:57)
	at org.apache.lucene.util.TestRuleSetupTeardownChained$1.evaluate(TestRuleSetupTeardownChained.java:49)
	at org.apache.lucene.util.AbstractBeforeAfterRule$1.evaluate(AbstractBeforeAfterRule.java:45)
	at org.apache.lucene.util.TestRuleThreadAndTestName$1.evaluate(TestRuleThreadAndTestName.java:48)
	at org.apache.lucene.util.TestRuleIgnoreAfterMaxFailures$1.evaluate(TestRuleIgnoreAfterMaxFailures.java:64)
	at org.apache.lucene.util.TestRuleMarkFailure$1.evaluate(TestRuleMarkFailure.java:47)
	at com.carrotsearch.randomizedtesting.rules.StatementAdapter.evaluate(StatementAdapter.java:36)
	at com.carrotsearch.randomizedtesting.ThreadLeakControl$StatementRunner.run(ThreadLeakControl.java:368)
	at com.carrotsearch.randomizedtesting.ThreadLeakControl.forkTimeoutingTask(ThreadLeakControl.java:817)
	at com.carrotsearch.randomizedtesting.ThreadLeakControl$3.evaluate(ThreadLeakControl.java:468)
	at com.carrotsearch.randomizedtesting.RandomizedRunner.runSingleTest(RandomizedRunner.java:943)
	at com.carrotsearch.randomizedtesting.RandomizedRunner$5.evaluate(RandomizedRunner.java:829)
	at com.carrotsearch.randomizedtesting.RandomizedRunner$6.evaluate(RandomizedRunner.java:879)
	at com.carrotsearch.randomizedtesting.RandomizedRunner$7.evaluate(RandomizedRunner.java:890)
	at com.carrotsearch.randomizedtesting.rules.StatementAdapter.evaluate(StatementAdapter.java:36)
	at com.carrotsearch.randomizedtesting.rules.SystemPropertiesRestoreRule$1.evaluate(SystemPropertiesRestoreRule.java:57)
	at org.apache.lucene.util.AbstractBeforeAfterRule$1.evaluate(AbstractBeforeAfterRule.java:45)
	at com.carrotsearch.randomizedtesting.rules.StatementAdapter.evaluate(StatementAdapter.java:36)
	at org.apache.lucene.util.TestRuleStoreClassName$1.evaluate(TestRuleStoreClassName.java:41)
	at com.carrotsearch.randomizedtesting.rules.NoShadowingOrOverridesOnMethodsRule$1.evaluate(NoShadowingOrOverridesOnMethodsRule.java:40)
	at com.carrotsearch.randomizedtesting.rules.NoShadowingOrOverridesOnMethodsRule$1.evaluate(NoShadowingOrOverridesOnMethodsRule.java:40)
	at com.carrotsearch.randomizedtesting.rules.StatementAdapter.evaluate(StatementAdapter.java:36)
	at com.carrotsearch.randomizedtesting.rules.StatementAdapter.evaluate(StatementAdapter.java:36)
	at com.carrotsearch.randomizedtesting.rules.StatementAdapter.evaluate(StatementAdapter.java:36)
	at org.apache.lucene.util.TestRuleAssertionsRequired$1.evaluate(TestRuleAssertionsRequired.java:53)
	at org.apache.lucene.util.TestRuleMarkFailure$1.evaluate(TestRuleMarkFailure.java:47)
	at org.apache.lucene.util.TestRuleIgnoreAfterMaxFailures$1.evaluate(TestRuleIgnoreAfterMaxFailures.java:64)
	at org.apache.lucene.util.TestRuleIgnoreTestSuites$1.evaluate(TestRuleIgnoreTestSuites.java:54)
	at com.carrotsearch.randomizedtesting.rules.StatementAdapter.evaluate(StatementAdapter.java:36)
	at com.carrotsearch.randomizedtesting.ThreadLeakControl$StatementRunner.run(ThreadLeakControl.java:368)
	at java.lang.Thread.run(Thread.java:748)




Build Log:
[...truncated 13967 lines...]
   [junit4] Suite: org.apache.solr.handler.admin.AutoscalingHistoryHandlerTest
   [junit4]   2> 2366563 INFO  (SUITE-AutoscalingHistoryHandlerTest-seed#[8E102D73904FB4A1]-worker) [    ] o.a.s.SolrTestCaseJ4 SecureRandom sanity checks: test.solr.allowed.securerandom=null & java.security.egd=file:/dev/./urandom
   [junit4]   2> Creating dataDir: /home/jenkins/workspace/Lucene-Solr-master-Linux/solr/build/solr-core/test/J1/temp/solr.handler.admin.AutoscalingHistoryHandlerTest_8E102D73904FB4A1-001/init-core-data-001
   [junit4]   2> 2366564 WARN  (SUITE-AutoscalingHistoryHandlerTest-seed#[8E102D73904FB4A1]-worker) [    ] o.a.s.SolrTestCaseJ4 startTrackingSearchers: numOpens=16 numCloses=16
   [junit4]   2> 2366564 INFO  (SUITE-AutoscalingHistoryHandlerTest-seed#[8E102D73904FB4A1]-worker) [    ] o.a.s.SolrTestCaseJ4 Using PointFields (NUMERIC_POINTS_SYSPROP=true) w/NUMERIC_DOCVALUES_SYSPROP=true
   [junit4]   2> 2366567 INFO  (SUITE-AutoscalingHistoryHandlerTest-seed#[8E102D73904FB4A1]-worker) [    ] o.a.s.SolrTestCaseJ4 Randomized ssl (false) and clientAuth (true) via: @org.apache.solr.util.RandomizeSSL(reason=, value=NaN, ssl=NaN, clientAuth=NaN)
   [junit4]   2> 2366567 INFO  (SUITE-AutoscalingHistoryHandlerTest-seed#[8E102D73904FB4A1]-worker) [    ] o.a.s.c.MiniSolrCloudCluster Starting cluster of 3 servers in /home/jenkins/workspace/Lucene-Solr-master-Linux/solr/build/solr-core/test/J1/temp/solr.handler.admin.AutoscalingHistoryHandlerTest_8E102D73904FB4A1-001/tempDir-001
   [junit4]   2> 2366568 INFO  (SUITE-AutoscalingHistoryHandlerTest-seed#[8E102D73904FB4A1]-worker) [    ] o.a.s.c.ZkTestServer STARTING ZK TEST SERVER
   [junit4]   2> 2366568 INFO  (Thread-5332) [    ] o.a.s.c.ZkTestServer client port:0.0.0.0/0.0.0.0:0
   [junit4]   2> 2366568 INFO  (Thread-5332) [    ] o.a.s.c.ZkTestServer Starting server
   [junit4]   2> 2366571 ERROR (Thread-5332) [    ] o.a.z.s.ZooKeeperServer ZKShutdownHandler is not registered, so ZooKeeper server won't take any action on ERROR or SHUTDOWN server state changes
   [junit4]   2> 2366668 INFO  (SUITE-AutoscalingHistoryHandlerTest-seed#[8E102D73904FB4A1]-worker) [    ] o.a.s.c.ZkTestServer start zk server on port:38027
   [junit4]   2> 2366679 INFO  (jetty-launcher-3649-thread-1) [    ] o.e.j.s.Server jetty-9.3.20.v20170531
   [junit4]   2> 2366679 INFO  (jetty-launcher-3649-thread-2) [    ] o.e.j.s.Server jetty-9.3.20.v20170531
   [junit4]   2> 2366679 INFO  (jetty-launcher-3649-thread-3) [    ] o.e.j.s.Server jetty-9.3.20.v20170531
   [junit4]   2> 2366681 INFO  (jetty-launcher-3649-thread-1) [    ] o.e.j.s.h.ContextHandler Started o.e.j.s.ServletContextHandler@29f25869{/solr,null,AVAILABLE}
   [junit4]   2> 2366681 INFO  (jetty-launcher-3649-thread-2) [    ] o.e.j.s.h.ContextHandler Started o.e.j.s.ServletContextHandler@663decb8{/solr,null,AVAILABLE}
   [junit4]   2> 2366681 INFO  (jetty-launcher-3649-thread-3) [    ] o.e.j.s.h.ContextHandler Started o.e.j.s.ServletContextHandler@d0529e8{/solr,null,AVAILABLE}
   [junit4]   2> 2366682 INFO  (jetty-launcher-3649-thread-3) [    ] o.e.j.s.AbstractConnector Started ServerConnector@67eaf1af{HTTP/1.1,[http/1.1]}{127.0.0.1:43643}
   [junit4]   2> 2366682 INFO  (jetty-launcher-3649-thread-2) [    ] o.e.j.s.AbstractConnector Started ServerConnector@6ce15dca{HTTP/1.1,[http/1.1]}{127.0.0.1:43585}
   [junit4]   2> 2366682 INFO  (jetty-launcher-3649-thread-3) [    ] o.e.j.s.Server Started @2368102ms
   [junit4]   2> 2366682 INFO  (jetty-launcher-3649-thread-2) [    ] o.e.j.s.Server Started @2368103ms
   [junit4]   2> 2366682 INFO  (jetty-launcher-3649-thread-3) [    ] o.a.s.c.s.e.JettySolrRunner Jetty properties: {hostContext=/solr, hostPort=43643}
   [junit4]   2> 2366682 INFO  (jetty-launcher-3649-thread-2) [    ] o.a.s.c.s.e.JettySolrRunner Jetty properties: {hostContext=/solr, hostPort=43585}
   [junit4]   2> 2366682 INFO  (jetty-launcher-3649-thread-1) [    ] o.e.j.s.AbstractConnector Started ServerConnector@7571e5f3{HTTP/1.1,[http/1.1]}{127.0.0.1:32797}
   [junit4]   2> 2366682 INFO  (jetty-launcher-3649-thread-1) [    ] o.e.j.s.Server Started @2368103ms
   [junit4]   2> 2366682 ERROR (jetty-launcher-3649-thread-3) [    ] o.a.s.u.StartupLoggingUtils Missing Java Option solr.log.dir. Logging may be missing or incomplete.
   [junit4]   2> 2366682 ERROR (jetty-launcher-3649-thread-2) [    ] o.a.s.u.StartupLoggingUtils Missing Java Option solr.log.dir. Logging may be missing or incomplete.
   [junit4]   2> 2366683 INFO  (jetty-launcher-3649-thread-3) [    ] o.a.s.s.SolrDispatchFilter  ___      _       Welcome to Apache Solr™ version 8.0.0
   [junit4]   2> 2366683 INFO  (jetty-launcher-3649-thread-2) [    ] o.a.s.s.SolrDispatchFilter  ___      _       Welcome to Apache Solr™ version 8.0.0
   [junit4]   2> 2366683 INFO  (jetty-launcher-3649-thread-3) [    ] o.a.s.s.SolrDispatchFilter / __| ___| |_ _   Starting in cloud mode on port null
   [junit4]   2> 2366683 INFO  (jetty-launcher-3649-thread-2) [    ] o.a.s.s.SolrDispatchFilter / __| ___| |_ _   Starting in cloud mode on port null
   [junit4]   2> 2366683 INFO  (jetty-launcher-3649-thread-3) [    ] o.a.s.s.SolrDispatchFilter \__ \/ _ \ | '_|  Install dir: null, Default config dir: null
   [junit4]   2> 2366683 INFO  (jetty-launcher-3649-thread-2) [    ] o.a.s.s.SolrDispatchFilter \__ \/ _ \ | '_|  Install dir: null, Default config dir: null
   [junit4]   2> 2366683 INFO  (jetty-launcher-3649-thread-3) [    ] o.a.s.s.SolrDispatchFilter |___/\___/_|_|    Start time: 2017-10-07T00:28:03.848Z
   [junit4]   2> 2366683 INFO  (jetty-launcher-3649-thread-2) [    ] o.a.s.s.SolrDispatchFilter |___/\___/_|_|    Start time: 2017-10-07T00:28:03.848Z
   [junit4]   2> 2366682 INFO  (jetty-launcher-3649-thread-1) [    ] o.a.s.c.s.e.JettySolrRunner Jetty properties: {hostContext=/solr, hostPort=32797}
   [junit4]   2> 2366684 ERROR (jetty-launcher-3649-thread-1) [    ] o.a.s.u.StartupLoggingUtils Missing Java Option solr.log.dir. Logging may be missing or incomplete.
   [junit4]   2> 2366684 INFO  (jetty-launcher-3649-thread-1) [    ] o.a.s.s.SolrDispatchFilter  ___      _       Welcome to Apache Solr™ version 8.0.0
   [junit4]   2> 2366684 INFO  (jetty-launcher-3649-thread-1) [    ] o.a.s.s.SolrDispatchFilter / __| ___| |_ _   Starting in cloud mode on port null
   [junit4]   2> 2366684 INFO  (jetty-launcher-3649-thread-1) [    ] o.a.s.s.SolrDispatchFilter \__ \/ _ \ | '_|  Install dir: null, Default config dir: null
   [junit4]   2> 2366685 INFO  (jetty-launcher-3649-thread-1) [    ] o.a.s.s.SolrDispatchFilter |___/\___/_|_|    Start time: 2017-10-07T00:28:03.850Z
   [junit4]   2> 2366685 INFO  (jetty-launcher-3649-thread-3) [    ] o.a.s.s.SolrDispatchFilter solr.xml found in ZooKeeper. Loading...
   [junit4]   2> 2366686 INFO  (jetty-launcher-3649-thread-2) [    ] o.a.s.s.SolrDispatchFilter solr.xml found in ZooKeeper. Loading...
   [junit4]   2> 2366687 INFO  (jetty-launcher-3649-thread-1) [    ] o.a.s.s.SolrDispatchFilter solr.xml found in ZooKeeper. Loading...
   [junit4]   2> 2366693 WARN  (NIOServerCxn.Factory:0.0.0.0/0.0.0.0:0) [    ] o.a.z.s.NIOServerCnxn caught end of stream exception
   [junit4]   2> EndOfStreamException: Unable to read additional data from client sessionid 0x15ef43b59170002, likely client has closed socket
   [junit4]   2> 	at org.apache.zookeeper.server.NIOServerCnxn.doIO(NIOServerCnxn.java:239)
   [junit4]   2> 	at org.apache.zookeeper.server.NIOServerCnxnFactory.run(NIOServerCnxnFactory.java:203)
   [junit4]   2> 	at java.lang.Thread.run(Thread.java:748)
   [junit4]   2> 2366693 WARN  (NIOServerCxn.Factory:0.0.0.0/0.0.0.0:0) [    ] o.a.z.s.NIOServerCnxn caught end of stream exception
   [junit4]   2> EndOfStreamException: Unable to read additional data from client sessionid 0x15ef43b59170001, likely client has closed socket
   [junit4]   2> 	at org.apache.zookeeper.server.NIOServerCnxn.doIO(NIOServerCnxn.java:239)
   [junit4]   2> 	at org.apache.zookeeper.server.NIOServerCnxnFactory.run(NIOServerCnxnFactory.java:203)
   [junit4]   2> 	at java.lang.Thread.run(Thread.java:748)
   [junit4]   2> 2366696 INFO  (jetty-launcher-3649-thread-3) [    ] o.a.s.c.ZkContainer Zookeeper client=127.0.0.1:38027/solr
   [junit4]   2> 2366696 INFO  (jetty-launcher-3649-thread-1) [    ] o.a.s.c.ZkContainer Zookeeper client=127.0.0.1:38027/solr
   [junit4]   2> 2366696 INFO  (jetty-launcher-3649-thread-2) [    ] o.a.s.c.ZkContainer Zookeeper client=127.0.0.1:38027/solr
   [junit4]   2> 2366720 WARN  (NIOServerCxn.Factory:0.0.0.0/0.0.0.0:0) [    ] o.a.z.s.NIOServerCnxn caught end of stream exception
   [junit4]   2> EndOfStreamException: Unable to read additional data from client sessionid 0x15ef43b59170006, likely client has closed socket
   [junit4]   2> 	at org.apache.zookeeper.server.NIOServerCnxn.doIO(NIOServerCnxn.java:239)
   [junit4]   2> 	at org.apache.zookeeper.server.NIOServerCnxnFactory.run(NIOServerCnxnFactory.java:203)
   [junit4]   2> 	at java.lang.Thread.run(Thread.java:748)
   [junit4]   2> 2366720 WARN  (NIOServerCxn.Factory:0.0.0.0/0.0.0.0:0) [    ] o.a.z.s.NIOServerCnxn caught end of stream exception
   [junit4]   2> EndOfStreamException: Unable to read additional data from client sessionid 0x15ef43b59170004, likely client has closed socket
   [junit4]   2> 	at org.apache.zookeeper.server.NIOServerCnxn.doIO(NIOServerCnxn.java:239)
   [junit4]   2> 	at org.apache.zookeeper.server.NIOServerCnxnFactory.run(NIOServerCnxnFactory.java:203)
   [junit4]   2> 	at java.lang.Thread.run(Thread.java:748)
   [junit4]   2> 2366747 INFO  (jetty-launcher-3649-thread-1) [n:127.0.0.1:32797_solr    ] o.a.s.c.Overseer Overseer (id=null) closing
   [junit4]   2> 2366747 INFO  (jetty-launcher-3649-thread-3) [n:127.0.0.1:43643_solr    ] o.a.s.c.Overseer Overseer (id=null) closing
   [junit4]   2> 2366747 INFO  (jetty-launcher-3649-thread-2) [n:127.0.0.1:43585_solr    ] o.a.s.c.Overseer Overseer (id=null) closing
   [junit4]   2> 2366747 INFO  (jetty-launcher-3649-thread-1) [n:127.0.0.1:32797_solr    ] o.a.s.c.OverseerElectionContext I am going to be the leader 127.0.0.1:32797_solr
   [junit4]   2> 2366747 INFO  (jetty-launcher-3649-thread-2) [n:127.0.0.1:43585_solr    ] o.a.s.c.ZkController Register node as live in ZooKeeper:/live_nodes/127.0.0.1:43585_solr
   [junit4]   2> 2366747 INFO  (jetty-launcher-3649-thread-3) [n:127.0.0.1:43643_solr    ] o.a.s.c.ZkController Register node as live in ZooKeeper:/live_nodes/127.0.0.1:43643_solr
   [junit4]   2> 2366747 INFO  (jetty-launcher-3649-thread-1) [n:127.0.0.1:32797_solr    ] o.a.s.c.Overseer Overseer (id=98784777583656967-127.0.0.1:32797_solr-n_0000000000) starting
   [junit4]   2> 2366748 INFO  (zkCallback-3664-thread-1-processing-n:127.0.0.1:32797_solr) [n:127.0.0.1:32797_solr    ] o.a.s.c.c.ZkStateReader Updated live nodes from ZooKeeper... (0) -> (2)
   [junit4]   2> 2366748 INFO  (zkCallback-3666-thread-1-processing-n:127.0.0.1:43585_solr) [n:127.0.0.1:43585_solr    ] o.a.s.c.c.ZkStateReader Updated live nodes from ZooKeeper... (0) -> (2)
   [junit4]   2> 2366749 INFO  (zkCallback-3665-thread-1-processing-n:127.0.0.1:43643_solr) [n:127.0.0.1:43643_solr    ] o.a.s.c.c.ZkStateReader Updated live nodes from ZooKeeper... (0) -> (2)
   [junit4]   2> 2366750 DEBUG (OverseerStateUpdate-98784777583656967-127.0.0.1:32797_solr-n_0000000000) [n:127.0.0.1:32797_solr    ] o.a.s.c.Overseer Starting to work on the main queue
   [junit4]   2> 2366753 DEBUG (OverseerAutoScalingTriggerThread-98784777583656967-127.0.0.1:32797_solr-n_0000000000) [n:127.0.0.1:32797_solr    ] o.a.s.c.a.OverseerTriggerThread Adding .autoAddReplicas trigger
   [junit4]   2> 2366754 DEBUG (OverseerAutoScalingTriggerThread-98784777583656967-127.0.0.1:32797_solr-n_0000000000) [n:127.0.0.1:32797_solr    ] o.a.s.c.a.OverseerTriggerThread Refreshing /autoscaling.json with znode version 1
   [junit4]   2> 2366754 INFO  (jetty-launcher-3649-thread-1) [n:127.0.0.1:32797_solr    ] o.a.s.c.ZkController Register node as live in ZooKeeper:/live_nodes/127.0.0.1:32797_solr
   [junit4]   2> 2366754 DEBUG (OverseerStateUpdate-98784777583656967-127.0.0.1:32797_solr-n_0000000000) [n:127.0.0.1:32797_solr    ] o.a.s.c.Overseer processMessage: queueSize: 1, message = {
   [junit4]   2>   "operation":"downnode",
   [junit4]   2>   "node_name":"127.0.0.1:32797_solr"} current state version: 0
   [junit4]   2> 2366754 DEBUG (OverseerStateUpdate-98784777583656967-127.0.0.1:32797_solr-n_0000000000) [n:127.0.0.1:32797_solr    ] o.a.s.c.o.NodeMutator DownNode state invoked for node: 127.0.0.1:32797_solr
   [junit4]   2> 2366755 INFO  (zkCallback-3664-thread-1-processing-n:127.0.0.1:32797_solr) [n:127.0.0.1:32797_solr    ] o.a.s.c.c.ZkStateReader Updated live nodes from ZooKeeper... (2) -> (3)
   [junit4]   2> 2366755 INFO  (zkCallback-3665-thread-1-processing-n:127.0.0.1:43643_solr) [n:127.0.0.1:43643_solr    ] o.a.s.c.c.ZkStateReader Updated live nodes from ZooKeeper... (2) -> (3)
   [junit4]   2> 2366755 DEBUG (OverseerAutoScalingTriggerThread-98784777583656967-127.0.0.1:32797_solr-n_0000000000) [n:127.0.0.1:32797_solr    ] o.a.s.c.a.NodeLostTrigger Initial livenodes: [127.0.0.1:43643_solr, 127.0.0.1:43585_solr, 127.0.0.1:32797_solr]
   [junit4]   2> 2366755 INFO  (zkCallback-3666-thread-1-processing-n:127.0.0.1:43585_solr) [n:127.0.0.1:43585_solr    ] o.a.s.c.c.ZkStateReader Updated live nodes from ZooKeeper... (2) -> (3)
   [junit4]   2> 2366755 DEBUG (OverseerAutoScalingTriggerThread-98784777583656967-127.0.0.1:32797_solr-n_0000000000) [n:127.0.0.1:32797_solr    ] o.a.s.c.a.OverseerTriggerThread Current znodeVersion 1, lastZnodeVersion -1
   [junit4]   2> 2366755 DEBUG (OverseerAutoScalingTriggerThread-98784777583656967-127.0.0.1:32797_solr-n_0000000000) [n:127.0.0.1:32797_solr    ] o.a.s.c.a.OverseerTriggerThread Processed trigger updates upto znodeVersion 1
   [junit4]   2> 2366755 DEBUG (OverseerAutoScalingTriggerThread-98784777583656967-127.0.0.1:32797_solr-n_0000000000) [n:127.0.0.1:32797_solr    ] o.a.s.c.a.OverseerTriggerThread -- clean old nodeAdded markers
   [junit4]   2> 2366756 DEBUG (OverseerAutoScalingTriggerThread-98784777583656967-127.0.0.1:32797_solr-n_0000000000) [n:127.0.0.1:32797_solr    ] o.a.s.c.a.OverseerTriggerThread Current znodeVersion 1, lastZnodeVersion 1
   [junit4]   2> 2366756 DEBUG (ScheduledTrigger-9726-thread-1) [n:127.0.0.1:32797_solr    ] o.a.s.c.a.NodeLostTrigger Running NodeLostTrigger: .auto_add_replicas with currently live nodes: [127.0.0.1:32797_solr, 127.0.0.1:43585_solr, 127.0.0.1:43643_solr]
   [junit4]   2> 2366796 INFO  (jetty-launcher-3649-thread-3) [n:127.0.0.1:43643_solr    ] o.a.s.m.r.SolrJmxReporter JMX monitoring for 'solr_43643.solr.node' (registry 'solr.node') enabled at server: com.sun.jmx.mbeanserver.JmxMBeanServer@32ea439a
   [junit4]   2> 2366799 INFO  (jetty-launcher-3649-thread-2) [n:127.0.0.1:43585_solr    ] o.a.s.m.r.SolrJmxReporter JMX monitoring for 'solr_43585.solr.node' (registry 'solr.node') enabled at server: com.sun.jmx.mbeanserver.JmxMBeanServer@32ea439a
   [junit4]   2> 2366803 INFO  (jetty-launcher-3649-thread-3) [n:127.0.0.1:43643_solr    ] o.a.s.m.r.SolrJmxReporter JMX monitoring for 'solr_43643.solr.jvm' (registry 'solr.jvm') enabled at server: com.sun.jmx.mbeanserver.JmxMBeanServer@32ea439a
   [junit4]   2> 2366803 INFO  (jetty-launcher-3649-thread-3) [n:127.0.0.1:43643_solr    ] o.a.s.m.r.SolrJmxReporter JMX monitoring for 'solr_43643.solr.jetty' (registry 'solr.jetty') enabled at server: com.sun.jmx.mbeanserver.JmxMBeanServer@32ea439a
   [junit4]   2> 2366804 INFO  (jetty-launcher-3649-thread-2) [n:127.0.0.1:43585_solr    ] o.a.s.m.r.SolrJmxReporter JMX monitoring for 'solr_43585.solr.jvm' (registry 'solr.jvm') enabled at server: com.sun.jmx.mbeanserver.JmxMBeanServer@32ea439a
   [junit4]   2> 2366804 INFO  (jetty-launcher-3649-thread-2) [n:127.0.0.1:43585_solr    ] o.a.s.m.r.SolrJmxReporter JMX monitoring for 'solr_43585.solr.jetty' (registry 'solr.jetty') enabled at server: com.sun.jmx.mbeanserver.JmxMBeanServer@32ea439a
   [junit4]   2> 2366804 INFO  (jetty-launcher-3649-thread-3) [n:127.0.0.1:43643_solr    ] o.a.s.c.CorePropertiesLocator Found 0 core definitions underneath /home/jenkins/workspace/Lucene-Solr-master-Linux/solr/build/solr-core/test/J1/temp/solr.handler.admin.AutoscalingHistoryHandlerTest_8E102D73904FB4A1-001/tempDir-001/node3/.
   [junit4]   2> 2366804 INFO  (jetty-launcher-3649-thread-2) [n:127.0.0.1:43585_solr    ] o.a.s.c.CorePropertiesLocator Found 0 core definitions underneath /home/jenkins/workspace/Lucene-Solr-master-Linux/solr/build/solr-core/test/J1/temp/solr.handler.admin.AutoscalingHistoryHandlerTest_8E102D73904FB4A1-001/tempDir-001/node2/.
   [junit4]   2> 2366821 INFO  (jetty-launcher-3649-thread-1) [n:127.0.0.1:32797_solr    ] o.a.s.m.r.SolrJmxReporter JMX monitoring for 'solr_32797.solr.node' (registry 'solr.node') enabled at server: com.sun.jmx.mbeanserver.JmxMBeanServer@32ea439a
   [junit4]   2> 2366826 INFO  (jetty-launcher-3649-thread-1) [n:127.0.0.1:32797_solr    ] o.a.s.m.r.SolrJmxReporter JMX monitoring for 'solr_32797.solr.jvm' (registry 'solr.jvm') enabled at server: com.sun.jmx.mbeanserver.JmxMBeanServer@32ea439a
   [junit4]   2> 2366826 INFO  (jetty-launcher-3649-thread-1) [n:127.0.0.1:32797_solr    ] o.a.s.m.r.SolrJmxReporter JMX monitoring for 'solr_32797.solr.jetty' (registry 'solr.jetty') enabled at server: com.sun.jmx.mbeanserver.JmxMBeanServer@32ea439a
   [junit4]   2> 2366827 INFO  (jetty-launcher-3649-thread-1) [n:127.0.0.1:32797_solr    ] o.a.s.c.CorePropertiesLocator Found 0 core definitions underneath /home/jenkins/workspace/Lucene-Solr-master-Linux/solr/build/solr-core/test/J1/temp/solr.handler.admin.AutoscalingHistoryHandlerTest_8E102D73904FB4A1-001/tempDir-001/node1/.
   [junit4]   2> 2366850 INFO  (SUITE-AutoscalingHistoryHandlerTest-seed#[8E102D73904FB4A1]-worker) [    ] o.a.s.c.c.ZkStateReader Updated live nodes from ZooKeeper... (0) -> (3)
   [junit4]   2> 2366850 INFO  (SUITE-AutoscalingHistoryHandlerTest-seed#[8E102D73904FB4A1]-worker) [    ] o.a.s.c.s.i.ZkClientClusterStateProvider Cluster at 127.0.0.1:38027/solr ready
   [junit4]   2> 2366852 INFO  (qtp1469377121-22226) [n:127.0.0.1:32797_solr    ] o.a.s.h.a.CollectionsHandler Invoked Collection Action :create with params replicationFactor=3&name=AutoscalingHistoryHandlerTest_collection&nrtReplicas=3&action=CREATE&numShards=1&wt=javabin&version=2 and sendToOCPQueue=true
   [junit4]   2> 2366853 INFO  (OverseerThreadFactory-9728-thread-1-processing-n:127.0.0.1:32797_solr) [n:127.0.0.1:32797_solr    ] o.a.s.c.CreateCollectionCmd Create collection AutoscalingHistoryHandlerTest_collection
   [junit4]   2> 2366853 INFO  (OverseerThreadFactory-9728-thread-1-processing-n:127.0.0.1:32797_solr) [n:127.0.0.1:32797_solr    ] o.a.s.c.CreateCollectionCmd Only _default config set found, using it.
   [junit4]   2> 2366853 INFO  (OverseerThreadFactory-9728-thread-1-processing-n:127.0.0.1:32797_solr) [n:127.0.0.1:32797_solr    ] o.a.s.c.c.ZkConfigManager Copying zk node /configs/_default/protwords.txt to /configs/AutoscalingHistoryHandlerTest_collection/protwords.txt
   [junit4]   2> 2366853 INFO  (OverseerThreadFactory-9728-thread-1-processing-n:127.0.0.1:32797_solr) [n:127.0.0.1:32797_solr    ] o.a.s.c.c.ZkConfigManager Copying zk node /configs/_default/managed-schema to /configs/AutoscalingHistoryHandlerTest_collection/managed-schema
   [junit4]   2> 2366854 INFO  (OverseerThreadFactory-9728-thread-1-processing-n:127.0.0.1:32797_solr) [n:127.0.0.1:32797_solr    ] o.a.s.c.c.ZkConfigManager Copying zk node /configs/_default/solrconfig.xml to /configs/AutoscalingHistoryHandlerTest_collection/solrconfig.xml
   [junit4]   2> 2366855 INFO  (OverseerThreadFactory-9728-thread-1-processing-n:127.0.0.1:32797_solr) [n:127.0.0.1:32797_solr    ] o.a.s.c.c.ZkConfigManager Copying zk node /configs/_default/synonyms.txt to /configs/AutoscalingHistoryHandlerTest_collection/synonyms.txt
   [junit4]   2> 2366855 INFO  (OverseerThreadFactory-9728-thread-1-processing-n:127.0.0.1:32797_solr) [n:127.0.0.1:32797_solr    ] o.a.s.c.c.ZkConfigManager Copying zk node /configs/_default/stopwords.txt to /configs/AutoscalingHistoryHandlerTest_collection/stopwords.txt
   [junit4]   2> 2366855 INFO  (OverseerThreadFactory-9728-thread-1-processing-n:127.0.0.1:32797_solr) [n:127.0.0.1:32797_solr    ] o.a.s.c.c.ZkConfigManager Copying zk node /configs/_default/lang/contractions_it.txt to /configs/AutoscalingHistoryHandlerTest_collection/lang/contractions_it.txt
   [junit4]   2> 2366856 INFO  (OverseerThreadFactory-9728-thread-1-processing-n:127.0.0.1:32797_solr) [n:127.0.0.1:32797_solr    ] o.a.s.c.c.ZkConfigManager Copying zk node /configs/_default/lang/stemdict_nl.txt to /configs/AutoscalingHistoryHandlerTest_collection/lang/stemdict_nl.txt
   [junit4]   2> 2366856 INFO  (OverseerThreadFactory-9728-thread-1-processing-n:127.0.0.1:32797_solr) [n:127.0.0.1:32797_solr    ] o.a.s.c.c.ZkConfigManager Copying zk node /configs/_default/lang/stopwords_hy.txt to /configs/AutoscalingHistoryHandlerTest_collection/lang/stopwords_hy.txt
   [junit4]   2> 2366857 INFO  (OverseerThreadFactory-9728-thread-1-processing-n:127.0.0.1:32797_solr) [n:127.0.0.1:32797_solr    ] o.a.s.c.c.ZkConfigManager Copying zk node /configs/_default/lang/stopwords_no.txt to /configs/AutoscalingHistoryHandlerTest_collection/lang/stopwords_no.txt
   [junit4]   2> 2366857 INFO  (OverseerThreadFactory-9728-thread-1-processing-n:127.0.0.1:32797_solr) [n:127.0.0.1:32797_solr    ] o.a.s.c.c.ZkConfigManager Copying zk node /configs/_default/lang/contractions_ca.txt to /configs/AutoscalingHistoryHandlerTest_collection/lang/contractions_ca.txt
   [junit4]   2> 2366857 INFO  (OverseerThreadFactory-9728-thread-1-processing-n:127.0.0.1:32797_solr) [n:127.0.0.1:32797_solr    ] o.a.s.c.c.ZkConfigManager Copying zk node /configs/_default/lang/stopwords_id.txt to /configs/AutoscalingHistoryHandlerTest_collection/lang/stopwords_id.txt
   [junit4]   2> 2366858 INFO  (OverseerThreadFactory-9728-thread-1-processing-n:127.0.0.1:32797_solr) [n:127.0.0.1:32797_solr    ] o.a.s.c.c.ZkConfigManager Copying zk node /configs/_default/lang/stopwords_ga.txt to /configs/AutoscalingHistoryHandlerTest_collection/lang/stopwords_ga.txt
   [junit4]   2> 2366858 INFO  (OverseerThreadFactory-9728-thread-1-processing-n:127.0.0.1:32797_solr) [n:127.0.0.1:32797_solr    ] o.a.s.c.c.ZkConfigManager Copying zk node /configs/_default/lang/stopwords_hi.txt to /configs/AutoscalingHistoryHandlerTest_collection/lang/stopwords_hi.txt
   [junit4]   2> 2366859 INFO  (OverseerThreadFactory-9728-thread-1-processing-n:127.0.0.1:32797_solr) [n:127.0.0.1:32797_solr    ] o.a.s.c.c.ZkConfigManager Copying zk node /configs/_default/lang/stopwords_da.txt to /configs/AutoscalingHistoryHandlerTest_collection/lang/stopwords_da.txt
   [junit4]   2> 2366859 INFO  (OverseerThreadFactory-9728-thread-1-processing-n:127.0.0.1:32797_solr) [n:127.0.0.1:32797_solr    ] o.a.s.c.c.ZkConfigManager Copying zk node /configs/_default/lang/stopwords_ja.txt to /configs/AutoscalingHistoryHandlerTest_collection/lang/stopwords_ja.txt
   [junit4]   2> 2366859 INFO  (OverseerThreadFactory-9728-thread-1-processing-n:127.0.0.1:32797_solr) [n:127.0.0.1:32797_solr    ] o.a.s.c.c.ZkConfigManager Copying zk node /configs/_default/lang/stopwords_pt.txt to /configs/AutoscalingHistoryHandlerTest_collection/lang/stopwords_pt.txt
   [junit4]   2> 2366860 INFO  (OverseerThreadFactory-9728-thread-1-processing-n:127.0.0.1:32797_solr) [n:127.0.0.1:32797_solr    ] o.a.s.c.c.ZkConfigManager Copying zk node /configs/_default/lang/stopwords_hu.txt to /configs/AutoscalingHistoryHandlerTest_collection/lang/stopwords_hu.txt
   [junit4]   2> 2366860 INFO  (OverseerThreadFactory-9728-thread-1-processing-n:127.0.0.1:32797_solr) [n:127.0.0.1:32797_solr    ] o.a.s.c.c.ZkConfigManager Copying zk node /configs/_default/lang/stopwords_el.txt to /configs/AutoscalingHistoryHandlerTest_collection/lang/stopwords_el.txt
   [junit4]   2> 2366861 INFO  (OverseerThreadFactory-9728-thread-1-processing-n:127.0.0.1:32797_solr) [n:127.0.0.1:32797_solr    ] o.a.s.c.c.ZkConfigManager Copying zk node /configs/_default/lang/stopwords_ru.txt to /configs/AutoscalingHistoryHandlerTest_collection/lang/stopwords_ru.txt
   [junit4]   2> 2366861 INFO  (OverseerThreadFactory-9728-thread-1-processing-n:127.0.0.1:32797_solr) [n:127.0.0.1:32797_solr    ] o.a.s.c.c.ZkConfigManager Copying zk node /configs/_default/lang/stopwords_tr.txt to /configs/AutoscalingHistoryHandlerTest_collection/lang/stopwords_tr.txt
   [junit4]   2> 2366861 INFO  (OverseerThreadFactory-9728-thread-1-processing-n:127.0.0.1:32797_solr) [n:127.0.0.1:32797_solr    ] o.a.s.c.c.ZkConfigManager Copying zk node /configs/_default/lang/stopwords_ar.txt to /configs/AutoscalingHistoryHandlerTest_collection/lang/stopwords_ar.txt
   [junit4]   2> 2366862 INFO  (OverseerThreadFactory-9728-thread-1-processing-n:127.0.0.1:32797_solr) [n:127.0.0.1:32797_solr    ] o.a.s.c.c.ZkConfigManager Copying zk node /configs/_default/lang/userdict_ja.txt to /configs/AutoscalingHistoryHandlerTest_collection/lang/userdict_ja.txt
   [junit4]   2> 2366862 INFO  (OverseerThreadFactory-9728-thread-1-processing-n:127.0.0.1:32797_solr) [n:127.0.0.1:32797_solr    ] o.a.s.c.c.ZkConfigManager Copying zk node /configs/_default/lang/stopwords_eu.txt to /configs/AutoscalingHistoryHandlerTest_collection/lang/stopwords_eu.txt
   [junit4]   2> 2366862 INFO  (OverseerThreadFactory-9728-thread-1-processing-n:127.0.0.1:32797_solr) [n:127.0.0.1:32797_solr    ] o.a.s.c.c.ZkConfigManager Copying zk node /configs/_default/lang/stopwords_it.txt to /configs/AutoscalingHistoryHandlerTest_collection/lang/stopwords_it.txt
   [junit4]   2> 2366863 INFO  (OverseerThreadFactory-9728-thread-1-processing-n:127.0.0.1:32797_solr) [n:127.0.0.1:32797_solr    ] o.a.s.c.c.ZkConfigManager Copying zk node /configs/_default/lang/stopwords_cz.txt to /configs/AutoscalingHistoryHandlerTest_collection/lang/stopwords_cz.txt
   [junit4]   2> 2366863 INFO  (OverseerThreadFactory-9728-thread-1-processing-n:127.0.0.1:32797_solr) [n:127.0.0.1:32797_solr    ] o.a.s.c.c.ZkConfigManager Copying zk node /configs/_default/lang/stoptags_ja.txt to /configs/AutoscalingHistoryHandlerTest_collection/lang/stoptags_ja.txt
   [junit4]   2> 2366864 INFO  (OverseerThreadFactory-9728-thread-1-processing-n:127.0.0.1:32797_solr) [n:127.0.0.1:32797_solr    ] o.a.s.c.c.ZkConfigManager Copying zk node /configs/_default/lang/contractions_fr.txt to /configs/AutoscalingHistoryHandlerTest_collection/lang/contractions_fr.txt
   [junit4]   2> 2366864 INFO  (OverseerThreadFactory-9728-thread-1-processing-n:127.0.0.1:32797_solr) [n:127.0.0.1:32797_solr    ] o.a.s.c.c.ZkConfigManager Copying zk node /configs/_default/lang/stopwords_de.txt to /configs/AutoscalingHistoryHandlerTest_collection/lang/stopwords_de.txt
   [junit4]   2> 2366865 INFO  (OverseerThreadFactory-9728-thread-1-processing-n:127.0.0.1:32797_solr) [n:127.0.0.1:32797_solr    ] o.a.s.c.c.ZkConfigManager Copying zk node /configs/_default/lang/stopwords_fa.txt to /configs/AutoscalingHistoryHandlerTest_collection/lang/stopwords_fa.txt
   [junit4]   2> 2366865 INFO  (OverseerThreadFactory-9728-thread-1-processing-n:127.0.0.1:32797_solr) [n:127.0.0.1:32797_solr    ] o.a.s.c.c.ZkConfigManager Copying zk node /configs/_default/lang/contractions_ga.txt to /configs/AutoscalingHistoryHandlerTest_collection/lang/contractions_ga.txt
   [junit4]   2> 2366865 INFO  (OverseerThreadFactory-9728-thread-1-processing-n:127.0.0.1:32797_solr) [n:127.0.0.1:32797_solr    ] o.a.s.c.c.ZkConfigManager Copying zk node /configs/_default/lang/stopwords_ca.txt to /configs/AutoscalingHistoryHandlerTest_collection/lang/stopwords_ca.txt
   [junit4]   2> 2366866 INFO  (OverseerThreadFactory-9728-thread-1-processing-n:127.0.0.1:32797_solr) [n:127.0.0.1:32797_solr    ] o.a.s.c.c.ZkConfigManager Copying zk node /configs/_default/lang/stopwords_nl.txt to /configs/AutoscalingHistoryHandlerTest_collection/lang/stopwords_nl.txt
   [junit4]   2> 2366866 INFO  (OverseerThreadFactory-9728-thread-1-processing-n:127.0.0.1:32797_solr) [n:127.0.0.1:32797_solr    ] o.a.s.c.c.ZkConfigManager Copying zk node /configs/_default/lang/stopwords_bg.txt to /configs/AutoscalingHistoryHandlerTest_collection/lang/stopwords_bg.txt
   [junit4]   2> 2366867 INFO  (OverseerThreadFactory-9728-thread-1-processing-n:127.0.0.1:32797_solr) [n:127.0.0.1:32797_solr    ] o.a.s.c.c.ZkConfigManager Copying zk node /configs/_default/lang/stopwords_lv.txt to /configs/AutoscalingHistoryHandlerTest_collection/lang/stopwords_lv.txt
   [junit4]   2> 2366867 INFO  (OverseerThreadFactory-9728-thread-1-processing-n:127.0.0.1:32797_solr) [n:127.0.0.1:32797_solr    ] o.a.s.c.c.ZkConfigManager Copying zk node /configs/_default/lang/stopwords_en.txt to /configs/AutoscalingHistoryHandlerTest_collection/lang/stopwords_en.txt
   [junit4]   2> 2366867 INFO  (OverseerThreadFactory-9728-thread-1-processing-n:127.0.0.1:32797_solr) [n:127.0.0.1:32797_solr    ] o.a.s.c.c.ZkConfigManager Copying zk node /configs/_default/lang/stopwords_es.txt to /configs/AutoscalingHistoryHandlerTest_collection/lang/stopwords_es.txt
   [junit4]   2> 2366868 INFO  (OverseerThreadFactory-9728-thread-1-processing-n:127.0.0.1:32797_solr) [n:127.0.0.1:32797_solr    ] o.a.s.c.c.ZkConfigManager Copying zk node /configs/_default/lang/stopwords_th.txt to /configs/AutoscalingHistoryHandlerTest_collection/lang/stopwords_th.txt
   [junit4]   2> 2366868 INFO  (OverseerThreadFactory-9728-thread-1-processing-n:127.0.0.1:32797_solr) [n:127.0.0.1:32797_solr    ] o.a.s.c.c.ZkConfigManager Copying zk node /configs/_default/lang/stopwords_ro.txt to /configs/AutoscalingHistoryHandlerTest_collection/lang/stopwords_ro.txt
   [junit4]   2> 2366869 INFO  (OverseerThreadFactory-9728-thread-1-processing-n:127.0.0.1:32797_solr) [n:127.0.0.1:32797_solr    ] o.a.s.c.c.ZkConfigManager Copying zk node /configs/_default/lang/stopwords_fr.txt to /configs/AutoscalingHistoryHandlerTest_collection/lang/stopwords_fr.txt
   [junit4]   2> 2366869 INFO  (OverseerThreadFactory-9728-thread-1-processing-n:127.0.0.1:32797_solr) [n:127.0.0.1:32797_solr    ] o.a.s.c.c.ZkConfigManager Copying zk node /configs/_default/lang/stopwords_sv.txt to /configs/AutoscalingHistoryHandlerTest_collection/lang/stopwords_sv.txt
   [junit4]   2> 2366870 INFO  (OverseerThreadFactory-9728-thread-1-processing-n:127.0.0.1:32797_solr) [n:127.0.0.1:32797_solr    ] o.a.s.c.c.ZkConfigManager Copying zk node /configs/_default/lang/stopwords_fi.txt to /configs/AutoscalingHistoryHandlerTest_collection/lang/stopwords_fi.txt
   [junit4]   2> 2366870 INFO  (OverseerThreadFactory-9728-thread-1-processing-n:127.0.0.1:32797_solr) [n:127.0.0.1:32797_solr    ] o.a.s.c.c.ZkConfigManager Copying zk node /configs/_default/lang/hyphenations_ga.txt to /configs/AutoscalingHistoryHandlerTest_collection/lang/hyphenations_ga.txt
   [junit4]   2> 2366870 INFO  (OverseerThreadFactory-9728-thread-1-processing-n:127.0.0.1:32797_solr) [n:127.0.0.1:32797_solr    ] o.a.s.c.c.ZkConfigManager Copying zk node /configs/_default/lang/stopwords_gl.txt to /configs/AutoscalingHistoryHandlerTest_collection/lang/stopwords_gl.txt
   [junit4]   2> 2366871 INFO  (OverseerThreadFactory-9728-thread-1-processing-n:127.0.0.1:32797_solr) [n:127.0.0.1:32797_solr    ] o.a.s.c.c.ZkConfigManager Copying zk node /configs/_default/params.json to /configs/AutoscalingHistoryHandlerTest_collection/params.json
   [junit4]   2> 2366872 DEBUG (OverseerStateUpdate-98784777583656967-127.0.0.1:32797_solr-n_0000000000) [n:127.0.0.1:32797_solr    ] o.a.s.c.Overseer processMessage: queueSize: 1, message = {
   [junit4]   2>   "name":"AutoscalingHistoryHandlerTest_collection",
   [junit4]   2>   "fromApi":"true",
   [junit4]   2>   "replicationFactor":"3",
   [junit4]   2>   "numShards":"1",
   [junit4]   2>   "nrtReplicas":"3",
   [junit4]   2>   "stateFormat":"2",
   [junit4]   2>   "operation":"create"} current state version: 0
   [junit4]   2> 2366872 DEBUG (OverseerStateUpdate-98784777583656967-127.0.0.1:32797_solr-n_0000000000) [n:127.0.0.1:32797_solr    ] o.a.s.c.o.ClusterStateMutator building a new cName: AutoscalingHistoryHandlerTest_collection
   [junit4]   2> 2366873 DEBUG (OverseerStateUpdate-98784777583656967-127.0.0.1:32797_solr-n_0000000000) [n:127.0.0.1:32797_solr    ] o.a.s.c.o.ZkStateWriter going to create_collection /collections/AutoscalingHistoryHandlerTest_collection/state.json
   [junit4]   2> 2366976 DEBUG (OverseerStateUpdate-98784777583656967-127.0.0.1:32797_solr-n_0000000000) [n:127.0.0.1:32797_solr    ] o.a.s.c.Overseer processMessage: queueSize: 1, message = {
   [junit4]   2>   "operation":"ADDREPLICA",
   [junit4]   2>   "collection":"AutoscalingHistoryHandlerTest_collection",
   [junit4]   2>   "shard":"shard1",
   [junit4]   2>   "core":"AutoscalingHistoryHandlerTest_collection_shard1_replica_n1",
   [junit4]   2>   "state":"down",
   [junit4]   2>   "base_url":"http://127.0.0.1:43585/solr",
   [junit4]   2>   "type":"NRT"} current state version: 0
   [junit4]   2> 2366976 INFO  (OverseerStateUpdate-98784777583656967-127.0.0.1:32797_solr-n_0000000000) [n:127.0.0.1:32797_solr    ] o.a.s.c.o.SliceMutator createReplica() {
   [junit4]   2>   "operation":"ADDREPLICA",
   [junit4]   2>   "collection":"AutoscalingHistoryHandlerTest_collection",
   [junit4]   2>   "shard":"shard1",
   [junit4]   2>   "core":"AutoscalingHistoryHandlerTest_collection_shard1_replica_n1",
   [junit4]   2>   "state":"down",
   [junit4]   2>   "base_url":"http://127.0.0.1:43585/solr",
   [junit4]   2>   "type":"NRT"} 
   [junit4]   2> 2366977 DEBUG (OverseerStateUpdate-98784777583656967-127.0.0.1:32797_solr-n_0000000000) [n:127.0.0.1:32797_solr    ] o.a.s.c.o.SliceMutator Old Slice: shard1:{
   [junit4]   2>   "range":"80000000-7fffffff",
   [junit4]   2>   "state":"active",
   [junit4]   2>   "replicas":{}}
   [junit4]   2> 2366977 DEBUG (OverseerStateUpdate-98784777583656967-127.0.0.1:32797_solr-n_0000000000) [n:127.0.0.1:32797_solr    ] o.a.s.c.o.SliceMutator New Slice: shard1:{
   [junit4]   2>   "range":"80000000-7fffffff",
   [junit4]   2>   "state":"active",
   [junit4]   2>   "replicas":{"core_node3":{
   [junit4]   2>       "core":"AutoscalingHistoryHandlerTest_collection_shard1_replica_n1",
   [junit4]   2>       "base_url":"http://127.0.0.1:43585/solr",
   [junit4]   2>       "state":"down",
   [junit4]   2>       "node_name":null,
   [junit4]   2>       "type":"NRT"}}}
   [junit4]   2> 2366978 DEBUG (OverseerStateUpdate-98784777583656967-127.0.0.1:32797_solr-n_0000000000) [n:127.0.0.1:32797_solr    ] o.a.s.c.Overseer processMessage: queueSize: 1, message = {
   [junit4]   2>   "operation":"ADDREPLICA",
   [junit4]   2>   "collection":"AutoscalingHistoryHandlerTest_collection",
   [junit4]   2>   "shard":"shard1",
   [junit4]   2>   "core":"AutoscalingHistoryHandlerTest_collection_shard1_replica_n2",
   [junit4]   2>   "state":"down",
   [junit4]   2>   "base_url":"http://127.0.0.1:32797/solr",
   [junit4]   2>   "type":"NRT"} current state version: 0
   [junit4]   2> 2366978 INFO  (OverseerStateUpdate-98784777583656967-127.0.0.1:32797_solr-n_0000000000) [n:127.0.0.1:32797_solr    ] o.a.s.c.o.SliceMutator createReplica() {
   [junit4]   2>   "operation":"ADDREPLICA",
   [junit4]   2>   "collection":"AutoscalingHistoryHandlerTest_collection",
   [junit4]   2>   "shard":"shard1",
   [junit4]   2>   "core":"AutoscalingHistoryHandlerTest_collection_shard1_replica_n2",
   [junit4]   2>   "state":"down",
   [junit4]   2>   "base_url":"http://127.0.0.1:32797/solr",
   [junit4]   2>   "type":"NRT"} 
   [junit4]   2> 2366979 DEBUG (OverseerStateUpdate-98784777583656967-127.0.0.1:32797_solr-n_0000000000) [n:127.0.0.1:32797_solr    ] o.a.s.c.o.SliceMutator Old Slice: shard1:{
   [junit4]   2>   "range":"80000000-7fffffff",
   [junit4]   2>   "state":"active",
   [junit4]   2>   "replicas":{"core_node3":{
   [junit4]   2>       "core":"AutoscalingHistoryHandlerTest_collection_shard1_replica_n1",
   [junit4]   2>       "base_url":"http://127.0.0.1:43585/solr",
   [junit4]   2>       "state":"down",
   [junit4]   2>       "node_name":null,
   [junit4]   2>       "type":"NRT"}}}
   [junit4]   2> 2366979 DEBUG (OverseerStateUpdate-98784777583656967-127.0.0.1:32797_solr-n_0000000000) [n:127.0.0.1:32797_solr    ] o.a.s.c.o.SliceMutator New Slice: shard1:{
   [junit4]   2>   "range":"80000000-7fffffff",
   [junit4]   2>   "state":"active",
   [junit4]   2>   "replicas":{
   [junit4]   2>     "core_node3":{
   [junit4]   2>       "core":"AutoscalingHistoryHandlerTest_collection_shard1_replica_n1",
   [junit4]   2>       "base_url":"http://127.0.0.1:43585/solr",
   [junit4]   2>       "state":"down",
   [junit4]   2>       "node_name":null,
   [junit4]   2>       "type":"NRT"},
   [junit4]   2>     "core_node5":{
   [junit4]   2>       "core":"AutoscalingHistoryHandlerTest_collection_shard1_replica_n2",
   [junit4]   2>       "base_url":"http://127.0.0.1:32797/solr",
   [junit4]   2>       "state":"down",
   [junit4]   2>       "node_name":null,
   [junit4]   2>       "type":"NRT"}}}
   [junit4]   2> 2366980 DEBUG (OverseerStateUpdate-98784777583656967-127.0.0.1:32797_solr-n_0000000000) [n:127.0.0.1:32797_solr    ] o.a.s.c.Overseer processMessage: queueSize: 1, message = {
   [junit4]   2>   "operation":"ADDREPLICA",
   [junit4]   2>   "collection":"AutoscalingHistoryHandlerTest_collection",
   [junit4]   2>   "shard":"shard1",
   [junit4]   2>   "core":"AutoscalingHistoryHandlerTest_collection_shard1_replica_n4",
   [junit4]   2>   "state":"down",
   [junit4]   2>   "base_url":"http://127.0.0.1:43643/solr",
   [junit4]   2>   "type":"NRT"} current state version: 0
   [junit4]   2> 2366980 INFO  (OverseerStateUpdate-98784777583656967-127.0.0.1:32797_solr-n_0000000000) [n:127.0.0.1:32797_solr    ] o.a.s.c.o.SliceMutator createReplica() {
   [junit4]   2>   "operation":"ADDREPLICA",
   [junit4]   2>   "collection":"AutoscalingHistoryHandlerTest_collection",
   [junit4]   2>   "shard":"shard1",
   [junit4]   2>   "core":"AutoscalingHistoryHandlerTest_collection_shard1_replica_n4",
   [junit4]   2>   "state":"down",
   [junit4]   2>   "base_url":"http://127.0.0.1:43643/solr",
   [junit4]   2>   "type":"NRT"} 
   [junit4]   2> 2366981 DEBUG (OverseerStateUpdate-98784777583656967-127.0.0.1:32797_solr-n_0000000000) [n:127.0.0.1:32797_solr    ] o.a.s.c.o.SliceMutator Old Slice: shard1:{
   [junit4]   2>   "range":"80000000-7fffffff",
   [junit4]   2>   "state":"active",
   [junit4]   2>   "replicas":{
   [junit4]   2>     "core_node3":{
   [junit4]   2>       "core":"AutoscalingHistoryHandlerTest_collection_shard1_replica_n1",
   [junit4]   2>       "base_url":"http://127.0.0.1:43585/solr",
   [junit4]   2>       "state":"down",
   [junit4]   2>       "node_name":null,
   [junit4]   2>       "type":"NRT"},
   [junit4]   2>     "core_node5":{
   [junit4]   2>       "core":"AutoscalingHistoryHandlerTest_collection_shard1_replica_n2",
   [junit4]   2>       "base_url":"http://127.0.0.1:32797/solr",
   [junit4]   2>       "state":"down",
   [junit4]   2>       "node_name":null,
   [junit4]   2>       "type":"NRT"}}}
   [junit4]   2> 2366981 DEBUG (OverseerStateUpdate-98784777583656967-127.0.0.1:32797_solr-n_0000000000) [n:127.0.0.1:32797_solr    ] o.a.s.c.o.SliceMutator New Slice: shard1:{
   [junit4]   2>   "range":"80000000-7fffffff",
   [junit4]   2>   "state":"active",
   [junit4]   2>   "replicas":{
   [junit4]   2>     "core_node3":{
   [junit4]   2>       "core":"AutoscalingHistoryHandlerTest_collection_shard1_replica_n1",
   [junit4]   2>       "base_url":"http://127.0.0.1:43585/solr",
   [junit4]   2>       "state":"down",
   [junit4]   2>       "node_name":null,
   [junit4]   2>       "type":"NRT"},
   [junit4]   2>     "core_node5":{
   [junit4]   2>       "core":"AutoscalingHistoryHandlerTest_collection_shard1_replica_n2",
   [junit4]   2>       "base_url":"http://127.0.0.1:32797/solr",
   [junit4]   2>       "state":"down",
   [junit4]   2>       "node_name":null,
   [junit4]   2>       "type":"NRT"},
   [junit4]   2>     "core_node6":{
   [junit4]   2>       "core":"AutoscalingHistoryHandlerTest_collection_shard1_replica_n4",
   [junit4]   2>       "base_url":"http://127.0.0.1:43643/solr",
   [junit4]   2>       "state":"down",
   [junit4]   2>       "node_name":null,
   [junit4]   2>       "type":"NRT"}}}
   [junit4]   2> 2367083 DEBUG (OverseerStateUpdate-98784777583656967-127.0.0.1:32797_solr-n_0000000000) [n:127.0.0.1:32797_solr    ] o.a.s.c.o.ZkStateWriter going to update_collection /collections/AutoscalingHistoryHandlerTest_collection/state.json version: 0
   [junit4]   2> 2367181 INFO  (qtp1469377121-22233) [n:127.0.0.1:32797_solr    ] o.a.s.h.a.CoreAdminOperation core create command qt=/admin/cores&coreNodeName=core_node5&collection.configName=AutoscalingHistoryHandlerTest_collection&newCollection=true&name=AutoscalingHistoryHandlerTest_collection_shard1_replica_n2&action=CREATE&numShards=1&collection=AutoscalingHistoryHandlerTest_collection&shard=shard1&wt=javabin&version=2&replicaType=NRT
   [junit4]   2> 2367181 INFO  (qtp1281657558-22228) [n:127.0.0.1:43585_solr    ] o.a.s.h.a.CoreAdminOperation core create command qt=/admin/cores&coreNodeName=core_node3&collection.configName=AutoscalingHistoryHandlerTest_collection&newCollection=true&name=AutoscalingHistoryHandlerTest_collection_shard1_replica_n1&action=CREATE&numShards=1&collection=AutoscalingHistoryHandlerTest_collection&shard=shard1&wt=javabin&version=2&replicaType=NRT
   [junit4]   2> 2367181 INFO  (qtp1123288107-22234) [n:127.0.0.1:43643_solr    ] o.a.s.h.a.CoreAdminOperation core create command qt=/admin/cores&coreNodeName=core_node6&collection.configName=AutoscalingHistoryHandlerTest_collection&newCollection=true&name=AutoscalingHistoryHandlerTest_collection_shard1_replica_n4&action=CREATE&numShards=1&collection=AutoscalingHistoryHandlerTest_collection&shard=shard1&wt=javabin&version=2&replicaType=NRT
   [junit4]   2> 2367181 INFO  (qtp1469377121-22233) [n:127.0.0.1:32797_solr    ] o.a.s.c.TransientSolrCoreCacheDefault Allocating transient cache for 2147483647 transient cores
   [junit4]   2> 2367181 INFO  (qtp1281657558-22228) [n:127.0.0.1:43585_solr    ] o.a.s.c.TransientSolrCoreCacheDefault Allocating transient cache for 2147483647 transient cores
   [junit4]   2> 2367182 INFO  (qtp1123288107-22234) [n:127.0.0.1:43643_solr    ] o.a.s.c.TransientSolrCoreCacheDefault Allocating transient cache for 2147483647 transient cores
   [junit4]   2> 2367184 DEBUG (OverseerStateUpdate-98784777583656967-127.0.0.1:32797_solr-n_0000000000) [n:127.0.0.1:32797_solr    ] o.a.s.c.Overseer processMessage: queueSize: 2, message = {
   [junit4]   2>   "core":"AutoscalingHistoryHandlerTest_collection_shard1_replica_n2",
   [junit4]   2>   "core_node_name":"core_node5",
   [junit4]   2>   "roles":null,
   [junit4]   2>   "base_url":"http://127.0.0.1:32797/solr",
   [junit4]   2>   "node_name":"127.0.0.1:32797_solr",
   [junit4]   2>   "numShards":"1",
   [junit4]   2>   "state":"down",
   [junit4]   2>   "shard":"shard1",
   [junit4]   2>   "collection":"AutoscalingHistoryHandlerTest_collection",
   [junit4]   2>   "type":"NRT",
   [junit4]   2>   "operation":"state"} current state version: 0
   [junit4]   2> 2367184 DEBUG (OverseerStateUpdate-98784777583656967-127.0.0.1:32797_solr-n_0000000000) [n:127.0.0.1:32797_solr    ] o.a.s.c.o.ReplicaMutator Update state numShards=1 message={
   [junit4]   2>   "core":"AutoscalingHistoryHandlerTest_collection_shard1_replica_n2",
   [junit4]   2>   "core_node_name":"core_node5",
   [junit4]   2>   "roles":null,
   [junit4]   2>   "base_url":"http://127.0.0.1:32797/solr",
   [junit4]   2>   "node_name":"127.0.0.1:32797_solr",
   [junit4]   2>   "numShards":"1",
   [junit4]   2>   "state":"down",
   [junit4]   2>   "shard":"shard1",
   [junit4]   2>   "collection":"AutoscalingHistoryHandlerTest_collection",
   [junit4]   2>   "type":"NRT",
   [junit4]   2>   "operation":"state"}
   [junit4]   2> 2367185 DEBUG (OverseerStateUpdate-98784777583656967-127.0.0.1:32797_solr-n_0000000000) [n:127.0.0.1:32797_solr    ] o.a.s.c.o.ReplicaMutator Will update state for replica: core_node5:{"core":"AutoscalingHistoryHandlerTest_collection_shard1_replica_n2","base_url":"http://127.0.0.1:32797/solr","node_name":"127.0.0.1:32797_solr","state":"down","type":"NRT"}
   [junit4]   2> 2367185 DEBUG (OverseerStateUpdate-98784777583656967-127.0.0.1:32797_solr-n_0000000000) [n:127.0.0.1:32797_solr    ] o.a.s.c.o.ReplicaMutator Collection is now: DocCollection(AutoscalingHistoryHandlerTest_collection//collections/AutoscalingHistoryHandlerTest_collection/state.json/1)={
   [junit4]   2>   "pullReplicas":"0",
   [junit4]   2>   "replicationFactor":"3",
   [junit4]   2>   "router":{"name":"compositeId"},
   [junit4]   2>   "maxShardsPerNode":"1",
   [junit4]   2>   "autoAddReplicas":"false",
   [junit4]   2>   "nrtReplicas":"3",
   [junit4]   2>   "tlogReplicas":"0",
   [junit4]   2>   "shards":{"shard1":{
   [junit4]   2>       "range":"80000000-7fffffff",
   [junit4]   2>       "state":"active",
   [junit4]   2>       "replicas":{
   [junit4]   2>         "core_node3":{
   [junit4]   2>           "core":"AutoscalingHistoryHandlerTest_collection_shard1_replica_n1",
   [junit4]   2>           "base_url":"http://127.0.0.1:43585/solr",
   [junit4]   2>           "state":"down",
   [junit4]   2>           "node_name":null,
   [junit4]   2>           "type":"NRT"},
   [junit4]   2>         "core_node5":{
   [junit4]   2>           "core":"AutoscalingHistoryHandlerTest_collection_shard1_replica_n2",
   [junit4]   2>           "base_url":"http://127.0.0.1:32797/solr",
   [junit4]   2>           "node_name":"127.0.0.1:32797_solr",
   [junit4]   2>           "state":"down",
   [junit4]   2>           "type":"NRT"},
   [junit4]   2>         "core_node6":{
   [junit4]   2>           "core":"AutoscalingHistoryHandlerTest_collection_shard1_replica_n4",
   [junit4]   2>           "base_url":"http://127.0.0.1:43643/solr",
   [junit4]   2>           "state":"down",
   [junit4]   2>           "node_name":null,
   [junit4]   2>           "type":"NRT"}}}}}
   [junit4]   2> 2367186 DEBUG (OverseerStateUpdate-98784777583656967-127.0.0.1:32797_solr-n_0000000000) [n:127.0.0.1:32797_solr    ] o.a.s.c.Overseer processMessage: queueSize: 1, message = {
   [junit4]   2>   "core":"AutoscalingHistoryHandlerTest_collection_shard1_replica_n1",
   [junit4]   2>   "core_node_name":"core_node3",
   [junit4]   2>   "roles":null,
   [junit4]   2>   "base_url":"http://127.0.0.1:43585/solr",
   [junit4]   2>   "node_name":"127.0.0.1:43585_solr",
   [junit4]   2>   "numShards":"1",
   [junit4]   2>   "state":"down",
   [junit4]   2>   "shard":"shard1",
   [junit4]   2>   "collection":"AutoscalingHistoryHandlerTest_collection",
   [junit4]   2>   "type":"NRT",
   [junit4]   2>   "operation":"state"} current state version: 0
   [junit4]   2> 2367186 DEBUG (OverseerStateUpdate-98784777583656967-127.0.0.1:32797_solr-n_0000000000) [n:127.0.0.1:32797_solr    ] o.a.s.c.o.ReplicaMutator Update state numShards=1 message={
   [junit4]   2>   "core":"AutoscalingHistoryHandlerTest_collection_shard1_replica_n1",
   [junit4]   2>   "core_node_name":"core_node3",
   [junit4]   2>   "roles":null,
   [junit4]   2>   "base_url":"http://127.0.0.1:43585/solr",
   [junit4]   2>   "node_name":"127.0.0.1:43585_solr",
   [junit4]   2>   "numShards":"1",
   [junit4]   2>   "state":"down",
   [junit4]   2>   "shard":"shard1",
   [junit4]   2>   "collection":"AutoscalingHistoryHandlerTest_collection",
   [junit4]   2>   "type":"NRT",
   [junit4]   2>   "operation":"state"}
   [junit4]   2> 2367186 DEBUG (OverseerStateUpdate-98784777583656967-127.0.0.1:32797_solr-n_0000000000) [n:127.0.0.1:32797_solr    ] o.a.s.c.o.ReplicaMutator Will update state for replica: core_node3:{"core":"AutoscalingHistoryHandlerTest_collection_shard1_replica_n1","base_url":"http://127.0.0.1:43585/solr","node_name":"127.0.0.1:43585_solr","state":"down","type":"NRT"}
   [junit4]   2> 2367187 DEBUG (OverseerStateUpdate-98784777583656967-127.0.0.1:32797_solr-n_0000000000) [n:127.0.0.1:32797_solr    ] o.a.s.c.o.ReplicaMutator Collection is now: DocCollection(AutoscalingHistoryHandlerTest_collection//collections/AutoscalingHistoryHandlerTest_collection/state.json/1)={
   [junit4]   2>   "pullReplicas":"0",
   [junit4]   2>   "replicationFactor":"3",
   [junit4]   2>   "router":{"name":"compositeId"},
   [junit4]   2>   "maxShardsPerNode":"1",
   [junit4]   2>   "autoAddReplicas":"false",
   [junit4]   2>   "nrtReplicas":"3",
   [junit4]   2>   "tlogReplicas":"0",
   [junit4]   2>   "shards":{"shard1":{
   [junit4]   2>       "range":"80000000-7fffffff",
   [junit4]   2>       "state":"active",
   [junit4]   2>       "replicas":{
   [junit4]   2>         "core_node3":{
   [junit4]   2>           "core":"AutoscalingHistoryHandlerTest_collection_shard1_replica_n1",
   [junit4]   2>           "base_url":"http://127.0.0.1:43585/solr",
   [junit4]   2>           "node_name":"127.0.0.1:43585_solr",
   [junit4]   2>           "state":"down",
   [junit4]   2>           "type":"NRT"},
   [junit4]   2>         "core_node5":{
   [junit4]   2>           "core":"AutoscalingHistoryHandlerTest_collection_shard1_replica_n2",
   [junit4]   2>           "base_url":"http://127.0.0.1:32797/solr",
   [junit4]   2>           "node_name":"127.0.0.1:32797_solr",
   [junit4]   2>           "state":"down",
   [junit4]   2>           "type":"NRT"},
   [junit4]   2>         "core_node6":{
   [junit4]   2>           "core":"AutoscalingHistoryHandlerTest_collection_shard1_replica_n4",
   [junit4]   2>           "base_url":"http://127.0.0.1:43643/solr",
   [junit4]   2>           "state":"down",
   [junit4]   2>           "node_name":null,
   [junit4]   2>           "type":"NRT"}}}}}
   [junit4]   2> 2367188 DEBUG (OverseerStateUpdate-98784777583656967-127.0.0.1:32797_solr-n_0000000000) [n:127.0.0.1:32797_solr    ] o.a.s.c.Overseer processMessage: queueSize: 1, message = {
   [junit4]   2>   "core":"AutoscalingHistoryHandlerTest_collection_shard1_replica_n4",
   [junit4]   2>   "core_node_name":"core_node6",
   [junit4]   2>   "roles":null,
   [junit4]   2>   "base_url":"http://127.0.0.1:43643/solr",
   [junit4]   2>   "node_name":"127.0.0.1:43643_solr",
   [junit4]   2>   "numShards":"1",
   [junit4]   2>   "state":"down",
   [junit4]   2>   "shard":"shard1",
   [junit4]   2>   "collection":"AutoscalingHistoryHandlerTest_collection",
   [junit4]   2>   "type":"NRT",
   [junit4]   2>   "operation":"state"} current state version: 0
   [junit4]   2> 2367188 DEBUG (OverseerStateUpdate-98784777583656967-127.0.0.1:32797_solr-n_0000000000) [n:127.0.0.1:32797_solr    ] o.a.s.c.o.ReplicaMutator Update state numShards=1 message={
   [junit4]   2>   "core":"AutoscalingHistoryHandlerTest_collection_shard1_replica_n4",
   [junit4]   2>   "core_node_name":"core_node6",
   [junit4]   2>   "roles":null,
   [junit4]   2>   "base_url":"http://127.0.0.1:43643/solr",
   [junit4]   2>   "node_name":"127.0.0.1:43643_solr",
   [junit4]   2>   "numShards":"1",
   [junit4]   2>   "state":"down",
   [junit4]   2>   "shard":"shard1",
   [junit4]   2>   "collection":"AutoscalingHistoryHandlerTest_collection",
   [junit4]   2>   "type":"NRT",
   [junit4]   2>   "operation":"state"}
   [junit4]   2> 2367188 DEBUG (OverseerStateUpdate-98784777583656967-127.0.0.1:32797_solr-n_0000000000) [n:127.0.0.1:32797_solr    ] o.a.s.c.o.ReplicaMutator Will update state for replica: core_node6:{"core":"AutoscalingHistoryHandlerTest_collection_shard1_replica_n4","base_url":"http://127.0.0.1:43643/solr","node_name":"127.0.0.1:43643_solr","state":"down","type":"NRT"}
   [junit4]   2> 2367188 DEBUG (OverseerStateUpdate-98784777583656967-127.0.0.1:32797_solr-n_0000000000) [n:127.0.0.1:32797_solr    ] o.a.s.c.o.ReplicaMutator Collection is now: DocCollection(AutoscalingHistoryHandlerTest_collection//collections/AutoscalingHistoryHandlerTest_collection/state.json/1)={
   [junit4]   2>   "pullReplicas":"0",
   [junit4]   2>   "replicationFactor":"3",
   [junit4]   2>   "router":{"name":"compositeId"},
   [junit4]   2>   "maxShardsPerNode":"1",
   [junit4]   2>   "autoAddReplicas":"false",
   [junit4]   2>   "nrtReplicas":"3",
   [junit4]   2>   "tlogReplicas":"0",
   [junit4]   2>   "shards":{"shard1":{
   [junit4]   2>       "range":"80000000-7fffffff",
   [junit4]   2>       "state":"active",
   [junit4]   2>       "replicas":{
   [junit4]   2>         "core_node3":{
   [junit4]   2>           "core":"AutoscalingHistoryHandlerTest_collection_shard1_replica_n1",
   [junit4]   2>           "base_url":"http://127.0.0.1:43585/solr",
   [junit4]   2>           "node_name":"127.0.0.1:43585_solr",
   [junit4]   2>           "state":"down",
   [junit4]   2>           "type":"NRT"},
   [junit4]   2>         "core_node5":{
   [junit4]   2>           "core":"AutoscalingHistoryHandlerTest_collection_shard1_replica_n2",
   [junit4]   2>           "base_url":"http://127.0.0.1:32797/solr",
   [junit4]   2>           "node_name":"127.0.0.1:32797_solr",
   [junit4]   2>           "state":"down",
   [junit4]   2>           "type":"NRT"},
   [junit4]   2>         "core_node6":{
   [junit4]   2>           "core":"AutoscalingHistoryHandlerTest_collection_shard1_replica_n4",
   [junit4]   2>           "base_url":"http://127.0.0.1:43643/solr",
   [junit4]   2>           "node_name":"127.0.0.1:43643_solr",
   [junit4]   2>           "state":"down",
   [junit4]   2>           "type":"NRT"}}}}}
   [junit4]   2> 2367290 DEBUG (OverseerStateUpdate-98784777583656967-127.0.0.1:32797_solr-n_0000000000) [n:127.0.0.1:32797_solr    ] o.a.s.c.o.ZkStateWriter going to update_collection /collections/AutoscalingHistoryHandlerTest_collection/state.json version: 1
   [junit4]   2> 2367290 INFO  (zkCallback-3664-thread-1-processing-n:127.0.0.1:32797_solr) [n:127.0.0.1:32797_solr    ] o.a.s.c.c.ZkStateReader A cluster state change: [WatchedEvent state:SyncConnected type:NodeDataChanged path:/collections/AutoscalingHistoryHandlerTest_collection/state.json] for collection [AutoscalingHistoryHandlerTest_collection] has occurred - updating... (live nodes size: [3])
   [junit4]   2> 2367290 INFO  (zkCallback-3665-thread-1-processing-n:127.0.0.1:43643_solr) [n:127.0.0.1:43643_solr    ] o.a.s.c.c.ZkStateReader A cluster state change: [WatchedEvent state:SyncConnected type:NodeDataChanged path:/collections/AutoscalingHistoryHandlerTest_collection/state.json] for collection [AutoscalingHistoryHandlerTest_collection] has occurred - updating... (live nodes size: [3])
   [junit4]   2> 2367290 INFO  (zkCallback-3666-thread-1-processing-n:127.0.0.1:43585_solr) [n:127.0.0.1:43585_solr    ] o.a.s.c.c.ZkStateReader A cluster state change: [WatchedEvent state:SyncConnected type:NodeDataChanged path:/collections/AutoscalingHistoryHandlerTest_collection/state.json] for collection [AutoscalingHistoryHandlerTest_collection] has occurred - updating... (live nodes size: [3])
   [junit4]   2> 2367291 INFO  (zkCallback-3666-thread-2-processing-n:127.0.0.1:43585_solr) [n:127.0.0.1:43585_solr    ] o.a.s.c.c.ZkStateReader A cluster state change: [WatchedEvent state:SyncConnected type:NodeDataChanged path:/collections/AutoscalingHistoryHandlerTest_collection/state.json] for collection [AutoscalingHistoryHandlerTest_collection] has occurred - updating... (live nodes size: [3])
   [junit4]   2> 2367291 INFO  (zkCallback-3665-thread-2-processing-n:127.0.0.1:43643_solr) [n:127.0.0.1:43643_solr    ] o.a.s.c.c.ZkStateReader A cluster state change: [WatchedEvent state:SyncConnected type:NodeDataChanged path:/collections/AutoscalingHistoryHandlerTest_collection/state.json] for collection [AutoscalingHistoryHandlerTest_collection] has occurred - updating... (live nodes size: [3])
   [junit4]   2> 2367291 INFO  (zkCallback-3664-thread-2-processing-n:127.0.0.1:32797_solr) [n:127.0.0.1:32797_solr    ] o.a.s.c.c.ZkStateReader A cluster state change: [WatchedEvent state:SyncConnected type:NodeDataChanged path:/collections/AutoscalingHistoryHandlerTest_collection/state.json] for collection [AutoscalingHistoryHandlerTest_collection] has occurred - updating... (live nodes size: [3])
   [junit4]   2> 2367756 DEBUG (ScheduledTrigger-9726-thread-1) [n:127.0.0.1:32797_solr    ] o.a.s.c.a.NodeLostTrigger Running NodeLostTrigger: .auto_add_replicas with currently live nodes: [127.0.0.1:32797_solr, 127.0.0.1:43585_solr, 127.0.0.1:43643_solr]
   [junit4]   2> 2368198 INFO  (qtp1123288107-22234) [n:127.0.0.1:43643_solr c:AutoscalingHistoryHandlerTest_collection s:shard1 r:core_node6 x:AutoscalingHistoryHandlerTest_collection_shard1_replica_n4] o.a.s.c.RequestParams conf resource params.json loaded . version : 0 
   [junit4]   2> 2368198 INFO  (qtp1123288107-22234) [n:127.0.0.1:43643_solr c:AutoscalingHistoryHandlerTest_collection s:shard1 r:core_node6 x:AutoscalingHistoryHandlerTest_collection_shard1_replica_n4] o.a.s.c.RequestParams request params refreshed to version 0
   [junit4]   2> 2368199 WARN  (qtp1123288107-22234) [n:127.0.0.1:43643_solr c:AutoscalingHistoryHandlerTest_collection s:shard1 r:core_node6 x:AutoscalingHistoryHandlerTest_collection_shard1_replica_n4] o.a.s.c.SolrConfig Couldn't add files from /home/jenkins/workspace/Lucene-Solr-master-Linux/solr/build/solr-core/test/J1/temp/solr.handler.admin.AutoscalingHistoryHandlerTest_8E102D73904FB4A1-001/tempDir-001/node3/AutoscalingHistoryHandlerTest_collection_shard1_replica_n4/../../../../contrib/extraction/lib filtered by .*\.jar to classpath: /home/jenkins/workspace/Lucene-Solr-master-Linux/solr/build/solr-core/test/J1/temp/solr.handler.admin.AutoscalingHistoryHandlerTest_8E102D73904FB4A1-001/tempDir-001/node3/AutoscalingHistoryHandlerTest_collection_shard1_replica_n4/../../../../contrib/extraction/lib
   [junit4]   2> 2368199 WARN  (qtp1123288107-22234) [n:127.0.0.1:43643_solr c:AutoscalingHistoryHandlerTest_collection s:shard1 r:core_node6 x:AutoscalingHistoryHandlerTest_collection_shard1_replica_n4] o.a.s.c.SolrConfig Couldn't add files from /home/jenkins/workspace/Lucene-Solr-master-Linux/solr/build/solr-core/test/J1/temp/solr.handler.admin.AutoscalingHistoryHandlerTest_8E102D73904FB4A1-001/tempDir-001/node3/AutoscalingHistoryHandlerTest_collection_shard1_replica_n4/../../../../dist filtered by solr-cell-\d.*\.jar to classpath: /home/jenkins/workspace/Lucene-Solr-master-Linux/solr/build/solr-core/test/J1/temp/solr.handler.admin.AutoscalingHistoryHandlerTest_8E102D73904FB4A1-001/tempDir-001/node3/AutoscalingHistoryHandlerTest_collection_shard1_replica_n4/../../../../dist
   [junit4]   2> 2368199 WARN  (qtp1123288107-22234) [n:127.0.0.1:43643_solr c:AutoscalingHistoryHandlerTest_collection s:shard1 r:core_node6 x:AutoscalingHistoryHandlerTest_collection_shard1_replica_n4] o.a.s.c.SolrConfig Couldn't add files from /home/jenkins/workspace/Lucene-Solr-master-Linux/solr/build/solr-core/test/J1/temp/solr.handler.admin.AutoscalingHistoryHandlerTest_8E102D73904FB4A1-001/tempDir-001/node3/AutoscalingHistoryHandlerTest_collection_shard1_replica_n4/../../../../contrib/clustering/lib filtered by .*\.jar to classpath: /home/jenkins/workspace/Lucene-Solr-master-Linux/solr/build/solr-core/test/J1/temp/solr.handler.admin.AutoscalingHistoryHandlerTest_8E102D73904FB4A1-001/tempDir-001/node3/AutoscalingHistoryHandlerTest_collection_shard1_replica_n4/../../../../contrib/clustering/lib
   [junit4]   2> 2368199 INFO  (qtp1469377121-22233) [n:127.0.0.1:32797_solr c:AutoscalingHistoryHandlerTest_collection s:shard1 r:core_node5 x:AutoscalingHistoryHandlerTest_collection_shard1_replica_n2] o.a.s.c.RequestParams conf resource params.json loaded . version : 0 
   [junit4]   2> 2368200 WARN  (qtp1123288107-22234) [n:127.0.0.1:43643_solr c:AutoscalingHistoryHandlerTest_collection s:shard1 r:core_node6 x:AutoscalingHistoryHandlerTest_collection_shard1_replica_n4] o.a.s.c.SolrConfig Couldn't add files from /home/jenkins/workspace/Lucene-Solr-master-Linux/solr/build/solr-core/test/J1/temp/solr.handler.admin.AutoscalingHistoryHandlerTest_8E102D73904FB4A1-001/tempDir-001/node3/AutoscalingHistoryHandlerTest_collection_shard1_replica_n4/../../../../dist filtered by solr-clustering-\d.*\.jar to classpath: /home/jenkins/workspace/Lucene-Solr-master-Linux/solr/build/solr-core/test/J1/temp/solr.handler.admin.AutoscalingHistoryHandlerTest_8E102D73904FB4A1-001/tempDir-001/node3/AutoscalingHistoryHandlerTest_collection_shard1_replica_n4/../../../../dist
   [junit4]   2> 2368200 WARN  (qtp1123288107-22234) [n:127.0.0.1:43643_solr c:AutoscalingHistoryHandlerTest_collection s:shard1 r:core_node6 x:AutoscalingHistoryHandlerTest_collection_shard1_replica_n4] o.a.s.c.SolrConfig Couldn't add files from /home/jenkins/workspace/Lucene-Solr-master-Linux/solr/build/solr-core/test/J1/temp/solr.handler.admin.AutoscalingHistoryHandlerTest_8E102D73904FB4A1-001/tempDir-001/node3/AutoscalingHistoryHandlerTest_collection_shard1_replica_n4/../../../../contrib/langid/lib filtered by .*\.jar to classpath: /home/jenkins/workspace/Lucene-Solr-master-Linux/solr/build/solr-core/test/J1/temp/solr.handler.admin.AutoscalingHistoryHandlerTest_8E102D73904FB4A1-001/tempDir-001/node3/AutoscalingHistoryHandlerTest_collection_shard1_replica_n4/../../../../contrib/langid/lib
   [junit4]   2> 2368200 WARN  (qtp1123288107-22234) [n:127.0.0.1:43643_solr c:AutoscalingHistoryHandlerTest_collection s:shard1 r:core_node6 x:AutoscalingHistoryHandlerTest_collection_shard1_replica_n4] o.a.s.c.SolrConfig Couldn't add files from /home/jenkins/workspace/Lucene-Solr-master-Linux/solr/build/solr-core/test/J1/temp/solr.handler.admin.AutoscalingHistoryHandlerTest_8E102D73904FB4A1-001/tempDir-001/node3/AutoscalingHistoryHandlerTest_collection_shard1_replica_n4/../../../../dist filtered by solr-langid-\d.*\.jar to classpath: /home/jenkins/workspace/Lucene-Solr-master-Linux/solr/build/solr-core/test/J1/temp/solr.handler.admin.AutoscalingHistoryHandlerTest_8E102D73904FB4A1-001/tempDir-001/node3/AutoscalingHistoryHandlerTest_collection_shard1_replica_n4/../../../../dist
   [junit4]   2> 2368200 WARN  (qtp1123288107-22234) [n:127.0.0.1:43643_solr c:AutoscalingHistoryHandlerTest_collection s:shard1 r:core_node6 x:AutoscalingHistoryHandlerTest_collection_shard1_replica_n4] o.a.s.c.SolrConfig Couldn't add files from /home/jenkins/workspace/Lucene-Solr-master-Linux/solr/build/solr-core/test/J1/temp/solr.handler.admin.AutoscalingHistoryHandlerTest_8E102D73904FB4A1-001/tempDir-001/node3/AutoscalingHistoryHandlerTest_collection_shard1_replica_n4/../../../../contrib/velocity/lib filtered by .*\.jar to classpath: /home/jenkins/workspace/Lucene-Solr-master-Linux/solr/build/solr-core/test/J1/temp/solr.handler.admin.AutoscalingHistoryHandlerTest_8E102D73904FB4A1-001/tempDir-001/node3/AutoscalingHistoryHandlerTest_collection_shard1_replica_n4/../../../../contrib/velocity/lib
   [junit4]   2> 2368201 WARN  (qtp1123288107-22234) [n:127.0.0.1:43643_solr c:AutoscalingHistoryHandlerTest_collection s:shard1 r:core_node6 x:AutoscalingHistoryHandlerTest_collection_shard1_replica_n4] o.a.s.c.SolrConfig Couldn't add files from /home/jenkins/workspace/Lucene-Solr-master-Linux/solr/build/solr-core/test/J1/temp/solr.handler.admin.AutoscalingHistoryHandlerTest_8E102D73904FB4A1-001/tempDir-001/node3/AutoscalingHistoryHandlerTest_collection_shard1_replica_n4/../../../../dist filtered by solr-velocity-\d.*\.jar to classpath: /home/jenkins/workspace/Lucene-Solr-master-Linux/solr/build/solr-core/test/J1/temp/solr.handler.admin.AutoscalingHistoryHandlerTest_8E102D73904FB4A1-001/tempDir-001/node3/AutoscalingHistoryHandlerTest_collection_shard1_replica_n4/../../../../dist
   [junit4]   2> 2368201 INFO  (qtp1281657558-22228) [n:127.0.0.1:43585_solr c:AutoscalingHistoryHandlerTest_collection s:shard1 r:core_node3 x:AutoscalingHistoryHandlerTest_collection_shard1_replica_n1] o.a.s.c.RequestParams conf resource params.json loaded . version : 0 
   [junit4]   2> 2368201 INFO  (qtp1281657558-22228) [n:127.0.0.1:43585_solr c:AutoscalingHistoryHandlerTest_collection s:shard1 r:core_node3 x:AutoscalingHistoryHandlerTest_collection_shard1_replica_n1] o.a.s.c.RequestParams request params refreshed to version 0
   [junit4]   2> 2368202 WARN  (qtp1281657558-22228) [n:127.0.0.1:43585_solr c:AutoscalingHistoryHandlerTest_collection s:shard1 r:core_node3 x:AutoscalingHistoryHandlerTest_collection_shard1_replica_n1] o.a.s.c.SolrConfig Couldn't add files from /home/jenkins/workspace/Lucene-Solr-master-Linux/solr/build/solr-core/test/J1/temp/solr.handler.admin.AutoscalingHistoryHandlerTest_8E102D73904FB4A1-001/tempDir-001/node2/AutoscalingHistoryHandlerTest_collection_shard1_replica_n1/../../../../contrib/extraction/lib filtered by .*\.jar to classpath: /home/jenkins/workspace/Lucene-Solr-master-Linux/solr/build/solr-core/test/J1/temp/solr.handler.admin.AutoscalingHistoryHandlerTest_8E102D73904FB4A1-001/tempDir-001/node2/AutoscalingHistoryHandlerTest_collection_shard1_replica_n1/../../../../contrib/extraction/lib
   [junit4]   2> 2368202 WARN  (qtp1281657558-22228) [n:127.0.0.1:43585_solr c:AutoscalingHistoryHandlerTest_collection s:shard1 r:core_node3 x:AutoscalingHistoryHandlerTest_collection_shard1_replica_n1] o.a.s.c.SolrConfig Couldn't add files from /home/jenkins/workspace/Lucene-Solr-master-Linux/solr/build/solr-core/test/J1/temp/solr.handler.admin.AutoscalingHistoryHandlerTest_8E102D73904FB4A1-001/tempDir-001/node2/AutoscalingHistoryHandlerTest_collection_shard1_replica_n1/../../../../dist filtered by solr-cell-\d.*\.jar to classpath: /home/jenkins/workspace/Lucene-Solr-master-Linux/solr/build/solr-core/test/J1/temp/solr.handler.admin.AutoscalingHistoryHandlerTest_8E102D73904FB4A1-001/tempDir-001/node2/AutoscalingHistoryHandlerTest_collection_shard1_replica_n1/../../../../dist
   [junit4]   2> 2368202 WARN  (qtp1281657558-22228) [n:127.0.0.1:43585_solr c:AutoscalingHistoryHandlerTest_collection s:shard1 r:core_node3 x:AutoscalingHistoryHandlerTest_collection_shard1_replica_n1] o.a.s.c.SolrConfig Couldn't add files from /home/jenkins/workspace/Lucene-Solr-master-Linux/solr/build/solr-core/test/J1/temp/solr.handler.admin.AutoscalingHistoryHandlerTest_8E102D73904FB4A1-001/tempDir-001/node2/AutoscalingHistoryHandlerTest_collection_shard1_replica_n1/../../../../contrib/clustering/lib filtered by .*\.jar to classpath: /home/jenkins/workspace/Lucene-Solr-master-Linux/solr/build/solr-core/test/J1/temp/solr.handler.admin.AutoscalingHistoryHandlerTest_8E102D73904FB4A1-001/tempDir-001/node2/AutoscalingHistoryHandlerTest_collection_shard1_replica_n1/../../../../contrib/clustering/lib
   [junit4]   2> 2368202 WARN  (qtp1281657558-22228) [n:127.0.0.1:43585_solr c:AutoscalingHistoryHandlerTest_collection s:shard1 r:core_node3 x:AutoscalingHistoryHandlerTest_collection_shard1_replica_n1] o.a.s.c.SolrConfig Couldn't add files from /home/jenkins/workspace/Lucene-Solr-master-Linux/solr/build/solr-core/test/J1/temp/solr.handler.admin.AutoscalingHistoryHandlerTest_8E102D73904FB4A1-001/tempDir-001/node2/AutoscalingHistoryHandlerTest_collection_shard1_replica_n1/../../../../dist filtered by solr-clustering-\d.*\.jar to classpath: /home/jenkins/workspace/Lucene-Solr-master-Linux/solr/build/solr-core/test/J1/temp/solr.handler.admin.AutoscalingHistoryHandlerTest_8E102D73904FB4A1-001/tempDir-001/node2/AutoscalingHistoryHandlerTest_collection_shard1_replica_n1/../../../../dist
   [junit4]   2> 2368203 WARN  (qtp1281657558-22228) [n:127.0.0.1:43585_solr c:AutoscalingHistoryHandlerTest_collection s:shard1 r:core_node3 x:AutoscalingHistoryHandlerTest_collection_shard1_replica_n1] o.a.s.c.SolrConfig Couldn't add files from /home/jenkins/workspace/Lucene-Solr-master-Linux/solr/build/solr-core/test/J1/temp/solr.handler.admin.AutoscalingHistoryHandlerTest_8E102D73904FB4A1-001/tempDir-001/node2/AutoscalingHistoryHandlerTest_collection_shard1_replica_n1/../../../../contrib/langid/lib filtered by .*\.jar to classpath: /home/jenkins/workspace/Lucene-Solr-master-Linux/solr/build/solr-core/test/J1/temp/solr.handler.admin.AutoscalingHistoryHandlerTest_8E102D73904FB4A1-001/tempDir-001/node2/AutoscalingHistoryHandlerTest_collection_shard1_replica_n1/../../../../contrib/langid/lib
   [junit4]   2> 2368203 WARN  (qtp1281657558-22228) [n:127.0.0.1:43585_solr c:AutoscalingHistoryHandlerTest_collection s:shard1 r:core_node3 x:AutoscalingHistoryHandlerTest_collection_shard1_replica_n1] o.a.s.c.SolrConfig Couldn't add files from /home/jenkins/workspace/Lucene-Solr-master-Linux/solr/build/solr-core/test/J1/temp/solr.handler.admin.AutoscalingHistoryHandlerTest_8E102D73904FB4A1-001/tempDir-001/node2/AutoscalingHistoryHandlerTest_collection_shard1_replica_n1/../../../../dist filtered by solr-langid-\d.*\.jar to classpath: /home/jenkins/workspace/Lucene-Solr-master-Linux/solr/build/solr-core/test/J1/temp/solr.handler.admin.AutoscalingHistoryHandlerTest_8E102D73904FB4A1-001/tempDir-001/node2/AutoscalingHistoryHandlerTest_collection_shard1_replica_n1/../../../../dist
   [junit4]   2> 2368203 WARN  (qtp1281657558-22228) [n:127.0.0.1:43585_solr c:AutoscalingHistoryHandlerTest_collection s:shard1 r:core_node3 x:AutoscalingHistoryHandlerTest_collection_shard1_replica_n1] o.a.s.c.SolrConfig Couldn't add files from /home/jenkins/workspace/Lucene-Solr-master-Linux/solr/build/solr-core/test/J1/temp/solr.handler.admin.AutoscalingHistoryHandlerTest_8E102D73904FB4A1-001/tempDir-001/node2/AutoscalingHistoryHandlerTest_collection_shard1_replica_n1/../../../../contrib/velocity/lib filtered by .*\.jar to classpath: /home/jenkins/workspace/Lucene-Solr-master-Linux/solr/build/solr-core/test/J1/temp/solr.handler.admin.AutoscalingHistoryHandlerTest_8E102D73904FB4A1-001/tempDir-001/node2/AutoscalingHistoryHandlerTest_collection_shard1_replica_n1/../../../../contrib/velocity/lib
   [junit4]   2> 2368203 WARN  (qtp1281657558-22228) [n:127.0.0.1:43585_solr c:AutoscalingHistoryHandlerTest_collection s:shard1 r:core_node3 x:AutoscalingHistoryHandlerTest_collection_shard1_replica_n1] o.a.s.c.SolrConfig Couldn't add files from /home/jenkins/workspace/Lucene-Solr-master-Linux/solr/build/solr-core/test/J1/temp/solr.handler.admin.AutoscalingHistoryHandlerTest_8E102D73904FB4A1-001/tempDir-001/node2/AutoscalingHistoryHandlerTest_collection_shard1_replica_n1/../../../../dist filtered by solr-velocity-\d.*\.jar to classpath: /home/jenkins/workspace/Lucene-Solr-master-Linux/solr/build/solr-core/test/J1/temp/solr.handler.admin.AutoscalingHistoryHandlerTest_8E102D73904FB4A1-001/tempDir-001/node2/AutoscalingHistoryHandlerTest_collection_shard1_replica_n1/../../../../dist
   [junit4]   2> 2368200 INFO  (qtp1469377121-22233) [n:127.0.0.1:32797_solr c:AutoscalingHistoryHandlerTest_collection s:shard1 r:core_node5 x:AutoscalingHistoryHandlerTest_collection_shard1_replica_n2] o.a.s.c.RequestParams request params refreshed to version 0
   [junit4]   2> 2368204 WARN  (qtp1469377121-22233) [n:127.0.0.1:32797_solr c:AutoscalingHistoryHandlerTest_collection s:shard1 r:core_node5 x:AutoscalingHistoryHandlerTest_collection_shard1_replica_n2] o.a.s.c.SolrConfig Couldn't add files from /home/jenkins/workspace/Lucene-Solr-master-Linux/solr/build/solr-core/test/J1/temp/solr.handler.admin.AutoscalingHistoryHandlerTest_8E102D73904FB4A1-001/tempDir-001/node1/AutoscalingHistoryHandlerTest_collection_shard1_replica_n2/../../../../contrib/extraction/lib filtered by .*\.jar to classpath: /home/jenkins/workspace/Lucene-Solr-master-Linux/solr/build/solr-core/test/J1/temp/solr.handler.admin.AutoscalingHistoryHandlerTest_8E102D73904FB4A1-001/tempDir-001/node1/AutoscalingHistoryHandlerTest_collection_shard1_replica_n2/../../../../contrib/extraction/lib
   [junit4]   2> 2368205 WARN  (qtp1469377121-22233) [n:127.0.0.1:32797_solr c:AutoscalingHistoryHandlerTest_collection s:shard1 r:core_node5 x:AutoscalingHistoryHandlerTest_collection_shard1_replica_n2] o.a.s.c.SolrConfig Couldn't add files from /home/jenkins/workspace/Lucene-Solr-master-Linux/solr/build/solr-core/test/J1/temp/solr.handler.admin.AutoscalingHistoryHandlerTest_8E102D73904FB4A1-001/tempDir-001/node1/AutoscalingHistoryHandlerTest_collection_shard1_replica_n2/../../../../dist filtered by solr-cell-\d.*\.jar to classpath: /home/jenkins/workspace/Lucene-Solr-master-Linux/solr/build/solr-core/test/J1/temp/solr.handler.admin.AutoscalingHistoryHandlerTest_8E102D73904FB4A1-001/tempDir-001/node1/AutoscalingHistoryHandlerTest_collection_shard1_replica_n2/../../../../dist
   [junit4]   2> 2368205 WARN  (qtp1469377121-22233) [n:127.0.0.1:32797_solr c:AutoscalingHistoryHandlerTest_collection s:shard1 r:core_node5 x:AutoscalingHistoryHandlerTest_collection_shard1_replica_n2] o.a.s.c.SolrConfig Couldn't add files from /home/jenkins/workspace/Lucene-Solr-master-Linux/solr/build/solr-core/test/J1/temp/solr.handler.admin.AutoscalingHistoryHandlerTest_8E102D73904FB4A1-001/tempDir-001/node1/AutoscalingHistoryHandlerTest_collection_shard1_replica_n2/../../../../contrib/clustering/lib filtered by .*\.jar to classpath: /home/jenkins/workspace/Lucene-Solr-master-Linux/solr/build/solr-core/test/J1/temp/solr.handler.admin.AutoscalingHistoryHandlerTest_8E102D73904FB4A1-001/tempDir-001/node1/AutoscalingHistoryHandlerTest_collection_shard1_replica_n2/../../../../contrib/clustering/lib
   [junit4]   2> 2368205 WARN  (qtp1469377121-22233) [n:127.0.0.1:32797_solr c:AutoscalingHistoryHandlerTest_collection s:shard1 r:core_node5 x:AutoscalingHistoryHandlerTest_collection_shard1_replica_n2] o.a.s.c.SolrConfig Couldn't add files from /home/jenkins/workspace/Lucene-Solr-master-Linux/solr/build/solr-core/test/J1/temp/solr.handler.admin.AutoscalingHistoryHandlerTest_8E102D73904FB4A1-001/tempDir-001/node1/AutoscalingHistoryHandlerTest_collection_shard1_replica_n2/../../../../dist filtered by solr-clustering-\d.*\.jar to classpath: /home/jenkins/workspace/Lucene-Solr-master-Linux/solr/build/solr-core/test/J1/temp/solr.handler.admin.AutoscalingHistoryHandlerTest_8E102D73904FB4A1-001/tempDir-001/node1/AutoscalingHistoryHandlerTest_collection_shard1_replica_n2/../../../../dist
   [junit4]   2> 2368205 WARN  (qtp1469377121-22233) [n:127.0.0.1:32797_solr c:AutoscalingHistoryHandlerTest_collection s:shard1 r:core_node5 x:AutoscalingHistoryHandlerTest_collection_shard1_replica_n2] o.a.s.c.SolrConfig Couldn't add files from /home/jenkins/workspace/Lucene-Solr-master-Linux/solr/build/solr-core/test/J1/temp/solr.handler.admin.AutoscalingHistoryHandlerTest_8E102D73904FB4A1-001/tempDir-001/node1/AutoscalingHistoryHandlerTest_collection_shard1_replica_n2/../../../../contrib/langid/lib filtered by .*\.jar to classpath: /home/jenkins/workspace/Lucene-Solr-master-Linux/solr/build/solr-core/test/J1/temp/solr.handler.admin.AutoscalingHistoryHandlerTest_8E102D73904FB4A1-001/tempDir-001/node1/AutoscalingHistoryHandlerTest_collection_shard1_replica_n2/../../../../contrib/langid/lib
   [junit4]   2> 2368205 WARN  (qtp1469377121-22233) [n:127.0.0.1:32797_solr c:AutoscalingHistoryHandlerTest_collection s:shard1 r:core_node5 x:AutoscalingHistoryHandlerTest_collection_shard1_replica_n2] o.a.s.c.SolrConfig Couldn't add files from /home/jenkins/workspace/Lucene-Solr-master-Linux/solr/build/solr-core/test/J1/temp/solr.handler.admin.AutoscalingHistoryHandlerTest_8E102D73904FB4A1-001/tempDir-001/node1/AutoscalingHistoryHandlerTest_collection_shard1_replica_n2/../../../../dist filtered by solr-langid-\d.*\.jar to classpath: /home/jenkins/workspace/Lucene-Solr-master-Linux/solr/build/solr-core/test/J1/temp/solr.handler.admin.AutoscalingHistoryHandlerTest_8E102D73904FB4A1-001/tempDir-001/node1/AutoscalingHistoryHandlerTest_collection_shard1_replica_n2/../../../../dist
   [junit4]   2> 2368206 WARN  (qtp1469377121-22233) [n:127.0.0.1:32797_solr c:AutoscalingHistoryHandlerTest_collection s:shard1 r:core_node5 x:AutoscalingHistoryHandlerTest_collection_shard1_replica_n2] o.a.s.c.SolrConfig Couldn't add files from /home/jenkins/workspace/Lucene-Solr-master-Linux/solr/build/solr-core/test/J1/temp/solr.handler.admin.AutoscalingHistoryHandlerTest_8E102D73904FB4A1-001/tempDir-001/node1/AutoscalingHistoryHandlerTest_collection_shard1_replica_n2/../../../../contrib/velocity/lib filtered by .*\.jar to classpath: /home/jenkins/workspace/Lucene-Solr-master-Linux/solr/build/solr-core/test/J1/temp/solr.handler.admin.AutoscalingHistoryHandlerTest_8E102D73904FB4A1-001/tempDir-001/node1/AutoscalingHistoryHandlerTest_collection_shard1_replica_n2/../../../../contrib/velocity/lib
   [junit4]   2> 2368206 WARN  (qtp1469377121-22233) [n:127.0.0.1:32797_solr c:AutoscalingHistoryHandlerTest_collection s:shard1 r:core_node5 x:AutoscalingHistoryHandlerTest_collection_shard1_replica_n2] o.a.s.c.SolrConfig Couldn't add files from /home/jenkins/workspace/Lucene-Solr-master-Linux/solr/build/solr-core/test/J1/temp/solr.handler.admin.AutoscalingHistoryHandlerTest_8E102D73904FB4A1-001/tempDir-001/node1/AutoscalingHistoryHandlerTest_collection_shard1_replica_n2/../../../../dist filtered by solr-velocity-\d.*\.jar to classpath: /home/jenkins/workspace/Lucene-Solr-master-Linux/solr/build/solr-core/test/J1/temp/solr.handler.admin.AutoscalingHistoryHandlerTest_8E102D73904FB4A1-001/tempDir-001/node1/AutoscalingHistoryHandlerTest_collection_shard1_replica_n2/../../../../dist
   [junit4]   2> 2368209 INFO  (qtp1281657558-22228) [n:127.0.0.1:43585_solr c:AutoscalingHistoryHandlerTest_collection s:shard1 r:core_node3 x:AutoscalingHistoryHandlerTest_collection_shard1_replica_n1] o.a.s.c.SolrConfig Using Lucene MatchVersion: 8.0.0
   [junit4]   2> 2368212 INFO  (qtp1469377121-22233) [n:127.0.0.1:32797_solr c:AutoscalingHistoryHandlerTest_collection s:shard1 r:core_node5 x:AutoscalingHistoryHandlerTest_collection_shard1_replica_n2] o.a.s.c.SolrConfig Using Lucene MatchVersion: 8.0.0
   [junit4]   2> 2368216 INFO  (qtp1123288107-22234) [n:127.0.0.1:43643_solr c:AutoscalingHistoryHandlerTest_collection s:shard1 r:core_node6 x:AutoscalingHistoryHandlerTest_collection_shard1_replica_n4] o.a.s.c.SolrConfig Using Lucene MatchVersion: 8.0.0
   [junit4]   2> 2368229 INFO  (qtp1281657558-22228) [n:127.0.0.1:43585_solr c:AutoscalingHistoryHandlerTest_collection s:shard1 r:core_node3 x:AutoscalingHistoryHandlerTest_collection_shard1_replica_n1] o.a.s.s.IndexSchema [AutoscalingHistoryHandlerTest_collection_shard1_replica_n1] Schema name=default-config
   [junit4]   2> 2368261 INFO  (qtp1123288107-22234) [n:127.0.0.1:43643_solr c:AutoscalingHistoryHandlerTest_collection s:shard1 r:core_node6 x:AutoscalingHistoryHandlerTest_collection_shard1_replica_n4] o.a.s.s.IndexSchema [AutoscalingHistoryHandlerTest_collection_shard1_replica_n4] Schema name=default-config
   [junit4]   2> 2368268 INFO  (qtp1469377121-22233) [n:127.0.0.1:32797_solr c:AutoscalingHistoryHandlerTest_collection s:shard1 r:core_node5 x:AutoscalingHistoryHandlerTest_collection_shard1_replica_n2] o.a.s.s.IndexSchema [AutoscalingHistoryHandlerTest_collection_shard1_replica_n2] Schema name=default-config
   [junit4]   2> 2368353 INFO  (qtp1123288107-22234) [n:127.0.0.1:43643_solr c:AutoscalingHistoryHandlerTest_collection s:shard1 r:core_node6 x:AutoscalingHistoryHandlerTest_collection_shard1_replica_n4] o.a.s.s.IndexSchema Loaded schema default-config/1.6 with uniqueid field id
   [junit4]   2> 2368361 INFO  (qtp1281657558-22228) [n:127.0.0.1:43585_solr c:AutoscalingHistoryHandlerTest_collection s:shard1 r:core_node3 x:AutoscalingHistoryHandlerTest_collection_shard1_replica_n1] o.a.s.s.IndexSchema Loaded schema default-config/1.6 with uniqueid field id
   [junit4]   2> 2368365 INFO  (qtp1123288107-22234) [n:127.0.0.1:43643_solr c:AutoscalingHistoryHandlerTest_collection s:shard1 r:core_node6 x:AutoscalingHistoryHandlerTest_collection_shard1_replica_n4] o.a.s.c.CoreContainer Creating SolrCore 'AutoscalingHistoryHandlerTest_collection_shard1_replica_n4' using configuration from collection AutoscalingHistoryHandlerTest_collection, trusted=true
   [junit4]   2> 2368366 INFO  (qtp1123288107-22234) [n:127.0.0.1:43643_solr c:AutoscalingHistoryHandlerTest_collection s:shard1 r:core_node6 x:AutoscalingHistoryHandlerTest_collection_shard1_replica_n4] o.a.s.m.r.SolrJmxReporter JMX monitoring for 'solr_43643.solr.core.AutoscalingHistoryHandlerTest_collection.shard1.replica_n4' (registry 'solr.core.AutoscalingHistoryHandlerTest_collection.shard1.replica_n4') enabled at server: com.sun.jmx.mbeanserver.JmxMBeanServer@32ea439a
   [junit4]   2> 2368366 INFO  (qtp1123288107-22234) [n:127.0.0.1:43643_solr c:AutoscalingHistoryHandlerTest_collection s:shard1 r:core_node6 x:AutoscalingHistoryHandlerTest_collection_shard1_replica_n4] o.a.s.c.SolrCore solr.RecoveryStrategy.Builder
   [junit4]   2> 2368366 INFO  (qtp1123288107-22234) [n:127.0.0.1:43643_solr c:AutoscalingHistoryHandlerTest_collection s:shard1 r:core_node6 x:AutoscalingHistoryHandlerTest_collection_shard1_replica_n4] o.a.s.c.SolrCore [[AutoscalingHistoryHandlerTest_collection_shard1_replica_n4] ] Opening new SolrCore at [/home/jenkins/workspace/Lucene-Solr-master-Linux/solr/build/solr-core/test/J1/temp/solr.handler.admin.AutoscalingHistoryHandlerTest_8E102D73904FB4A1-001/tempDir-001/node3/AutoscalingHistoryHandlerTest_collection_shard1_replica_n4], dataDir=[/home/jenkins/workspace/Lucene-Solr-master-Linux/solr/build/solr-core/test/J1/temp/solr.handler.admin.AutoscalingHistoryHandlerTest_8E102D73904FB4A1-001/tempDir-001/node3/./AutoscalingHistoryHandlerTest_collection_shard1_replica_n4/data/]
   [junit4]   2> 2368369 INFO  (qtp1123288107-22234) [n:127.0.0.1:43643_solr c:AutoscalingHistoryHandlerTest_collection s:shard1 r:core_node6 x:AutoscalingHistoryHandlerTest_collection_shard1_replica_n4] o.a.s.r.XSLTResponseWriter xsltCacheLifetimeSeconds=5
   [junit4]   2> 2368373 INFO  (qtp1281657558-22228) [n:127.0.0.1:43585_solr c:AutoscalingHistoryHandlerTest_collection s:shard1 r:core_node3 x:AutoscalingHistoryHandlerTest_collection_shard1_replica_n1] o.a.s.c.CoreContainer Creating SolrCore 'AutoscalingHistoryHandlerTest_collection_shard1_replica_n1' using configuration from collection AutoscalingHistoryHandlerTest_collection, trusted=true
   [junit4]   2> 2368374 INFO  (qtp1281657558-22228) [n:127.0.0.1:43585_solr c:AutoscalingHistoryHandlerTest_collection s:shard1 r:core_node3 x:AutoscalingHistoryHandlerTest_collection_shard1_replica_n1] o.a.s.m.r.SolrJmxReporter JMX monitoring for 'solr_43585.solr.core.AutoscalingHistoryHandlerTest_collection.shard1.replica_n1' (registry 'solr.core.AutoscalingHistoryHandlerTest_collection.shard1.replica_n1') enabled at server: com.sun.jmx.mbeanserver.JmxMBeanServer@32ea439a
   [junit4]   2> 2368374 INFO  (qtp1281657558-22228) [n:127.0.0.1:43585_solr c:AutoscalingHistoryHandlerTest_collection s:shard1 r:core_node3 x:AutoscalingHistoryHandlerTest_collection_shard1_replica_n1] o.a.s.c.SolrCore solr.RecoveryStrategy.Builder
   [junit4]   2> 2368374 INFO  (qtp1281657558-22228) [n:127.0.0.1:43585_solr c:AutoscalingHistoryHandlerTest_collection s:shard1 r:core_node3 x:AutoscalingHistoryHandlerTest_collection_shard1_replica_n1] o.a.s.c.SolrCore [[AutoscalingHistoryHandlerTest_collection_shard1_replica_n1] ] Opening new SolrCore at [/home/jenkins/workspace/Lucene-Solr-master-Linux/solr/build/solr-core/test/J1/temp/solr.handler.admin.AutoscalingHistoryHandlerTest_8E102D73904FB4A1-001/tempDir-001/node2/AutoscalingHistoryHandlerTest_collection_shard1_replica_n1], dataDir=[/home/jenkins/workspace/Lucene-Solr-master-Linux/solr/build/solr-core/test/J1/temp/solr.handler.admin.AutoscalingHistoryHandlerTest_8E102D73904FB4A1-001/tempDir-001/node2/./AutoscalingHistoryHandlerTest_collection_shard1_replica_n1/data/]
   [junit4]   2> 2368382 INFO  (qtp1281657558-22228) [n:127.0.0.1:43585_solr c:AutoscalingHistoryHandlerTest_collection s:shard1 r:core_node3 x:AutoscalingHistoryHandlerTest_collection_shard1_replica_n1] o.a.s.r.XSLTResponseWriter xsltCacheLifetimeSeconds=5
   [junit4]   2> 2368409 INFO  (qtp1469377121-22233) [n:127.0.0.1:32797_solr c:AutoscalingHistoryHandlerTest_collection s:shard1 r:core_node5 x:AutoscalingHistoryHandlerTest_collection_shard1_replica_n2] o.a.s.s.IndexSchema Loaded schema default-config/1.6 with uniqueid field id
   [junit4]   2> 2368409 INFO  (qtp1123288107-22234) [n:127.0.0.1:43643_solr c:AutoscalingHistoryHandlerTest_collection s:shard1 r:core_node6 x:AutoscalingHistoryHandlerTest_collection_shard1_replica_n4] o.a.s.u.UpdateHandler Using UpdateLog implementation: org.apache.solr.update.UpdateLog
   [junit4]   2> 2368409 INFO  (qtp1123288107-22234) [n:127.0.0.1:43643_solr c:AutoscalingHistoryHandlerTest_collection s:shard1 r:core_node6 x:AutoscalingHistoryHandlerTest_collection_shard1_replica_n4] o.a.s.u.UpdateLog Initializing UpdateLog: dataDir= defaultSyncLevel=FLUSH numRecordsToKeep=100 maxNumLogsToKeep=10 numVersionBuckets=65536
   [junit4]   2> 2368411 INFO  (qtp1123288107-22234) [n:127.0.0.1:43643_solr c:AutoscalingHistoryHandlerTest_collection s:shard1 r:core_node6 x:AutoscalingHistoryHandlerTest_collection_shard1_replica_n4] o.a.s.u.CommitTracker Hard AutoCommit: if uncommited for 15000ms; 
   [junit4]   2> 2368411 INFO  (qtp1123288107-22234) [n:127.0.0.1:43643_solr c:AutoscalingHistoryHandlerTest_collection s:shard1 r:core_node6 x:AutoscalingHistoryHandlerTest_collection_shard1_replica_n4] o.a.s.u.CommitTracker Soft AutoCommit: disabled
   [

[...truncated too long message...]

1:34885_solr) [n:127.0.0.1:34885_solr    ] o.a.s.c.c.ZkStateReader ZooKeeper watch triggered, but Solr cannot talk to ZK: [KeeperErrorCode = Session expired for /live_nodes]
   [junit4]   2> 2754967 INFO  (jetty-closer-3650-thread-3) [    ] o.e.j.s.h.ContextHandler Stopped o.e.j.s.ServletContextHandler@2116bdf8{/solr,null,UNAVAILABLE}
   [junit4]   2> 2754967 ERROR (SUITE-AutoscalingHistoryHandlerTest-seed#[8E102D73904FB4A1]-worker) [    ] o.a.z.s.ZooKeeperServer ZKShutdownHandler is not registered, so ZooKeeper server won't take any action on ERROR or SHUTDOWN server state changes
   [junit4]   2> 2754967 INFO  (SUITE-AutoscalingHistoryHandlerTest-seed#[8E102D73904FB4A1]-worker) [    ] o.a.s.c.ZkTestServer connecting to 127.0.0.1:38027 38027
   [junit4]   2> 2760752 INFO  (Thread-5332) [    ] o.a.s.c.ZkTestServer connecting to 127.0.0.1:38027 38027
   [junit4]   2> 2760753 WARN  (Thread-5332) [    ] o.a.s.c.ZkTestServer Watch limit violations: 
   [junit4]   2> Maximum concurrent create/delete watches above limit:
   [junit4]   2> 
   [junit4]   2> 	33	/solr/aliases.json
   [junit4]   2> 	33	/solr/clusterprops.json
   [junit4]   2> 	6	/solr/configs/.system/managed-schema
   [junit4]   2> 	5	/solr/configs/.system
   [junit4]   2> 	4	/solr/security.json
   [junit4]   2> 	3	/solr/configs/AutoscalingHistoryHandlerTest_collection
   [junit4]   2> 	3	/solr/configs/AutoscalingHistoryHandlerTest_collection/managed-schema
   [junit4]   2> 
   [junit4]   2> Maximum concurrent data watches above limit:
   [junit4]   2> 
   [junit4]   2> 	492	/solr/collections/.system/state.json
   [junit4]   2> 	33	/solr/clusterstate.json
   [junit4]   2> 	30	/solr/collections/AutoscalingHistoryHandlerTest_collection/state.json
   [junit4]   2> 	3	/solr/overseer_elect/election/98784777583656967-127.0.0.1:32797_solr-n_0000000000
   [junit4]   2> 
   [junit4]   2> Maximum concurrent children watches above limit:
   [junit4]   2> 
   [junit4]   2> 	33	/solr/collections
   [junit4]   2> 	32	/solr/live_nodes
   [junit4]   2> 
   [junit4]   2> NOTE: leaving temporary files on disk at: /home/jenkins/workspace/Lucene-Solr-master-Linux/solr/build/solr-core/test/J1/temp/solr.handler.admin.AutoscalingHistoryHandlerTest_8E102D73904FB4A1-001
   [junit4]   2> NOTE: test params are: codec=Asserting(Lucene70): {action_s=PostingsFormat(name=MockRandom), event.source_s=Lucene50(blocksize=128), type=PostingsFormat(name=MockRandom), before.actions_ss=Lucene50(blocksize=128), event.property._enqueue_time__ss=PostingsFormat(name=MockRandom), after.actions_ss=PostingsFormat(name=LuceneVarGapFixedInterval), stage_s=PostingsFormat(name=MockRandom), event.id_s=Lucene50(blocksize=128), event.property.eventTimes_ss=PostingsFormat(name=MockRandom), source_s=Lucene50(blocksize=128), event.type_s=PostingsFormat(name=MockRandom), responses_ts=PostingsFormat(name=LuceneVarGapFixedInterval), id=Lucene50(blocksize=128), collections_ss=PostingsFormat(name=MockRandom), operations.params_ts=PostingsFormat(name=MockRandom), event.property.nodeNames_ss=PostingsFormat(name=MockRandom)}, docValues:{_version_=DocValuesFormat(name=Lucene70), event.time_l=DocValuesFormat(name=Lucene70), timestamp=DocValuesFormat(name=Lucene70)}, maxPointsInLeafNode=533, maxMBSortInHeap=6.668327496278855, sim=RandomSimilarity(queryNorm=true): {}, locale=en-ZA, timezone=America/Indiana/Vincennes
   [junit4]   2> NOTE: Linux 4.10.0-33-generic amd64/Oracle Corporation 1.8.0_144 (64-bit)/cpus=8,threads=1,free=217361912,total=536870912
   [junit4]   2> NOTE: All tests run in this JVM: [JsonLoaderTest, ShardRoutingCustomTest, DistributedExpandComponentTest, CursorMarkTest, AliasIntegrationTest, BadComponentTest, TestAtomicUpdateErrorCases, TestTolerantUpdateProcessorRandomCloud, TestCustomSort, SuggesterTSTTest, TestRequestForwarding, HdfsCollectionsAPIDistributedZkTest, PreAnalyzedFieldManagedSchemaCloudTest, DOMUtilTest, DisMaxRequestHandlerTest, RuleEngineTest, TestUpdate, TestSimpleTrackingShardHandler, TestPerFieldSimilarity, TestSolrQueryResponse, NodeAddedTriggerTest, TestJettySolrRunner, TestFastLRUCache, TestRTimerTree, TestMultiValuedNumericRangeQuery, LoggingHandlerTest, CacheHeaderTest, TestNumericTokenStream, TestSchemaSimilarityResource, HdfsBasicDistributedZkTest, TestSearchPerf, TestLegacyFieldReuse, DistributedIntervalFacetingTest, DocValuesMissingTest, TestBM25SimilarityFactory, IndexSchemaRuntimeFieldTest, UpdateRequestProcessorFactoryTest, TestManagedSynonymGraphFilterFactory, TestCharFilters, WrapperMergePolicyFactoryTest, TestEmbeddedSolrServerAdminHandler, ReplicationFactorTest, MetricsConfigTest, TestSolrXml, SystemInfoHandlerTest, TestPolicyCloud, TestSegmentSorting, TestQueryTypes, CoreMergeIndexesAdminHandlerTest, SuggestComponentContextFilterQueryTest, BlockJoinFacetSimpleTest, TestLegacyFieldCache, PropertiesRequestHandlerTest, CollectionsAPIAsyncDistributedZkTest, TestPostingsSolrHighlighter, LeaderFailureAfterFreshStartTest, TestFuzzyAnalyzedSuggestions, TestCloudDeleteByQuery, DirectSolrConnectionTest, ResourceLoaderTest, FullHLLTest, DeleteNodeTest, QueryParsingTest, BigEndianAscendingWordSerializerTest, MigrateRouteKeyTest, CoreSorterTest, CollectionReloadTest, TestManagedSchemaAPI, TestCoreContainer, TestDistribIDF, SchemaVersionSpecificBehaviorTest, SpellCheckComponentTest, SSLMigrationTest, CSVRequestHandlerTest, ConfigSetsAPITest, ZkSolrClientTest, AlternateDirectoryTest, CollectionsAPIDistributedZkTest, TestConfigSetsAPIZkFailure, TestFieldCacheSortRandom, SolrCmdDistributorTest, TestSystemIdResolver, TestUseDocValuesAsStored2, TestShardHandlerFactory, TestCustomDocTransformer, TestReqParamsAPI, TestExpandComponent, TestUnifiedSolrHighlighter, TestClassicSimilarityFactory, FileUtilsTest, CoreAdminHandlerTest, TestHashPartitioner, TestCloudSearcherWarming, CdcrReplicationDistributedZkTest, HttpSolrCallGetCoreTest, DocValuesTest, TestNestedDocsSort, DistributedMLTComponentTest, TestPullReplica, NoCacheHeaderTest, TestFileDictionaryLookup, TestJsonRequest, TestLRUStatsCache, ConvertedLegacyTest, SoftAutoCommitTest, TestCollationFieldDocValues, TestBulkSchemaConcurrent, HdfsThreadLeakTest, ZkControllerTest, TestFiltering, ExecutePlanActionTest, TestStreamBody, TestDynamicLoading, DistributedTermsComponentTest, ClusterStateUpdateTest, OverseerStatusTest, TestConfigSets, TestCloudPivotFacet, TestCopyFieldCollectionResource, TestFieldCache, HighlighterTest, MoveReplicaHDFSTest, TestLeaderInitiatedRecoveryThread, ChaosMonkeySafeLeaderTest, BasicDistributedZk2Test, UnloadDistributedZkTest, SyncSliceTest, OpenCloseCoreStressTest, ShardRoutingTest, TestReplicationHandler, TestDistributedSearch, TestDistributedGrouping, TestFaceting, DistributedSpellCheckComponentTest, TestRealTimeGet, TestStressReorder, TestStressVersions, HardAutoCommitTest, SimpleFacetsTest, TestSolr4Spatial, StatsComponentTest, TestGroupingSearch, QueryElevationComponentTest, BadIndexSchemaTest, TestFunctionQuery, BasicFunctionalityTest, TestLazyCores, DirectUpdateHandlerTest, TestBadConfig, TestIndexSearcher, ShowFileRequestHandlerTest, SolrIndexSplitterTest, SimplePostToolTest, TestCoreDiscovery, TestExtendedDismaxParser, SuggesterTest, SpatialFilterTest, SolrCoreCheckLockOnStartupTest, TestPseudoReturnFields, DefaultValueUpdateProcessorTest, TestRemoteStreaming, DocValuesMultiTest, DistanceFunctionTest, TestSurroundQueryParser, TestQueryUtils, DirectSolrSpellCheckerTest, DocumentAnalysisRequestHandlerTest, TestOmitPositions, XmlUpdateRequestHandlerTest, TestValueSourceCache, TestIndexingPerformance, FieldAnalysisRequestHandlerTest, TestJmxIntegration, TestCSVResponseWriter, BinaryUpdateRequestHandlerTest, TestPartialUpdateDeduplication, TestComponentsName, SOLR749Test, UpdateParamsTest, TestQuerySenderNoQuery, TestSolrDeletionPolicy2, MultiTermTest, SampleTest, TestDocSet, NumericFieldsTest, TestElisionMultitermQuery, ExternalFileFieldSortTest, TestSolrCoreProperties, NotRequiredUniqueKeyTest, TestXIncludeConfig, TestSweetSpotSimilarityFactory, TimeZoneUtilsTest, PluginInfoTest, PrimUtilsTest, ClusterStateTest, TestLRUCache, ZkNodePropsTest, CircularListTest, TestRTGBase, TestCursorMarkWithoutUniqueKey, TestDistributedMissingSort, ActionThrottleTest, AssignTest, CdcrReplicationHandlerTest, CdcrVersionReplicationTest, ChaosMonkeySafeLeaderWithPullReplicasTest, DeleteInactiveReplicaTest, DocValuesNotIndexedTest, ForceLeaderTest, NodeMutatorTest, OutOfBoxZkACLAndCredentialsProvidersTest, PeerSyncReplicationTest, SharedFSAutoReplicaFailoverTest, SimpleCollectionCreateDeleteTest, SolrCloudExampleTest, TestCollectionsAPIViaSolrCloudCluster, TestDistribDocBasedVersion, TestLeaderElectionWithEmptyReplica, TestLocalFSCloudBackupRestore, TestRandomRequestDistribution, TestReplicaProperties, TestSizeLimitedDistributedMap, TestSolrCloudWithDelegationTokens, TestSolrCloudWithSecureImpersonation, TestStressCloudBlindAtomicUpdates, TestTolerantUpdateProcessorCloud, VMParamsZkACLAndCredentialsProvidersTest, ZkFailoverTest, SystemLogListenerTest, TriggerIntegrationTest, TestSolrCoreSnapshots, TestHdfsBackupRestoreCore, TestSolrConfigHandlerConcurrent, AutoscalingHistoryHandlerTest]
   [junit4] Completed [745/745 (1!)] on J1 in 394.22s, 1 test, 1 failure <<< FAILURES!

[...truncated 46824 lines...]
BUILD FAILED
/home/jenkins/workspace/Lucene-Solr-master-Linux/build.xml:826: The following error occurred while executing this line:
/home/jenkins/workspace/Lucene-Solr-master-Linux/build.xml:706: The following error occurred while executing this line:
/home/jenkins/workspace/Lucene-Solr-master-Linux/build.xml:693: Source checkout is dirty (unversioned/missing files) after running tests!!! Offending files:
* lucene/licenses/morfologik-ukrainian-search-3.7.5.jar.sha1

Total time: 73 minutes 22 seconds
Build step 'Invoke Ant' marked build as failure
Archiving artifacts
[WARNINGS] Skipping publisher since build result is FAILURE
Recording test results
Email was triggered for: Failure - Any
Sending email for trigger: Failure - Any

Mime
View raw message