lucene-dev mailing list archives

Site index · List index
Message view « Date » · « Thread »
Top « Date » · « Thread »
From Policeman Jenkins Server <jenk...@thetaphi.de>
Subject [JENKINS] Lucene-Solr-5.5-Linux (32bit/jdk1.7.0_80) - Build # 493 - Unstable!
Date Sun, 22 Oct 2017 09:03:09 GMT
Build: https://jenkins.thetaphi.de/job/Lucene-Solr-5.5-Linux/493/
Java: 32bit/jdk1.7.0_80 -client -XX:+UseConcMarkSweepGC

1 tests failed.
FAILED:  org.apache.solr.handler.TestReplicationHandler.doTestIndexFetchOnMasterRestart

Error Message:
expected:<1> but was:<2>

Stack Trace:
java.lang.AssertionError: expected:<1> but was:<2>
	at __randomizedtesting.SeedInfo.seed([A7631F261128FBF8:7F94DBC2BAF339A4]:0)
	at org.junit.Assert.fail(Assert.java:93)
	at org.junit.Assert.failNotEquals(Assert.java:647)
	at org.junit.Assert.assertEquals(Assert.java:128)
	at org.junit.Assert.assertEquals(Assert.java:472)
	at org.junit.Assert.assertEquals(Assert.java:456)
	at org.apache.solr.handler.TestReplicationHandler.doTestIndexFetchOnMasterRestart(TestReplicationHandler.java:625)
	at sun.reflect.NativeMethodAccessorImpl.invoke0(Native Method)
	at sun.reflect.NativeMethodAccessorImpl.invoke(NativeMethodAccessorImpl.java:57)
	at sun.reflect.DelegatingMethodAccessorImpl.invoke(DelegatingMethodAccessorImpl.java:43)
	at java.lang.reflect.Method.invoke(Method.java:606)
	at com.carrotsearch.randomizedtesting.RandomizedRunner.invoke(RandomizedRunner.java:1764)
	at com.carrotsearch.randomizedtesting.RandomizedRunner$8.evaluate(RandomizedRunner.java:871)
	at com.carrotsearch.randomizedtesting.RandomizedRunner$9.evaluate(RandomizedRunner.java:907)
	at com.carrotsearch.randomizedtesting.RandomizedRunner$10.evaluate(RandomizedRunner.java:921)
	at com.carrotsearch.randomizedtesting.rules.SystemPropertiesRestoreRule$1.evaluate(SystemPropertiesRestoreRule.java:57)
	at org.apache.lucene.util.TestRuleSetupTeardownChained$1.evaluate(TestRuleSetupTeardownChained.java:49)
	at org.apache.lucene.util.AbstractBeforeAfterRule$1.evaluate(AbstractBeforeAfterRule.java:45)
	at org.apache.lucene.util.TestRuleThreadAndTestName$1.evaluate(TestRuleThreadAndTestName.java:48)
	at org.apache.lucene.util.TestRuleIgnoreAfterMaxFailures$1.evaluate(TestRuleIgnoreAfterMaxFailures.java:64)
	at org.apache.lucene.util.TestRuleMarkFailure$1.evaluate(TestRuleMarkFailure.java:47)
	at com.carrotsearch.randomizedtesting.rules.StatementAdapter.evaluate(StatementAdapter.java:36)
	at com.carrotsearch.randomizedtesting.ThreadLeakControl$StatementRunner.run(ThreadLeakControl.java:367)
	at com.carrotsearch.randomizedtesting.ThreadLeakControl.forkTimeoutingTask(ThreadLeakControl.java:809)
	at com.carrotsearch.randomizedtesting.ThreadLeakControl$3.evaluate(ThreadLeakControl.java:460)
	at com.carrotsearch.randomizedtesting.RandomizedRunner.runSingleTest(RandomizedRunner.java:880)
	at com.carrotsearch.randomizedtesting.RandomizedRunner$5.evaluate(RandomizedRunner.java:781)
	at com.carrotsearch.randomizedtesting.RandomizedRunner$6.evaluate(RandomizedRunner.java:816)
	at com.carrotsearch.randomizedtesting.RandomizedRunner$7.evaluate(RandomizedRunner.java:827)
	at com.carrotsearch.randomizedtesting.rules.StatementAdapter.evaluate(StatementAdapter.java:36)
	at com.carrotsearch.randomizedtesting.rules.SystemPropertiesRestoreRule$1.evaluate(SystemPropertiesRestoreRule.java:57)
	at org.apache.lucene.util.AbstractBeforeAfterRule$1.evaluate(AbstractBeforeAfterRule.java:45)
	at com.carrotsearch.randomizedtesting.rules.StatementAdapter.evaluate(StatementAdapter.java:36)
	at org.apache.lucene.util.TestRuleStoreClassName$1.evaluate(TestRuleStoreClassName.java:41)
	at com.carrotsearch.randomizedtesting.rules.NoShadowingOrOverridesOnMethodsRule$1.evaluate(NoShadowingOrOverridesOnMethodsRule.java:40)
	at com.carrotsearch.randomizedtesting.rules.NoShadowingOrOverridesOnMethodsRule$1.evaluate(NoShadowingOrOverridesOnMethodsRule.java:40)
	at com.carrotsearch.randomizedtesting.rules.StatementAdapter.evaluate(StatementAdapter.java:36)
	at com.carrotsearch.randomizedtesting.rules.StatementAdapter.evaluate(StatementAdapter.java:36)
	at com.carrotsearch.randomizedtesting.rules.StatementAdapter.evaluate(StatementAdapter.java:36)
	at org.apache.lucene.util.TestRuleAssertionsRequired$1.evaluate(TestRuleAssertionsRequired.java:53)
	at org.apache.lucene.util.TestRuleMarkFailure$1.evaluate(TestRuleMarkFailure.java:47)
	at org.apache.lucene.util.TestRuleIgnoreAfterMaxFailures$1.evaluate(TestRuleIgnoreAfterMaxFailures.java:64)
	at org.apache.lucene.util.TestRuleIgnoreTestSuites$1.evaluate(TestRuleIgnoreTestSuites.java:54)
	at com.carrotsearch.randomizedtesting.rules.StatementAdapter.evaluate(StatementAdapter.java:36)
	at com.carrotsearch.randomizedtesting.ThreadLeakControl$StatementRunner.run(ThreadLeakControl.java:367)
	at java.lang.Thread.run(Thread.java:745)




Build Log:
[...truncated 11466 lines...]
   [junit4] Suite: org.apache.solr.handler.TestReplicationHandler
   [junit4]   2> Creating dataDir: /home/jenkins/workspace/Lucene-Solr-5.5-Linux/solr/build/solr-core/test/J2/temp/solr.handler.TestReplicationHandler_A7631F261128FBF8-001/init-core-data-001
   [junit4]   2> 989050 INFO  (TEST-TestReplicationHandler.testRateLimitedReplication-seed#[A7631F261128FBF8]) [    ] o.a.s.SolrTestCaseJ4 ###Starting testRateLimitedReplication
   [junit4]   2> 989050 INFO  (TEST-TestReplicationHandler.testRateLimitedReplication-seed#[A7631F261128FBF8]) [    ] o.a.s.SolrTestCaseJ4 Writing core.properties file to /home/jenkins/workspace/Lucene-Solr-5.5-Linux/solr/build/solr-core/test/J2/temp/solr.handler.TestReplicationHandler_A7631F261128FBF8-001/solr-instance-001/collection1
   [junit4]   2> 989052 INFO  (TEST-TestReplicationHandler.testRateLimitedReplication-seed#[A7631F261128FBF8]) [    ] o.e.j.s.Server jetty-9.2.13.v20150730
   [junit4]   2> 989053 INFO  (TEST-TestReplicationHandler.testRateLimitedReplication-seed#[A7631F261128FBF8]) [    ] o.e.j.s.h.ContextHandler Started o.e.j.s.ServletContextHandler@16a57f2{/solr,null,AVAILABLE}
   [junit4]   2> 989054 INFO  (TEST-TestReplicationHandler.testRateLimitedReplication-seed#[A7631F261128FBF8]) [    ] o.e.j.s.ServerConnector Started ServerConnector@1f065ba{HTTP/1.1}{127.0.0.1:37091}
   [junit4]   2> 989054 INFO  (TEST-TestReplicationHandler.testRateLimitedReplication-seed#[A7631F261128FBF8]) [    ] o.e.j.s.Server Started @990117ms
   [junit4]   2> 989054 INFO  (TEST-TestReplicationHandler.testRateLimitedReplication-seed#[A7631F261128FBF8]) [    ] o.a.s.c.s.e.JettySolrRunner Jetty properties: {hostContext=/solr, solr.data.dir=/home/jenkins/workspace/Lucene-Solr-5.5-Linux/solr/build/solr-core/test/J2/temp/solr.handler.TestReplicationHandler_A7631F261128FBF8-001/solr-instance-001/collection1/data, hostPort=37091}
   [junit4]   2> 989054 INFO  (TEST-TestReplicationHandler.testRateLimitedReplication-seed#[A7631F261128FBF8]) [    ] o.a.s.s.SolrDispatchFilter SolrDispatchFilter.init(): sun.misc.Launcher$AppClassLoader@15e0eab
   [junit4]   2> 989054 INFO  (TEST-TestReplicationHandler.testRateLimitedReplication-seed#[A7631F261128FBF8]) [    ] o.a.s.c.SolrResourceLoader new SolrResourceLoader for directory: '/home/jenkins/workspace/Lucene-Solr-5.5-Linux/solr/build/solr-core/test/J2/temp/solr.handler.TestReplicationHandler_A7631F261128FBF8-001/solr-instance-001'
   [junit4]   2> 989054 INFO  (TEST-TestReplicationHandler.testRateLimitedReplication-seed#[A7631F261128FBF8]) [    ] o.a.s.c.SolrResourceLoader JNDI not configured for solr (NoInitialContextEx)
   [junit4]   2> 989054 INFO  (TEST-TestReplicationHandler.testRateLimitedReplication-seed#[A7631F261128FBF8]) [    ] o.a.s.c.SolrResourceLoader solr home defaulted to 'solr/' (could not find system property or JNDI)
   [junit4]   2> 989055 INFO  (TEST-TestReplicationHandler.testRateLimitedReplication-seed#[A7631F261128FBF8]) [    ] o.a.s.c.SolrXmlConfig Loading container configuration from /home/jenkins/workspace/Lucene-Solr-5.5-Linux/solr/build/solr-core/test/J2/temp/solr.handler.TestReplicationHandler_A7631F261128FBF8-001/solr-instance-001/solr.xml
   [junit4]   2> 989065 INFO  (TEST-TestReplicationHandler.testRateLimitedReplication-seed#[A7631F261128FBF8]) [    ] o.a.s.c.CorePropertiesLocator Config-defined core root directory: /home/jenkins/workspace/Lucene-Solr-5.5-Linux/solr/build/solr-core/test/J2/temp/solr.handler.TestReplicationHandler_A7631F261128FBF8-001/solr-instance-001/.
   [junit4]   2> 989065 INFO  (TEST-TestReplicationHandler.testRateLimitedReplication-seed#[A7631F261128FBF8]) [    ] o.a.s.c.CoreContainer New CoreContainer 32321448
   [junit4]   2> 989065 INFO  (TEST-TestReplicationHandler.testRateLimitedReplication-seed#[A7631F261128FBF8]) [    ] o.a.s.c.CoreContainer Loading cores into CoreContainer [instanceDir=/home/jenkins/workspace/Lucene-Solr-5.5-Linux/solr/build/solr-core/test/J2/temp/solr.handler.TestReplicationHandler_A7631F261128FBF8-001/solr-instance-001]
   [junit4]   2> 989066 WARN  (TEST-TestReplicationHandler.testRateLimitedReplication-seed#[A7631F261128FBF8]) [    ] o.a.s.c.CoreContainer Couldn't add files from /home/jenkins/workspace/Lucene-Solr-5.5-Linux/solr/build/solr-core/test/J2/temp/solr.handler.TestReplicationHandler_A7631F261128FBF8-001/solr-instance-001/lib to classpath: /home/jenkins/workspace/Lucene-Solr-5.5-Linux/solr/build/solr-core/test/J2/temp/solr.handler.TestReplicationHandler_A7631F261128FBF8-001/solr-instance-001/lib
   [junit4]   2> 989066 INFO  (TEST-TestReplicationHandler.testRateLimitedReplication-seed#[A7631F261128FBF8]) [    ] o.a.s.h.c.HttpShardHandlerFactory created with socketTimeout : 90000,urlScheme : ,connTimeout : 15000,maxConnectionsPerHost : 20,maxConnections : 10000,corePoolSize : 0,maximumPoolSize : 2147483647,maxThreadIdleTime : 5,sizeOfQueue : -1,fairnessPolicy : false,useRetries : false,connectionsEvictorSleepDelay : 5000,maxConnectionIdleTime : 40000,
   [junit4]   2> 989067 INFO  (TEST-TestReplicationHandler.testRateLimitedReplication-seed#[A7631F261128FBF8]) [    ] o.a.s.u.UpdateShardHandler Creating UpdateShardHandler HTTP client with params: socketTimeout=340000&connTimeout=45000&retry=true
   [junit4]   2> 989067 INFO  (TEST-TestReplicationHandler.testRateLimitedReplication-seed#[A7631F261128FBF8]) [    ] o.a.s.l.LogWatcher SLF4J impl is org.slf4j.impl.Log4jLoggerFactory
   [junit4]   2> 989067 INFO  (TEST-TestReplicationHandler.testRateLimitedReplication-seed#[A7631F261128FBF8]) [    ] o.a.s.l.LogWatcher Registering Log Listener [Log4j (org.slf4j.impl.Log4jLoggerFactory)]
   [junit4]   2> 989067 INFO  (TEST-TestReplicationHandler.testRateLimitedReplication-seed#[A7631F261128FBF8]) [    ] o.a.s.c.CoreContainer Security conf doesn't exist. Skipping setup for authorization module.
   [junit4]   2> 989067 INFO  (TEST-TestReplicationHandler.testRateLimitedReplication-seed#[A7631F261128FBF8]) [    ] o.a.s.c.CoreContainer No authentication plugin used.
   [junit4]   2> 989067 INFO  (TEST-TestReplicationHandler.testRateLimitedReplication-seed#[A7631F261128FBF8]) [    ] o.a.s.c.CorePropertiesLocator Looking for core definitions underneath /home/jenkins/workspace/Lucene-Solr-5.5-Linux/solr/build/solr-core/test/J2/temp/solr.handler.TestReplicationHandler_A7631F261128FBF8-001/solr-instance-001/.
   [junit4]   2> 989068 INFO  (TEST-TestReplicationHandler.testRateLimitedReplication-seed#[A7631F261128FBF8]) [    ] o.a.s.c.CoreDescriptor Created CoreDescriptor: {configSetProperties=configsetprops.json, name=collection1, loadOnStartup=true, dataDir=data/, config=solrconfig.xml, transient=false, schema=schema.xml}
   [junit4]   2> 989068 INFO  (TEST-TestReplicationHandler.testRateLimitedReplication-seed#[A7631F261128FBF8]) [    ] o.a.s.c.CorePropertiesLocator Found core collection1 in /home/jenkins/workspace/Lucene-Solr-5.5-Linux/solr/build/solr-core/test/J2/temp/solr.handler.TestReplicationHandler_A7631F261128FBF8-001/solr-instance-001/./collection1
   [junit4]   2> 989068 INFO  (TEST-TestReplicationHandler.testRateLimitedReplication-seed#[A7631F261128FBF8]) [    ] o.a.s.c.CorePropertiesLocator Found 1 core definitions
   [junit4]   2> 989068 INFO  (coreLoadExecutor-3144-thread-1) [    ] o.a.s.c.SolrResourceLoader new SolrResourceLoader for directory: '/home/jenkins/workspace/Lucene-Solr-5.5-Linux/solr/build/solr-core/test/J2/temp/solr.handler.TestReplicationHandler_A7631F261128FBF8-001/solr-instance-001/collection1'
   [junit4]   2> 989068 INFO  (coreLoadExecutor-3144-thread-1) [    ] o.a.s.c.SolrResourceLoader JNDI not configured for solr (NoInitialContextEx)
   [junit4]   2> 989068 INFO  (coreLoadExecutor-3144-thread-1) [    ] o.a.s.c.SolrResourceLoader solr home defaulted to 'solr/' (could not find system property or JNDI)
   [junit4]   2> 989068 INFO  (TEST-TestReplicationHandler.testRateLimitedReplication-seed#[A7631F261128FBF8]) [    ] o.a.s.s.SolrDispatchFilter user.dir=/home/jenkins/workspace/Lucene-Solr-5.5-Linux/solr/build/solr-core/test/J2
   [junit4]   2> 989068 INFO  (TEST-TestReplicationHandler.testRateLimitedReplication-seed#[A7631F261128FBF8]) [    ] o.a.s.s.SolrDispatchFilter SolrDispatchFilter.init() done
   [junit4]   2> 989073 INFO  (coreLoadExecutor-3144-thread-1) [    ] o.a.s.c.SolrConfig current version of requestparams : -1
   [junit4]   2> 989079 INFO  (coreLoadExecutor-3144-thread-1) [    ] o.a.s.c.SolrConfig Using Lucene MatchVersion: 5.5.5
   [junit4]   2> 989093 INFO  (coreLoadExecutor-3144-thread-1) [    ] o.a.s.c.SolrConfig Loaded SolrConfig: solrconfig.xml
   [junit4]   2> 989095 INFO  (coreLoadExecutor-3144-thread-1) [    ] o.a.s.s.IndexSchema [collection1] Schema name=test
   [junit4]   2> 989098 INFO  (coreLoadExecutor-3144-thread-1) [    ] o.a.s.s.IndexSchema unique key field: id
   [junit4]   2> 989099 INFO  (coreLoadExecutor-3144-thread-1) [    ] o.a.s.c.ConfigSetProperties Did not find ConfigSet properties, assuming default properties: Can't find resource 'configsetprops.json' in classpath or '/home/jenkins/workspace/Lucene-Solr-5.5-Linux/solr/build/solr-core/test/J2/temp/solr.handler.TestReplicationHandler_A7631F261128FBF8-001/solr-instance-001/collection1'
   [junit4]   2> 989099 INFO  (coreLoadExecutor-3144-thread-1) [    ] o.a.s.c.CoreContainer Creating SolrCore 'collection1' using configuration from instancedir /home/jenkins/workspace/Lucene-Solr-5.5-Linux/solr/build/solr-core/test/J2/temp/solr.handler.TestReplicationHandler_A7631F261128FBF8-001/solr-instance-001/./collection1
   [junit4]   2> 989099 INFO  (coreLoadExecutor-3144-thread-1) [    x:collection1] o.a.s.c.SolrCore org.apache.solr.core.MockDirectoryFactory
   [junit4]   2> 989099 INFO  (coreLoadExecutor-3144-thread-1) [    x:collection1] o.a.s.c.SolrCore [[collection1] ] Opening new SolrCore at [/home/jenkins/workspace/Lucene-Solr-5.5-Linux/solr/build/solr-core/test/J2/temp/solr.handler.TestReplicationHandler_A7631F261128FBF8-001/solr-instance-001/collection1], dataDir=[/home/jenkins/workspace/Lucene-Solr-5.5-Linux/solr/build/solr-core/test/J2/temp/solr.handler.TestReplicationHandler_A7631F261128FBF8-001/solr-instance-001/./collection1/data/]
   [junit4]   2> 989099 INFO  (coreLoadExecutor-3144-thread-1) [    x:collection1] o.a.s.c.SolrCore JMX monitoring not detected for core: collection1
   [junit4]   2> 989100 INFO  (coreLoadExecutor-3144-thread-1) [    x:collection1] o.a.s.c.CachingDirectoryFactory return new directory for /home/jenkins/workspace/Lucene-Solr-5.5-Linux/solr/build/solr-core/test/J2/temp/solr.handler.TestReplicationHandler_A7631F261128FBF8-001/solr-instance-001/./collection1/data
   [junit4]   2> 989100 INFO  (coreLoadExecutor-3144-thread-1) [    x:collection1] o.a.s.c.SolrCore New index directory detected: old=null new=/home/jenkins/workspace/Lucene-Solr-5.5-Linux/solr/build/solr-core/test/J2/temp/solr.handler.TestReplicationHandler_A7631F261128FBF8-001/solr-instance-001/./collection1/data/index/
   [junit4]   2> 989100 WARN  (coreLoadExecutor-3144-thread-1) [    x:collection1] o.a.s.c.SolrCore [collection1] Solr index directory '/home/jenkins/workspace/Lucene-Solr-5.5-Linux/solr/build/solr-core/test/J2/temp/solr.handler.TestReplicationHandler_A7631F261128FBF8-001/solr-instance-001/./collection1/data/index' doesn't exist. Creating new index...
   [junit4]   2> 989100 INFO  (coreLoadExecutor-3144-thread-1) [    x:collection1] o.a.s.c.CachingDirectoryFactory return new directory for /home/jenkins/workspace/Lucene-Solr-5.5-Linux/solr/build/solr-core/test/J2/temp/solr.handler.TestReplicationHandler_A7631F261128FBF8-001/solr-instance-001/./collection1/data/index
   [junit4]   2> 989100 INFO  (coreLoadExecutor-3144-thread-1) [    x:collection1] o.a.s.u.RandomMergePolicy RandomMergePolicy wrapping class org.apache.lucene.index.TieredMergePolicy: [TieredMergePolicy: maxMergeAtOnce=49, maxMergeAtOnceExplicit=46, maxMergedSegmentMB=66.0390625, floorSegmentMB=1.2509765625, forceMergeDeletesPctAllowed=1.4143387299218924, segmentsPerTier=17.0, maxCFSSegmentSizeMB=8.796093022207999E12, noCFSRatio=0.1758811827956598
   [junit4]   2> 989100 INFO  (coreLoadExecutor-3144-thread-1) [    x:collection1] o.a.s.c.SolrDeletionPolicy SolrDeletionPolicy.onCommit: commits: num=1
   [junit4]   2> 	commit{dir=MockDirectoryWrapper(RAMDirectory@12e124d lockFactory=org.apache.lucene.store.SingleInstanceLockFactory@1b3b748),segFN=segments_1,generation=1}
   [junit4]   2> 989100 INFO  (coreLoadExecutor-3144-thread-1) [    x:collection1] o.a.s.c.SolrDeletionPolicy newest commit generation = 1
   [junit4]   2> 989100 INFO  (OldIndexDirectoryCleanupThreadForCore-collection1) [    x:collection1] o.a.s.c.SolrCore Looking for old index directories to cleanup for core collection1 in /home/jenkins/workspace/Lucene-Solr-5.5-Linux/solr/build/solr-core/test/J2/temp/solr.handler.TestReplicationHandler_A7631F261128FBF8-001/solr-instance-001/./collection1/data/
   [junit4]   2> 989102 INFO  (coreLoadExecutor-3144-thread-1) [    x:collection1] o.a.s.c.SolrCore no updateRequestProcessorChain defined as default, creating implicit default
   [junit4]   2> 989103 INFO  (coreLoadExecutor-3144-thread-1) [    x:collection1] o.a.s.h.l.XMLLoader xsltCacheLifetimeSeconds=60
   [junit4]   2> 989103 INFO  (coreLoadExecutor-3144-thread-1) [    x:collection1] o.a.s.h.l.XMLLoader xsltCacheLifetimeSeconds=60
   [junit4]   2> 989104 INFO  (coreLoadExecutor-3144-thread-1) [    x:collection1] o.a.s.h.l.XMLLoader xsltCacheLifetimeSeconds=60
   [junit4]   2> 989104 INFO  (coreLoadExecutor-3144-thread-1) [    x:collection1] o.a.s.h.l.XMLLoader xsltCacheLifetimeSeconds=60
   [junit4]   2> 989105 INFO  (coreLoadExecutor-3144-thread-1) [    x:collection1] o.a.s.c.PluginBag requestHandler : 'lazy' created with startup=lazy 
   [junit4]   2> 989105 INFO  (coreLoadExecutor-3144-thread-1) [    x:collection1] o.a.s.c.RequestHandlers Registered paths: /config,/update/json,/admin/luke,/get,/admin/mbeans,/update/csv,/update/json/docs,/admin/logging,/admin/threads,defaults,/admin/file,/update,/replication,/admin/properties,standard,lazy,/admin/segments,/admin/system,/admin/plugins,/admin/ping,/schema
   [junit4]   2> 989106 INFO  (coreLoadExecutor-3144-thread-1) [    x:collection1] o.a.s.c.SolrCore Using default statsCache cache: org.apache.solr.search.stats.LocalStatsCache
   [junit4]   2> 989106 INFO  (coreLoadExecutor-3144-thread-1) [    x:collection1] o.a.s.u.CommitTracker Hard AutoCommit: disabled
   [junit4]   2> 989106 INFO  (coreLoadExecutor-3144-thread-1) [    x:collection1] o.a.s.u.CommitTracker Soft AutoCommit: disabled
   [junit4]   2> 989106 INFO  (coreLoadExecutor-3144-thread-1) [    x:collection1] o.a.s.u.RandomMergePolicy RandomMergePolicy wrapping class org.apache.lucene.index.TieredMergePolicy: [TieredMergePolicy: maxMergeAtOnce=39, maxMergeAtOnceExplicit=49, maxMergedSegmentMB=41.158203125, floorSegmentMB=1.5791015625, forceMergeDeletesPctAllowed=28.786997372414287, segmentsPerTier=50.0, maxCFSSegmentSizeMB=8.796093022207999E12, noCFSRatio=1.0
   [junit4]   2> 989106 INFO  (coreLoadExecutor-3144-thread-1) [    x:collection1] o.a.s.c.SolrDeletionPolicy SolrDeletionPolicy.onInit: commits: num=1
   [junit4]   2> 	commit{dir=MockDirectoryWrapper(RAMDirectory@12e124d lockFactory=org.apache.lucene.store.SingleInstanceLockFactory@1b3b748),segFN=segments_1,generation=1}
   [junit4]   2> 989106 INFO  (coreLoadExecutor-3144-thread-1) [    x:collection1] o.a.s.c.SolrDeletionPolicy newest commit generation = 1
   [junit4]   2> 989106 INFO  (coreLoadExecutor-3144-thread-1) [    x:collection1] o.a.s.s.SolrIndexSearcher Opening Searcher@af76dd[collection1] main
   [junit4]   2> 989106 INFO  (coreLoadExecutor-3144-thread-1) [    x:collection1] o.a.s.r.ManagedResourceStorage File-based storage initialized to use dir: /home/jenkins/workspace/Lucene-Solr-5.5-Linux/solr/build/solr-core/test/J2/temp/solr.handler.TestReplicationHandler_A7631F261128FBF8-001/solr-instance-001/collection1/conf
   [junit4]   2> 989106 INFO  (coreLoadExecutor-3144-thread-1) [    x:collection1] o.a.s.r.RestManager Initializing RestManager with initArgs: {storageDir=/home/jenkins/workspace/Lucene-Solr-5.5-Linux/solr/build/solr-core/test/J2/temp/solr.handler.TestReplicationHandler_A7631F261128FBF8-001/solr-instance-001/collection1/conf}
   [junit4]   2> 989106 INFO  (coreLoadExecutor-3144-thread-1) [    x:collection1] o.a.s.r.ManagedResourceStorage Reading _rest_managed.json using file:dir=/home/jenkins/workspace/Lucene-Solr-5.5-Linux/solr/build/solr-core/test/J2/temp/solr.handler.TestReplicationHandler_A7631F261128FBF8-001/solr-instance-001/collection1/conf
   [junit4]   2> 989106 INFO  (coreLoadExecutor-3144-thread-1) [    x:collection1] o.a.s.r.RestManager Initializing 0 registered ManagedResources
   [junit4]   2> 989106 INFO  (coreLoadExecutor-3144-thread-1) [    x:collection1] o.a.s.h.ReplicationHandler Replication enabled for following config files: schema.xml,xslt/dummy.xsl
   [junit4]   2> 989106 INFO  (coreLoadExecutor-3144-thread-1) [    x:collection1] o.a.s.h.ReplicationHandler Commits will be reserved for  10000
   [junit4]   2> 989106 INFO  (searcherExecutor-3145-thread-1-processing-x:collection1) [    x:collection1] o.a.s.c.SolrCore [collection1] Registered new searcher Searcher@af76dd[collection1] main{ExitableDirectoryReader(UninvertingDirectoryReader())}
   [junit4]   2> 989107 INFO  (coreLoadExecutor-3144-thread-1) [    x:collection1] o.a.s.c.CoreContainer registering core: collection1
   [junit4]   2> 989570 INFO  (TEST-TestReplicationHandler.testRateLimitedReplication-seed#[A7631F261128FBF8]) [    ] o.a.s.SolrTestCaseJ4 Writing core.properties file to /home/jenkins/workspace/Lucene-Solr-5.5-Linux/solr/build/solr-core/test/J2/temp/solr.handler.TestReplicationHandler_A7631F261128FBF8-001/solr-instance-002/collection1
   [junit4]   2> 989591 INFO  (TEST-TestReplicationHandler.testRateLimitedReplication-seed#[A7631F261128FBF8]) [    ] o.e.j.s.Server jetty-9.2.13.v20150730
   [junit4]   2> 989593 INFO  (TEST-TestReplicationHandler.testRateLimitedReplication-seed#[A7631F261128FBF8]) [    ] o.e.j.s.h.ContextHandler Started o.e.j.s.ServletContextHandler@11bab73{/solr,null,AVAILABLE}
   [junit4]   2> 989593 INFO  (TEST-TestReplicationHandler.testRateLimitedReplication-seed#[A7631F261128FBF8]) [    ] o.e.j.s.ServerConnector Started ServerConnector@6f1e62{HTTP/1.1}{127.0.0.1:36381}
   [junit4]   2> 989594 INFO  (TEST-TestReplicationHandler.testRateLimitedReplication-seed#[A7631F261128FBF8]) [    ] o.e.j.s.Server Started @990657ms
   [junit4]   2> 989594 INFO  (TEST-TestReplicationHandler.testRateLimitedReplication-seed#[A7631F261128FBF8]) [    ] o.a.s.c.s.e.JettySolrRunner Jetty properties: {hostContext=/solr, hostPort=36381, solr.data.dir=/home/jenkins/workspace/Lucene-Solr-5.5-Linux/solr/build/solr-core/test/J2/temp/solr.handler.TestReplicationHandler_A7631F261128FBF8-001/solr-instance-002/collection1/data}
   [junit4]   2> 989594 INFO  (TEST-TestReplicationHandler.testRateLimitedReplication-seed#[A7631F261128FBF8]) [    ] o.a.s.s.SolrDispatchFilter SolrDispatchFilter.init(): sun.misc.Launcher$AppClassLoader@15e0eab
   [junit4]   2> 989594 INFO  (TEST-TestReplicationHandler.testRateLimitedReplication-seed#[A7631F261128FBF8]) [    ] o.a.s.c.SolrResourceLoader new SolrResourceLoader for directory: '/home/jenkins/workspace/Lucene-Solr-5.5-Linux/solr/build/solr-core/test/J2/temp/solr.handler.TestReplicationHandler_A7631F261128FBF8-001/solr-instance-002'
   [junit4]   2> 989594 INFO  (TEST-TestReplicationHandler.testRateLimitedReplication-seed#[A7631F261128FBF8]) [    ] o.a.s.c.SolrResourceLoader JNDI not configured for solr (NoInitialContextEx)
   [junit4]   2> 989594 INFO  (TEST-TestReplicationHandler.testRateLimitedReplication-seed#[A7631F261128FBF8]) [    ] o.a.s.c.SolrResourceLoader solr home defaulted to 'solr/' (could not find system property or JNDI)
   [junit4]   2> 989595 INFO  (TEST-TestReplicationHandler.testRateLimitedReplication-seed#[A7631F261128FBF8]) [    ] o.a.s.c.SolrXmlConfig Loading container configuration from /home/jenkins/workspace/Lucene-Solr-5.5-Linux/solr/build/solr-core/test/J2/temp/solr.handler.TestReplicationHandler_A7631F261128FBF8-001/solr-instance-002/solr.xml
   [junit4]   2> 989609 INFO  (TEST-TestReplicationHandler.testRateLimitedReplication-seed#[A7631F261128FBF8]) [    ] o.a.s.c.CorePropertiesLocator Config-defined core root directory: /home/jenkins/workspace/Lucene-Solr-5.5-Linux/solr/build/solr-core/test/J2/temp/solr.handler.TestReplicationHandler_A7631F261128FBF8-001/solr-instance-002/.
   [junit4]   2> 989609 INFO  (TEST-TestReplicationHandler.testRateLimitedReplication-seed#[A7631F261128FBF8]) [    ] o.a.s.c.CoreContainer New CoreContainer 1287958
   [junit4]   2> 989609 INFO  (TEST-TestReplicationHandler.testRateLimitedReplication-seed#[A7631F261128FBF8]) [    ] o.a.s.c.CoreContainer Loading cores into CoreContainer [instanceDir=/home/jenkins/workspace/Lucene-Solr-5.5-Linux/solr/build/solr-core/test/J2/temp/solr.handler.TestReplicationHandler_A7631F261128FBF8-001/solr-instance-002]
   [junit4]   2> 989609 WARN  (TEST-TestReplicationHandler.testRateLimitedReplication-seed#[A7631F261128FBF8]) [    ] o.a.s.c.CoreContainer Couldn't add files from /home/jenkins/workspace/Lucene-Solr-5.5-Linux/solr/build/solr-core/test/J2/temp/solr.handler.TestReplicationHandler_A7631F261128FBF8-001/solr-instance-002/lib to classpath: /home/jenkins/workspace/Lucene-Solr-5.5-Linux/solr/build/solr-core/test/J2/temp/solr.handler.TestReplicationHandler_A7631F261128FBF8-001/solr-instance-002/lib
   [junit4]   2> 989610 INFO  (TEST-TestReplicationHandler.testRateLimitedReplication-seed#[A7631F261128FBF8]) [    ] o.a.s.h.c.HttpShardHandlerFactory created with socketTimeout : 90000,urlScheme : ,connTimeout : 15000,maxConnectionsPerHost : 20,maxConnections : 10000,corePoolSize : 0,maximumPoolSize : 2147483647,maxThreadIdleTime : 5,sizeOfQueue : -1,fairnessPolicy : false,useRetries : false,connectionsEvictorSleepDelay : 5000,maxConnectionIdleTime : 40000,
   [junit4]   2> 989611 INFO  (TEST-TestReplicationHandler.testRateLimitedReplication-seed#[A7631F261128FBF8]) [    ] o.a.s.u.UpdateShardHandler Creating UpdateShardHandler HTTP client with params: socketTimeout=340000&connTimeout=45000&retry=true
   [junit4]   2> 989611 INFO  (TEST-TestReplicationHandler.testRateLimitedReplication-seed#[A7631F261128FBF8]) [    ] o.a.s.l.LogWatcher SLF4J impl is org.slf4j.impl.Log4jLoggerFactory
   [junit4]   2> 989611 INFO  (TEST-TestReplicationHandler.testRateLimitedReplication-seed#[A7631F261128FBF8]) [    ] o.a.s.l.LogWatcher Registering Log Listener [Log4j (org.slf4j.impl.Log4jLoggerFactory)]
   [junit4]   2> 989611 INFO  (TEST-TestReplicationHandler.testRateLimitedReplication-seed#[A7631F261128FBF8]) [    ] o.a.s.c.CoreContainer Security conf doesn't exist. Skipping setup for authorization module.
   [junit4]   2> 989612 INFO  (TEST-TestReplicationHandler.testRateLimitedReplication-seed#[A7631F261128FBF8]) [    ] o.a.s.c.CoreContainer No authentication plugin used.
   [junit4]   2> 989615 INFO  (TEST-TestReplicationHandler.testRateLimitedReplication-seed#[A7631F261128FBF8]) [    ] o.a.s.c.CorePropertiesLocator Looking for core definitions underneath /home/jenkins/workspace/Lucene-Solr-5.5-Linux/solr/build/solr-core/test/J2/temp/solr.handler.TestReplicationHandler_A7631F261128FBF8-001/solr-instance-002/.
   [junit4]   2> 989616 INFO  (TEST-TestReplicationHandler.testRateLimitedReplication-seed#[A7631F261128FBF8]) [    ] o.a.s.c.CoreDescriptor Created CoreDescriptor: {schema=schema.xml, loadOnStartup=true, transient=false, name=collection1, dataDir=data/, configSetProperties=configsetprops.json, config=solrconfig.xml}
   [junit4]   2> 989616 INFO  (TEST-TestReplicationHandler.testRateLimitedReplication-seed#[A7631F261128FBF8]) [    ] o.a.s.c.CorePropertiesLocator Found core collection1 in /home/jenkins/workspace/Lucene-Solr-5.5-Linux/solr/build/solr-core/test/J2/temp/solr.handler.TestReplicationHandler_A7631F261128FBF8-001/solr-instance-002/./collection1
   [junit4]   2> 989617 INFO  (TEST-TestReplicationHandler.testRateLimitedReplication-seed#[A7631F261128FBF8]) [    ] o.a.s.c.CorePropertiesLocator Found 1 core definitions
   [junit4]   2> 989617 INFO  (coreLoadExecutor-3154-thread-1) [    ] o.a.s.c.SolrResourceLoader new SolrResourceLoader for directory: '/home/jenkins/workspace/Lucene-Solr-5.5-Linux/solr/build/solr-core/test/J2/temp/solr.handler.TestReplicationHandler_A7631F261128FBF8-001/solr-instance-002/collection1'
   [junit4]   2> 989617 INFO  (coreLoadExecutor-3154-thread-1) [    ] o.a.s.c.SolrResourceLoader JNDI not configured for solr (NoInitialContextEx)
   [junit4]   2> 989617 INFO  (TEST-TestReplicationHandler.testRateLimitedReplication-seed#[A7631F261128FBF8]) [    ] o.a.s.s.SolrDispatchFilter user.dir=/home/jenkins/workspace/Lucene-Solr-5.5-Linux/solr/build/solr-core/test/J2
   [junit4]   2> 989617 INFO  (TEST-TestReplicationHandler.testRateLimitedReplication-seed#[A7631F261128FBF8]) [    ] o.a.s.s.SolrDispatchFilter SolrDispatchFilter.init() done
   [junit4]   2> 989617 INFO  (coreLoadExecutor-3154-thread-1) [    ] o.a.s.c.SolrResourceLoader solr home defaulted to 'solr/' (could not find system property or JNDI)
   [junit4]   2> 989627 INFO  (coreLoadExecutor-3154-thread-1) [    ] o.a.s.c.SolrConfig current version of requestparams : -1
   [junit4]   2> 989638 INFO  (coreLoadExecutor-3154-thread-1) [    ] o.a.s.c.SolrConfig Using Lucene MatchVersion: 5.5.5
   [junit4]   2> 989652 INFO  (coreLoadExecutor-3154-thread-1) [    ] o.a.s.c.SolrConfig Loaded SolrConfig: solrconfig.xml
   [junit4]   2> 989654 INFO  (coreLoadExecutor-3154-thread-1) [    ] o.a.s.s.IndexSchema [collection1] Schema name=test
   [junit4]   2> 989657 INFO  (coreLoadExecutor-3154-thread-1) [    ] o.a.s.s.IndexSchema unique key field: id
   [junit4]   2> 989658 INFO  (coreLoadExecutor-3154-thread-1) [    ] o.a.s.c.ConfigSetProperties Did not find ConfigSet properties, assuming default properties: Can't find resource 'configsetprops.json' in classpath or '/home/jenkins/workspace/Lucene-Solr-5.5-Linux/solr/build/solr-core/test/J2/temp/solr.handler.TestReplicationHandler_A7631F261128FBF8-001/solr-instance-002/collection1'
   [junit4]   2> 989658 INFO  (coreLoadExecutor-3154-thread-1) [    ] o.a.s.c.CoreContainer Creating SolrCore 'collection1' using configuration from instancedir /home/jenkins/workspace/Lucene-Solr-5.5-Linux/solr/build/solr-core/test/J2/temp/solr.handler.TestReplicationHandler_A7631F261128FBF8-001/solr-instance-002/./collection1
   [junit4]   2> 989658 INFO  (coreLoadExecutor-3154-thread-1) [    x:collection1] o.a.s.c.SolrCore org.apache.solr.core.MockDirectoryFactory
   [junit4]   2> 989658 INFO  (coreLoadExecutor-3154-thread-1) [    x:collection1] o.a.s.c.SolrCore [[collection1] ] Opening new SolrCore at [/home/jenkins/workspace/Lucene-Solr-5.5-Linux/solr/build/solr-core/test/J2/temp/solr.handler.TestReplicationHandler_A7631F261128FBF8-001/solr-instance-002/collection1], dataDir=[/home/jenkins/workspace/Lucene-Solr-5.5-Linux/solr/build/solr-core/test/J2/temp/solr.handler.TestReplicationHandler_A7631F261128FBF8-001/solr-instance-002/./collection1/data/]
   [junit4]   2> 989658 INFO  (coreLoadExecutor-3154-thread-1) [    x:collection1] o.a.s.c.SolrCore JMX monitoring not detected for core: collection1
   [junit4]   2> 989658 INFO  (coreLoadExecutor-3154-thread-1) [    x:collection1] o.a.s.c.CachingDirectoryFactory return new directory for /home/jenkins/workspace/Lucene-Solr-5.5-Linux/solr/build/solr-core/test/J2/temp/solr.handler.TestReplicationHandler_A7631F261128FBF8-001/solr-instance-002/./collection1/data
   [junit4]   2> 989658 INFO  (coreLoadExecutor-3154-thread-1) [    x:collection1] o.a.s.c.SolrCore New index directory detected: old=null new=/home/jenkins/workspace/Lucene-Solr-5.5-Linux/solr/build/solr-core/test/J2/temp/solr.handler.TestReplicationHandler_A7631F261128FBF8-001/solr-instance-002/./collection1/data/index/
   [junit4]   2> 989658 WARN  (coreLoadExecutor-3154-thread-1) [    x:collection1] o.a.s.c.SolrCore [collection1] Solr index directory '/home/jenkins/workspace/Lucene-Solr-5.5-Linux/solr/build/solr-core/test/J2/temp/solr.handler.TestReplicationHandler_A7631F261128FBF8-001/solr-instance-002/./collection1/data/index' doesn't exist. Creating new index...
   [junit4]   2> 989658 INFO  (coreLoadExecutor-3154-thread-1) [    x:collection1] o.a.s.c.CachingDirectoryFactory return new directory for /home/jenkins/workspace/Lucene-Solr-5.5-Linux/solr/build/solr-core/test/J2/temp/solr.handler.TestReplicationHandler_A7631F261128FBF8-001/solr-instance-002/./collection1/data/index
   [junit4]   2> 989659 INFO  (coreLoadExecutor-3154-thread-1) [    x:collection1] o.a.s.u.RandomMergePolicy RandomMergePolicy wrapping class org.apache.lucene.index.TieredMergePolicy: [TieredMergePolicy: maxMergeAtOnce=49, maxMergeAtOnceExplicit=46, maxMergedSegmentMB=66.0390625, floorSegmentMB=1.2509765625, forceMergeDeletesPctAllowed=1.4143387299218924, segmentsPerTier=17.0, maxCFSSegmentSizeMB=8.796093022207999E12, noCFSRatio=0.1758811827956598
   [junit4]   2> 989659 INFO  (coreLoadExecutor-3154-thread-1) [    x:collection1] o.a.s.c.SolrDeletionPolicy SolrDeletionPolicy.onCommit: commits: num=1
   [junit4]   2> 	commit{dir=MockDirectoryWrapper(RAMDirectory@1a9762 lockFactory=org.apache.lucene.store.SingleInstanceLockFactory@1c8bda7),segFN=segments_1,generation=1}
   [junit4]   2> 989659 INFO  (coreLoadExecutor-3154-thread-1) [    x:collection1] o.a.s.c.SolrDeletionPolicy newest commit generation = 1
   [junit4]   2> 989659 INFO  (OldIndexDirectoryCleanupThreadForCore-collection1) [    x:collection1] o.a.s.c.SolrCore Looking for old index directories to cleanup for core collection1 in /home/jenkins/workspace/Lucene-Solr-5.5-Linux/solr/build/solr-core/test/J2/temp/solr.handler.TestReplicationHandler_A7631F261128FBF8-001/solr-instance-002/./collection1/data/
   [junit4]   2> 989660 INFO  (coreLoadExecutor-3154-thread-1) [    x:collection1] o.a.s.c.SolrCore no updateRequestProcessorChain defined as default, creating implicit default
   [junit4]   2> 989661 INFO  (coreLoadExecutor-3154-thread-1) [    x:collection1] o.a.s.h.l.XMLLoader xsltCacheLifetimeSeconds=60
   [junit4]   2> 989661 INFO  (coreLoadExecutor-3154-thread-1) [    x:collection1] o.a.s.h.l.XMLLoader xsltCacheLifetimeSeconds=60
   [junit4]   2> 989662 INFO  (coreLoadExecutor-3154-thread-1) [    x:collection1] o.a.s.h.l.XMLLoader xsltCacheLifetimeSeconds=60
   [junit4]   2> 989662 INFO  (coreLoadExecutor-3154-thread-1) [    x:collection1] o.a.s.h.l.XMLLoader xsltCacheLifetimeSeconds=60
   [junit4]   2> 989663 INFO  (coreLoadExecutor-3154-thread-1) [    x:collection1] o.a.s.c.PluginBag requestHandler : 'lazy' created with startup=lazy 
   [junit4]   2> 989663 INFO  (coreLoadExecutor-3154-thread-1) [    x:collection1] o.a.s.c.RequestHandlers Registered paths: /config,/update/json,/admin/luke,/get,/admin/mbeans,/update/csv,/update/json/docs,/admin/logging,/admin/threads,defaults,/admin/file,/update,/replication,/admin/properties,standard,lazy,/admin/segments,/admin/system,/admin/plugins,/admin/ping,/schema
   [junit4]   2> 989663 INFO  (coreLoadExecutor-3154-thread-1) [    x:collection1] o.a.s.c.SolrCore Using default statsCache cache: org.apache.solr.search.stats.LocalStatsCache
   [junit4]   2> 989664 INFO  (coreLoadExecutor-3154-thread-1) [    x:collection1] o.a.s.u.CommitTracker Hard AutoCommit: disabled
   [junit4]   2> 989664 INFO  (coreLoadExecutor-3154-thread-1) [    x:collection1] o.a.s.u.CommitTracker Soft AutoCommit: disabled
   [junit4]   2> 989664 INFO  (coreLoadExecutor-3154-thread-1) [    x:collection1] o.a.s.u.RandomMergePolicy RandomMergePolicy wrapping class org.apache.lucene.index.TieredMergePolicy: [TieredMergePolicy: maxMergeAtOnce=39, maxMergeAtOnceExplicit=49, maxMergedSegmentMB=41.158203125, floorSegmentMB=1.5791015625, forceMergeDeletesPctAllowed=28.786997372414287, segmentsPerTier=50.0, maxCFSSegmentSizeMB=8.796093022207999E12, noCFSRatio=1.0
   [junit4]   2> 989664 INFO  (coreLoadExecutor-3154-thread-1) [    x:collection1] o.a.s.c.SolrDeletionPolicy SolrDeletionPolicy.onInit: commits: num=1
   [junit4]   2> 	commit{dir=MockDirectoryWrapper(RAMDirectory@1a9762 lockFactory=org.apache.lucene.store.SingleInstanceLockFactory@1c8bda7),segFN=segments_1,generation=1}
   [junit4]   2> 989664 INFO  (coreLoadExecutor-3154-thread-1) [    x:collection1] o.a.s.c.SolrDeletionPolicy newest commit generation = 1
   [junit4]   2> 989664 INFO  (coreLoadExecutor-3154-thread-1) [    x:collection1] o.a.s.s.SolrIndexSearcher Opening Searcher@b613bd[collection1] main
   [junit4]   2> 989664 INFO  (coreLoadExecutor-3154-thread-1) [    x:collection1] o.a.s.r.ManagedResourceStorage File-based storage initialized to use dir: /home/jenkins/workspace/Lucene-Solr-5.5-Linux/solr/build/solr-core/test/J2/temp/solr.handler.TestReplicationHandler_A7631F261128FBF8-001/solr-instance-002/collection1/conf
   [junit4]   2> 989664 INFO  (coreLoadExecutor-3154-thread-1) [    x:collection1] o.a.s.r.RestManager Initializing RestManager with initArgs: {storageDir=/home/jenkins/workspace/Lucene-Solr-5.5-Linux/solr/build/solr-core/test/J2/temp/solr.handler.TestReplicationHandler_A7631F261128FBF8-001/solr-instance-002/collection1/conf}
   [junit4]   2> 989664 INFO  (coreLoadExecutor-3154-thread-1) [    x:collection1] o.a.s.r.ManagedResourceStorage Reading _rest_managed.json using file:dir=/home/jenkins/workspace/Lucene-Solr-5.5-Linux/solr/build/solr-core/test/J2/temp/solr.handler.TestReplicationHandler_A7631F261128FBF8-001/solr-instance-002/collection1/conf
   [junit4]   2> 989664 INFO  (coreLoadExecutor-3154-thread-1) [    x:collection1] o.a.s.r.RestManager Initializing 0 registered ManagedResources
   [junit4]   2> 989665 INFO  (coreLoadExecutor-3154-thread-1) [    x:collection1] o.a.s.h.ReplicationHandler Poll scheduled at an interval of 1000ms
   [junit4]   2> 989665 INFO  (searcherExecutor-3155-thread-1-processing-x:collection1) [    x:collection1] o.a.s.c.SolrCore [collection1] Registered new searcher Searcher@b613bd[collection1] main{ExitableDirectoryReader(UninvertingDirectoryReader())}
   [junit4]   2> 989666 INFO  (coreLoadExecutor-3154-thread-1) [    x:collection1] o.a.s.c.CoreContainer registering core: collection1
   [junit4]   2> 989667 INFO  (qtp28522562-8470) [    x:collection1] o.a.s.c.S.Request [collection1]  webapp=/solr path=/replication params={qt=/replication&wt=javabin&command=indexversion&version=2} status=0 QTime=0
   [junit4]   2> 990119 INFO  (qtp28522562-8471) [    x:collection1] o.a.s.u.DirectUpdateHandler2 [collection1] REMOVING ALL DOCUMENTS FROM INDEX
   [junit4]   2> 990119 INFO  (qtp28522562-8471) [    x:collection1] o.a.s.u.p.LogUpdateProcessorFactory [collection1]  webapp=/solr path=/update params={wt=javabin&version=2}{deleteByQuery=*:*} 0 0
   [junit4]   2> 990120 INFO  (qtp2362392-8490) [    x:collection1] o.a.s.u.DirectUpdateHandler2 [collection1] REMOVING ALL DOCUMENTS FROM INDEX
   [junit4]   2> 990120 INFO  (qtp2362392-8490) [    x:collection1] o.a.s.u.p.LogUpdateProcessorFactory [collection1]  webapp=/solr path=/update params={wt=javabin&version=2}{deleteByQuery=*:*} 0 0
   [junit4]   2> 990122 INFO  (qtp28522562-8472) [    x:collection1] o.a.s.u.DirectUpdateHandler2 start commit{,optimize=false,openSearcher=true,waitSearcher=true,expungeDeletes=false,softCommit=false,prepareCommit=false}
   [junit4]   2> 990122 INFO  (qtp28522562-8472) [    x:collection1] o.a.s.c.SolrDeletionPolicy SolrDeletionPolicy.onCommit: commits: num=2
   [junit4]   2> 	commit{dir=MockDirectoryWrapper(RAMDirectory@12e124d lockFactory=org.apache.lucene.store.SingleInstanceLockFactory@1b3b748),segFN=segments_1,generation=1}
   [junit4]   2> 	commit{dir=MockDirectoryWrapper(RAMDirectory@12e124d lockFactory=org.apache.lucene.store.SingleInstanceLockFactory@1b3b748),segFN=segments_2,generation=2}
   [junit4]   2> 990122 INFO  (qtp28522562-8472) [    x:collection1] o.a.s.c.SolrDeletionPolicy newest commit generation = 2
   [junit4]   2> 990123 INFO  (qtp28522562-8472) [    x:collection1] o.a.s.s.SolrIndexSearcher Opening Searcher@35e29c[collection1] main
   [junit4]   2> 990123 INFO  (qtp28522562-8472) [    x:collection1] o.a.s.u.DirectUpdateHandler2 end_commit_flush
   [junit4]   2> 990123 INFO  (searcherExecutor-3145-thread-1-processing-x:collection1) [    x:collection1] o.a.s.c.SolrCore [collection1] Registered new searcher Searcher@35e29c[collection1] main{ExitableDirectoryReader(UninvertingDirectoryReader())}
   [junit4]   2> 990123 INFO  (qtp28522562-8472) [    x:collection1] o.a.s.u.p.LogUpdateProcessorFactory [collection1]  webapp=/solr path=/update params={softCommit=false&waitSearcher=true&wt=javabin&commit=true&version=2}{commit=} 0 0
   [junit4]   2> 990124 INFO  (qtp2362392-8491) [    x:collection1] o.a.s.u.DirectUpdateHandler2 start commit{,optimize=false,openSearcher=true,waitSearcher=true,expungeDeletes=false,softCommit=false,prepareCommit=false}
   [junit4]   2> 990125 INFO  (qtp2362392-8491) [    x:collection1] o.a.s.c.SolrDeletionPolicy SolrDeletionPolicy.onCommit: commits: num=2
   [junit4]   2> 	commit{dir=MockDirectoryWrapper(RAMDirectory@1a9762 lockFactory=org.apache.lucene.store.SingleInstanceLockFactory@1c8bda7),segFN=segments_1,generation=1}
   [junit4]   2> 	commit{dir=MockDirectoryWrapper(RAMDirectory@1a9762 lockFactory=org.apache.lucene.store.SingleInstanceLockFactory@1c8bda7),segFN=segments_2,generation=2}
   [junit4]   2> 990125 INFO  (qtp2362392-8491) [    x:collection1] o.a.s.c.SolrDeletionPolicy newest commit generation = 2
   [junit4]   2> 990125 INFO  (qtp2362392-8491) [    x:collection1] o.a.s.s.SolrIndexSearcher Opening Searcher@104b26a[collection1] main
   [junit4]   2> 990125 INFO  (qtp2362392-8491) [    x:collection1] o.a.s.u.DirectUpdateHandler2 end_commit_flush
   [junit4]   2> 990125 INFO  (searcherExecutor-3155-thread-1-processing-x:collection1) [    x:collection1] o.a.s.c.SolrCore [collection1] Registered new searcher Searcher@104b26a[collection1] main{ExitableDirectoryReader(UninvertingDirectoryReader())}
   [junit4]   2> 990125 INFO  (qtp2362392-8491) [    x:collection1] o.a.s.u.p.LogUpdateProcessorFactory [collection1]  webapp=/solr path=/update params={softCommit=false&waitSearcher=true&wt=javabin&commit=true&version=2}{commit=} 0 0
   [junit4]   2> 990126 INFO  (TEST-TestReplicationHandler.testRateLimitedReplication-seed#[A7631F261128FBF8]) [    ] o.e.j.s.ServerConnector Stopped ServerConnector@1f065ba{HTTP/1.1}{127.0.0.1:0}
   [junit4]   2> 990126 INFO  (TEST-TestReplicationHandler.testRateLimitedReplication-seed#[A7631F261128FBF8]) [    ] o.a.s.c.CoreContainer Shutting down CoreContainer instance=32321448
   [junit4]   2> 990126 INFO  (coreCloseExecutor-3160-thread-1) [    x:collection1] o.a.s.c.SolrCore [collection1]  CLOSING SolrCore org.apache.solr.core.SolrCore@14262ae
   [junit4]   2> 990126 INFO  (coreCloseExecutor-3160-thread-1) [    x:collection1] o.a.s.u.DirectUpdateHandler2 closing DirectUpdateHandler2{commits=1,autocommits=0,soft autocommits=0,optimizes=0,rollbacks=0,expungeDeletes=0,docsPending=0,adds=0,deletesById=0,deletesByQuery=0,errors=0,cumulative_adds=0,cumulative_deletesById=0,cumulative_deletesByQuery=1,cumulative_errors=0}
   [junit4]   2> 990126 INFO  (coreCloseExecutor-3160-thread-1) [    x:collection1] o.a.s.u.SolrCoreState Closing SolrCoreState
   [junit4]   2> 990126 INFO  (coreCloseExecutor-3160-thread-1) [    x:collection1] o.a.s.u.DefaultSolrCoreState SolrCoreState ref count has reached 0 - closing IndexWriter
   [junit4]   2> 990126 INFO  (coreCloseExecutor-3160-thread-1) [    x:collection1] o.a.s.u.DefaultSolrCoreState closing IndexWriter with IndexWriterCloser
   [junit4]   2> 990126 INFO  (coreCloseExecutor-3160-thread-1) [    x:collection1] o.a.s.c.SolrCore [collection1] Closing main searcher on request.
   [junit4]   2> 990126 INFO  (coreCloseExecutor-3160-thread-1) [    x:collection1] o.a.s.c.CachingDirectoryFactory Closing MockDirectoryFactory - 2 directories currently being tracked
   [junit4]   2> 990126 INFO  (coreCloseExecutor-3160-thread-1) [    x:collection1] o.a.s.c.CachingDirectoryFactory looking to close /home/jenkins/workspace/Lucene-Solr-5.5-Linux/solr/build/solr-core/test/J2/temp/solr.handler.TestReplicationHandler_A7631F261128FBF8-001/solr-instance-001/./collection1/data/index [CachedDir<<refCount=0;path=/home/jenkins/workspace/Lucene-Solr-5.5-Linux/solr/build/solr-core/test/J2/temp/solr.handler.TestReplicationHandler_A7631F261128FBF8-001/solr-instance-001/./collection1/data/index;done=false>>]
   [junit4]   2> 990126 INFO  (coreCloseExecutor-3160-thread-1) [    x:collection1] o.a.s.c.CachingDirectoryFactory Closing directory: /home/jenkins/workspace/Lucene-Solr-5.5-Linux/solr/build/solr-core/test/J2/temp/solr.handler.TestReplicationHandler_A7631F261128FBF8-001/solr-instance-001/./collection1/data/index
   [junit4]   2> 990126 INFO  (coreCloseExecutor-3160-thread-1) [    x:collection1] o.a.s.c.CachingDirectoryFactory looking to close /home/jenkins/workspace/Lucene-Solr-5.5-Linux/solr/build/solr-core/test/J2/temp/solr.handler.TestReplicationHandler_A7631F261128FBF8-001/solr-instance-001/./collection1/data [CachedDir<<refCount=0;path=/home/jenkins/workspace/Lucene-Solr-5.5-Linux/solr/build/solr-core/test/J2/temp/solr.handler.TestReplicationHandler_A7631F261128FBF8-001/solr-instance-001/./collection1/data;done=false>>]
   [junit4]   2> 990126 INFO  (coreCloseExecutor-3160-thread-1) [    x:collection1] o.a.s.c.CachingDirectoryFactory Closing directory: /home/jenkins/workspace/Lucene-Solr-5.5-Linux/solr/build/solr-core/test/J2/temp/solr.handler.TestReplicationHandler_A7631F261128FBF8-001/solr-instance-001/./collection1/data
   [junit4]   2> 990127 INFO  (TEST-TestReplicationHandler.testRateLimitedReplication-seed#[A7631F261128FBF8]) [    ] o.e.j.s.h.ContextHandler Stopped o.e.j.s.ServletContextHandler@16a57f2{/solr,null,UNAVAILABLE}
   [junit4]   2> 990127 INFO  (TEST-TestReplicationHandler.testRateLimitedReplication-seed#[A7631F261128FBF8]) [    ] o.e.j.s.ServerConnector Stopped ServerConnector@6f1e62{HTTP/1.1}{127.0.0.1:0}
   [junit4]   2> 990128 INFO  (TEST-TestReplicationHandler.testRateLimitedReplication-seed#[A7631F261128FBF8]) [    ] o.a.s.c.CoreContainer Shutting down CoreContainer instance=1287958
   [junit4]   2> 990128 INFO  (coreCloseExecutor-3162-thread-1) [    x:collection1] o.a.s.c.SolrCore [collection1]  CLOSING SolrCore org.apache.solr.core.SolrCore@5f2757
   [junit4]   2> 990128 INFO  (coreCloseExecutor-3162-thread-1) [    x:collection1] o.a.s.u.DirectUpdateHandler2 closing DirectUpdateHandler2{commits=1,autocommits=0,soft autocommits=0,optimizes=0,rollbacks=0,expungeDeletes=0,docsPending=0,adds=0,deletesById=0,deletesByQuery=0,errors=0,cumulative_adds=0,cumulative_deletesById=0,cumulative_deletesByQuery=1,cumulative_errors=0}
   [junit4]   2> 990128 INFO  (coreCloseExecutor-3162-thread-1) [    x:collection1] o.a.s.u.SolrCoreState Closing SolrCoreState
   [junit4]   2> 990128 INFO  (coreCloseExecutor-3162-thread-1) [    x:collection1] o.a.s.u.DefaultSolrCoreState SolrCoreState ref count has reached 0 - closing IndexWriter
   [junit4]   2> 990128 INFO  (coreCloseExecutor-3162-thread-1) [    x:collection1] o.a.s.u.DefaultSolrCoreState closing IndexWriter with IndexWriterCloser
   [junit4]   2> 990128 INFO  (coreCloseExecutor-3162-thread-1) [    x:collection1] o.a.s.c.SolrCore [collection1] Closing main searcher on request.
   [junit4]   2> 990128 INFO  (coreCloseExecutor-3162-thread-1) [    x:collection1] o.a.s.c.CachingDirectoryFactory Closing MockDirectoryFactory - 2 directories currently being tracked
   [junit4]   2> 990128 INFO  (coreCloseExecutor-3162-thread-1) [    x:collection1] o.a.s.c.CachingDirectoryFactory looking to close /home/jenkins/workspace/Lucene-Solr-5.5-Linux/solr/build/solr-core/test/J2/temp/solr.handler.TestReplicationHandler_A7631F261128FBF8-001/solr-instance-002/./collection1/data [CachedDir<<refCount=0;path=/home/jenkins/workspace/Lucene-Solr-5.5-Linux/solr/build/solr-core/test/J2/temp/solr.handler.TestReplicationHandler_A7631F261128FBF8-001/solr-instance-002/./collection1/data;done=false>>]
   [junit4]   2> 990128 INFO  (coreCloseExecutor-3162-thread-1) [    x:collection1] o.a.s.c.CachingDirectoryFactory Closing directory: /home/jenkins/workspace/Lucene-Solr-5.5-Linux/solr/build/solr-core/test/J2/temp/solr.handler.TestReplicationHandler_A7631F261128FBF8-001/solr-instance-002/./collection1/data
   [junit4]   2> 990128 INFO  (coreCloseExecutor-3162-thread-1) [    x:collection1] o.a.s.c.CachingDirectoryFactory looking to close /home/jenkins/workspace/Lucene-Solr-5.5-Linux/solr/build/solr-core/test/J2/temp/solr.handler.TestReplicationHandler_A7631F261128FBF8-001/solr-instance-002/./collection1/data/index [CachedDir<<refCount=0;path=/home/jenkins/workspace/Lucene-Solr-5.5-Linux/solr/build/solr-core/test/J2/temp/solr.handler.TestReplicationHandler_A7631F261128FBF8-001/solr-instance-002/./collection1/data/index;done=false>>]
   [junit4]   2> 990128 INFO  (coreCloseExecutor-3162-thread-1) [    x:collection1] o.a.s.c.CachingDirectoryFactory Closing directory: /home/jenkins/workspace/Lucene-Solr-5.5-Linux/solr/build/solr-core/test/J2/temp/solr.handler.TestReplicationHandler_A7631F261128FBF8-001/solr-instance-002/./collection1/data/index
   [junit4]   2> 990129 INFO  (TEST-TestReplicationHandler.testRateLimitedReplication-seed#[A7631F261128FBF8]) [    ] o.e.j.s.h.ContextHandler Stopped o.e.j.s.ServletContextHandler@11bab73{/solr,null,UNAVAILABLE}
   [junit4]   2> 990138 INFO  (TEST-TestReplicationHandler.testRateLimitedReplication-seed#[A7631F261128FBF8]) [    ] o.e.j.s.Server jetty-9.2.13.v20150730
   [junit4]   2> 990139 INFO  (TEST-TestReplicationHandler.testRateLimitedReplication-seed#[A7631F261128FBF8]) [    ] o.e.j.s.h.ContextHandler Started o.e.j.s.ServletContextHandler@1f3c5ec{/solr,null,AVAILABLE}
   [junit4]   2> 990139 INFO  (TEST-TestReplicationHandler.testRateLimitedReplication-seed#[A7631F261128FBF8]) [    ] o.e.j.s.ServerConnector Started ServerConnector@149a5d7{HTTP/1.1}{127.0.0.1:46795}
   [junit4]   2> 990139 INFO  (TEST-TestReplicationHandler.testRateLimitedReplication-seed#[A7631F261128FBF8]) [    ] o.e.j.s.Server Started @991202ms
   [junit4]   2> 990139 INFO  (TEST-TestReplicationHandler.testRateLimitedReplication-seed#[A7631F261128FBF8]) [    ] o.a.s.c.s.e.JettySolrRunner Jetty properties: {hostContext=/solr, hostPort=46795, solr.data.dir=/home/jenkins/workspace/Lucene-Solr-5.5-Linux/solr/build/solr-core/test/J2/temp/solr.handler.TestReplicationHandler_A7631F261128FBF8-001/solr-instance-001/collection1/data}
   [junit4]   2> 990139 INFO  (TEST-TestReplicationHandler.testRateLimitedReplication-seed#[A7631F261128FBF8]) [    ] o.a.s.s.SolrDispatchFilter SolrDispatchFilter.init(): sun.misc.Launcher$AppClassLoader@15e0eab
   [junit4]   2> 990139 INFO  (TEST-TestReplicationHandler.testRateLimitedReplication-seed#[A7631F261128FBF8]) [    ] o.a.s.c.SolrResourceLoader new SolrResourceLoader for directory: '/home/jenkins/workspace/Lucene-Solr-5.5-Linux/solr/build/solr-core/test/J2/temp/solr.handler.TestReplicationHandler_A7631F261128FBF8-001/solr-instance-001'
   [junit4]   2> 990140 INFO  (TEST-TestReplicationHandler.testRateLimitedReplication-seed#[A7631F261128FBF8]) [    ] o.a.s.c.SolrResourceLoader JNDI not configured for solr (NoInitialContextEx)
   [junit4]   2> 990140 INFO  (TEST-TestReplicationHandler.testRateLimitedReplication-seed#[A7631F261128FBF8]) [    ] o.a.s.c.SolrResourceLoader solr home defaulted to 'solr/' (could not find system property or JNDI)
   [junit4]   2> 990140 INFO  (TEST-TestReplicationHandler.testRateLimitedReplication-seed#[A7631F261128FBF8]) [    ] o.a.s.c.SolrXmlConfig Loading container configuration from /home/jenkins/workspace/Lucene-Solr-5.5-Linux/solr/build/solr-core/test/J2/temp/solr.handler.TestReplicationHandler_A7631F261128FBF8-001/solr-instance-001/solr.xml
   [junit4]   2> 990149 INFO  (TEST-TestReplicationHandler.testRateLimitedReplication-seed#[A7631F261128FBF8]) [    ] o.a.s.c.CorePropertiesLocator Config-defined core root directory: /home/jenkins/workspace/Lucene-Solr-5.5-Linux/solr/build/solr-core/test/J2/temp/solr.handler.TestReplicationHandler_A7631F261128FBF8-001/solr-instance-001/.
   [junit4]   2> 990149 INFO  (TEST-TestReplicationHandler.testRateLimitedReplication-seed#[A7631F261128FBF8]) [    ] o.a.s.c.CoreContainer New CoreContainer 1406553
   [junit4]   2> 990149 INFO  (TEST-TestReplicationHandler.testRateLimitedReplication-seed#[A7631F261128FBF8]) [    ] o.a.s.c.CoreContainer Loading cores into CoreContainer [instanceDir=/home/jenkins/workspace/Lucene-Solr-5.5-Linux/solr/build/solr-core/test/J2/temp/solr.handler.TestReplicationHandler_A7631F261128FBF8-001/solr-instance-001]
   [junit4]   2> 990149 WARN  (TEST-TestReplicationHandler.testRateLimitedReplication-seed#[A7631F261128FBF8]) [    ] o.a.s.c.CoreContainer Couldn't add files from /home/jenkins/workspace/Lucene-Solr-5.5-Linux/solr/build/solr-core/test/J2/temp/solr.handler.TestReplicationHandler_A7631F261128FBF8-001/solr-instance-001/lib to classpath: /home/jenkins/workspace/Lucene-Solr-5.5-Linux/solr/build/solr-core/test/J2/temp/solr.handler.TestReplicationHandler_A7631F261128FBF8-001/solr-instance-001/lib
   [junit4]   2> 990149 INFO  (TEST-TestReplicationHandler.testRateLimitedReplication-seed#[A7631F261128FBF8]) [    ] o.a.s.h.c.HttpShardHandlerFactory created with socketTimeout : 90000,urlScheme : ,connTimeout : 15000,maxConnectionsPerHost : 20,maxConnections : 10000,corePoolSize : 0,maximumPoolSize : 2147483647,maxThreadIdleTime : 5,sizeOfQueue : -1,fairnessPolicy : false,useRetries : false,connectionsEvictorSleepDelay : 5000,maxConnectionIdleTime : 40000,
   [junit4]   2> 990150 INFO  (TEST-TestReplicationHandler.testRateLimitedReplication-seed#[A7631F261128FBF8]) [    ] o.a.s.u.UpdateShardHandler Creating UpdateShardHandler HTTP client with params: socketTimeout=340000&connTimeout=45000&retry=true
   [junit4]   2> 990150 INFO  (TEST-TestReplicationHandler.testRateLimitedReplication-seed#[A7631F261128FBF8]) [    ] o.a.s.l.LogWatcher SLF4J impl is org.slf4j.impl.Log4jLoggerFactory
   [junit4]   2> 990150 INFO  (TEST-TestReplicationHandler.testRateLimitedReplication-seed#[A7631F261128FBF8]) [    ] o.a.s.l.LogWatcher Registering Log Listener [Log4j (org.slf4j.impl.Log4jLoggerFactory)]
   [junit4]   2> 990151 INFO  (TEST-TestReplicationHandler.testRateLimitedReplication-seed#[A7631F261128FBF8]) [    ] o.a.s.c.CoreContainer Security conf doesn't exist. Skipping setup for authorization module.
   [junit4]   2> 990151 INFO  (TEST-TestReplicationHandler.testRateLimitedReplication-seed#[A7631F261128FBF8]) [    ] o.a.s.c.CoreContainer No authentication plugin used.
   [junit4]   2> 990151 INFO  (TEST-TestReplicationHandler.testRateLimitedReplication-seed#[A7631F261128FBF8]) [    ] o.a.s.c.CorePropertiesLocator Looking for core definitions underneath /home/jenkins/workspace/Lucene-Solr-5.5-Linux/solr/build/solr-core/test/J2/temp/solr.handler.TestReplicationHandler_A7631F261128FBF8-001/solr-instance-001/.
   [junit4]   2> 990151 INFO  (TEST-TestReplicationHandler.testRateLimitedReplication-seed#[A7631F261128FBF8]) [    ] o.a.s.c.CoreDescriptor Created CoreDescriptor: {loadOnStartup=true, config=solrconfig.xml, dataDir=data/, transient=false, schema=schema.xml, configSetProperties=configsetprops.json, name=collection1}
   [junit4]   2> 990151 INFO  (TEST-TestReplicationHandler.testRateLimitedReplication-seed#[A7631F261128FBF8]) [    ] o.a.s.c.CorePropertiesLocator Found core collection1 in /home/jenkins/workspace/Lucene-Solr-5.5-Linux/solr/build/solr-core/test/J2/temp/solr.handler.TestReplicationHandler_A7631F261128FBF8-001/solr-instance-001/./collection1
   [junit4]   2> 990151 INFO  (TEST-TestReplicationHandler.testRateLimitedReplication-seed#[A7631F261128FBF8]) [    ] o.a.s.c.CorePropertiesLocator Found 1 core definitions
   [junit4]   2> 990152 INFO  (coreLoadExecutor-3169-thread-1) [    ] o.a.s.c.SolrResourceLoader new SolrResourceLoader for directory: '/home/jenkins/workspace/Lucene-Solr-5.5-Linux/solr/build/solr-core/test/J2/temp/solr.handler.TestReplicationHandler_A7631F261128FBF8-001/solr-instance-001/collection1'
   [junit4]   2> 990152 INFO  (TEST-TestReplicationHandler.testRateLimitedReplication-seed#[A7631F261128FBF8]) [    ] o.a.s.s.SolrDispatchFilter user.dir=/home/jenkins/workspace/Lucene-Solr-5.5-Linux/solr/build/solr-core/test/J2
   [junit4]   2> 990152 INFO  (coreLoadExecutor-3169-thread-1) [    ] o.a.s.c.SolrResourceLoader JNDI not configured for solr (NoInitialContextEx)
   [junit4]   2> 990152 INFO  (TEST-TestReplicationHandler.testRateLimitedReplication-seed#[A7631F261128FBF8]) [    ] o.a.s.s.SolrDispatchFilter SolrDispatchFilter.init() done
   [junit4]   2> 990152 INFO  (coreLoadExecutor-3169-thread-1) [    ] o.a.s.c.SolrResourceLoader solr home defaulted to 'solr/' (could not find system property or JNDI)
   [junit4]   2> 990158 INFO  (coreLoadExecutor-3169-thread-1) [    ] o.a.s.c.SolrConfig current version of requestparams : -1
   [junit4]   2> 990169 INFO  (coreLoadExecutor-3169-thread-1) [    ] o.a.s.c.SolrConfig Using Lucene MatchVersion: 5.5.5
   [junit4]   2> 990195 INFO  (coreLoadExecutor-3169-thread-1) [    ] o.a.s.c.SolrConfig Loaded SolrConfig: solrconfig.xml
   [junit4]   2> 990198 INFO  (coreLoadExecutor-3169-thread-1) [    ] o.a.s.s.IndexSchema [collection1] Schema name=test
   [junit4]   2> 990202 INFO  (coreLoadExecutor-3169-thread-1) [    ] o.a.s.s.IndexSchema unique key field: id
   [junit4]   2> 990209 INFO  (coreLoadExecutor-3169-thread-1) [    ] o.a.s.c.ConfigSetProperties Did not find ConfigSet properties, assuming default properties: Can't find resource 'configsetprops.json' in classpath or '/home/jenkins/workspace/Lucene-Solr-5.5-Linux/solr/build/solr-core/test/J2/temp/solr.handler.TestReplicationHandler_A7631F261128FBF8-001/solr-instance-001/collection1'
   [junit4]   2> 990209 INFO  (coreLoadExecutor-3169-thread-1) [    ] o.a.s.c.CoreContainer Creating SolrCore 'collection1' using configuration from instancedir /home/jenkins/workspace/Lucene-Solr-5.5-Linux/solr/build/solr-core/test/J2/temp/solr.handler.TestReplicationHandler_A7631F261128FBF8-001/solr-instance-001/./collection1
   [junit4]   2> 990209 INFO  (coreLoadExecutor-3169-thread-1) [    x:collection1] o.a.s.c.SolrCore solr.StandardDirectoryFactory
   [junit4]   2> 990214 INFO  (coreLoadExecutor-3169-thread-1) [    x:collection1] o.a.s.c.SolrCore [[collection1] ] Opening new SolrCore at [/home/jenkins/workspace/Lucene-Solr-5.5-Linux/solr/build/solr-core/test/J2/temp/solr.handler.TestReplicationHandler_A7631F261128FBF8-001/solr-instance-001/collection1], dataDir=[/home/jenkins/workspace/Lucene-Solr-5.5-Linux/solr/build/solr-core/test/J2/temp/solr.handler.TestReplicationHandler_A7631F261128FBF8-001/solr-instance-001/./collection1/data/]
   [junit4]   2> 990214 INFO  (coreLoadExecutor-3169-thread-1) [    x:collection1] o.a.s.c.SolrCore JMX monitoring not detected for core: collection1
   [junit4]   2> 990214 INFO  (coreLoadExecutor-3169-thread-1) [    x:collection1] o.a.s.c.CachingDirectoryFactory return new directory for /home/jenkins/workspace/Lucene-Solr-5.5-Linux/solr/build/solr-core/test/J2/temp/solr.handler.TestReplicationHandler_A7631F261128FBF8-001/solr-instance-001/collection1/data
   [junit4]   2> 990214 INFO  (coreLoadExecutor-3169-thread-1) [    x:collection1] o.a.s.c.SolrCore New index directory detected: old=null new=/home/jenkins/workspace/Lucene-Solr-5.5-Linux/solr/build/solr-core/test/J2/temp/solr.handler.TestReplicationHandler_A7631F261128FBF8-001/solr-instance-001/./collection1/data/index/
   [junit4]   2> 990214 WARN  (coreLoadExecutor-3169-thread-1) [    x:collection1] o.a.s.c.SolrCore [collection1] Solr index directory '/home/jenkins/workspace/Lucene-Solr-5.5-Linux/solr/build/solr-core/test/J2/temp/solr.handler.TestReplicationHandler_A7631F261128FBF8-001/solr-instance-001/./collection1/data/index' doesn't exist. Creating new index...
   [junit4]   2> 990215 INFO  (coreLoadExecutor-3169-thread-1) [    x:collection1] o.a.s.c.CachingDirectoryFactory return new directory for /home/jenkins/workspace/Lucene-Solr-5.5-Linux/solr/build/solr-core/test/J2/temp/solr.handler.TestReplicationHandler_A7631F261128FBF8-001/solr-instance-001/collection1/data/index
   [junit4]   2> 990215 INFO  (coreLoadExecutor-3169-thread-1) [    x:collection1] o.a.s.u.RandomMergePolicy RandomMergePolicy wrapping class org.apache.lucene.index.LogDocMergePolicy: [LogDocMergePolicy: minMergeSize=1000, mergeFactor=36, maxMergeSize=9223372036854775807, maxMergeSizeForForcedMerge=9223372036854775807, calibrateSizeByDeletes=false, maxMergeDocs=2147483647, maxCFSSegmentSizeMB=8.796093022207999E12, noCFSRatio=0.5132476683786937]
   [junit4]   2> 990227 INFO  (coreLoadExecutor-3169-thread-1) [    x:collection1] o.a.s.c.SolrDeletionPolicy SolrDeletionPolicy.onCommit: commits: num=1
   [junit4]   2> 	commit{dir=/home/jenkins/workspace/Lucene-Solr-5.5-Linux/solr/build/solr-core/test/J2/temp/solr.handler.TestReplicationHandler_A7631F261128FBF8-001/solr-instance-001/collection1/data/index,segFN=segments_1,generation=1}
   [junit4]   2> 990227 INFO  (coreLoadExecutor-3169-thread-1) [    x:collection1] o.a.s.c.SolrDeletionPolicy newest commit generation = 1
   [junit4]   2> 990227 INFO  (OldIndexDirectoryCleanupThreadForCore-collection1) [    x:collection1] o.a.s.c.SolrCore Looking for old index directories to cleanup for core collection1 in /home/jenkins/workspace/Lucene-Solr-5.5-Linux/solr/build/solr-core/test/J2/temp/solr.handler.TestReplicationHandler_A7631F261128FBF8-001/solr-instance-001/./collection1/data/
   [junit4]   2> 990228 INFO  (coreLoadExecutor-3169-thread-1) [    x:collection1] o.a.s.c.SolrCore no updateRequestProcessorChain defined as default, creating implicit default
   [junit4]   2> 990230 INFO  (coreLoadExecutor-3169-thread-1) [    x:collection1] o.a.s.h.l.XMLLoader xsltCacheLifetimeSeconds=60
   [junit4]   2> 990231 INFO  (coreLoadExecutor-3169-thread-1) [    x:collection1] o.a.s.h.l.XMLLoader xsltCacheLifetimeSeconds=60
   [junit4]   2> 990232 INFO  (coreLoadExecutor-3169-thread-1) [    x:collection1] o.a.s.h.l.XMLLoader xsltCacheLifetimeSeconds=60
   [junit4]   2> 990232 INFO  (coreLoadExecutor-3169-thread-1) [    x:collection1] o.a.s.h.l.XMLLoader xsltCacheLifetimeSeconds=60
   [junit4]   2> 990233 INFO  (coreLoadExecutor-3169-thread-1) [    x:collection1] o.a.s.c.PluginBag requestHandler : 'lazy' created with startup=lazy 
   [junit4]   2> 990233 INFO  (coreLoadExecutor-3169-thread-1) [    x:collection1] o.a.s.c.RequestHandlers Registered paths: /config,/update/json,/admin/luke,/get,/admin/mbeans,/update/csv,/update/json/docs,/admin/logging,/admin/threads,defaults,/admin/file,/update,/replication,/admin/properties,standard,lazy,/admin/segments,/admin/system,/admin/plugins,/admin/ping,/schema
   [junit4]   2> 990234 INFO  (coreLoadExecutor-3169-thread-1) [    x:collection1] o.a.s.c.SolrCore Using default statsCache cache: org.apache.solr.search.stats.LocalStatsCache
   [junit4]   2> 990235 INFO  (coreLoadExecutor-3169-thread-1) [    x:collection1] o.a.s.u.CommitTracker Hard AutoCommit: disabled
   [junit4]   2> 990235 INFO  (coreLoadExecutor-3169-thread-1) [    x:collection1] o.a.s.u.CommitTracker Soft AutoCommit: disabled
   [junit4]   2> 990235 INFO  (coreLoadExecutor-3169-thread-1) [    x:collection1] o.a.s.u.RandomMergePolicy RandomMergePolicy wrapping class org.apache.lucene.index.LogDocMergePolicy: [LogDocMergePolicy: minMergeSize=1000, mergeFactor=42, maxMergeSize=9223372036854775807, maxMergeSizeForForcedMerge=9223372036854775807, calibrateSizeByDeletes=true, maxMergeDocs=2147483647, maxCFSSegmentSizeMB=8.796093022207999E12, noCFSRatio=0.0]
   [junit4]   2> 990235 INFO  (coreLoadExecutor-3169-thread-1) [    x:collection1] o.a.s.c.SolrDeletionPolicy SolrDeletionPolicy.onInit: commits: num=1
   [junit4]   2> 	commit{dir=/home/jenkins/workspace/Lucene-Solr-5.5-Linux/solr/build/solr-core/test/J2/temp/solr.handler.TestReplicationHandler_A7631F261128FBF8-001/solr-instance-001/collection1/data/index,segFN=segments_1,generation=1}
   [junit4]   2> 990235 INFO  (coreLoadExecutor-3169-thread-1) [    x:collection1] o.a.s.c.SolrDeletionPolicy newest commit generation = 1
   [junit4]   2> 990235 INFO  (coreLoadExecutor-3169-thread-1) [    x:collection1] o.a.s.s.SolrIndexSearcher Opening Searcher@ccbd34[collection1] main
   [junit4]   2> 990235 INFO  (coreLoadExecutor-3169-thread-1) [    x:collection1] o.a.s.r.ManagedResourceStorage File-based storage initialized to use dir: /home/jenkins/workspace/Lucene-Solr-5.5-Linux/solr/build/solr-core/test/J2/temp/solr.handler.TestReplicationHandler_A7631F261128FBF8-001/solr-instance-001/collection1/conf
   [junit4]   2> 990235 INFO  (coreLoadExecutor-3169-thread-1) [    x:collection1] o.a.s.r.RestManager Initializing RestManager with initArgs: {storageDir=/home/jenkins/workspace/Lucene-Solr-5.5-Linux/solr/build/solr-core/test/J2/temp/solr.handler.TestReplicationHandler_A7631F261128FBF8-001/solr-instance-001/collection1/conf}
   [junit4]   2> 990235 INFO  (coreLoadExecutor-3169-thread-1) [    x:collection1] o.a.s.r.ManagedResourceStorage Reading _rest_managed.json using file:dir=/home/jenkins/workspace/Lucene-Solr-5.5-Linux/solr/build/solr-core/test/J2/temp/solr.handler.TestReplicationHandler_A7631F261128FBF8-001/solr-instance-001/collection1/conf
   [junit4]   2> 990236 INFO  (coreLoadExecutor-3169-thread-1) [    x:collection1] o.a.s.r.RestManager Initializing 0 registered ManagedResources
   [junit4]   2> 990236 INFO  (coreLoadExecutor-3169-thread-1) [    x:collection1] o.a.s.h.ReplicationHandler Commits will be reserved for  10000
   [junit4]   2> 990236 INFO  (coreLoadExecutor-3169-thread-1) [    x:collection1] o.a.s.c.CoreContainer registering core: collection1
   [junit4]   2> 990236 INFO  (searcherExecutor-3170-thread-1-processing-x:collection1) [    x:collection1] o.a.s.c.SolrCore [collection1] Registered new searcher Searcher@ccbd34[collection1] main{ExitableDirectoryReader(UninvertingDirectoryReader())}
   [junit4]   2> 990654 INFO  (qtp11129775-8517) [    x:collection1] o.a.s.u.p.LogUpdateProcessorFactory [collection1]  webapp=/solr path=/update params={wt=javabin&version=2}{add=[0]} 0 0
   [junit4]   2> 990656 INFO  (qtp11129775-8518) [    x:collection1] o.a.s.u.p.LogUpdateProcessorFactory [collection1]  webapp=/solr path=/update params={wt=javabin&version=2}{add=[1]} 0 0
   [junit4]   2> 990657 INFO  (qtp11129775-8519) [    x:collection1] o.a.s.u.p.LogUpdateProcessorFactory [collection1]  webapp=/solr path=/update params={wt=javabin&version=2}{add=[2]} 0 0
   [junit4]   2> 990659 INFO  (qtp11129775-8517) [    x:collection1] o.a.s.u.p.LogUpdateProcessorFactory [collection1]  webapp=/solr path=/update params={wt=javabin&version=2}{add=[3]} 0 0
   [junit4]   2> 990661 INFO  (qtp11129775-8518) [    x:collection1] o.a.s.u.p.LogUpdateProcessorFactory [collection1]  webapp=/solr path=/update params={wt=javabin&version=2}{add=[4]} 0 0
   [junit4]   2> 990663 INFO  (qtp11129775-8519) [    x:collection1] o.a.s.u.p.LogUpdateProcessorFactory [collection1]  webapp=/solr path=/update params={wt=javabin&version=2}{add=[5]} 0 0
   [junit4]   2> 990664 INFO  (qtp11129775-8517) [    x:collection1] o.a.s.u.p.LogUpdateProcessorFactory [collection1]  webapp=/solr path=/update params={wt=javabin&version=2}{add=[6]} 0 0
   [junit4]   2> 990666 INFO  (qtp11129775-8518) [    x:collection1] o.a.s.u.p.LogUpdateProcessorFactory [collection1]  webapp=/solr path=/update params={wt=javabin&version=2}{add=[7]} 0 0
   [junit4]   2> 990668 INFO  (qtp11129775-8519) [    x:collection1] o.a.s.u.p.LogUpdateProcessorFactory [collection1]  webapp=/solr path=/update params={wt=javabin&version=2}{add=[8]} 0 0
   [junit4]   2> 990669 INFO  (qtp11129775-8517) [    x:collection1] o.a.s.u.p.LogUpdateProcessorFactory [collection1]  webapp=/solr path=/update params={wt=javabin&version=2}{add=[9]} 0 0
   [junit4]   2> 990671 INFO  (qtp11129775-8518) [    x:collection1] o.a.s.u.p.LogUpdateProcessorFactory [collection1]  webapp=/solr path=/update params={wt=javabin&version=2}{add=[10]} 0 0
   [junit4]   2> 990673 INFO  (qtp11129775-8519) [    x:collection1] o.a.s.u.p.LogUpdateProcessorFactory [collection1]  webapp=/solr path=/update params={wt=javabin&version=2}{add=[11]} 0 0
   [junit4]   2> 990675 INFO  (qtp11129775-8517) [    x:collection1] o.a.s.u.p.LogUpdateProcessorFactory [collection1]  webapp=/solr path=/update params={wt=javabin&version=2}{add=[12]} 0 0
   [junit4]   2> 990676 INFO  (qtp11129775-8518) [    x:collection1] o.a.s.u.p.LogUpdateProcessorFactory [collection1]  webapp=/solr path=/update params={wt=javabin&version=2}{add=[13]} 0 0
   [junit4]   2> 990678 INFO  (qtp11129775-8519) [    x:collection1] o.a.s.u.p.LogUpdateProcessorFactory [collection1]  webapp=/solr path=/update params={wt=javabin&version=2}{add=[14]} 0 0
   [junit4]   2> 990679 INFO  (qtp11129775-8517) [    x:collection1] o.a.s.u.p.LogUpdateProcessorFactory [collection1]  webapp=/solr path=/update params={wt=javabin&version=2}{add=[15]} 0 0
   [junit4]   2> 990681 INFO  (qtp11129775-8518) [    x:collection1] o.a.s.u.p.LogUpdateProcessorFactory [collection1]  webapp=/solr path=/update params={wt=javabin&version=2}{add=[16]} 0 0
   [junit4]   2> 990683 INFO  (qtp11129775-8519) [    x:collection1] o.a.s.u.p.LogUpdateProcessorFactory [collection1]  webapp=/solr path=/update params={wt=javabin&version=2}{add=[17]} 0 0
   [junit4]   2> 990685 INFO  (qtp11129775-8517) [    x:collection1] o.a.s.u.p.LogUpdateProcessorFactory [collection1]  webapp=/solr path=/update params={wt=javabin&version=2}{add=[18]} 0 0
   [junit4]   2> 990686 INFO  (qtp11129775-8518) [    x:collection1] o.a.s.u.p.LogUpdateProcessorFactory [collection1]  webapp=/solr path=/update params={wt=javabin&version=2}{add=[19]} 0 0
   [junit4]   2> 990688 INFO  (qtp11129775-8519) [    x:collection1] o.a.s.u.p.LogUpdateProcessorFactory [collection1]  webapp=/solr path=/update params={wt=javabin&version=2}{add=[20]} 0 0
   [junit4]   2> 990690 INFO  (qtp11129775-8517) [    x:collection1] o.a.s.u.p.LogUpdateProcessorFactory [collection1]  webapp=/solr path=/update params={wt=javabin&version=2}{add=[21]} 0 0
   [junit4]   2> 990691 INFO  (qtp11129775-8518) [    x:collection1] o.a.s.u.p.LogUpdateProcessorFactory [collection1]  webapp=/solr path=/update params={wt=javabin&version=2}{add=[22]} 0 0
   [junit4]   2> 990693 INFO  (qtp11129775-8519) [    x:collection1] o.a.s.u.p.LogUpdateProcessorFactory [collection1]  webapp=/solr path=/update params={wt=javabin&version=2}{add=[23]} 0 0
   [junit4]   2> 990695 INFO  (qtp11129775-8517) [    x:collection1] o.a.s.u.p.LogUpdateProcessorFactory [collection1]  webapp=/solr path=/update params={wt=javabin&version=2}{add=[24]} 0 0
   [junit4]   2> 990697 INFO  (qtp11129775-8518) [    x:collection1] o.a.s.u.p.LogUpdateProcessorFactory [collection1]  webapp=/solr path=/update params={wt=javabin&version=2}{add=[25]} 0 0
   [junit4]   2> 990698 INFO  (qtp11129775-8519) [    x:collection1] o.a.s.u.p.LogUpdateProcessorFactory [collection1]  webapp=/solr path=/update params={wt=javabin&version=2}{add=[26]} 0 0
   [junit4]   2> 990700 INFO  (qtp11129775-8517) [    x:collection1] o.a.s.u.p.LogUpdateProcessorFactory [collection1]  webapp=/solr path=/update params={wt=javabin&version=2}{add=[27]} 0 0
   [junit4]   2> 990702 INFO  (qtp11129775-8518) [    x:collection1] o.a.s.u.p.LogUpdateProcessorFactory [collection1]  webapp=/solr path=/update params={wt=javabin&version=2}{add=[28]} 0 0
   [junit4]   2> 990703 INFO  (qtp11129775-8519) [    x:collection1] o.a.s.u.p.LogUpdateProcessorFactory [collection1]  webapp=/solr path=/update params={wt=javabin&version=2}{add=[29]} 0 0
   [junit4]   2> 990705 INFO  (qtp11129775-8517) [    x:collection1] o.a.s.u.p.LogUpdateProcessorFactory [collection1]  webapp=/solr path=/update params={wt=javabin&version=2}{add=[30]} 0 0
   [junit4]   2> 990707 INFO  (qtp11129775-8518) [    x:collection1] o.a.s.u.p.LogUpdateProcessorFactory [collection1]  webapp=/solr path=/update params={wt=javabin&version=2}{add=[31]} 0 0
   [junit4]   2> 990709 INFO  (qtp11129775-8519) [    x:collection1] o.a.s.u.p.LogUpdateProcessorFactory [collection1]  webapp=/solr path=/update params={wt=javabin&version=2}{add=[32]} 0 0
   [junit4]   2> 990710 INFO  (qtp11129775-8517) [    x:collection1] o.a.s.u.p.LogUpdateProcessorFactory [collection1]  webapp=/solr path=/update params={wt=javabin&version=2}{add=[33]} 0 0
   [junit4]   2> 990712 INFO  (qtp11129775-8518) [    x:collection1] o.a.s.u.p.LogUpdateProcessorFactory [collection1]  webapp=/solr path=/update params={wt=javabin&version=2}{add=[34]} 0 0
   [junit4]   2> 990713 INFO  (qtp11129775-8519) [    x:collection1] o.a.s.u.p.LogUpdateProcessorFactory [collection1]  webapp=/solr path=/update params={wt=javabin&version=2}{add=[35]} 0 0
   [junit4]   2> 990715 INFO  (qtp11129775-8517) [    x:collection1] o.a.s.u.p.LogUpdateProcessorFactory [collection1]  webapp=/solr path=/update params={wt=javabin&version=2}{add=[36]} 0 0
   [junit4]   2> 990717 INFO  (qtp11129775-8518) [    x:collection1] o.a.s.u.p.LogUpdateProcessorFactory [collection1]  webapp=/solr path=/update params={wt=javabin&version=2}{add=[37]} 0 0
   [junit4]   2> 990718 INFO  (qtp11129775-8519) [    x:collection1] o.a.s.u.p.LogUpdateProcessorFactory [collection1]  webapp=/solr path=/update params={wt=javabin&version=2}{add=[38]} 0 0
   [junit4]   2> 990720 INFO  (qtp11129775-8517) [    x:collection1] o.a.s.u.p.LogUpdateProcessorFactory [collection1]  webapp=/solr path=/update params={wt=javabin&version=2}{add=[39]} 0 0
   [junit4]   2> 990722 INFO  (qtp11129775-8518) [    x:collection1] o.a.s.u.p.LogUpdateProcessorFactory [collection1]  webapp=/solr path=/update params={wt=javabin&version=2}{add=[40]} 0 0
   [junit4]   2> 990723 INFO  (qtp11129775-8519) [    x:collection1] o.a.s.u.p.LogUpdateProcessorFactory [collection1]  webapp=/solr path=/update params={wt=javabin&version=2}{add=[41]} 0 0
   [junit4]   2> 990725 INFO  (qtp11129775-8517) [    x:collection1] o.a.s.u.p.LogUpdateProcessorFactory [collection1]  webapp=/solr path=/update params={wt=javabin&version=2}{add=[42]} 0 0
   [junit4]   2> 990727 INFO  (qtp11129775-8518) [    x:collection1] o.a.s.u.p.LogUpdateProcessorFactory [collection1]  webapp=/solr path=/update params={wt=javabin&version=2}{add=[43]} 0 0
   [junit4]   2> 990729 INFO  (qtp11129775-8519) [    x:collection1] o.a.s.u.p.LogUpdateProcessorFactory [collection1]  webapp=/solr path=/update params={wt=javabin&version=2}{add=[44]} 0 0
   [junit4]   2> 990730 INFO  (qtp11129775-8517) [    x:collection1] o.a.s.u.p.LogUpdateProcessorFactory [collection1]  webapp=/solr path=/update params={wt=javabin&version=2}{add=[45]} 0 0
   [junit4]   2> 990732 INFO  (qtp11129775-8518) [    x:collection1] o.a.s.u.p.LogUpdateProcessorFactory [collection1]  webapp=/solr path=/update params={wt=javabin&version=2}{add=[46]} 0 0
   [junit4]   2> 990734 INFO  (qtp11129775-8519) [    x:collection1] o.a.s.u.p.LogUpdateProcessorFactory [collection1]  webapp=/solr path=/update params={wt=javabin&version=2}{add=[47]} 0 0
   [junit4]   2> 990735 INFO  (qtp11129775-8517) [    x:collection1] o.a.s.u.p.LogUpdateProcessorFactory [collection1]  webapp=/solr path=/update params={wt=javabin&version=2}{add=[48]} 0 0
   [junit4]   2> 990737 INFO  (qtp11129775-8518) [    x:collection1] o.a.s.u.p.LogUpdateProcessorFactory [collection1]  webapp=/solr path=/update params={wt=javabin&version=2}{add=[49]} 0 0
   [junit4]   2> 990739 INFO  (qtp11129775-8519) [    x:collection1] o.a.s.u.p.LogUpdateProcessorFactory [collection1]  webapp=/solr path=/update params={wt=javabin&version=2}{add=[50]} 0 0
   [junit4]   2> 990741 INFO  (qtp11129775-8517) [    x:collection1] o.a.s.u.p.LogUpdateProcessorFactory [collection1]  webapp=/solr path=/update params={wt=javabin&version=2}{add=[51]} 0 0
   [junit4]   2> 990742 INFO  (qtp11129775-8518) [    x:collection1] o.a.s.u.p.LogUpdateProcessorFactory [collection1]  webapp=/solr path=/update params={wt=javabin&version=2}{add=[52]} 0 0
   [junit4]   2> 990744 INFO  (qtp11129775-8519) [    x:collection1] o.a.s.u.p.LogUpdateProcessorFactory [collection1]  webapp=/solr path=/update params={wt=javabin&version=2}{add=[53]} 0 0
   [junit4]   2> 990745 INFO  (qtp11129775-8517) [    x:collection1] o.a.s.u.p.LogUpdateProcessorFactory [collection1]  webapp=/solr path=/update params={wt=javabin&version=2}{add=[54]} 0 0
   [junit4]   2> 990747 INFO  (qtp11129775-8518) [    x:collection1] o.a.s.u.p.LogUpdateProcessorFactory [collection1]  webapp=/solr path=/update params={wt=javabin&version=2}{add=[55]} 0 0
   [junit4]   2> 990748 INFO  (qtp11129775-8519) [    x:collection1] o.a.s.u.p.LogUpdateProcessorFactory [collection1]  webapp=/solr path=/update params={wt=javabin&version=2}{add=[56]} 0 0
   [junit4]   2> 990750 INFO  (qtp11129775-8517) [    x:collection1] o.a.s.u.p.LogUpdateProcessorFactory [collection1]  webapp=/solr path=/update params={wt=javabin&version=2}{add=[57]} 0 0
   [junit4]   2> 990752 INFO  (qtp11129775-8518) [    x:collection1] o.a.s.u.p.LogUpdateProcessorFactory [collection1]  webapp=/solr path=/update params={wt=javabin&version=2}{add=[58]} 0 0
   [junit4]   2> 990754 INFO  (qtp11129775-8519) [    x:collection1] o.a.s.u.p.LogUpdateProcessorFactory [collection1]  webapp=/solr path=/update params={wt=javabin&version=2}{add=[59]} 0 0
   [junit4]   2> 990755 INFO  (qtp11129775-8517) [    x:collection1] o.a.s.u.p.LogUpdateProcessorFactory [collection1]  webapp=/solr path=/update params={wt=javabin&version=2}{add=[60]} 0 0
   [junit4]   2> 990756 INFO  (qtp11129775-8518) [    x:collection1] o.a.s.u.p.LogUpdateProcessorFactory [collection1]  webapp=/solr path=/update params={wt=javabin&version=2}{add=[61]} 0 0
   [junit4]   2> 990758 INFO  (qtp11129775-8519) [    x:collection1] o.a.s.u.p.LogUpdateProcessorFactory [collection1]  webapp=/solr path=/update params={wt=javabin&version=2}{add=[62]} 0 0
   [junit4]   2> 990760 INFO  (qtp11129775-8517) [    x:collection1] o.a.s.u.p.LogUpdateProcessorFactory [collection1]  webapp=/solr path=/update params={wt=javabin&version=2}{add=[63]} 0 0
   [junit4]   2> 990761 INFO  (qtp11129775-8518) [    x:collection1] o.a.s.u.p.LogUpdateProcessorFactory [collection1]  webapp=/solr path=/update params={wt=javabin&version=2}{add=[64]} 0 0
   [junit4]   2> 990763 INFO  (qtp11129775-8519) [    x:collection1] o.a.s.u.p.LogUpdateProcessorFactory [collection1]  webapp=/solr path=/update params={wt=javabin&version=2}{add=[65]} 0 0
   [junit4]   2> 990765 INFO  (qtp11129775-8517) [    x:collection1] o.a.s.u.p.LogUpdateProcessorFactory [collection1]  webapp=/solr path=/update params={wt=javabin&version=2}{add=[66]} 0 0
   [junit4]   2> 990766 INFO  (qtp11129775-8518) [    x:collection1] o.a.s.u.p.LogUpdateProcessorFactory [collection1]  webapp=/solr path=/update params={wt=javabin&version=2}{add=[67]} 0 0
   [junit4]   2> 990768 INFO  (qtp11129775-8519) [    x:collection1] o.a.s.u.p.LogUpdateProcessorFactory [collection1]  webapp=/solr path=/update params={wt=javabin&version=2}{add=[68]} 0 0
   [junit4]   2> 990770 INFO  (qtp11129775-8517) [    x:collection1] o.a.s.u.p.LogUpdateProcessorFactory [collection1]  webapp=/solr path=/update params={wt=javabin&version=2}{add=[69]} 0 0
   [junit4]   2> 990771 INFO  (qtp11129775-8518) [    x:collection1] o.a.s.u.DirectUpdateHandler2 start commit{,optimize=false,openSearcher=true,waitSearcher=true,expungeDeletes=false,softCommit=false,prepareCommit=false}
   [junit4]   2> 990840 INFO  (qtp11129775-8518) [    x:collection1] o.a.s.c.SolrDeletionPolicy SolrDeletionPolicy.onCommit: commits: num=2
   [junit4]   2> 	commit{dir=/home/jenkins/workspace/Lucene-Solr-5.5-Linux/solr/build/solr-core/test/J2/temp/solr.handler.TestReplicationHandler_A7631F261128FBF8-001/solr-instance-001/collection1/data/index,segFN=segments_1,generation=1}
   [junit4]   2> 	commit{dir=/home/jenkins/workspace/Lucene-Solr-5.5-Linux/solr/build/solr-core/test/J2/temp/solr.handler.TestReplicationHandler_A7631F261128FBF8-001/solr-instance-001/collection1/data/index,segFN=segments_2,generation=2}
   [junit4]   2> 990840 INFO  (qtp11129775-8518) [    x:collection1] o.a.s.c.SolrDeletionPolicy newest commit generation = 2
   [junit4]   2> 990842 INFO  (qtp11129775-8518) [    x:collection1] o.a.s.s.SolrIndexSearcher Opening Searcher@e029ee[collection1] main
   [junit4]   2> 990842 INFO  (qtp11129775-8518) [    x:collection1] o.a.s.u.DirectUpdateHandler2 end_commit_flush
   [junit4]   2> 990842 INFO  (searcherExecutor-3170-thread-1-processing-x:collection1) [    x:collection1] o.a.s.c.SolrCore [collection1] Registered new searcher Searcher@e029ee[collection1] main{ExitableDirectoryReader(UninvertingDirectoryReader(Uninverting(_0(5.5.5):C70)))}
   [junit4]   2> 990842 INFO  (qtp11129775-8518) [    x:collection1] o.a.s.u.p.LogUpdateProcessorFactory [collection1]  webapp=/solr path=/update params={softCommit=false&waitSearcher=true&wt=javabin&commit=true&version=2}{commit=} 0 70
   [junit4]   2> 990843 INFO  (TEST-TestReplicationHandler.testRateLimitedReplication-seed#[A7631F261128FBF8]) [    ] o.e.j.s.ServerConnector Stopped ServerConnector@149a5d7{HTTP/1.1}{127.0.0.1:0}
   [junit4]   2> 990843 INFO  (TEST-TestReplicationHandler.testRateLimitedReplication-seed#[A7631F261128FBF8]) [    ] o.a.s.c.CoreContainer Shutting down CoreContainer instance=1406553
   [junit4]   2> 990843 INFO  (coreCloseExecutor-3174-thread-1) [    x:collection1] o.a.s.c.SolrCore [collection1]  CLOSING SolrCore org.apache.solr.core.SolrCore@56ff52
   [junit4]   2> 990843 INFO  (coreCloseExecutor-3174-thread-1) [    x:collection1] o.a.s.u.DirectUpdateHandler2 closing DirectUpdateHandler2{commits=1,autocommits=0,soft autocommits=0,optimizes=0,rollbacks=0,expungeDeletes=0,docsPending=0,adds=0,deletesById=0,deletesByQuery=0,errors=0,cumulative_adds=70,cumulative_deletesById=0,cumulative_deletesByQuery=0,cumulative_errors=0}
   [junit4]   2> 990843 INFO  (coreCloseExecutor-3174-thread-1) [    x:collection1] o.a.s.u.SolrCoreState Closing SolrCoreState
   [junit4]   2> 990843 INFO  (coreCloseExecutor-3174-thread-1) [    x:collection1] o.a.s.u.DefaultSolrCoreState SolrCoreState ref count has reached 0 - closing IndexWriter
   [junit4]   2> 990843 INFO  (coreCloseExecutor-3174-thread-1) [    x:collection1] o.a.s.u.DefaultSolrCoreState closing IndexWriter with IndexWriterCloser
   [junit4]   2> 990843 INFO  (coreCloseExecutor-3174-thread-1) [    x:collection1] o.a.s.c.SolrCore [collection1] Closing main searcher on request.
   [junit4]   2> 990843 INFO  (coreCloseExecutor-3174-thread-1) [    x:collection1] o.a.s.c.CachingDirectoryFactory Closing StandardDirectoryFactory - 2 directories currently being tracked
   [junit4]   2> 990843 INFO  (coreCloseExecutor-3174-thread-1) [    x:collection1] o.a.s.c.CachingDirectoryFactory looking to close /home/jenkins/workspace/Lucene-Solr-5.5-Linux/solr/build/solr-core/test/J2/temp/solr.handler.TestReplicationHandler_A7631F261128FBF8-001/solr-instance-001/collection1/data [CachedDir<<refCount=0;path=/home/jenkins/workspace/Lucene-Solr-5.5-Linux/solr/build/solr-core/test/J2/temp/solr.handler.TestReplicationHandler_A7631F261128FBF8-001/solr-instance-001/collection1/data;done=false>>]
   [junit4]   2> 990844 INFO  (coreCloseExecutor-3174-thread-1) [    x:collection1] o.a.s.c.CachingDirectoryFactory Closing directory: /home/jenkins/workspace/Lucene-Solr-5.5-Linux/solr/build/solr-core/test/J2/temp/solr.handler.TestReplicationHandler_A7631F261128FBF8-001/solr-instance-001/collection1/data
   [junit4]   2> 990844 INFO  (coreCloseExecutor-3174-thread-1) [    x:collection1] o.a.s.c.CachingDirectoryFactory looking to close /home/jenkins/workspace/Lucene-Solr-5.5-Linux/solr/build/solr-core/test/J2/temp/solr.handler.TestReplicationHandler_A7631F261128FBF8-001/solr-instance-001/collection1/data/index [CachedDir<<refCount=0;path=/home/jenkins/workspace/Lucene-Solr-5.5-Linux/solr/build/solr-core/test/J2/temp/solr.handler.TestReplicationHandler_A7631F261128FBF8-001/solr-instance-001/collection1/data/index;done=false>>]
   [junit4]   2> 990844 INFO  (coreCloseExecutor-3174-thread-1) [    x:collection1] o.a.s.c.CachingDirectoryFactory Closing directory: /home/jenkins/workspace/Lucene-Solr-5.5-Linux/solr/build/solr-core/test/J2/temp/solr.handler.TestReplicationHandler_A7631F261128FBF8-001/solr-instance-001/collection1/data/index
   [junit4]   2> 990844 INFO  (TEST-TestReplicationHandler.testRateLimitedReplication-seed#[A7631F261128FBF8]) [    ] o.e.j.s.h.ContextHandler Stopped o.e.j.s.ServletContextHandler@1f3c5ec{/solr,null,UNAVAILABLE}
   [junit4]   2> 990845 INFO  (TEST-TestReplicationHandler.testRateLimitedReplication-seed#[A7631F261128FBF8]) [    ] o.e.j.s.Server jetty-9.2.13.v20150730
   [junit4]   2> 990846 INFO  (TEST-TestReplicationHandler.testRateLimitedReplication-seed#[A7631F261128FBF8]) [    ] o.e.j.s.h.ContextHandler Started o.e.j.s.ServletContextHandler@561a05{/solr,null,AVAILABLE}
   [junit4]   2> 990846 INFO  (TEST-TestReplicationHandler.testRateLimitedReplication-seed#[A7631F261128FBF8]) [    ] o.e.j.s.ServerConnector Started ServerConnector@8aadda{HTTP/1.1}{127.0.0.1:40307}
   [junit4]   2> 990846 INFO  (TEST-TestReplicationHandler.testRateLimitedReplication-seed#[A7631F261128FBF8]) [    ] o.e.j.s.Server Started @991909ms
   [junit4]   2> 990846 INFO  (TEST-TestReplicationHandler.testRateLimitedReplication-seed#[A7631F261128FBF8]) [    ] o.a.s.c.s.e.JettySolrRunner Jetty properties: {solr.data.dir=/home/jenkins/workspace/Lucene-Solr-5.5-Linux/solr/build/solr-core/test/J2/temp/solr.handler.TestReplicationHandler_A7631F261128FBF8-001/solr-instance-001/collection1/data, hostContext=/solr, hostPort=40307}
   [junit4]   2> 990846 INFO  (TEST-TestReplicationHandler.testRateLimitedReplication-seed#[A7631F261128FBF8]) [    ] o.a.s.s.SolrDispatchFilter SolrDispatchFilter.init(): sun.misc.Launcher$AppClassLoader@15e0eab
   [junit4]   2> 990846 INFO  (TEST-TestReplicationHandler.testRateLimitedReplication-seed#[A7631F261128FBF8]) [    ] o.a.s.c.SolrResourceLoader new SolrResourceLoader for directory: '/home/jenkins/workspace/Lucene-Solr-5.5-Linux/solr/build/solr-core/test/J2/temp/solr.handler.TestReplicationHandler_A7631F261128FBF8-001/solr-instance-001'
   [junit4]   2> 990846 INFO  (TEST-TestReplicationHandler.testRateLimitedReplication-seed#[A7631F261128FBF8]) [    ] o.a.s.c.SolrResourceLoader JNDI not configured for solr (NoInitialContextEx)
   [junit4]   2> 990846 INFO  (TEST-TestReplicationHandler.testRateLimitedReplication-seed#[A7631F261128FBF8]) [    ] o.a.s.c.SolrResourceLoader solr home defaulted to 'solr/' (could not find system property or JNDI)
   [junit4]   2> 990847 INFO  (TEST-TestReplicationHandler.testRateLimitedReplication-seed#[A7631F261128FBF8]) [    ] o.a.s.c.SolrXmlConfig Loading container configuration from /home/jenkins/workspace/Lucene-Solr-5.5-Linux/solr/build/solr-core/test/J2/temp/solr.handler.TestReplicationHandler_A7631F261128FBF8-001/solr-instance-001/solr.xml
   [junit4]   2> 990855 INFO  (TEST-TestReplicationHandler.testRateLimitedReplication-seed#[A7631F261128FBF8]) [    ] o.a.s.c.CorePropertiesLocator Config-defined core root directory: /home/jenkins/workspace/Lucene-Solr-5.5-Linux/solr/build/solr-core/test/J2/temp/solr.handler.TestReplicationHandler_A7631F261128FBF8-001/solr-instance-001/.
   [junit4]   2> 990855 INFO  (TEST-TestReplicationHandler.testRateLimitedReplication-seed#[A7631F261128FBF8]) [    ] o.a.s.c.CoreContainer New CoreContainer 16145652
   [junit4]   2> 990855 INFO  (TEST-TestReplicationHandler.testRateLimitedReplication-seed#[A7631F261128FBF8]) [    ] o.a.s.c.CoreContainer Loading cores into CoreContainer [instanceDir=/home/jenkins/workspace/Lucene-Solr-5.5-Linux/solr/build/solr-core/test/J2/temp/solr.handler.TestReplicationHandler_A7631F261128FBF8-001/solr-instance-001]
   [junit4]   2> 990855 WARN  (TEST-TestReplicationHandler.testRateLimitedReplication-seed#[A7631F261128FBF8]) [    ] o.a.s.c.CoreContainer Couldn't add files from /home/jenkins/workspace/Lucene-Solr-5.5-Linux/solr/build/solr-core/test/J2/temp/solr.handler.TestReplicationHandler_A7631F261128FBF8-001/solr-instance-001/lib to classpath: /home/jenkins/workspace/Lucene-Solr-5.5-Linux/solr/build/solr-core/test/J2/temp/solr.handler.TestReplicationHandler_A7631F261128FBF8-001/solr-instance-001/lib
   [junit4]   2> 990855 INFO  (TEST-TestReplicationHandler.testRateLimitedReplication-seed#[A7631F261128FBF8]) [    ] o.a.s.h.c.HttpShardHandlerFactory created with socketTimeout : 90000,urlScheme : ,connTimeout : 15000,maxConnectionsPerHost : 20,maxConnections : 10000,corePoolSize : 0,maximumPoolSize : 2147483647,maxThreadIdleTime : 5,sizeOfQueue : -1,fairnessPolicy : false,useRetries : false,connectionsEvictorSleepDelay : 5000,maxConnectionIdleTime : 40000,
   [junit4]   2> 990856 INFO  (TEST-TestReplicationHandler.testRateLimitedReplication-seed#[A7631F261128FBF8]) [    ] o.a.s.u.UpdateShardHandler Creating UpdateShardHandler HTTP client with params: socketTimeout=340000&connTimeout=45000&retry=true
   [junit4]   2>

[...truncated too long message...]

O  (TEST-TestReplicationHandler.doTestReplicateAfterStartup-seed#[A7631F261128FBF8]) [    ] o.a.s.c.CoreContainer Shutting down CoreContainer instance=3391011
   [junit4]   2> 1068355 INFO  (coreCloseExecutor-3853-thread-1) [    x:collection1] o.a.s.c.SolrCore [collection1]  CLOSING SolrCore org.apache.solr.core.SolrCore@57ea2d
   [junit4]   2> 1068355 INFO  (coreCloseExecutor-3853-thread-1) [    x:collection1] o.a.s.u.DirectUpdateHandler2 closing DirectUpdateHandler2{commits=1,autocommits=0,soft autocommits=0,optimizes=0,rollbacks=0,expungeDeletes=0,docsPending=0,adds=0,deletesById=0,deletesByQuery=0,errors=0,cumulative_adds=492,cumulative_deletesById=0,cumulative_deletesByQuery=0,cumulative_errors=0}
   [junit4]   2> 1068355 INFO  (coreCloseExecutor-3853-thread-1) [    x:collection1] o.a.s.u.SolrCoreState Closing SolrCoreState
   [junit4]   2> 1068355 INFO  (coreCloseExecutor-3853-thread-1) [    x:collection1] o.a.s.u.DefaultSolrCoreState SolrCoreState ref count has reached 0 - closing IndexWriter
   [junit4]   2> 1068355 INFO  (coreCloseExecutor-3853-thread-1) [    x:collection1] o.a.s.u.DefaultSolrCoreState closing IndexWriter with IndexWriterCloser
   [junit4]   2> 1068356 INFO  (coreCloseExecutor-3853-thread-1) [    x:collection1] o.a.s.c.SolrCore [collection1] Closing main searcher on request.
   [junit4]   2> 1068356 INFO  (coreCloseExecutor-3853-thread-1) [    x:collection1] o.a.s.c.CachingDirectoryFactory Closing MockDirectoryFactory - 2 directories currently being tracked
   [junit4]   2> 1068356 INFO  (coreCloseExecutor-3853-thread-1) [    x:collection1] o.a.s.c.CachingDirectoryFactory looking to close /home/jenkins/workspace/Lucene-Solr-5.5-Linux/solr/build/solr-core/test/J2/temp/solr.handler.TestReplicationHandler_A7631F261128FBF8-001/solr-instance-033/./collection1/data/index [CachedDir<<refCount=0;path=/home/jenkins/workspace/Lucene-Solr-5.5-Linux/solr/build/solr-core/test/J2/temp/solr.handler.TestReplicationHandler_A7631F261128FBF8-001/solr-instance-033/./collection1/data/index;done=false>>]
   [junit4]   2> 1068356 INFO  (coreCloseExecutor-3853-thread-1) [    x:collection1] o.a.s.c.CachingDirectoryFactory Closing directory: /home/jenkins/workspace/Lucene-Solr-5.5-Linux/solr/build/solr-core/test/J2/temp/solr.handler.TestReplicationHandler_A7631F261128FBF8-001/solr-instance-033/./collection1/data/index
   [junit4]   2> 1068356 INFO  (coreCloseExecutor-3853-thread-1) [    x:collection1] o.a.s.c.CachingDirectoryFactory looking to close /home/jenkins/workspace/Lucene-Solr-5.5-Linux/solr/build/solr-core/test/J2/temp/solr.handler.TestReplicationHandler_A7631F261128FBF8-001/solr-instance-033/./collection1/data [CachedDir<<refCount=0;path=/home/jenkins/workspace/Lucene-Solr-5.5-Linux/solr/build/solr-core/test/J2/temp/solr.handler.TestReplicationHandler_A7631F261128FBF8-001/solr-instance-033/./collection1/data;done=false>>]
   [junit4]   2> 1068356 INFO  (coreCloseExecutor-3853-thread-1) [    x:collection1] o.a.s.c.CachingDirectoryFactory Closing directory: /home/jenkins/workspace/Lucene-Solr-5.5-Linux/solr/build/solr-core/test/J2/temp/solr.handler.TestReplicationHandler_A7631F261128FBF8-001/solr-instance-033/./collection1/data
   [junit4]   2> 1068356 INFO  (TEST-TestReplicationHandler.doTestReplicateAfterStartup-seed#[A7631F261128FBF8]) [    ] o.e.j.s.h.ContextHandler Stopped o.e.j.s.ServletContextHandler@35a45a{/solr,null,UNAVAILABLE}
   [junit4]   2> 1068365 INFO  (TEST-TestReplicationHandler.doTestReplicateAfterStartup-seed#[A7631F261128FBF8]) [    ] o.e.j.s.ServerConnector Stopped ServerConnector@1894210{HTTP/1.1}{127.0.0.1:0}
   [junit4]   2> 1068365 INFO  (TEST-TestReplicationHandler.doTestReplicateAfterStartup-seed#[A7631F261128FBF8]) [    ] o.a.s.c.CoreContainer Shutting down CoreContainer instance=30809041
   [junit4]   2> 1068366 INFO  (coreCloseExecutor-3855-thread-1) [    x:collection1] o.a.s.c.SolrCore [collection1]  CLOSING SolrCore org.apache.solr.core.SolrCore@1ff8028
   [junit4]   2> 1068366 INFO  (coreCloseExecutor-3855-thread-1) [    x:collection1] o.a.s.u.DirectUpdateHandler2 closing DirectUpdateHandler2{commits=0,autocommits=0,soft autocommits=0,optimizes=0,rollbacks=0,expungeDeletes=0,docsPending=0,adds=0,deletesById=0,deletesByQuery=0,errors=0,cumulative_adds=0,cumulative_deletesById=0,cumulative_deletesByQuery=0,cumulative_errors=0}
   [junit4]   2> 1068366 INFO  (coreCloseExecutor-3855-thread-1) [    x:collection1] o.a.s.u.SolrCoreState Closing SolrCoreState
   [junit4]   2> 1068366 INFO  (coreCloseExecutor-3855-thread-1) [    x:collection1] o.a.s.u.DefaultSolrCoreState SolrCoreState ref count has reached 0 - closing IndexWriter
   [junit4]   2> 1068366 INFO  (coreCloseExecutor-3855-thread-1) [    x:collection1] o.a.s.u.DefaultSolrCoreState closing IndexWriter with IndexWriterCloser
   [junit4]   2> 1068366 INFO  (coreCloseExecutor-3855-thread-1) [    x:collection1] o.a.s.c.SolrCore [collection1] Closing main searcher on request.
   [junit4]   2> 1068366 INFO  (coreCloseExecutor-3855-thread-1) [    x:collection1] o.a.s.c.CachingDirectoryFactory Closing MockDirectoryFactory - 2 directories currently being tracked
   [junit4]   2> 1068366 INFO  (coreCloseExecutor-3855-thread-1) [    x:collection1] o.a.s.c.CachingDirectoryFactory looking to close /home/jenkins/workspace/Lucene-Solr-5.5-Linux/solr/build/solr-core/test/J2/temp/solr.handler.TestReplicationHandler_A7631F261128FBF8-001/solr-instance-034/./collection1/data [CachedDir<<refCount=0;path=/home/jenkins/workspace/Lucene-Solr-5.5-Linux/solr/build/solr-core/test/J2/temp/solr.handler.TestReplicationHandler_A7631F261128FBF8-001/solr-instance-034/./collection1/data;done=false>>]
   [junit4]   2> 1068366 INFO  (coreCloseExecutor-3855-thread-1) [    x:collection1] o.a.s.c.CachingDirectoryFactory Closing directory: /home/jenkins/workspace/Lucene-Solr-5.5-Linux/solr/build/solr-core/test/J2/temp/solr.handler.TestReplicationHandler_A7631F261128FBF8-001/solr-instance-034/./collection1/data
   [junit4]   2> 1068366 INFO  (coreCloseExecutor-3855-thread-1) [    x:collection1] o.a.s.c.CachingDirectoryFactory looking to close /home/jenkins/workspace/Lucene-Solr-5.5-Linux/solr/build/solr-core/test/J2/temp/solr.handler.TestReplicationHandler_A7631F261128FBF8-001/solr-instance-034/./collection1/data/index [CachedDir<<refCount=0;path=/home/jenkins/workspace/Lucene-Solr-5.5-Linux/solr/build/solr-core/test/J2/temp/solr.handler.TestReplicationHandler_A7631F261128FBF8-001/solr-instance-034/./collection1/data/index;done=false>>]
   [junit4]   2> 1068367 INFO  (coreCloseExecutor-3855-thread-1) [    x:collection1] o.a.s.c.CachingDirectoryFactory Closing directory: /home/jenkins/workspace/Lucene-Solr-5.5-Linux/solr/build/solr-core/test/J2/temp/solr.handler.TestReplicationHandler_A7631F261128FBF8-001/solr-instance-034/./collection1/data/index
   [junit4]   2> 1068367 INFO  (TEST-TestReplicationHandler.doTestReplicateAfterStartup-seed#[A7631F261128FBF8]) [    ] o.e.j.s.h.ContextHandler Stopped o.e.j.s.ServletContextHandler@59158{/solr,null,UNAVAILABLE}
   [junit4]   2> 1068368 INFO  (SUITE-TestReplicationHandler-seed#[A7631F261128FBF8]-worker) [    ] o.a.s.SolrTestCaseJ4 ###deleteCore
   [junit4]   2> NOTE: leaving temporary files on disk at: /home/jenkins/workspace/Lucene-Solr-5.5-Linux/solr/build/solr-core/test/J2/temp/solr.handler.TestReplicationHandler_A7631F261128FBF8-001
   [junit4]   2> NOTE: test params are: codec=CheapBastard, sim=DefaultSimilarity, locale=nl, timezone=SystemV/YST9
   [junit4]   2> NOTE: Linux 4.10.0-33-generic i386/Oracle Corporation 1.7.0_80 (32-bit)/cpus=8,threads=1,free=150061648,total=361803776
   [junit4]   2> NOTE: All tests run in this JVM: [ConfigSetsAPITest, TestCollapseQParserPlugin, TestSearchPerf, SolrCloudExampleTest, OverseerRolesTest, SliceStateTest, TestFastWriter, NoCacheHeaderTest, TestClusterStateMutator, BJQParserTest, TestWriterPerf, BadComponentTest, RecoveryZkTest, TestChildDocTransformer, TestPHPSerializedResponseWriter, DateMathParserTest, TestSolrIndexConfig, JavabinLoaderTest, TestStressReorder, TestAnalyzeInfixSuggestions, CustomCollectionTest, DistributedSuggestComponentTest, SuggesterWFSTTest, FieldMutatingUpdateProcessorTest, StatsComponentTest, TestSolrXml, TestTolerantSearch, SearchHandlerTest, ClusterStateTest, TestReload, TestMinMaxOnMultiValuedField, HdfsRestartWhileUpdatingTest, TestIndexSearcher, DistributedDebugComponentTest, TestStressRecovery, CursorMarkTest, TestSuggestSpellingConverter, TestJmxIntegration, TestConfigReload, TestGroupingSearch, LeaderInitiatedRecoveryOnShardRestartTest, TestFreeTextSuggestions, TestExpandComponent, HdfsLockFactoryTest, RegexBoostProcessorTest, SolrTestCaseJ4Test, DocValuesMultiTest, CoreAdminHandlerTest, DebugComponentTest, ScriptEngineTest, HighlighterConfigTest, TestManagedSchemaFieldTypeResource, IgnoreCommitOptimizeUpdateProcessorFactoryTest, HardAutoCommitTest, CoreSorterTest, InfoHandlerTest, FieldAnalysisRequestHandlerTest, TestSolrJ, TestJettySolrRunner, SuggesterTSTTest, HLLSerializationTest, SharedFSAutoReplicaFailoverTest, TestRecovery, HttpPartitionTest, TestBulkSchemaAPI, HdfsChaosMonkeyNothingIsSafeTest, TestInitParams, TestJsonRequest, TestSchemaResource, TestObjectReleaseTracker, TestSerializedLuceneMatchVersion, TestSweetSpotSimilarityFactory, TestSha256AuthenticationProvider, SolrCoreCheckLockOnStartupTest, CheckHdfsIndexTest, SimpleFacetsTest, TestNamedUpdateProcessors, TestJmxMonitoredMap, TestBulkSchemaConcurrent, TestConfigSetsAPIZkFailure, StatelessScriptUpdateProcessorFactoryTest, TestFieldSortValues, DirectSolrConnectionTest, TestSort, TestManagedSchemaAPI, FullSolrCloudDistribCmdsTest, TestManagedResource, TestPostingsSolrHighlighter, DataDrivenBlockJoinTest, TestRestoreCore, SSLMigrationTest, TestPerFieldSimilarityWithDefaultOverride, UnloadDistributedZkTest, OverseerTest, BasicZkTest, TestReplicationHandler]
   [junit4] Completed [266/575 (1!)] on J2 in 79.34s, 16 tests, 1 failure <<< FAILURES!

[...truncated 50076 lines...]

Mime
View raw message