lucene-dev mailing list archives

Site index · List index
Message view « Date » · « Thread »
Top « Date » · « Thread »
From Policeman Jenkins Server <jenk...@thetaphi.de>
Subject [JENKINS] Lucene-Solr-master-Linux (32bit/jdk1.8.0_144) - Build # 20598 - Still Unstable!
Date Tue, 03 Oct 2017 03:54:42 GMT
Build: https://jenkins.thetaphi.de/job/Lucene-Solr-master-Linux/20598/
Java: 32bit/jdk1.8.0_144 -client -XX:+UseConcMarkSweepGC

2 tests failed.
FAILED:  junit.framework.TestSuite.org.apache.solr.cloud.TestSolrCloudWithSecureImpersonation

Error Message:
2 threads leaked from SUITE scope at org.apache.solr.cloud.TestSolrCloudWithSecureImpersonation:     1) Thread[id=14934, name=jetty-launcher-3227-thread-1-EventThread, state=TIMED_WAITING, group=TGRP-TestSolrCloudWithSecureImpersonation]         at sun.misc.Unsafe.park(Native Method)         at java.util.concurrent.locks.LockSupport.parkNanos(LockSupport.java:215)         at java.util.concurrent.locks.AbstractQueuedSynchronizer.doAcquireSharedNanos(AbstractQueuedSynchronizer.java:1037)         at java.util.concurrent.locks.AbstractQueuedSynchronizer.tryAcquireSharedNanos(AbstractQueuedSynchronizer.java:1328)         at java.util.concurrent.CountDownLatch.await(CountDownLatch.java:277)         at org.apache.curator.CuratorZookeeperClient.internalBlockUntilConnectedOrTimedOut(CuratorZookeeperClient.java:323)         at org.apache.curator.RetryLoop.callWithRetry(RetryLoop.java:105)         at org.apache.curator.framework.imps.GetDataBuilderImpl.pathInForeground(GetDataBuilderImpl.java:288)         at org.apache.curator.framework.imps.GetDataBuilderImpl.forPath(GetDataBuilderImpl.java:279)         at org.apache.curator.framework.imps.GetDataBuilderImpl.forPath(GetDataBuilderImpl.java:41)         at org.apache.curator.framework.recipes.shared.SharedValue.readValue(SharedValue.java:244)         at org.apache.curator.framework.recipes.shared.SharedValue.access$100(SharedValue.java:44)         at org.apache.curator.framework.recipes.shared.SharedValue$1.process(SharedValue.java:61)         at org.apache.curator.framework.imps.NamespaceWatcher.process(NamespaceWatcher.java:67)         at org.apache.zookeeper.ClientCnxn$EventThread.processEvent(ClientCnxn.java:530)         at org.apache.zookeeper.ClientCnxn$EventThread.run(ClientCnxn.java:505)    2) Thread[id=14930, name=jetty-launcher-3227-thread-2-EventThread, state=TIMED_WAITING, group=TGRP-TestSolrCloudWithSecureImpersonation]         at sun.misc.Unsafe.park(Native Method)         at java.util.concurrent.locks.LockSupport.parkNanos(LockSupport.java:215)         at java.util.concurrent.locks.AbstractQueuedSynchronizer.doAcquireSharedNanos(AbstractQueuedSynchronizer.java:1037)         at java.util.concurrent.locks.AbstractQueuedSynchronizer.tryAcquireSharedNanos(AbstractQueuedSynchronizer.java:1328)         at java.util.concurrent.CountDownLatch.await(CountDownLatch.java:277)         at org.apache.curator.CuratorZookeeperClient.internalBlockUntilConnectedOrTimedOut(CuratorZookeeperClient.java:323)         at org.apache.curator.RetryLoop.callWithRetry(RetryLoop.java:105)         at org.apache.curator.framework.imps.GetDataBuilderImpl.pathInForeground(GetDataBuilderImpl.java:288)         at org.apache.curator.framework.imps.GetDataBuilderImpl.forPath(GetDataBuilderImpl.java:279)         at org.apache.curator.framework.imps.GetDataBuilderImpl.forPath(GetDataBuilderImpl.java:41)         at org.apache.curator.framework.recipes.shared.SharedValue.readValue(SharedValue.java:244)         at org.apache.curator.framework.recipes.shared.SharedValue.access$100(SharedValue.java:44)         at org.apache.curator.framework.recipes.shared.SharedValue$1.process(SharedValue.java:61)         at org.apache.curator.framework.imps.NamespaceWatcher.process(NamespaceWatcher.java:67)         at org.apache.zookeeper.ClientCnxn$EventThread.processEvent(ClientCnxn.java:530)         at org.apache.zookeeper.ClientCnxn$EventThread.run(ClientCnxn.java:505)

Stack Trace:
com.carrotsearch.randomizedtesting.ThreadLeakError: 2 threads leaked from SUITE scope at org.apache.solr.cloud.TestSolrCloudWithSecureImpersonation: 
   1) Thread[id=14934, name=jetty-launcher-3227-thread-1-EventThread, state=TIMED_WAITING, group=TGRP-TestSolrCloudWithSecureImpersonation]
        at sun.misc.Unsafe.park(Native Method)
        at java.util.concurrent.locks.LockSupport.parkNanos(LockSupport.java:215)
        at java.util.concurrent.locks.AbstractQueuedSynchronizer.doAcquireSharedNanos(AbstractQueuedSynchronizer.java:1037)
        at java.util.concurrent.locks.AbstractQueuedSynchronizer.tryAcquireSharedNanos(AbstractQueuedSynchronizer.java:1328)
        at java.util.concurrent.CountDownLatch.await(CountDownLatch.java:277)
        at org.apache.curator.CuratorZookeeperClient.internalBlockUntilConnectedOrTimedOut(CuratorZookeeperClient.java:323)
        at org.apache.curator.RetryLoop.callWithRetry(RetryLoop.java:105)
        at org.apache.curator.framework.imps.GetDataBuilderImpl.pathInForeground(GetDataBuilderImpl.java:288)
        at org.apache.curator.framework.imps.GetDataBuilderImpl.forPath(GetDataBuilderImpl.java:279)
        at org.apache.curator.framework.imps.GetDataBuilderImpl.forPath(GetDataBuilderImpl.java:41)
        at org.apache.curator.framework.recipes.shared.SharedValue.readValue(SharedValue.java:244)
        at org.apache.curator.framework.recipes.shared.SharedValue.access$100(SharedValue.java:44)
        at org.apache.curator.framework.recipes.shared.SharedValue$1.process(SharedValue.java:61)
        at org.apache.curator.framework.imps.NamespaceWatcher.process(NamespaceWatcher.java:67)
        at org.apache.zookeeper.ClientCnxn$EventThread.processEvent(ClientCnxn.java:530)
        at org.apache.zookeeper.ClientCnxn$EventThread.run(ClientCnxn.java:505)
   2) Thread[id=14930, name=jetty-launcher-3227-thread-2-EventThread, state=TIMED_WAITING, group=TGRP-TestSolrCloudWithSecureImpersonation]
        at sun.misc.Unsafe.park(Native Method)
        at java.util.concurrent.locks.LockSupport.parkNanos(LockSupport.java:215)
        at java.util.concurrent.locks.AbstractQueuedSynchronizer.doAcquireSharedNanos(AbstractQueuedSynchronizer.java:1037)
        at java.util.concurrent.locks.AbstractQueuedSynchronizer.tryAcquireSharedNanos(AbstractQueuedSynchronizer.java:1328)
        at java.util.concurrent.CountDownLatch.await(CountDownLatch.java:277)
        at org.apache.curator.CuratorZookeeperClient.internalBlockUntilConnectedOrTimedOut(CuratorZookeeperClient.java:323)
        at org.apache.curator.RetryLoop.callWithRetry(RetryLoop.java:105)
        at org.apache.curator.framework.imps.GetDataBuilderImpl.pathInForeground(GetDataBuilderImpl.java:288)
        at org.apache.curator.framework.imps.GetDataBuilderImpl.forPath(GetDataBuilderImpl.java:279)
        at org.apache.curator.framework.imps.GetDataBuilderImpl.forPath(GetDataBuilderImpl.java:41)
        at org.apache.curator.framework.recipes.shared.SharedValue.readValue(SharedValue.java:244)
        at org.apache.curator.framework.recipes.shared.SharedValue.access$100(SharedValue.java:44)
        at org.apache.curator.framework.recipes.shared.SharedValue$1.process(SharedValue.java:61)
        at org.apache.curator.framework.imps.NamespaceWatcher.process(NamespaceWatcher.java:67)
        at org.apache.zookeeper.ClientCnxn$EventThread.processEvent(ClientCnxn.java:530)
        at org.apache.zookeeper.ClientCnxn$EventThread.run(ClientCnxn.java:505)
	at __randomizedtesting.SeedInfo.seed([3B85EF51F68AA083]:0)


FAILED:  junit.framework.TestSuite.org.apache.solr.uninverting.TestNumericTerms64

Error Message:
The test or suite printed 13416 bytes to stdout and stderr, even though the limit was set to 8192 bytes. Increase the limit with @Limit, ignore it completely with @SuppressSysoutChecks or run with -Dtests.verbose=true

Stack Trace:
java.lang.AssertionError: The test or suite printed 13416 bytes to stdout and stderr, even though the limit was set to 8192 bytes. Increase the limit with @Limit, ignore it completely with @SuppressSysoutChecks or run with -Dtests.verbose=true
	at __randomizedtesting.SeedInfo.seed([3B85EF51F68AA083]:0)
	at org.apache.lucene.util.TestRuleLimitSysouts.afterIfSuccessful(TestRuleLimitSysouts.java:211)
	at com.carrotsearch.randomizedtesting.rules.TestRuleAdapter$1.afterIfSuccessful(TestRuleAdapter.java:36)
	at com.carrotsearch.randomizedtesting.rules.StatementAdapter.evaluate(StatementAdapter.java:37)
	at org.apache.lucene.util.TestRuleAssertionsRequired$1.evaluate(TestRuleAssertionsRequired.java:53)
	at org.apache.lucene.util.TestRuleMarkFailure$1.evaluate(TestRuleMarkFailure.java:47)
	at org.apache.lucene.util.TestRuleIgnoreAfterMaxFailures$1.evaluate(TestRuleIgnoreAfterMaxFailures.java:64)
	at org.apache.lucene.util.TestRuleIgnoreTestSuites$1.evaluate(TestRuleIgnoreTestSuites.java:54)
	at com.carrotsearch.randomizedtesting.rules.StatementAdapter.evaluate(StatementAdapter.java:36)
	at com.carrotsearch.randomizedtesting.ThreadLeakControl$StatementRunner.run(ThreadLeakControl.java:368)
	at java.lang.Thread.run(Thread.java:748)




Build Log:
[...truncated 12142 lines...]
   [junit4] Suite: org.apache.solr.cloud.TestSolrCloudWithSecureImpersonation
   [junit4]   2> Creating dataDir: /home/jenkins/workspace/Lucene-Solr-master-Linux/solr/build/solr-core/test/J2/temp/solr.cloud.TestSolrCloudWithSecureImpersonation_3B85EF51F68AA083-001/init-core-data-001
   [junit4]   2> 746442 WARN  (SUITE-TestSolrCloudWithSecureImpersonation-seed#[3B85EF51F68AA083]-worker) [    ] o.a.s.SolrTestCaseJ4 startTrackingSearchers: numOpens=300 numCloses=300
   [junit4]   2> 746442 INFO  (SUITE-TestSolrCloudWithSecureImpersonation-seed#[3B85EF51F68AA083]-worker) [    ] o.a.s.SolrTestCaseJ4 Using TrieFields (NUMERIC_POINTS_SYSPROP=false) w/NUMERIC_DOCVALUES_SYSPROP=false
   [junit4]   2> 746443 INFO  (SUITE-TestSolrCloudWithSecureImpersonation-seed#[3B85EF51F68AA083]-worker) [    ] o.a.s.SolrTestCaseJ4 Randomized ssl (false) and clientAuth (true) via: @org.apache.solr.util.RandomizeSSL(reason=, ssl=NaN, value=NaN, clientAuth=NaN)
   [junit4]   2> 746443 INFO  (SUITE-TestSolrCloudWithSecureImpersonation-seed#[3B85EF51F68AA083]-worker) [    ] o.a.s.SolrTestCaseJ4 SecureRandom sanity checks: test.solr.allowed.securerandom=null & java.security.egd=file:/dev/./urandom
   [junit4]   2> 746458 INFO  (SUITE-TestSolrCloudWithSecureImpersonation-seed#[3B85EF51F68AA083]-worker) [    ] o.a.s.c.MiniSolrCloudCluster Starting cluster of 2 servers in /home/jenkins/workspace/Lucene-Solr-master-Linux/solr/build/solr-core/test/J2/temp/solr.cloud.TestSolrCloudWithSecureImpersonation_3B85EF51F68AA083-001/tempDir-001
   [junit4]   2> 746458 INFO  (SUITE-TestSolrCloudWithSecureImpersonation-seed#[3B85EF51F68AA083]-worker) [    ] o.a.s.c.ZkTestServer STARTING ZK TEST SERVER
   [junit4]   2> 746458 INFO  (Thread-1897) [    ] o.a.s.c.ZkTestServer client port:0.0.0.0/0.0.0.0:0
   [junit4]   2> 746458 INFO  (Thread-1897) [    ] o.a.s.c.ZkTestServer Starting server
   [junit4]   2> 746460 ERROR (Thread-1897) [    ] o.a.z.s.ZooKeeperServer ZKShutdownHandler is not registered, so ZooKeeper server won't take any action on ERROR or SHUTDOWN server state changes
   [junit4]   2> 746558 INFO  (SUITE-TestSolrCloudWithSecureImpersonation-seed#[3B85EF51F68AA083]-worker) [    ] o.a.s.c.ZkTestServer start zk server on port:46445
   [junit4]   2> 746570 INFO  (jetty-launcher-3227-thread-1) [    ] o.e.j.s.Server jetty-9.3.20.v20170531
   [junit4]   2> 746570 INFO  (jetty-launcher-3227-thread-2) [    ] o.e.j.s.Server jetty-9.3.20.v20170531
   [junit4]   2> 746579 INFO  (jetty-launcher-3227-thread-1) [    ] o.e.j.s.h.ContextHandler Started o.e.j.s.ServletContextHandler@2b3bd6{/solr,null,AVAILABLE}
   [junit4]   2> 746579 INFO  (jetty-launcher-3227-thread-2) [    ] o.e.j.s.h.ContextHandler Started o.e.j.s.ServletContextHandler@102c399{/solr,null,AVAILABLE}
   [junit4]   2> 746580 INFO  (jetty-launcher-3227-thread-1) [    ] o.e.j.s.AbstractConnector Started ServerConnector@1a66a44{HTTP/1.1,[http/1.1]}{127.0.0.1:46365}
   [junit4]   2> 746580 INFO  (jetty-launcher-3227-thread-2) [    ] o.e.j.s.AbstractConnector Started ServerConnector@19184a3{HTTP/1.1,[http/1.1]}{127.0.0.1:41915}
   [junit4]   2> 746580 INFO  (jetty-launcher-3227-thread-1) [    ] o.e.j.s.Server Started @747775ms
   [junit4]   2> 746580 INFO  (jetty-launcher-3227-thread-2) [    ] o.e.j.s.Server Started @747775ms
   [junit4]   2> 746581 INFO  (jetty-launcher-3227-thread-1) [    ] o.a.s.c.s.e.JettySolrRunner Jetty properties: {hostContext=/solr, hostPort=46365}
   [junit4]   2> 746581 INFO  (jetty-launcher-3227-thread-2) [    ] o.a.s.c.s.e.JettySolrRunner Jetty properties: {hostContext=/solr, hostPort=41915}
   [junit4]   2> 746581 ERROR (jetty-launcher-3227-thread-1) [    ] o.a.s.u.StartupLoggingUtils Missing Java Option solr.log.dir. Logging may be missing or incomplete.
   [junit4]   2> 746581 ERROR (jetty-launcher-3227-thread-2) [    ] o.a.s.u.StartupLoggingUtils Missing Java Option solr.log.dir. Logging may be missing or incomplete.
   [junit4]   2> 746581 INFO  (jetty-launcher-3227-thread-1) [    ] o.a.s.s.SolrDispatchFilter  ___      _       Welcome to Apache Solr? version 8.0.0
   [junit4]   2> 746581 INFO  (jetty-launcher-3227-thread-2) [    ] o.a.s.s.SolrDispatchFilter  ___      _       Welcome to Apache Solr? version 8.0.0
   [junit4]   2> 746581 INFO  (jetty-launcher-3227-thread-1) [    ] o.a.s.s.SolrDispatchFilter / __| ___| |_ _   Starting in cloud mode on port null
   [junit4]   2> 746581 INFO  (jetty-launcher-3227-thread-2) [    ] o.a.s.s.SolrDispatchFilter / __| ___| |_ _   Starting in cloud mode on port null
   [junit4]   2> 746581 INFO  (jetty-launcher-3227-thread-1) [    ] o.a.s.s.SolrDispatchFilter \__ \/ _ \ | '_|  Install dir: null, Default config dir: null
   [junit4]   2> 746582 INFO  (jetty-launcher-3227-thread-2) [    ] o.a.s.s.SolrDispatchFilter \__ \/ _ \ | '_|  Install dir: null, Default config dir: null
   [junit4]   2> 746582 INFO  (jetty-launcher-3227-thread-1) [    ] o.a.s.s.SolrDispatchFilter |___/\___/_|_|    Start time: 2017-10-03T03:07:44.645Z
   [junit4]   2> 746582 INFO  (jetty-launcher-3227-thread-2) [    ] o.a.s.s.SolrDispatchFilter |___/\___/_|_|    Start time: 2017-10-03T03:07:44.645Z
   [junit4]   2> 746585 INFO  (jetty-launcher-3227-thread-2) [    ] o.a.s.s.SolrDispatchFilter solr.xml found in ZooKeeper. Loading...
   [junit4]   2> 746585 INFO  (jetty-launcher-3227-thread-1) [    ] o.a.s.s.SolrDispatchFilter solr.xml found in ZooKeeper. Loading...
   [junit4]   2> 746601 WARN  (NIOServerCxn.Factory:0.0.0.0/0.0.0.0:0) [    ] o.a.z.s.NIOServerCnxn caught end of stream exception
   [junit4]   2> EndOfStreamException: Unable to read additional data from client sessionid 0x15ee0341a0a0001, likely client has closed socket
   [junit4]   2> 	at org.apache.zookeeper.server.NIOServerCnxn.doIO(NIOServerCnxn.java:239)
   [junit4]   2> 	at org.apache.zookeeper.server.NIOServerCnxnFactory.run(NIOServerCnxnFactory.java:203)
   [junit4]   2> 	at java.lang.Thread.run(Thread.java:748)
   [junit4]   2> 746605 INFO  (jetty-launcher-3227-thread-2) [    ] o.a.s.c.ZkContainer Zookeeper client=127.0.0.1:46445/solr
   [junit4]   2> 746607 INFO  (jetty-launcher-3227-thread-1) [    ] o.a.s.c.ZkContainer Zookeeper client=127.0.0.1:46445/solr
   [junit4]   2> 746682 INFO  (jetty-launcher-3227-thread-2) [n:127.0.0.1:41915_solr    ] o.a.s.c.Overseer Overseer (id=null) closing
   [junit4]   2> 746683 INFO  (jetty-launcher-3227-thread-1) [n:127.0.0.1:46365_solr    ] o.a.s.c.Overseer Overseer (id=null) closing
   [junit4]   2> 746683 INFO  (jetty-launcher-3227-thread-2) [n:127.0.0.1:41915_solr    ] o.a.s.c.OverseerElectionContext I am going to be the leader 127.0.0.1:41915_solr
   [junit4]   2> 746683 INFO  (jetty-launcher-3227-thread-2) [n:127.0.0.1:41915_solr    ] o.a.s.c.Overseer Overseer (id=98762756228513797-127.0.0.1:41915_solr-n_0000000000) starting
   [junit4]   2> 746684 INFO  (jetty-launcher-3227-thread-1) [n:127.0.0.1:46365_solr    ] o.a.s.c.ZkController Register node as live in ZooKeeper:/live_nodes/127.0.0.1:46365_solr
   [junit4]   2> 746685 INFO  (zkCallback-3238-thread-1-processing-n:127.0.0.1:41915_solr) [n:127.0.0.1:41915_solr    ] o.a.s.c.c.ZkStateReader Updated live nodes from ZooKeeper... (0) -> (1)
   [junit4]   2> 746685 INFO  (zkCallback-3239-thread-1-processing-n:127.0.0.1:46365_solr) [n:127.0.0.1:46365_solr    ] o.a.s.c.c.ZkStateReader Updated live nodes from ZooKeeper... (0) -> (1)
   [junit4]   2> 746693 INFO  (jetty-launcher-3227-thread-2) [n:127.0.0.1:41915_solr    ] o.a.s.c.ZkController Register node as live in ZooKeeper:/live_nodes/127.0.0.1:41915_solr
   [junit4]   2> 746693 INFO  (zkCallback-3239-thread-1-processing-n:127.0.0.1:46365_solr) [n:127.0.0.1:46365_solr    ] o.a.s.c.c.ZkStateReader Updated live nodes from ZooKeeper... (1) -> (2)
   [junit4]   2> 746693 INFO  (zkCallback-3238-thread-1-processing-n:127.0.0.1:41915_solr) [n:127.0.0.1:41915_solr    ] o.a.s.c.c.ZkStateReader Updated live nodes from ZooKeeper... (1) -> (2)
   [junit4]   2> 746776 INFO  (jetty-launcher-3227-thread-2) [n:127.0.0.1:41915_solr    ] o.a.s.c.CoreContainer Initializing authentication plugin: org.apache.solr.security.HttpParamDelegationTokenPlugin
   [junit4]   2> 746780 WARN  (jetty-launcher-3227-thread-2) [n:127.0.0.1:41915_solr    ] o.a.s.c.s.i.Krb5HttpClientBuilder org.apache.solr.client.solrj.impl.Krb5HttpClientBuilder is configured without specifying system property 'java.security.auth.login.config'
   [junit4]   2> 746781 INFO  (jetty-launcher-3227-thread-2) [n:127.0.0.1:41915_solr    ] o.a.s.s.KerberosPlugin Params: {solr.kerberos.impersonator.user.noGroups.hosts=*, solr.kerberos.impersonator.user.bogusGroup.groups=__some_bogus_group, token.valid=30, cookie.domain=127.0.0.1, solr.kerberos.impersonator.user.anyHostAnyUser.groups=*, solr.kerberos.impersonator.user.bogusGroup.hosts=*, solr.kerberos.impersonator.user.anyHostAnyUser.hosts=*, token.validity=36000, solr.kerberos.impersonator.user.noHosts.groups=*, type=kerberos, solr.kerberos.impersonator.user.localHostAnyGroup.groups=*, delegation-token.token-kind=solr-dt, solr.kerberos.impersonator.user.wrongHost.hosts=1.1.1.1.1.1, cookie.path=/, zk-dt-secret-manager.znodeWorkingPath=solr/security/zkdtsm, solr.kerberos.impersonator.user.localHostAnyGroup.hosts=localhost.localdomain,localhost,127.0.0.1, signer.secret.provider.zookeeper.path=/token, solr.kerberos.impersonator.user.anyHostUsersGroup.groups=jenkins, zk-dt-secret-manager.enable=true, solr.kerberos.impersonator.user.wrongHost.groups=*, kerberos.name.rules=DEFAULT, signer.secret.provider=zookeeper, solr.kerberos.impersonator.user.anyHostUsersGroup.hosts=*}
   [junit4]   2> 746784 INFO  (jetty-launcher-3227-thread-2) [n:127.0.0.1:41915_solr    ] o.a.c.f.i.CuratorFrameworkImpl Starting
   [junit4]   2> 746788 INFO  (jetty-launcher-3227-thread-2-EventThread) [n:127.0.0.1:41915_solr    ] o.a.c.f.s.ConnectionStateManager State change: CONNECTED
   [junit4]   2> 746797 INFO  (jetty-launcher-3227-thread-1) [n:127.0.0.1:46365_solr    ] o.a.s.c.CoreContainer Initializing authentication plugin: org.apache.solr.security.HttpParamDelegationTokenPlugin
   [junit4]   2> 746797 WARN  (jetty-launcher-3227-thread-1) [n:127.0.0.1:46365_solr    ] o.a.s.c.s.i.Krb5HttpClientBuilder org.apache.solr.client.solrj.impl.Krb5HttpClientBuilder is configured without specifying system property 'java.security.auth.login.config'
   [junit4]   2> 746798 INFO  (jetty-launcher-3227-thread-1) [n:127.0.0.1:46365_solr    ] o.a.s.s.KerberosPlugin Params: {solr.kerberos.impersonator.user.noGroups.hosts=*, solr.kerberos.impersonator.user.bogusGroup.groups=__some_bogus_group, token.valid=30, cookie.domain=127.0.0.1, solr.kerberos.impersonator.user.anyHostAnyUser.groups=*, solr.kerberos.impersonator.user.bogusGroup.hosts=*, solr.kerberos.impersonator.user.anyHostAnyUser.hosts=*, token.validity=36000, solr.kerberos.impersonator.user.noHosts.groups=*, type=kerberos, solr.kerberos.impersonator.user.localHostAnyGroup.groups=*, delegation-token.token-kind=solr-dt, solr.kerberos.impersonator.user.wrongHost.hosts=1.1.1.1.1.1, cookie.path=/, zk-dt-secret-manager.znodeWorkingPath=solr/security/zkdtsm, solr.kerberos.impersonator.user.localHostAnyGroup.hosts=localhost.localdomain,localhost,127.0.0.1, signer.secret.provider.zookeeper.path=/token, solr.kerberos.impersonator.user.anyHostUsersGroup.groups=jenkins, zk-dt-secret-manager.enable=true, solr.kerberos.impersonator.user.wrongHost.groups=*, kerberos.name.rules=DEFAULT, signer.secret.provider=zookeeper, solr.kerberos.impersonator.user.anyHostUsersGroup.hosts=*}
   [junit4]   2> 746799 INFO  (jetty-launcher-3227-thread-1) [n:127.0.0.1:46365_solr    ] o.a.c.f.i.CuratorFrameworkImpl Starting
   [junit4]   2> 746800 INFO  (jetty-launcher-3227-thread-1-EventThread) [n:127.0.0.1:46365_solr    ] o.a.c.f.s.ConnectionStateManager State change: CONNECTED
   [junit4]   2> 746811 WARN  (jetty-launcher-3227-thread-1) [n:127.0.0.1:46365_solr    ] o.a.s.c.s.i.Krb5HttpClientBuilder org.apache.solr.client.solrj.impl.Krb5HttpClientBuilder is configured without specifying system property 'java.security.auth.login.config'
   [junit4]   2> 746841 INFO  (jetty-launcher-3227-thread-1) [n:127.0.0.1:46365_solr    ] o.a.s.m.r.SolrJmxReporter JMX monitoring for 'solr_46365.solr.node' (registry 'solr.node') enabled at server: com.sun.jmx.mbeanserver.JmxMBeanServer@1f8192c
   [junit4]   2> 746850 INFO  (jetty-launcher-3227-thread-1) [n:127.0.0.1:46365_solr    ] o.a.s.m.r.SolrJmxReporter JMX monitoring for 'solr_46365.solr.jvm' (registry 'solr.jvm') enabled at server: com.sun.jmx.mbeanserver.JmxMBeanServer@1f8192c
   [junit4]   2> 746850 INFO  (jetty-launcher-3227-thread-1) [n:127.0.0.1:46365_solr    ] o.a.s.m.r.SolrJmxReporter JMX monitoring for 'solr_46365.solr.jetty' (registry 'solr.jetty') enabled at server: com.sun.jmx.mbeanserver.JmxMBeanServer@1f8192c
   [junit4]   2> 746851 INFO  (jetty-launcher-3227-thread-1) [n:127.0.0.1:46365_solr    ] o.a.s.c.CorePropertiesLocator Found 0 core definitions underneath /home/jenkins/workspace/Lucene-Solr-master-Linux/solr/build/solr-core/test/J2/temp/solr.cloud.TestSolrCloudWithSecureImpersonation_3B85EF51F68AA083-001/tempDir-001/node1/.
   [junit4]   2> 747810 WARN  (jetty-launcher-3227-thread-2) [n:127.0.0.1:41915_solr    ] o.a.s.c.s.i.Krb5HttpClientBuilder org.apache.solr.client.solrj.impl.Krb5HttpClientBuilder is configured without specifying system property 'java.security.auth.login.config'
   [junit4]   2> 747858 INFO  (jetty-launcher-3227-thread-2) [n:127.0.0.1:41915_solr    ] o.a.s.m.r.SolrJmxReporter JMX monitoring for 'solr_41915.solr.node' (registry 'solr.node') enabled at server: com.sun.jmx.mbeanserver.JmxMBeanServer@1f8192c
   [junit4]   2> 747867 INFO  (jetty-launcher-3227-thread-2) [n:127.0.0.1:41915_solr    ] o.a.s.m.r.SolrJmxReporter JMX monitoring for 'solr_41915.solr.jvm' (registry 'solr.jvm') enabled at server: com.sun.jmx.mbeanserver.JmxMBeanServer@1f8192c
   [junit4]   2> 747867 INFO  (jetty-launcher-3227-thread-2) [n:127.0.0.1:41915_solr    ] o.a.s.m.r.SolrJmxReporter JMX monitoring for 'solr_41915.solr.jetty' (registry 'solr.jetty') enabled at server: com.sun.jmx.mbeanserver.JmxMBeanServer@1f8192c
   [junit4]   2> 747868 INFO  (jetty-launcher-3227-thread-2) [n:127.0.0.1:41915_solr    ] o.a.s.c.CorePropertiesLocator Found 0 core definitions underneath /home/jenkins/workspace/Lucene-Solr-master-Linux/solr/build/solr-core/test/J2/temp/solr.cloud.TestSolrCloudWithSecureImpersonation_3B85EF51F68AA083-001/tempDir-001/node2/.
   [junit4]   2> 747904 INFO  (TEST-TestSolrCloudWithSecureImpersonation.testProxyInvalidProxyUser-seed#[3B85EF51F68AA083]) [    ] o.a.s.SolrTestCaseJ4 ###Starting testProxyInvalidProxyUser
   [junit4]   2> 747927 INFO  (TEST-TestSolrCloudWithSecureImpersonation.testProxyInvalidProxyUser-seed#[3B85EF51F68AA083]) [    ] o.a.s.SolrTestCaseJ4 ###Ending testProxyInvalidProxyUser
   [junit4]   2> 747936 INFO  (TEST-TestSolrCloudWithSecureImpersonation.testForwarding-seed#[3B85EF51F68AA083]) [    ] o.a.s.SolrTestCaseJ4 ###Starting testForwarding
   [junit4]   2> 748073 WARN  (NIOServerCxn.Factory:0.0.0.0/0.0.0.0:0) [    ] o.a.z.s.NIOServerCnxn caught end of stream exception
   [junit4]   2> EndOfStreamException: Unable to read additional data from client sessionid 0x15ee0341a0a000a, likely client has closed socket
   [junit4]   2> 	at org.apache.zookeeper.server.NIOServerCnxn.doIO(NIOServerCnxn.java:239)
   [junit4]   2> 	at org.apache.zookeeper.server.NIOServerCnxnFactory.run(NIOServerCnxnFactory.java:203)
   [junit4]   2> 	at java.lang.Thread.run(Thread.java:748)
   [junit4]   2> 748074 INFO  (TEST-TestSolrCloudWithSecureImpersonation.testForwarding-seed#[3B85EF51F68AA083]) [    ] o.a.s.c.c.ZkStateReader Updated live nodes from ZooKeeper... (0) -> (2)
   [junit4]   2> 748075 INFO  (TEST-TestSolrCloudWithSecureImpersonation.testForwarding-seed#[3B85EF51F68AA083]) [    ] o.a.s.c.s.i.ZkClientClusterStateProvider Cluster at 127.0.0.1:46445/solr ready
   [junit4]   2> 748079 INFO  (qtp28736148-14898) [n:127.0.0.1:46365_solr    ] o.a.s.h.a.CollectionsHandler Invoked Collection Action :create with params pullReplicas=0&replicationFactor=1&collection.configName=conf1&maxShardsPerNode=1&name=forwardingCollection&nrtReplicas=1&action=CREATE&numShards=1&tlogReplicas=0&wt=javabin&version=2 and sendToOCPQueue=true
   [junit4]   2> 748081 INFO  (OverseerThreadFactory-3638-thread-1-processing-n:127.0.0.1:41915_solr) [n:127.0.0.1:41915_solr    ] o.a.s.c.CreateCollectionCmd Create collection forwardingCollection
   [junit4]   2> 748188 INFO  (OverseerStateUpdate-98762756228513797-127.0.0.1:41915_solr-n_0000000000) [n:127.0.0.1:41915_solr    ] o.a.s.c.o.SliceMutator createReplica() {
   [junit4]   2>   "operation":"ADDREPLICA",
   [junit4]   2>   "collection":"forwardingCollection",
   [junit4]   2>   "shard":"shard1",
   [junit4]   2>   "core":"forwardingCollection_shard1_replica_n1",
   [junit4]   2>   "state":"down",
   [junit4]   2>   "base_url":"http://127.0.0.1:46365/solr",
   [junit4]   2>   "type":"NRT"} 
   [junit4]   2> 748392 INFO  (qtp28736148-14894) [n:127.0.0.1:46365_solr    ] o.a.s.h.a.CoreAdminOperation core create command qt=/admin/cores&coreNodeName=core_node2&collection.configName=conf1&newCollection=true&name=forwardingCollection_shard1_replica_n1&action=CREATE&numShards=1&collection=forwardingCollection&shard=shard1&wt=javabin&version=2&replicaType=NRT
   [junit4]   2> 748393 INFO  (qtp28736148-14894) [n:127.0.0.1:46365_solr    ] o.a.s.c.TransientSolrCoreCacheDefault Allocating transient cache for 2147483647 transient cores
   [junit4]   2> 748502 INFO  (zkCallback-3239-thread-1-processing-n:127.0.0.1:46365_solr) [n:127.0.0.1:46365_solr    ] o.a.s.c.c.ZkStateReader A cluster state change: [WatchedEvent state:SyncConnected type:NodeDataChanged path:/collections/forwardingCollection/state.json] for collection [forwardingCollection] has occurred - updating... (live nodes size: [2])
   [junit4]   2> 748502 INFO  (zkCallback-3239-thread-2-processing-n:127.0.0.1:46365_solr) [n:127.0.0.1:46365_solr    ] o.a.s.c.c.ZkStateReader A cluster state change: [WatchedEvent state:SyncConnected type:NodeDataChanged path:/collections/forwardingCollection/state.json] for collection [forwardingCollection] has occurred - updating... (live nodes size: [2])
   [junit4]   2> 749419 INFO  (qtp28736148-14894) [n:127.0.0.1:46365_solr c:forwardingCollection s:shard1 r:core_node2 x:forwardingCollection_shard1_replica_n1] o.a.s.c.SolrConfig Using Lucene MatchVersion: 8.0.0
   [junit4]   2> 749439 INFO  (qtp28736148-14894) [n:127.0.0.1:46365_solr c:forwardingCollection s:shard1 r:core_node2 x:forwardingCollection_shard1_replica_n1] o.a.s.s.IndexSchema [forwardingCollection_shard1_replica_n1] Schema name=test
   [junit4]   2> 749521 INFO  (qtp28736148-14894) [n:127.0.0.1:46365_solr c:forwardingCollection s:shard1 r:core_node2 x:forwardingCollection_shard1_replica_n1] o.a.s.s.IndexSchema Loaded schema test/1.0 with uniqueid field id
   [junit4]   2> 749534 INFO  (qtp28736148-14894) [n:127.0.0.1:46365_solr c:forwardingCollection s:shard1 r:core_node2 x:forwardingCollection_shard1_replica_n1] o.a.s.c.CoreContainer Creating SolrCore 'forwardingCollection_shard1_replica_n1' using configuration from collection forwardingCollection, trusted=true
   [junit4]   2> 749535 INFO  (qtp28736148-14894) [n:127.0.0.1:46365_solr c:forwardingCollection s:shard1 r:core_node2 x:forwardingCollection_shard1_replica_n1] o.a.s.m.r.SolrJmxReporter JMX monitoring for 'solr_46365.solr.core.forwardingCollection.shard1.replica_n1' (registry 'solr.core.forwardingCollection.shard1.replica_n1') enabled at server: com.sun.jmx.mbeanserver.JmxMBeanServer@1f8192c
   [junit4]   2> 749535 INFO  (qtp28736148-14894) [n:127.0.0.1:46365_solr c:forwardingCollection s:shard1 r:core_node2 x:forwardingCollection_shard1_replica_n1] o.a.s.c.SolrCore solr.RecoveryStrategy.Builder
   [junit4]   2> 749535 INFO  (qtp28736148-14894) [n:127.0.0.1:46365_solr c:forwardingCollection s:shard1 r:core_node2 x:forwardingCollection_shard1_replica_n1] o.a.s.c.SolrCore [[forwardingCollection_shard1_replica_n1] ] Opening new SolrCore at [/home/jenkins/workspace/Lucene-Solr-master-Linux/solr/build/solr-core/test/J2/temp/solr.cloud.TestSolrCloudWithSecureImpersonation_3B85EF51F68AA083-001/tempDir-001/node1/forwardingCollection_shard1_replica_n1], dataDir=[/home/jenkins/workspace/Lucene-Solr-master-Linux/solr/build/solr-core/test/J2/temp/solr.cloud.TestSolrCloudWithSecureImpersonation_3B85EF51F68AA083-001/tempDir-001/node1/./forwardingCollection_shard1_replica_n1/data/]
   [junit4]   2> 749538 INFO  (qtp28736148-14894) [n:127.0.0.1:46365_solr c:forwardingCollection s:shard1 r:core_node2 x:forwardingCollection_shard1_replica_n1] o.a.s.u.RandomMergePolicy RandomMergePolicy wrapping class org.apache.lucene.index.LogDocMergePolicy: [LogDocMergePolicy: minMergeSize=1000, mergeFactor=16, maxMergeSize=9223372036854775807, maxMergeSizeForForcedMerge=9223372036854775807, calibrateSizeByDeletes=false, maxMergeDocs=2147483647, maxCFSSegmentSizeMB=8.796093022207999E12, noCFSRatio=0.0]
   [junit4]   2> 749599 INFO  (qtp28736148-14894) [n:127.0.0.1:46365_solr c:forwardingCollection s:shard1 r:core_node2 x:forwardingCollection_shard1_replica_n1] o.a.s.u.UpdateHandler Using UpdateLog implementation: org.apache.solr.update.UpdateLog
   [junit4]   2> 749599 INFO  (qtp28736148-14894) [n:127.0.0.1:46365_solr c:forwardingCollection s:shard1 r:core_node2 x:forwardingCollection_shard1_replica_n1] o.a.s.u.UpdateLog Initializing UpdateLog: dataDir= defaultSyncLevel=FLUSH numRecordsToKeep=100 maxNumLogsToKeep=10 numVersionBuckets=65536
   [junit4]   2> 749601 INFO  (qtp28736148-14894) [n:127.0.0.1:46365_solr c:forwardingCollection s:shard1 r:core_node2 x:forwardingCollection_shard1_replica_n1] o.a.s.u.CommitTracker Hard AutoCommit: disabled
   [junit4]   2> 749601 INFO  (qtp28736148-14894) [n:127.0.0.1:46365_solr c:forwardingCollection s:shard1 r:core_node2 x:forwardingCollection_shard1_replica_n1] o.a.s.u.CommitTracker Soft AutoCommit: disabled
   [junit4]   2> 749602 INFO  (qtp28736148-14894) [n:127.0.0.1:46365_solr c:forwardingCollection s:shard1 r:core_node2 x:forwardingCollection_shard1_replica_n1] o.a.s.u.RandomMergePolicy RandomMergePolicy wrapping class org.apache.lucene.index.TieredMergePolicy: [TieredMergePolicy: maxMergeAtOnce=35, maxMergeAtOnceExplicit=39, maxMergedSegmentMB=0.7041015625, floorSegmentMB=1.7548828125, forceMergeDeletesPctAllowed=4.647390579635189, segmentsPerTier=42.0, maxCFSSegmentSizeMB=8.796093022207999E12, noCFSRatio=0.0
   [junit4]   2> 749603 INFO  (qtp28736148-14894) [n:127.0.0.1:46365_solr c:forwardingCollection s:shard1 r:core_node2 x:forwardingCollection_shard1_replica_n1] o.a.s.s.SolrIndexSearcher Opening [Searcher@ee9c6e[forwardingCollection_shard1_replica_n1] main]
   [junit4]   2> 749604 INFO  (qtp28736148-14894) [n:127.0.0.1:46365_solr c:forwardingCollection s:shard1 r:core_node2 x:forwardingCollection_shard1_replica_n1] o.a.s.h.c.SpellCheckComponent Initializing spell checkers
   [junit4]   2> 749632 INFO  (qtp28736148-14894) [n:127.0.0.1:46365_solr c:forwardingCollection s:shard1 r:core_node2 x:forwardingCollection_shard1_replica_n1] o.a.s.s.DirectSolrSpellChecker init: {name=direct,classname=DirectSolrSpellChecker,field=lowerfilt,minQueryLength=3}
   [junit4]   2> 749698 INFO  (qtp28736148-14894) [n:127.0.0.1:46365_solr c:forwardingCollection s:shard1 r:core_node2 x:forwardingCollection_shard1_replica_n1] o.a.s.h.ReplicationHandler Commits will be reserved for 10000ms.
   [junit4]   2> 749698 INFO  (searcherExecutor-3643-thread-1-processing-n:127.0.0.1:46365_solr x:forwardingCollection_shard1_replica_n1 s:shard1 c:forwardingCollection r:core_node2) [n:127.0.0.1:46365_solr c:forwardingCollection s:shard1 r:core_node2 x:forwardingCollection_shard1_replica_n1] o.a.s.h.c.SpellCheckComponent Loading spell index for spellchecker: default
   [junit4]   2> 749698 INFO  (qtp28736148-14894) [n:127.0.0.1:46365_solr c:forwardingCollection s:shard1 r:core_node2 x:forwardingCollection_shard1_replica_n1] o.a.s.u.UpdateLog Could not find max version in index or recent updates, using new clock 1580204103052558336
   [junit4]   2> 749699 INFO  (searcherExecutor-3643-thread-1-processing-n:127.0.0.1:46365_solr x:forwardingCollection_shard1_replica_n1 s:shard1 c:forwardingCollection r:core_node2) [n:127.0.0.1:46365_solr c:forwardingCollection s:shard1 r:core_node2 x:forwardingCollection_shard1_replica_n1] o.a.s.h.c.SpellCheckComponent Loading spell index for spellchecker: direct
   [junit4]   2> 749699 INFO  (searcherExecutor-3643-thread-1-processing-n:127.0.0.1:46365_solr x:forwardingCollection_shard1_replica_n1 s:shard1 c:forwardingCollection r:core_node2) [n:127.0.0.1:46365_solr c:forwardingCollection s:shard1 r:core_node2 x:forwardingCollection_shard1_replica_n1] o.a.s.h.c.SpellCheckComponent Loading spell index for spellchecker: wordbreak
   [junit4]   2> 749699 INFO  (searcherExecutor-3643-thread-1-processing-n:127.0.0.1:46365_solr x:forwardingCollection_shard1_replica_n1 s:shard1 c:forwardingCollection r:core_node2) [n:127.0.0.1:46365_solr c:forwardingCollection s:shard1 r:core_node2 x:forwardingCollection_shard1_replica_n1] o.a.s.h.c.SpellCheckComponent Loading spell index for spellchecker: multipleFields
   [junit4]   2> 749699 INFO  (searcherExecutor-3643-thread-1-processing-n:127.0.0.1:46365_solr x:forwardingCollection_shard1_replica_n1 s:shard1 c:forwardingCollection r:core_node2) [n:127.0.0.1:46365_solr c:forwardingCollection s:shard1 r:core_node2 x:forwardingCollection_shard1_replica_n1] o.a.s.h.c.SpellCheckComponent Loading spell index for spellchecker: jarowinkler
   [junit4]   2> 749699 INFO  (searcherExecutor-3643-thread-1-processing-n:127.0.0.1:46365_solr x:forwardingCollection_shard1_replica_n1 s:shard1 c:forwardingCollection r:core_node2) [n:127.0.0.1:46365_solr c:forwardingCollection s:shard1 r:core_node2 x:forwardingCollection_shard1_replica_n1] o.a.s.h.c.SpellCheckComponent Loading spell index for spellchecker: external
   [junit4]   2> 749699 INFO  (searcherExecutor-3643-thread-1-processing-n:127.0.0.1:46365_solr x:forwardingCollection_shard1_replica_n1 s:shard1 c:forwardingCollection r:core_node2) [n:127.0.0.1:46365_solr c:forwardingCollection s:shard1 r:core_node2 x:forwardingCollection_shard1_replica_n1] o.a.s.h.c.SpellCheckComponent Loading spell index for spellchecker: freq
   [junit4]   2> 749699 INFO  (searcherExecutor-3643-thread-1-processing-n:127.0.0.1:46365_solr x:forwardingCollection_shard1_replica_n1 s:shard1 c:forwardingCollection r:core_node2) [n:127.0.0.1:46365_solr c:forwardingCollection s:shard1 r:core_node2 x:forwardingCollection_shard1_replica_n1] o.a.s.h.c.SpellCheckComponent Loading spell index for spellchecker: fqcn
   [junit4]   2> 749700 INFO  (searcherExecutor-3643-thread-1-processing-n:127.0.0.1:46365_solr x:forwardingCollection_shard1_replica_n1 s:shard1 c:forwardingCollection r:core_node2) [n:127.0.0.1:46365_solr c:forwardingCollection s:shard1 r:core_node2 x:forwardingCollection_shard1_replica_n1] o.a.s.h.c.SpellCheckComponent Loading spell index for spellchecker: perDict
   [junit4]   2> 749701 INFO  (searcherExecutor-3643-thread-1-processing-n:127.0.0.1:46365_solr x:forwardingCollection_shard1_replica_n1 s:shard1 c:forwardingCollection r:core_node2) [n:127.0.0.1:46365_solr c:forwardingCollection s:shard1 r:core_node2 x:forwardingCollection_shard1_replica_n1] o.a.s.c.SolrCore [forwardingCollection_shard1_replica_n1] Registered new searcher Searcher@ee9c6e[forwardingCollection_shard1_replica_n1] main{ExitableDirectoryReader(UninvertingDirectoryReader())}
   [junit4]   2> 749704 INFO  (qtp28736148-14894) [n:127.0.0.1:46365_solr c:forwardingCollection s:shard1 r:core_node2 x:forwardingCollection_shard1_replica_n1] o.a.s.c.ShardLeaderElectionContext Enough replicas found to continue.
   [junit4]   2> 749704 INFO  (qtp28736148-14894) [n:127.0.0.1:46365_solr c:forwardingCollection s:shard1 r:core_node2 x:forwardingCollection_shard1_replica_n1] o.a.s.c.ShardLeaderElectionContext I may be the new leader - try and sync
   [junit4]   2> 749704 INFO  (qtp28736148-14894) [n:127.0.0.1:46365_solr c:forwardingCollection s:shard1 r:core_node2 x:forwardingCollection_shard1_replica_n1] o.a.s.c.SyncStrategy Sync replicas to http://127.0.0.1:46365/solr/forwardingCollection_shard1_replica_n1/
   [junit4]   2> 749704 INFO  (qtp28736148-14894) [n:127.0.0.1:46365_solr c:forwardingCollection s:shard1 r:core_node2 x:forwardingCollection_shard1_replica_n1] o.a.s.c.SyncStrategy Sync Success - now sync replicas to me
   [junit4]   2> 749704 INFO  (qtp28736148-14894) [n:127.0.0.1:46365_solr c:forwardingCollection s:shard1 r:core_node2 x:forwardingCollection_shard1_replica_n1] o.a.s.c.SyncStrategy http://127.0.0.1:46365/solr/forwardingCollection_shard1_replica_n1/ has no replicas
   [junit4]   2> 749704 INFO  (qtp28736148-14894) [n:127.0.0.1:46365_solr c:forwardingCollection s:shard1 r:core_node2 x:forwardingCollection_shard1_replica_n1] o.a.s.c.ShardLeaderElectionContext Found all replicas participating in election, clear LIR
   [junit4]   2> 749705 INFO  (qtp28736148-14894) [n:127.0.0.1:46365_solr c:forwardingCollection s:shard1 r:core_node2 x:forwardingCollection_shard1_replica_n1] o.a.s.c.ShardLeaderElectionContext I am the new leader: http://127.0.0.1:46365/solr/forwardingCollection_shard1_replica_n1/ shard1
   [junit4]   2> 749807 INFO  (zkCallback-3239-thread-2-processing-n:127.0.0.1:46365_solr) [n:127.0.0.1:46365_solr    ] o.a.s.c.c.ZkStateReader A cluster state change: [WatchedEvent state:SyncConnected type:NodeDataChanged path:/collections/forwardingCollection/state.json] for collection [forwardingCollection] has occurred - updating... (live nodes size: [2])
   [junit4]   2> 749807 INFO  (zkCallback-3239-thread-1-processing-n:127.0.0.1:46365_solr) [n:127.0.0.1:46365_solr    ] o.a.s.c.c.ZkStateReader A cluster state change: [WatchedEvent state:SyncConnected type:NodeDataChanged path:/collections/forwardingCollection/state.json] for collection [forwardingCollection] has occurred - updating... (live nodes size: [2])
   [junit4]   2> 749856 INFO  (qtp28736148-14894) [n:127.0.0.1:46365_solr c:forwardingCollection s:shard1 r:core_node2 x:forwardingCollection_shard1_replica_n1] o.a.s.c.ZkController I am the leader, no recovery necessary
   [junit4]   2> 749858 INFO  (qtp28736148-14894) [n:127.0.0.1:46365_solr c:forwardingCollection s:shard1 r:core_node2 x:forwardingCollection_shard1_replica_n1] o.a.s.s.HttpSolrCall [admin] webapp=null path=/admin/cores params={qt=/admin/cores&coreNodeName=core_node2&collection.configName=conf1&newCollection=true&name=forwardingCollection_shard1_replica_n1&action=CREATE&numShards=1&collection=forwardingCollection&shard=shard1&wt=javabin&version=2&replicaType=NRT} status=0 QTime=1465
   [junit4]   2> 749863 INFO  (qtp28736148-14898) [n:127.0.0.1:46365_solr    ] o.a.s.h.a.CollectionsHandler Wait for new collection to be active for at most 30 seconds. Check all shard replicas
   [junit4]   2> 749959 INFO  (zkCallback-3239-thread-1-processing-n:127.0.0.1:46365_solr) [n:127.0.0.1:46365_solr    ] o.a.s.c.c.ZkStateReader A cluster state change: [WatchedEvent state:SyncConnected type:NodeDataChanged path:/collections/forwardingCollection/state.json] for collection [forwardingCollection] has occurred - updating... (live nodes size: [2])
   [junit4]   2> 749959 INFO  (zkCallback-3239-thread-2-processing-n:127.0.0.1:46365_solr) [n:127.0.0.1:46365_solr    ] o.a.s.c.c.ZkStateReader A cluster state change: [WatchedEvent state:SyncConnected type:NodeDataChanged path:/collections/forwardingCollection/state.json] for collection [forwardingCollection] has occurred - updating... (live nodes size: [2])
   [junit4]   2> 750082 INFO  (OverseerCollectionConfigSetProcessor-98762756228513797-127.0.0.1:41915_solr-n_0000000000) [n:127.0.0.1:41915_solr    ] o.a.s.c.OverseerTaskQueue Response ZK path: /overseer/collection-queue-work/qnr-0000000000 doesn't exist.  Requestor may have disconnected from ZooKeeper
   [junit4]   2> 750864 INFO  (qtp28736148-14898) [n:127.0.0.1:46365_solr    ] o.a.s.s.HttpSolrCall [admin] webapp=null path=/admin/collections params={pullReplicas=0&replicationFactor=1&collection.configName=conf1&maxShardsPerNode=1&name=forwardingCollection&nrtReplicas=1&action=CREATE&numShards=1&tlogReplicas=0&wt=javabin&version=2} status=0 QTime=2784
   [junit4]   2> 750865 INFO  (TEST-TestSolrCloudWithSecureImpersonation.testForwarding-seed#[3B85EF51F68AA083]) [    ] o.a.s.c.AbstractDistribZkTestBase Wait for recoveries to finish - collection: forwardingCollection failOnTimeout:true timeout (sec):100
   [junit4]   2> 750866 INFO  (TEST-TestSolrCloudWithSecureImpersonation.testForwarding-seed#[3B85EF51F68AA083]) [    ] o.a.s.c.AbstractDistribZkTestBase Recoveries finished - collection: forwardingCollection
   [junit4]   2> 750875 INFO  (qtp28736148-14887) [n:127.0.0.1:46365_solr c:forwardingCollection s:shard1 r:core_node2 x:forwardingCollection_shard1_replica_n1] o.a.s.c.S.Request [forwardingCollection_shard1_replica_n1]  webapp=/solr path=/select params={q=*:*&wt=javabin&version=2} hits=0 status=0 QTime=1
   [junit4]   2> 750882 INFO  (qtp19132474-14897) [n:127.0.0.1:41915_solr    ] o.a.s.c.TransientSolrCoreCacheDefault Allocating transient cache for 2147483647 transient cores
   [junit4]   2> 750887 INFO  (qtp28736148-14887) [n:127.0.0.1:46365_solr c:forwardingCollection s:shard1 r:core_node2 x:forwardingCollection_shard1_replica_n1] o.a.s.c.S.Request [forwardingCollection_shard1_replica_n1]  webapp=/solr path=/select params={q=*:*&wt=javabin&version=2} hits=0 status=0 QTime=0
   [junit4]   2> 750890 INFO  (TEST-TestSolrCloudWithSecureImpersonation.testForwarding-seed#[3B85EF51F68AA083]) [    ] o.a.s.SolrTestCaseJ4 ###Ending testForwarding
   [junit4]   2> 750924 INFO  (TEST-TestSolrCloudWithSecureImpersonation.testProxyNullProxyUser-seed#[3B85EF51F68AA083]) [    ] o.a.s.SolrTestCaseJ4 ###Starting testProxyNullProxyUser
   [junit4]   2> 750940 WARN  (qtp28736148-14896) [    ] o.a.h.s.a.s.AuthenticationFilter AuthenticationToken ignored: Invalid AuthenticationToken type
   [junit4]   2> 750941 INFO  (qtp28736148-14896) [    ] o.a.s.s.SolrDispatchFilter Error authenticating
   [junit4]   2> java.lang.IllegalArgumentException: userName is NULL, empty or contains a '&'
   [junit4]   2> 	at org.apache.hadoop.security.authentication.util.AuthToken.checkForIllegalArgument(AuthToken.java:87)
   [junit4]   2> 	at org.apache.hadoop.security.authentication.util.AuthToken.<init>(AuthToken.java:70)
   [junit4]   2> 	at org.apache.hadoop.security.authentication.server.AuthenticationToken.<init>(AuthenticationToken.java:58)
   [junit4]   2> 	at org.apache.solr.security.HttpParamDelegationTokenPlugin$HttpParamDelegationTokenAuthenticationHandler$HttpParamAuthenticationHandler.authenticate(HttpParamDelegationTokenPlugin.java:213)
   [junit4]   2> 	at org.apache.hadoop.security.token.delegation.web.DelegationTokenAuthenticationHandler.authenticate(DelegationTokenAuthenticationHandler.java:348)
   [junit4]   2> 	at org.apache.solr.security.RequestContinuesRecorderAuthenticationHandler.authenticate(RequestContinuesRecorderAuthenticationHandler.java:69)
   [junit4]   2> 	at org.apache.hadoop.security.authentication.server.AuthenticationFilter.doFilter(AuthenticationFilter.java:518)
   [junit4]   2> 	at org.apache.solr.security.DelegationTokenKerberosFilter.doFilter(DelegationTokenKerberosFilter.java:134)
   [junit4]   2> 	at org.apache.solr.security.HttpParamDelegationTokenPlugin$HttpParamToRequestFilter.doFilter(HttpParamDelegationTokenPlugin.java:245)
   [junit4]   2> 	at org.apache.solr.security.KerberosPlugin.doAuthenticate(KerberosPlugin.java:243)
   [junit4]   2> 	at org.apache.solr.servlet.SolrDispatchFilter.authenticateRequest(SolrDispatchFilter.java:451)
   [junit4]   2> 	at org.apache.solr.servlet.SolrDispatchFilter.doFilter(SolrDispatchFilter.java:347)
   [junit4]   2> 	at org.apache.solr.servlet.SolrDispatchFilter.doFilter(SolrDispatchFilter.java:326)
   [junit4]   2> 	at org.eclipse.jetty.servlet.ServletHandler$CachedChain.doFilter(ServletHandler.java:1759)
   [junit4]   2> 	at org.apache.solr.client.solrj.embedded.JettySolrRunner$DebugFilter.doFilter(JettySolrRunner.java:139)
   [junit4]   2> 	at org.eclipse.jetty.servlet.ServletHandler$CachedChain.doFilter(ServletHandler.java:1759)
   [junit4]   2> 	at org.eclipse.jetty.servlet.ServletHandler.doHandle(ServletHandler.java:582)
   [junit4]   2> 	at org.eclipse.jetty.server.session.SessionHandler.doHandle(SessionHandler.java:224)
   [junit4]   2> 	at org.eclipse.jetty.server.handler.ContextHandler.doHandle(ContextHandler.java:1180)
   [junit4]   2> 	at org.eclipse.jetty.servlet.ServletHandler.doScope(ServletHandler.java:512)
   [junit4]   2> 	at org.eclipse.jetty.server.session.SessionHandler.doScope(SessionHandler.java:185)
   [junit4]   2> 	at org.eclipse.jetty.server.handler.ContextHandler.doScope(ContextHandler.java:1112)
   [junit4]   2> 	at org.eclipse.jetty.server.handler.ScopedHandler.handle(ScopedHandler.java:141)
   [junit4]   2> 	at org.eclipse.jetty.server.handler.gzip.GzipHandler.handle(GzipHandler.java:493)
   [junit4]   2> 	at org.eclipse.jetty.server.handler.HandlerWrapper.handle(HandlerWrapper.java:134)
   [junit4]   2> 	at org.eclipse.jetty.server.Server.handle(Server.java:534)
   [junit4]   2> 	at org.eclipse.jetty.server.HttpChannel.handle(HttpChannel.java:320)
   [junit4]   2> 	at org.eclipse.jetty.server.HttpConnection.onFillable(HttpConnection.java:251)
   [junit4]   2> 	at org.eclipse.jetty.io.AbstractConnection$ReadCallback.succeeded(AbstractConnection.java:283)
   [junit4]   2> 	at org.eclipse.jetty.io.FillInterest.fillable(FillInterest.java:108)
   [junit4]   2> 	at org.eclipse.jetty.io.SelectChannelEndPoint$2.run(SelectChannelEndPoint.java:93)
   [junit4]   2> 	at org.eclipse.jetty.util.thread.strategy.ExecuteProduceConsume.executeProduceConsume(ExecuteProduceConsume.java:303)
   [junit4]   2> 	at org.eclipse.jetty.util.thread.strategy.ExecuteProduceConsume.produceConsume(ExecuteProduceConsume.java:148)
   [junit4]   2> 	at org.eclipse.jetty.util.thread.strategy.ExecuteProduceConsume.run(ExecuteProduceConsume.java:136)
   [junit4]   2> 	at org.eclipse.jetty.util.thread.QueuedThreadPool.runJob(QueuedThreadPool.java:671)
   [junit4]   2> 	at org.eclipse.jetty.util.thread.QueuedThreadPool$2.run(QueuedThreadPool.java:589)
   [junit4]   2> 	at java.lang.Thread.run(Thread.java:748)
   [junit4]   2> 750942 WARN  (qtp28736148-14896) [    ] o.e.j.s.ServletHandler /solr/admin/collections
   [junit4]   2> org.apache.solr.common.SolrException: Error during request authentication, 
   [junit4]   2> 	at org.apache.solr.servlet.SolrDispatchFilter.authenticateRequest(SolrDispatchFilter.java:457)
   [junit4]   2> 	at org.apache.solr.servlet.SolrDispatchFilter.doFilter(SolrDispatchFilter.java:347)
   [junit4]   2> 	at org.apache.solr.servlet.SolrDispatchFilter.doFilter(SolrDispatchFilter.java:326)
   [junit4]   2> 	at org.eclipse.jetty.servlet.ServletHandler$CachedChain.doFilter(ServletHandler.java:1759)
   [junit4]   2> 	at org.apache.solr.client.solrj.embedded.JettySolrRunner$DebugFilter.doFilter(JettySolrRunner.java:139)
   [junit4]   2> 	at org.eclipse.jetty.servlet.ServletHandler$CachedChain.doFilter(ServletHandler.java:1759)
   [junit4]   2> 	at org.eclipse.jetty.servlet.ServletHandler.doHandle(ServletHandler.java:582)
   [junit4]   2> 	at org.eclipse.jetty.server.session.SessionHandler.doHandle(SessionHandler.java:224)
   [junit4]   2> 	at org.eclipse.jetty.server.handler.ContextHandler.doHandle(ContextHandler.java:1180)
   [junit4]   2> 	at org.eclipse.jetty.servlet.ServletHandler.doScope(ServletHandler.java:512)
   [junit4]   2> 	at org.eclipse.jetty.server.session.SessionHandler.doScope(SessionHandler.java:185)
   [junit4]   2> 	at org.eclipse.jetty.server.handler.ContextHandler.doScope(ContextHandler.java:1112)
   [junit4]   2> 	at org.eclipse.jetty.server.handler.ScopedHandler.handle(ScopedHandler.java:141)
   [junit4]   2> 	at org.eclipse.jetty.server.handler.gzip.GzipHandler.handle(GzipHandler.java:493)
   [junit4]   2> 	at org.eclipse.jetty.server.handler.HandlerWrapper.handle(HandlerWrapper.java:134)
   [junit4]   2> 	at org.eclipse.jetty.server.Server.handle(Server.java:534)
   [junit4]   2> 	at org.eclipse.jetty.server.HttpChannel.handle(HttpChannel.java:320)
   [junit4]   2> 	at org.eclipse.jetty.server.HttpConnection.onFillable(HttpConnection.java:251)
   [junit4]   2> 	at org.eclipse.jetty.io.AbstractConnection$ReadCallback.succeeded(AbstractConnection.java:283)
   [junit4]   2> 	at org.eclipse.jetty.io.FillInterest.fillable(FillInterest.java:108)
   [junit4]   2> 	at org.eclipse.jetty.io.SelectChannelEndPoint$2.run(SelectChannelEndPoint.java:93)
   [junit4]   2> 	at org.eclipse.jetty.util.thread.strategy.ExecuteProduceConsume.executeProduceConsume(ExecuteProduceConsume.java:303)
   [junit4]   2> 	at org.eclipse.jetty.util.thread.strategy.ExecuteProduceConsume.produceConsume(ExecuteProduceConsume.java:148)
   [junit4]   2> 	at org.eclipse.jetty.util.thread.strategy.ExecuteProduceConsume.run(ExecuteProduceConsume.java:136)
   [junit4]   2> 	at org.eclipse.jetty.util.thread.QueuedThreadPool.runJob(QueuedThreadPool.java:671)
   [junit4]   2> 	at org.eclipse.jetty.util.thread.QueuedThreadPool$2.run(QueuedThreadPool.java:589)
   [junit4]   2> 	at java.lang.Thread.run(Thread.java:748)
   [junit4]   2> Caused by: java.lang.IllegalArgumentException: userName is NULL, empty or contains a '&'
   [junit4]   2> 	at org.apache.hadoop.security.authentication.util.AuthToken.checkForIllegalArgument(AuthToken.java:87)
   [junit4]   2> 	at org.apache.hadoop.security.authentication.util.AuthToken.<init>(AuthToken.java:70)
   [junit4]   2> 	at org.apache.hadoop.security.authentication.server.AuthenticationToken.<init>(AuthenticationToken.java:58)
   [junit4]   2> 	at org.apache.solr.security.HttpParamDelegationTokenPlugin$HttpParamDelegationTokenAuthenticationHandler$HttpParamAuthenticationHandler.authenticate(HttpParamDelegationTokenPlugin.java:213)
   [junit4]   2> 	at org.apache.hadoop.security.token.delegation.web.DelegationTokenAuthenticationHandler.authenticate(DelegationTokenAuthenticationHandler.java:348)
   [junit4]   2> 	at org.apache.solr.security.RequestContinuesRecorderAuthenticationHandler.authenticate(RequestContinuesRecorderAuthenticationHandler.java:69)
   [junit4]   2> 	at org.apache.hadoop.security.authentication.server.AuthenticationFilter.doFilter(AuthenticationFilter.java:518)
   [junit4]   2> 	at org.apache.solr.security.DelegationTokenKerberosFilter.doFilter(DelegationTokenKerberosFilter.java:134)
   [junit4]   2> 	at org.apache.solr.security.HttpParamDelegationTokenPlugin$HttpParamToRequestFilter.doFilter(HttpParamDelegationTokenPlugin.java:245)
   [junit4]   2> 	at org.apache.solr.security.KerberosPlugin.doAuthenticate(KerberosPlugin.java:243)
   [junit4]   2> 	at org.apache.solr.servlet.SolrDispatchFilter.authenticateRequest(SolrDispatchFilter.java:451)
   [junit4]   2> 	... 26 more
   [junit4]   2> 750944 INFO  (TEST-TestSolrCloudWithSecureImpersonation.testProxyNullProxyUser-seed#[3B85EF51F68AA083]) [    ] o.a.s.SolrTestCaseJ4 ###Ending testProxyNullProxyUser
   [junit4]   2> 750970 INFO  (TEST-TestSolrCloudWithSecureImpersonation.testProxyWrongHost-seed#[3B85EF51F68AA083]) [    ] o.a.s.SolrTestCaseJ4 ###Starting testProxyWrongHost
   [junit4]   2> 750972 WARN  (qtp28736148-14887) [n:127.0.0.1:46365_solr c:forwardingCollection s:shard1 r:core_node2 x:forwardingCollection_shard1_replica_n1] o.a.h.s.a.s.AuthenticationFilter AuthenticationToken ignored: Invalid AuthenticationToken type
   [junit4]   2> 765987 WARN  (jetty-launcher-3227-thread-1-SendThread(127.0.0.1:46445)) [n:127.0.0.1:46365_solr    ] o.a.z.ClientCnxn Client session timed out, have not heard from server in 18175ms for sessionid 0x15ee0341a0a0008
   [junit4]   2> 765987 WARN  (jetty-launcher-3227-thread-1-SendThread(127.0.0.1:46445)) [n:127.0.0.1:46365_solr    ] o.a.z.ClientCnxn Client session timed out, have not heard from server in 16027ms for sessionid 0x15ee0341a0a0006
   [junit4]   2> 765987 WARN  (jetty-launcher-3227-thread-2-SendThread(127.0.0.1:46445)) [n:127.0.0.1:41915_solr    ] o.a.z.ClientCnxn Client session timed out, have not heard from server in 18174ms for sessionid 0x15ee0341a0a0007
   [junit4]   2> 765988 WARN  (NIOServerCxn.Factory:0.0.0.0/0.0.0.0:0) [    ] o.a.z.s.NIOServerCnxn caught end of stream exception
   [junit4]   2> EndOfStreamException: Unable to read additional data from client sessionid 0x15ee0341a0a0008, likely client has closed socket
   [junit4]   2> 	at org.apache.zookeeper.server.NIOServerCnxn.doIO(NIOServerCnxn.java:239)
   [junit4]   2> 	at org.apache.zookeeper.server.NIOServerCnxnFactory.run(NIOServerCnxnFactory.java:203)
   [junit4]   2> 	at java.lang.Thread.run(Thread.java:748)
   [junit4]   2> 765987 WARN  (jetty-launcher-3227-thread-2-SendThread(127.0.0.1:46445)) [n:127.0.0.1:41915_solr    ] o.a.z.ClientCnxn Client session timed out, have not heard from server in 15104ms for sessionid 0x15ee0341a0a0005
   [junit4]   2> 765991 WARN  (NIOServerCxn.Factory:0.0.0.0/0.0.0.0:0) [    ] o.a.z.s.NIOServerCnxn caught end of stream exception
   [junit4]   2> EndOfStreamException: Unable to read additional data from client sessionid 0x15ee0341a0a0007, likely client has closed socket
   [junit4]   2> 	at org.apache.zookeeper.server.NIOServerCnxn.doIO(NIOServerCnxn.java:239)
   [junit4]   2> 	at org.apache.zookeeper.server.NIOServerCnxnFactory.run(NIOServerCnxnFactory.java:203)
   [junit4]   2> 	at java.lang.Thread.run(Thread.java:748)
   [junit4]   2> 765992 WARN  (NIOServerCxn.Factory:0.0.0.0/0.0.0.0:0) [    ] o.a.z.s.NIOServerCnxn caught end of stream exception
   [junit4]   2> EndOfStreamException: Unable to read additional data from client sessionid 0x15ee0341a0a0006, likely client has closed socket
   [junit4]   2> 	at org.apache.zookeeper.server.NIOServerCnxn.doIO(NIOServerCnxn.java:239)
   [junit4]   2> 	at org.apache.zookeeper.server.NIOServerCnxnFactory.run(NIOServerCnxnFactory.java:203)
   [junit4]   2> 	at java.lang.Thread.run(Thread.java:748)
   [junit4]   2> 765992 WARN  (NIOServerCxn.Factory:0.0.0.0/0.0.0.0:0) [    ] o.a.z.s.NIOServerCnxn caught end of stream exception
   [junit4]   2> EndOfStreamException: Unable to read additional data from client sessionid 0x15ee0341a0a0005, likely client has closed socket
   [junit4]   2> 	at org.apache.zookeeper.server.NIOServerCnxn.doIO(NIOServerCnxn.java:239)
   [junit4]   2> 	at org.apache.zookeeper.server.NIOServerCnxnFactory.run(NIOServerCnxnFactory.java:203)
   [junit4]   2> 	at java.lang.Thread.run(Thread.java:748)
   [junit4]   2> 765996 INFO  (TEST-TestSolrCloudWithSecureImpersonation.testProxyWrongHost-seed#[3B85EF51F68AA083]) [    ] o.a.s.SolrTestCaseJ4 ###Ending testProxyWrongHost
   [junit4]   2> 766022 INFO  (TEST-TestSolrCloudWithSecureImpersonation.testProxyNoConfigGroups-seed#[3B85EF51F68AA083]) [    ] o.a.s.SolrTestCaseJ4 ###Starting testProxyNoConfigGroups
   [junit4]   2> 766023 WARN  (qtp28736148-14896) [    ] o.a.h.s.a.s.AuthenticationFilter AuthenticationToken ignored: Invalid AuthenticationToken type
   [junit4]   2> 766027 INFO  (TEST-TestSolrCloudWithSecureImpersonation.testProxyNoConfigGroups-seed#[3B85EF51F68AA083]) [    ] o.a.s.SolrTestCaseJ4 ###Ending testProxyNoConfigGroups
   [junit4]   2> 766041 INFO  (TEST-TestSolrCloudWithSecureImpersonation.testProxyValidateGroup-seed#[3B85EF51F68AA083]) [    ] o.a.s.SolrTestCaseJ4 ###Starting testProxyValidateGroup
   [junit4]   2> 766042 WARN  (qtp28736148-14885) [    ] o.a.h.s.a.s.AuthenticationFilter AuthenticationToken ignored: Invalid AuthenticationToken type
   [junit4]   2> 766055 INFO  (qtp28736148-14885) [n:127.0.0.1:46365_solr    ] o.a.s.h.a.CollectionsHandler Invoked Collection Action :list with params doAs=jenkins&action=LIST&wt=javabin&version=2 and sendToOCPQueue=true
   [junit4]   2> 766055 INFO  (qtp28736148-14885) [n:127.0.0.1:46365_solr    ] o.a.s.s.HttpSolrCall [admin] webapp=null path=/admin/collections params={doAs=jenkins&action=LIST&wt=javabin&version=2} status=0 QTime=0
   [junit4]   2> 766056 INFO  (TEST-TestSolrCloudWithSecureImpersonation.testProxyValidateGroup-seed#[3B85EF51F68AA083]) [    ] o.a.s.SolrTestCaseJ4 ###Ending testProxyValidateGroup
   [junit4]   2> 766067 INFO  (TEST-TestSolrCloudWithSecureImpersonation.testProxyValidateHost-seed#[3B85EF51F68AA083]) [    ] o.a.s.SolrTestCaseJ4 ###Starting testProxyValidateHost
   [junit4]   2> 766068 WARN  (qtp28736148-14894) [n:127.0.0.1:46365_solr c:forwardingCollection s:shard1 r:core_node2 x:forwardingCollection_shard1_replica_n1] o.a.h.s.a.s.AuthenticationFilter AuthenticationToken ignored: Invalid AuthenticationToken type
   [junit4]   2> 766068 INFO  (qtp28736148-14894) [n:127.0.0.1:46365_solr    ] o.a.s.h.a.CollectionsHandler Invoked Collection Action :list with params doAs=bar&action=LIST&wt=javabin&version=2 and sendToOCPQueue=true
   [junit4]   2> 766069 INFO  (qtp28736148-14894) [n:127.0.0.1:46365_solr    ] o.a.s.s.HttpSolrCall [admin] webapp=null path=/admin/collections params={doAs=bar&action=LIST&wt=javabin&version=2} status=0 QTime=0
   [junit4]   2> 766069 INFO  (TEST-TestSolrCloudWithSecureImpersonation.testProxyValidateHost-seed#[3B85EF51F68AA083]) [    ] o.a.s.SolrTestCaseJ4 ###Ending testProxyValidateHost
   [junit4]   2> 766080 INFO  (TEST-TestSolrCloudWithSecureImpersonation.testProxyNoConfigHosts-seed#[3B85EF51F68AA083]) [    ] o.a.s.SolrTestCaseJ4 ###Starting testProxyNoConfigHosts
   [junit4]   2> 766080 WARN  (qtp28736148-14887) [n:127.0.0.1:46365_solr c:forwardingCollection s:shard1 r:core_node2 x:forwardingCollection_shard1_replica_n1] o.a.h.s.a.s.AuthenticationFilter AuthenticationToken ignored: Invalid AuthenticationToken type
   [junit4]   2> 766083 INFO  (TEST-TestSolrCloudWithSecureImpersonation.testProxyNoConfigHosts-seed#[3B85EF51F68AA083]) [    ] o.a.s.SolrTestCaseJ4 ###Ending testProxyNoConfigHosts
   [junit4]   2> 766089 WARN  (zkCallback-3246-thread-1) [    ] o.a.s.c.c.ConnectionManager Watcher org.apache.solr.common.cloud.ConnectionManager@4d68ca name: ZooKeeperConnection Watcher:127.0.0.1:46445/solr got event WatchedEvent state:Disconnected type:None path:null path: null type: None
   [junit4]   2> 766089 WARN  (zkCallback-3239-thread-2-processing-n:127.0.0.1:46365_solr) [n:127.0.0.1:46365_solr    ] o.a.s.c.c.ConnectionManager Watcher org.apache.solr.common.cloud.ConnectionManager@483dde name: ZooKeeperConnection Watcher:127.0.0.1:46445/solr got event WatchedEvent state:Disconnected type:None path:null path: null type: None
   [junit4]   2> 766089 WARN  (zkCallback-3239-thread-2-processing-n:127.0.0.1:46365_solr) [n:127.0.0.1:46365_solr    ] o.a.s.c.c.ConnectionManager zkClient has disconnected
   [junit4]   2> 766089 WARN  (zkCallback-3246-thread-1) [    ] o.a.s.c.c.ConnectionManager zkClient has disconnected
   [junit4]   2> 766092 WARN  (zkCallback-3238-thread-2-processing-n:127.0.0.1:41915_solr) [n:127.0.0.1:41915_solr    ] o.a.s.c.c.ConnectionManager Watcher org.apache.solr.common.cloud.ConnectionManager@1d78a9 name: ZooKeeperConnection Watcher:127.0.0.1:46445/solr got event WatchedEvent state:Disconnected type:None path:null path: null type: None
   [junit4]   2> 766092 WARN  (zkCallback-3238-thread-2-processing-n:127.0.0.1:41915_solr) [n:127.0.0.1:41915_solr    ] o.a.s.c.c.ConnectionManager zkClient has disconnected
   [junit4]   2> 766096 INFO  (TEST-TestSolrCloudWithSecureImpersonation.testProxyInvalidRemote-seed#[3B85EF51F68AA083]) [    ] o.a.s.SolrTestCaseJ4 ###Starting testProxyInvalidRemote
   [junit4]   2> 766097 WARN  (qtp28736148-14896) [    ] o.a.h.s.a.s.AuthenticationFilter AuthenticationToken ignored: Invalid AuthenticationToken type
   [junit4]   2> 766103 INFO  (TEST-TestSolrCloudWithSecureImpersonation.testProxyInvalidRemote-seed#[3B85EF51F68AA083]) [    ] o.a.s.SolrTestCaseJ4 ###Ending testProxyInvalidRemote
   [junit4]   2> 766114 INFO  (TEST-TestSolrCloudWithSecureImpersonation.testProxyValidateAnyHostAnyUser-seed#[3B85EF51F68AA083]) [    ] o.a.s.SolrTestCaseJ4 ###Starting testProxyValidateAnyHostAnyUser
   [junit4]   2> 766115 WARN  (qtp28736148-14885) [n:127.0.0.1:46365_solr    ] o.a.h.s.a.s.AuthenticationFilter AuthenticationToken ignored: Invalid AuthenticationToken type
   [junit4]   2> 766116 INFO  (qtp28736148-14885) [n:127.0.0.1:46365_solr    ] o.a.s.h.a.CollectionsHandler Invoked Collection Action :list with params doAs=bar&action=LIST&wt=javabin&version=2 and sendToOCPQueue=true
   [junit4]   2> 766116 INFO  (qtp28736148-14885) [n:127.0.0.1:46365_solr    ] o.a.s.s.HttpSolrCall [admin] webapp=null path=/admin/collections params={doAs=bar&action=LIST&wt=javabin&version=2} status=0 QTime=0
   [junit4]   2> 766117 INFO  (TEST-TestSolrCloudWithSecureImpersonation.testProxyValidateAnyHostAnyUser-seed#[3B85EF51F68AA083]) [    ] o.a.s.SolrTestCaseJ4 ###Ending testProxyValidateAnyHostAnyUser
   [junit4]   2> 766128 INFO  (TEST-TestSolrCloudWithSecureImpersonation.testProxyInvalidGroup-seed#[3B85EF51F68AA083]) [    ] o.a.s.SolrTestCaseJ4 ###Starting testProxyInvalidGroup
   [junit4]   2> 766129 WARN  (qtp28736148-14894) [n:127.0.0.1:46365_solr    ] o.a.h.s.a.s.AuthenticationFilter AuthenticationToken ignored: Invalid AuthenticationToken type
   [junit4]   2> 766133 WARN  (qtp28736148-14894) [n:127.0.0.1:46365_solr    ] o.a.h.s.ShellBasedUnixGroupsMapping got exception trying to get groups for user bar: id: ‘bar’: no such user
   [junit4]   2> id: ‘bar’: no such user
   [junit4]   2> 
   [junit4]   2> 766135 INFO  (TEST-TestSolrCloudWithSecureImpersonation.testProxyInvalidGroup-seed#[3B85EF51F68AA083]) [    ] o.a.s.SolrTestCaseJ4 ###Ending testProxyInvalidGroup
   [junit4]   2> 766146 INFO  (TEST-TestSolrCloudWithSecureImpersonation.testProxyUnknownRemote-seed#[3B85EF51F68AA083]) [    ] o.a.s.SolrTestCaseJ4 ###Starting testProxyUnknownRemote
   [junit4]   2> 766147 WARN  (qtp28736148-14887) [n:127.0.0.1:46365_solr c:forwardingCollection s:shard1 r:core_node2 x:forwardingCollection_shard1_replica_n1] o.a.h.s.a.s.AuthenticationFilter AuthenticationToken ignored: Invalid AuthenticationToken type
   [junit4]   2> 772006 WARN  (TEST-TestSolrCloudWithSecureImpersonation.testForwarding-seed#[3B85EF51F68AA083]-SendThread(127.0.0.1:46445)) [    ] o.a.z.ClientCnxn Unable to reconnect to ZooKeeper service, session 0x15ee0341a0a000b has expired
   [junit4]   2> 772006 WARN  (zkCallback-3246-thread-1) [    ] o.a.s.c.c.ConnectionManager Watcher org.apache.solr.common.cloud.ConnectionManager@4d68ca name: ZooKeeperConnection Watcher:127.0.0.1:46445/solr got event WatchedEvent state:Expired type:None path:null path: null type: None
   [junit4]   2> 772006 WARN  (zkCallback-3246-thread-1) [    ] o.a.s.c.c.ConnectionManager Our previous ZooKeeper session was expired. Attempting to reconnect to recover relationship with ZooKeeper...
   [junit4]   2> 772006 WARN  (zkCallback-3246-thread-1) [    ] o.a.s.c.c.DefaultConnectionStrategy Connection expired - starting a new one...
   [junit4]   2> 772007 WARN  (jetty-launcher-3227-thread-1-SendThread(127.0.0.1:46445)) [n:127.0.0.1:46365_solr    ] o.a.z.ClientCnxn Unable to reconnect to ZooKeeper service, session 0x15ee0341a0a0006 has expired
   [junit4]   2> 772007 WARN  (zkCallback-3239-thread-4-processing-n:127.0.0.1:46365_solr) [n:127.0.0.1:46365_solr    ] o.a.s.c.c.ConnectionManager Watcher org.apache.solr.common.cloud.ConnectionManager@483dde name: ZooKeeperConnection Watcher:127.0.0.1:46445/solr got event WatchedEvent state:Expired type:None path:null path: null type: None
   [junit4]   2> 772007 WARN  (zkCallback-3239-thread-4-processing-n:127.0.0.1:46365_solr) [n:127.0.0.1:46365_solr    ] o.a.s.c.c.ConnectionManager Our previous ZooKeeper session was expired. Attempting to reconnect to recover relationship with ZooKeeper...
   [junit4]   2> 772007 WARN  (jetty-launcher-3227-thread-2-SendThread(127.0.0.1:46445)) [n:127.0.0.1:41915_solr    ] o.a.z.ClientCnxn Unable to reconnect to ZooKeeper service, session 0x15ee0341a0a0007 has expired
   [junit4]   2> 772008 WARN  (jetty-launcher-3227-thread-1-SendThread(127.0.0.1:46445)) [n:127.0.0.1:46365_solr    ] o.a.z.ClientCnxn Unable to reconnect to ZooKeeper service, session 0x15ee0341a0a0008 has expired
   [junit4]   2> 772008 INFO  (TEST-TestSolrCloudWithSecureImpersonation.testProxyUnknownRemote-seed#[3B85EF51F68AA083]) [    ] o.a.s.SolrTestCaseJ4 ###Ending testProxyUnknownRemote
   [junit4]   2> 772009 INFO  (zkCallback-3238-thread-2-processing-n:127.0.0.1:41915_solr) [n:127.0.0.1:41915_solr    ] o.a.s.c.c.ZkStateReader Updated live nodes from ZooKeeper... (2) -> (1)
   [junit4]   2> 772010 WARN  (zkCallback-3239-thread-4-processing-n:127.0.0.1:46365_solr) [n:127.0.0.1:46365_solr    ] o.a.s.c.c.DefaultConnectionStrategy Connection expired - starting a new one...
   [junit4]   2> 772011 INFO  (zkCallback-3239-thread-4-processing-n:127.0.0.1:46365_solr) [n:127.0.0.1:46365_solr    ] o.a.s.c.c.ConnectionManager Connection with ZooKeeper reestablished.
   [junit4]   2> 772011 INFO  (zkCallback-3239-thread-4-processing-n:127.0.0.1:46365_solr) [n:127.0.0.1:46365_solr    ] o.a.s.c.ZkController ZooKeeper session re-connected ... refreshing core states after session expiration.
   [junit4]   2> 772012 INFO  (zkCallback-3239-thread-4-processing-n:127.0.0.1:46365_solr) [n:127.0.0.1:46365_solr    ] o.a.s.c.c.ZkStateReader Updated live nodes from ZooKeeper... (2) -> (1)
   [junit4]   2> 772015 INFO  (zkCallback-3239-thread-4-processing-n:127.0.0.1:46365_solr) [n:127.0.0.1:46365_solr    ] o.a.s.c.ZkController Register node as live in ZooKeeper:/live_nodes/127.0.0.1:46365_solr
   [junit4]   2> 772015 INFO  (zkCallback-3238-thread-2-processing-n:127.0.0.1:41915_solr) [n:127.0.0.1:41915_solr    ] o.a.s.c.c.ZkStateReader Updated live nodes from ZooKeeper... (1) -> (2)
   [junit4]   2> 772016 INFO  (zkCallback-3239-thread-1-processing-n:127.0.0.1:46365_solr) [n:127.0.0.1:46365_solr    ] o.a.s.c.c.ZkStateReader Updated live nodes from ZooKeeper... (1) -> (2)
   [junit4]   2> 772016 INFO  (zkCallback-3239-thread-1-processing-n:127.0.0.1:46365_solr) [n:127.0.0.1:46365_solr    ] o.a.s.c.c.ZkStateReader A cluster state change: [WatchedEvent state:SyncConnected type:NodeDataChanged path:/collections/forwardingCollection/state.json] for collection [forwardingCollection] has occurred - updating... (live nodes size: [2])
   [junit4]   2> 772016 INFO  (coreZkRegister-3633-thread-1-processing-n:127.0.0.1:46365_solr) [n:127.0.0.1:46365_solr    ] o.a.s.c.ZkController Registering core forwardingCollection_shard1_replica_n1 afterExpiration? true
   [junit4]   2> 772017 INFO  (coreZkRegister-3633-thread-1-processing-n:127.0.0.1:46365_solr) [n:127.0.0.1:46365_solr c:forwardingCollection s:shard1 r:core_node2 x:forwardingCollection_shard1_replica_n1] o.a.s.c.ActionThrottle The last leader attempt started 22313ms ago.
   [junit4]   2> 772017 INFO  (zkCallback-3239-thread-4-processing-n:127.0.0.1:46365_solr) [n:127.0.0.1:46365_solr    ] o.a.s.c.c.DefaultConnectionStrategy Reconnected to ZooKeeper
   [junit4]   2> 772017 INFO  (zkCallback-3239-thread-4-processing-n:127.0.0.1:46365_solr) [n:127.0.0.1:46365_solr    ] o.a.s.c.c.ConnectionManager Connected:true
   [junit4]   2> 772017 INFO  (coreZkRegister-3633-thread-1-processing-n:127.0.0.1:46365_solr) [n:127.0.0.1:46365_solr c:forwardingCollection s:shard1 r:core_node2 x:forwardingCollection_shard1_replica_n1] o.a.s.c.ShardLeaderElectionContext Enough replicas found to continue.
   [junit4]   2> 772017 INFO  (coreZkRegister-3633-thread-1-processing-n:127.0.0.1:46365_solr) [n:127.0.0.1:46365_solr c:forwardingCollection s:shard1 r:core_node2 x:forwardingCollection_shard1_replica_n1] o.a.s.c.ShardLeaderElectionContext I may be the new leader - try and sync
   [junit4]   2> 772017 INFO  (Thread-1922) [n:127.0.0.1:46365_solr    ] o.a.s.c.SolrCore config update listener called for core forwardingCollection_shard1_replica_n1
   [junit4]   2> 772017 INFO  (coreZkRegister-3633-thread-1-processing-n:127.0.0.1:46365_solr) [n:127.0.0.1:46365_solr c:forwardingCollection s:shard1 r:core_node2 x:forwardingCollection_shard1_replica_n1] o.a.s.c.SyncStrategy Sync replicas to http://127.0.0.1:46365/solr/forwardingCollection_shard1_replica_n1/
   [junit4]   2> 772017 INFO  (coreZkRegister-3633-thread-1-processing-n:127.0.0.1:46365_solr) [n:127.0.0.1:46365_solr c:forwardingCollection s:shard1 r:core_node2 x:forwardingCollection_shard1_replica_n1] o.a.s.c.SyncStrategy Sync Success - now sync replicas to me
   [junit4]   2> 772018 INFO  (coreZkRegister-3633-thread-1-processing-n:127.0.0.1:46365_solr) [n:127.0.0.1:46365_solr c:forwardingCollection s:shard1 r:core_node2 x:forwardingCollection_shard1_replica_n1] o.a.s.c.SyncStrategy http://127.0.0.1:46365/solr/forwardingCollection_shard1_replica_n1/ has no replicas
   [junit4]   2> 772018 INFO  (coreZkRegister-3633-thread-1-processing-n:127.0.0.1:46365_solr) [n:127.0.0.1:46365_solr c:forwardingCollection s:shard1 r:core_node2 x:forwardingCollection_shard1_replica_n1] o.a.s.c.ShardLeaderElectionContext Found all replicas participating in election, clear LIR
   [junit4]   2> 772018 INFO  (coreZkRegister-3633-thread-1-processing-n:127.0.0.1:46365_solr) [n:127.0.0.1:46365_solr c:forwardingCollection s:shard1 r:core_node2 x:forwardingCollection_shard1_replica_n1] o.a.s.c.ShardLeaderElectionContext I am the new leader: http://127.0.0.1:46365/solr/forwardingCollection_shard1_replica_n1/ shard1
   [junit4]   2> 772019 INFO  (coreZkRegister-3633-thread-1-processing-n:127.0.0.1:46365_solr) [n:127.0.0.1:46365_solr c:forwardingCollection s:shard1 r:core_node2 x:forwardingCollection_shard1_replica_n1] o.a.s.c.ZkController I am the leader, no recovery necessary
   [junit4]   2> 772121 INFO  (zkCallback-3239-thread-4-processing-n:127.0.0.1:46365_solr) [n:127.0.0.1:46365_solr    ] o.a.s.c.c.ZkStateReader A cluster state change: [WatchedEvent state:SyncConnected type:NodeDataChanged path:/collections/forwardingCollection/state.json] for collection [forwardingCollection] has occurred - updating... (live nodes size: [2])
   [junit4]   2> 772508 ERROR (zkCallback-3246-thread-1) [    ] o.a.s.c.c.DefaultConnectionStrategy Reconnect to ZooKeeper failed:java.lang.RuntimeException: java.util.concurrent.TimeoutException: Could not connect to ZooKeeper 127.0.0.1:46445/solr within 9223372036854775807 ms
   [junit4]   2> 	at org.apache.solr.common.cloud.ConnectionManager$1.update(ConnectionManager.java:151)
   [junit4]   2> 	at org.apache.solr.common.cloud.DefaultConnectionStrategy.reconnect(DefaultConnectionStrategy.java:57)
   [junit4]   2> 	at org.apache.solr.common.cloud.ConnectionManager.process(ConnectionManager.java:142)
   [junit4]   2> 	at org.apache.solr.common.cloud.SolrZkClient$3.lambda$process$0(SolrZkClient.java:269)
   [junit4]   2> 	at java.util.concurrent.Executors$RunnableAdapter.call(Executors.java:511)
   [junit4]   2> 	at java.util.concurrent.FutureTask.run(FutureTask.java:266)
   [junit4]   2> 	at org.apache.solr.common.util.ExecutorUtil$MDCAwareThreadPoolExecutor.lambda$execute$0(ExecutorUtil.java:188)
   [junit4]   2> 	at java.util.concurrent.ThreadPoolExecutor.runWorker(ThreadPoolExecutor.java:1149)
   [junit4]   2> 	at java.util.concurrent.ThreadPoolExecutor$Worker.run(ThreadPoolExecutor.java:624)
   [junit4]   2> 	at java.lang.Thread.run(Thread.java:748)
   [junit4]   2> Caused by: java.util.concurrent.TimeoutException: Could not connect to ZooKeeper 127.0.0.1:46445/solr within 9223372036854775807 ms
   [junit4]   2> 	at org.apache.solr.common.cloud.ConnectionManager.waitForConnected(ConnectionManager.java:233)
   [junit4]   2> 	at org.apache.solr.common.cloud.ConnectionManager$1.update(ConnectionManager.java:148)
   [junit4]   2> 	... 9 more
   [junit4]   2> 
   [junit4]   2> 772508 WARN  (zkCallback-3246-thread-1) [    ] o.a.s.c.c.DefaultConnectionStrategy Reconnect to ZooKeeper failed
   [junit4]   2> 772508 INFO  (zkCallback-3246-thread-1) [    ] o.a.s.c.c.ConnectionManager Connected:false
   [junit4]   2> 772509 INFO  (jetty-closer-3228-thread-1) [    ] o.e.j.s.AbstractConnector Stopped ServerConnector@1a66a44{HTTP/1.1,[http/1.1]}{127.0.0.1:0}
   [junit4]   2> 772509 INFO  (jetty-closer-3228-thread-2) [    ] o.e.j.s.AbstractConnector Stopped ServerConnector@19184a3{HTTP/1.1,[http/1.1]}{127.0.0.1:0}
   [junit4]   2> 772510 INFO  (jetty-closer-3228-thread-1) [    ] o.a.s.c.CoreContainer Shutting down CoreContainer instance=20483029
   [junit4]   2> 772510 INFO  (jetty-closer-3228-thread-2) [    ] o.a.s.c.CoreContainer Shutting down CoreContainer instance=10161979
   [junit4]   2> 772510 INFO  (jetty-closer-3228-thread-1) [    ] o.a.s.m.SolrMetricManager Closing metric reporters for registry=solr.node, tag=null
   [junit4]   2> 772510 INFO  (jetty-closer-3228-thread-2) [    ] o.a.s.m.SolrMetricManager Closing metric reporters for registry=solr.node, tag=null
   [junit4]   2> 772510 INFO  (jetty-closer-3228-thread-1) [    ] o.a.s.m.r.SolrJmxReporter Closing reporter [org.apache.solr.metrics.reporters.SolrJmxReporter@9e5576: rootName = solr_46365, domain = solr.node, service url = null, agent id = null] for registry solr.node / com.codahale.metrics.MetricRegistry@1655fb3
   [junit4]   2> 772510 INFO  (jetty-closer-3228-thread-2) [    ] o.a.s.m.r.SolrJmxReporter Closing reporter [org.apache.solr.metrics.reporters.SolrJmxReporter@1113a85: rootName = solr_41915, domain = solr.node, service url = null, agent id = null] for registry solr.node / com.codahale.metrics.MetricRegistry@ae0c5d
   [junit4]   2> 772517 INFO  (jetty-closer-3228-thread-1) [    ] o.a.s.m.SolrMetricManager Closing metric reporters for registry=solr.jvm, tag=null
   [junit4]   2> 772517 INFO  (jetty-closer-3228-thread-2) [    ] o.a.s.m.SolrMetricManager Closing metric reporters for registry=solr.jvm, tag=null
   [junit4]   2> 772517 INFO  (jetty-closer-3228-thread-1) [    ] o.a.s.m.r.SolrJmxReporter Closing reporter [org.apache.solr.metrics.reporters.SolrJmxReporter@4ea621: rootName = solr_46365, domain = solr.jvm, service url = null, agent id = null] for registry solr.jvm / com.codahale.metrics.MetricRegistry@1a68dcf
   [junit4]   2> 772517 INFO  (jetty-closer-3228-thread-2) [    ] o.a.s.m.r.SolrJmxReporter Closing reporter [org.apache.solr.metrics.reporters.SolrJmxReporter@6530b8: rootName = solr_41915, domain = solr.jvm, service url = null, agent id = null] for registry solr.jvm / com.codahale.metrics.MetricRegistry@1a68dcf
   [junit4]   2> 772522 INFO  (jetty-closer-3228-thread-1) [    ] o.a.s.m.SolrMetricManager Closing metric reporters for registry=solr.jetty, tag=null
   [junit4]   2> 772522 INFO  (jetty-closer-3228-thread-1) [    ] o.a.s.m.r.SolrJmxReporter Closing reporter [org.apache.solr.metrics.reporters.SolrJmxReporter@fd8197: rootName = solr_46365, domain = solr.jetty, service url = null, agent id = null] for registry solr.jetty / com.codahale.metrics.MetricRegistry@198051f
   [junit4]   2> 772523 INFO  (jetty-closer-3228-thread-2) [    ] o.a.s.m.SolrMetricManager Closing metric reporters for registry=solr.jetty, tag=null
   [junit4]   2> 772523 INFO  (jetty-closer-3228-thread-2) [    ] o.a.s.m.r.SolrJmxReporter Closing reporter [org.apache.solr.metrics.reporters.SolrJmxReporter@aacdf: rootName = solr_41915, domain = solr.jetty, service url = null, agent id = null] for registry solr.jetty / com.codahale.metrics.MetricRegistry@198051f
   [junit4]   2> 772523 INFO  (jetty-closer-3228-thread-1) [    ] o.a.s.m.SolrMetricManager Closing metric reporters for registry=solr.cluster, tag=null
   [junit4]   2> 772523 INFO  (coreCloseExecutor-3648-thread-1) [n:127.0.0.1:46365_solr c:forwardingCollection s:shard1 r:core_node2 x:forwardingCollection_shard1_replica_n1] o.a.s.c.SolrCore [forwardingCollection_shard1_replica_n1]  CLOSING SolrCore org.apache.solr.core.SolrCore@16fd249
   [junit4]   2> 772523 INFO  (coreCloseExecutor-3648-thread-1) [n:127.0.0.1:46365_solr c:forwardingCollection s:shard1 r:core_node2 x:forwardingCollection_shard1_replica_n1] o.a.s.m.SolrMetricManager Closing metric reporters for registry=solr.core.forwardingCollection.shard1.replica_n1, tag=24105545
   [junit4]   2> 772524 INFO  (coreCloseExecutor-3648-thread-1) [n:127.0.0.1:46365_solr c:forwardingCollection s:shard1 r:core_node2 x:forwardingCollection_shard1_replica_n1] o.a.s.m.r.SolrJmxReporter Closing reporter [org.apache.solr.metrics.reporters.SolrJmxReporter@73cd4f: rootName = solr_46365, domain = solr.core.forwardingCollection.shard1.replica_n1, service url = null, agent id = null] for registry solr.core.forwardingCollection.shard1.replica_n1 / com.codahale.metrics.MetricRegistry@c4093f
   [junit4]   2> 772524 INFO  (jetty-closer-3228-thread-2) [    ] o.a.s.m.SolrMetricManager Closing metric reporters for registry=solr.cluster, tag=null
   [junit4]   2> 772524 INFO  (jetty-closer-3228-thread-2) [    ] o.a.s.c.Overseer Overseer (id=98762756228513797-127.0.0.1:41915_solr-n_0000000000) closing
   [junit4]   2> 772524 INFO  (OverseerStateUpdate-98762756228513797-127.0.0.1:41915_solr-n_0000000000) [n:127.0.0.1:41915_solr    ] o.a.s.c.Overseer Overseer Loop exiting : 127.0.0.1:41915_solr
   [junit4]   2> 772525 ERROR (Thread[Thread-1917,5,TGRP-TestSolrCloudWithSecureImpersonation]) [n:127.0.0.1:41915_solr    ] o.a.h.s.t.d.AbstractDelegationTokenSecretManager ExpiredTokenRemover received java.lang.InterruptedException: sleep interrupted
   [junit4]   2> 772525 INFO  (zkCallback-3239-thread-1-processing-n:127.0.0.1:46365_solr) [n:127.0.0.1:46365_solr    ] o.a.s.c.c.ZkStateReader Updated live nodes from ZooKeeper... (2) -> (1)
   [junit4]   2> 772525 INFO  (zkCallback-3239-thread-4-processing-n:127.0.0.1:46365_solr) [n:127.0.0.1:46365_solr    ] o.a.s.c.OverseerElectionContext I am going to be the leader 127.0.0.1:46365_solr
   [junit4]   2> 772525 INFO  (jetty-closer-3228-thread-2) [    ] o.e.j.s.h.ContextHandler Stopped o.e.j.s.ServletContextHandler@102c399{/solr,null,UNAVAILABLE}
   [junit4]   2> 772538 INFO  (coreCloseExecutor-3648-thread-1) [n:127.0.0.1:46365_solr c:forwardingCollection s:shard1 r:core_node2 x:forwardingCollection_shard1_replica_n1] o.a.s.m.SolrMetricManager Closing metric reporters for registry=solr.collection.forwardingCollection.shard1.leader, tag=24105545
   [junit4]   2> 772540 WARN  (zkCallback-3239-thread-4-processing-n:127.0.0.1:46365_solr) [n:127.0.0.1:46365_solr    ] o.a.s.c.c.ZkStateReader ZooKeeper watch triggered, but Solr cannot talk to ZK: [KeeperErrorCode = Session expired for /live_nodes]
   [junit4]   2> 772540 ERROR (Thread[Thread-1914,5,TGRP-TestSolrCloudWithSecureImpersonation]) [n:127.0.0.1:46365_solr    ] o.a.h.s.t.d.AbstractDelegationTokenSecretManager ExpiredTokenRemover received java.lang.InterruptedException: sleep interrupted
   [junit4]   2> 772541 INFO  (jetty-closer-3228-thread-1) [    ] o.e.j.s.h.ContextHandler Stopped o.e.j.s.ServletContextHandler@2b3bd6{/solr,null,UNAVAILABLE}
   [junit4]   2> 772541 ERROR (SUITE-TestSolrCloudWithSecureImpersonation-seed#[3B85EF51F68AA083]-worker) [    ] o.a.z.s.ZooKeeperServer ZKShutdownHandler is not registered, so ZooKeeper server won't take any action on ERROR or SHUTDOWN server state changes
   [junit4]   2> 772541 INFO  (SUITE-TestSolrCloudWithSecureImpersonation-seed#[3B85EF51F68AA083]-worker) [    ] o.a.s.c.ZkTestServer connecting to 127.0.0.1:46445 46445
   [junit4]   2> 777562 INFO  (Thread-1897) [    ] o.a.s.c.ZkTestServer connecting to 127.0.0.1:46445 46445
   [junit4]   2> 777563 WARN  (Thread-1897) [    ] o.a.s.c.ZkTestServer Watch limit violations: 
   [junit4]   2> Maximum concurrent create/delete watches above limit:
   [junit4]   2> 
   [junit4]   2> 	4	/solr/aliases.json
   [junit4]   2> 	4	/solr/clusterprops.json
   [junit4]   2> 	3	/solr/security.json
   [junit4]   2> 	2	/solr/configs/conf1
   [junit4]   2> 
   [junit4]   2> Maximum concurrent data watches above limit:
   [junit4]   2> 
   [junit4]   2> 	6	/solr/collections/forwardingCollection/state.json
   [junit4]   2> 	4	/solr/clusterstate.json
   [junit4]   2> 	2	/solr/overseer_elect/election/98762756228513797-127.0.0.1:41915_solr-n_0000000000
   [junit4]   2> 	2	/solr/security/zkdtsm/ZKDTSMRoot/ZKDTSMKeyIdRoot
   [junit4]   2> 	2	/solr/security/zkdtsm/ZKDTSMRoot/ZKDTSMMasterKeyRoot/DK_1
   [junit4]   2> 	2	/solr/security/zkdtsm/ZKDTSMRoot/ZKDTSMMasterKeyRoot/DK_3
   [junit4]   2> 	2	/solr/security/zkdtsm/ZKDTSMRoot/ZKDTSMMasterKeyRoot/DK_2
   [junit4]   2> 	2	/solr/security/zkdtsm/ZKDTSMRoot/ZKDTSMMasterKeyRoot/DK_4
   [junit4]   2> 	2	/solr/security/zkdtsm/ZKDTSMRoot/ZKDTSMSeqNumRoot
   [junit4]   2> 
   [junit4]   2> Maximum concurrent children watches above limit:
   [junit4]   2> 
   [junit4]   2> 	4	/solr/live_nodes
   [junit4]   2> 	4	/solr/collections
   [junit4]   2> 	2	/solr/security/zkdtsm/ZKDTSMRoot/ZKDTSMMasterKeyRoot
   [junit4]   2> 	2	/solr/security/zkdtsm/ZKDTSMRoot/ZKDTSMTokensRoot
   [junit4]   2> 
   [junit4]   2> 777621 INFO  (SUITE-TestSolrCloudWithSecureImpersonation-seed#[3B85EF51F68AA083]-worker) [    ] o.a.s.SolrTestCaseJ4 ------------------------------------------------------- Done waiting for tracked resources to be released
   [junit4]   2> Oct 03, 2017 3:08:15 AM com.carrotsearch.randomizedtesting.ThreadLeakControl checkThreadLeaks
   [junit4]   2> WARNING: Will linger awaiting termination of 2 leaked thread(s).
   [junit4]   2> Oct 03, 2017 3:08:35 AM com.carrotsearch.randomizedtesting.ThreadLeakControl checkThreadLeaks
   [junit4]   2> SEVERE: 2 threads leaked from SUITE scope at org.apache.solr.cloud.TestSolrCloudWithSecureImpersonation: 
   [junit4]   2>    1) Thread[id=14934, name=jetty-launcher-3227-thread-1-EventThread, state=TIMED_WAITING, group=TGRP-TestSolrCloudWithSecureImpersonation]
   [junit4]   2>         at sun.misc.Unsafe.park(Native Method)
   [junit4]   2>         at java.util.concurrent.locks.LockSupport.parkNanos(LockSupport.java:215)
   [junit4]   2>         at java.util.concurrent.locks.AbstractQueuedSynchronizer.doAcquireSharedNanos(AbstractQueuedSynchronizer.java:1037)
   [junit4]   2>         at java.util.concurrent.locks.AbstractQueuedSynchronizer.tryAcquireSharedNanos(AbstractQueuedSynchronizer.java:1328)
   [junit4]   2>         at java.util.concurrent.CountDownLatch.await(CountDownLatch.java:277)
   [junit4]   2>         at org.apache.curator.CuratorZookeeperClient.internalBlockUntilConnectedOrTimedOut(CuratorZookeeperClient.java:323)
   [junit4]   2>         at org.apache.curator.RetryLoop.callWithRetry(RetryLoop.java:105)
   [junit4]   2>         at org.apache.curator.framework.imps.GetDataBuilderImpl.pathInForeground(GetDataBuilderImpl.java:288)
   [junit4]   2>         at org.apache.curator.framework.imps.GetDataBuilderImpl.forPath(GetDataBuilderImpl.java:279)
   [junit4]   2>         at org.apache.curator.framework.imps.GetDataBuilderImpl.forPath(GetDataBuilderImpl.java:41)
   [junit4]   2>         at org.apache.curator.framework.recipes.shared.SharedValue.readValue(SharedValue.java:244)
   [junit4]   2>         at org.apache.curator.framework.recipes.shared.SharedValue.access$100(SharedValue.java:44)
   [junit4]   2>         at org.apache.curator.framework.recipes.shared.SharedValue$1.process(SharedValue.java:61)
   [junit4]   2>         at org.apache.curator.framework.imps.NamespaceWatcher.process(NamespaceWatcher.java:67)
   [junit4]   2>         at org.apache.zookeeper.ClientCnxn$EventThread.processEvent(ClientCnxn.java:530)
   [junit4]   2>         at org.apache.zookeeper.ClientCnxn$EventThread.run(ClientCnxn.java:505)
   [junit4]   2>    2) Thread[id=14930, name=jetty-launcher-3227-thread-2-EventThread, state=TIMED_WAITING, group=TGRP-TestSolrCloudWithSecureImpersonation]
   [junit4]   2>         at sun.misc.Unsafe.park(Native Method)
   [junit4]   2>         at java.util.concurrent.locks.LockSupport.parkNanos(LockSupport.java:215)
   [junit4]   2>         at java.util.concurrent.locks.AbstractQueuedSynchronizer.doAcquireSharedNanos(AbstractQueuedSynchronizer.java:1037)
   [junit4]   2>         at java.util.concurrent.locks.AbstractQueuedSynchronizer.tryAcquireSharedNanos(AbstractQueuedSynchronizer.java:1328)
   [junit4]   2>         at java.util.concurrent.CountDownLatch.await(CountDownLatch.java:277)
   [junit4]   2>         at org.apache.curator.CuratorZookeeperClient.internalBlockUntilConnectedOrTimedOut(CuratorZookeeperClient.java:323)
   [junit4]   2>         at org.apache.curator.RetryLoop.callWithRetry(RetryLoop.java:105)
   [junit4]   2>         at org.apache.curator.framework.imps.GetDataBuilderImpl.pathInForeground(GetDataBuilderImpl.java:288)
   [junit4]   2>         at org.apache.curator.framework.imps.GetDataBuilderImpl.forPath(GetDataBuilderImpl.java:279)
   [junit4]   2>         at org.apache.curator.framework.imps.GetDataBuilderImpl.forPath(GetDataBuilderImpl.java:41)
   [junit4]   2>         at org.apache.curator.framework.recipes.shared.SharedValue.readValue(SharedValue.java:244)
   [junit4]   2>         at org.apache.curator.framework.recipes.shared.SharedValue.access$100(SharedValue.java:44)
   [junit4]   2>         at org.apache.curator.framework.recipes.shared.SharedValue$1.process(SharedValue.java:61)
   [junit4]   2>         at org.apache.curator.framework.imps.NamespaceWatcher.process(NamespaceWatcher.java:67)
   [junit4]   2>         at org.apache.zookeeper.ClientCnxn$EventThread.processEvent(ClientCnxn.java:530)
   [junit4]   2>         at org.apache.zookeeper.ClientCnxn$EventThread.run(ClientCnxn.java:505)
   [junit4]   2> Oct 03, 2017 3:08:35 AM com.carrotsearch.randomizedtesting.ThreadLeakControl tryToInterruptAll
   [junit4]   2> INFO: Starting to interrupt leaked threads:
   [junit4]   2>    1) Thread[id=14934, name=jetty-launcher-3227-thread-1-EventThread, state=TIMED_WAITING, group=TGRP-TestSolrCloudWithSecureImpersonation]
   [junit4]   2>    2) Thread[id=14930, name=jetty-launcher-3227-thread-2-EventThread, state=TIMED_WAITING, group=TGRP-TestSolrCloudWithSecureImpersonation]
   [junit4]   2> 797792 ERROR (jetty-launcher-3227-thread-1-EventThread) [n:127.0.0.1:46365_solr    ] o.a.c.f.i.CuratorFrameworkImpl Watcher exception
   [junit4]   2> java.lang.InterruptedException
   [junit4]   2> 	at java.util.concurrent.locks.AbstractQueuedSynchronizer.doAcquireSharedNanos(AbstractQueuedSynchronizer.java:1039)
   [junit4]   2> 	at java.util.concurrent.locks.AbstractQueuedSynchronizer.tryAcquireSharedNanos(AbstractQueuedSynchronizer.java:1328)
   [junit4]   2> 	at java.util.concurrent.CountDownLatch.await(CountDownLatch.java:277)
   [junit4]   2> 	at org.apache.curator.CuratorZookeeperClient.internalBlockUntilConnectedOrTimedOut(CuratorZookeeperClient.java:323)
   [junit4]   2> 	at org.apache.curator.RetryLoop.callWithRetry(RetryLoop.java:105)
   [junit4]   2> 	at org.apache.curator.framework.imps.GetDataBuilderImpl.pathInForeground(GetDataBuilderImpl.java:288)
   [junit4]   2> 	at org.apache.curator.framework.imps.GetDataBuilderImpl.forPath(GetDataBuilderImpl.java:279)
   [junit4]   2> 	at org.apache.curator.framework.imps.GetDataBuilderImpl.forPath(GetDataBuilderImpl.java:41)
   [junit4]   2> 	at org.apache.curator.framework.recipes.shared.SharedValue.readValue(SharedValue.java:244)
   [junit4]   2> 	at org.apache.curator.framework.recipes.shared.SharedValue.access$100(SharedValue.java:44)
   [junit4]   2> 	at org.apache.curator.framework.recipes.shared.SharedValue$1.process(SharedValue.java:61)
   [junit4]   2> 	at org.apache.curator.framework.imps.NamespaceWatcher.process(NamespaceWatcher.java:67)
   [junit4]   2> 	at org.apache.zookeeper.ClientCnxn$EventThread.processEvent(ClientCnxn.java:530)
   [junit4]   2> 	at org.apache.zookeeper.ClientCnxn$EventThread.run(ClientCnxn.java:505)
   [junit4]   2> 797792 ERROR (jetty-launcher-3227-thread-2-EventThread) [n:127.0.0.1:41915_solr    ] o.a.c.f.i.CuratorFrameworkImpl Watcher exception
   [junit4]   2> java.lang.InterruptedException
   [junit4]   2> 	at java.util.concurrent.locks.AbstractQueuedSynchronizer.doAcquireSharedNanos(AbstractQueuedSynchronizer.java:1039)
   [junit4]   2> 	at java.util.concurrent.locks.AbstractQueuedSynchronizer.tryAcquireSharedNanos(AbstractQueuedSynchronizer.java:1328)
   [junit4]   2> 	at java.util.concurrent.CountDownLatch.await(CountDownLatch.java:277)
   [junit4]   2> 	at org.apache.curator.CuratorZookeeperClient.internalBlockUntilConnectedOrTimedOut(CuratorZookeeperClient.java:323)
   [junit4]   2> 	at org.apache.curator.RetryLoop.callWithRetry(RetryLoop.java:105)
   [junit4]   2> 	at org.apache.curator.framework.imps.GetDataBuilderImpl.pathInForeground(GetDataBuilderImpl.java:288)
   [junit4]   2> 	at org.apache.curator.framework.imps.GetDataBuilderImpl.forPath(GetDataBuilderImpl.java:279)
   [junit4]   2> 	at org.apache.curator.framework.imps.GetDataBuilderImpl.forPath(GetDataBuilderImpl.java:41)
   [junit4]   2> 	at org.apache.curator.framework.recipes.shared.Shar

[...truncated too long message...]

 [junit4]   2> 2757832 WARN  (jetty-launcher-3227-thread-2-SendThread(127.0.0.1:46445)) [n:127.0.0.1:41915_solr    ] o.a.z.ClientCnxn Session 0x0 for server null, unexpected error, closing socket connection and attempting reconnect
   [junit4]   2> java.net.ConnectException: Connection refused
   [junit4]   2> 	at sun.nio.ch.SocketChannelImpl.checkConnect(Native Method)
   [junit4]   2> 	at sun.nio.ch.SocketChannelImpl.finishConnect(SocketChannelImpl.java:717)
   [junit4]   2> 	at org.apache.zookeeper.ClientCnxnSocketNIO.doTransport(ClientCnxnSocketNIO.java:361)
   [junit4]   2> 	at org.apache.zookeeper.ClientCnxn$SendThread.run(ClientCnxn.java:1141)
   [junit4]   2> 2758933 WARN  (jetty-launcher-3227-thread-1-SendThread(127.0.0.1:46445)) [n:127.0.0.1:46365_solr    ] o.a.z.ClientCnxn Session 0x0 for server null, unexpected error, closing socket connection and attempting reconnect
   [junit4]   2> java.net.ConnectException: Connection refused
   [junit4]   2> 	at sun.nio.ch.SocketChannelImpl.checkConnect(Native Method)
   [junit4]   2> 	at sun.nio.ch.SocketChannelImpl.finishConnect(SocketChannelImpl.java:717)
   [junit4]   2> 	at org.apache.zookeeper.ClientCnxnSocketNIO.doTransport(ClientCnxnSocketNIO.java:361)
   [junit4]   2> 	at org.apache.zookeeper.ClientCnxn$SendThread.run(ClientCnxn.java:1141)
   [junit4]   2> 2758933 WARN  (jetty-launcher-3227-thread-2-SendThread(127.0.0.1:46445)) [n:127.0.0.1:41915_solr    ] o.a.z.ClientCnxn Session 0x0 for server null, unexpected error, closing socket connection and attempting reconnect
   [junit4]   2> java.net.ConnectException: Connection refused
   [junit4]   2> 	at sun.nio.ch.SocketChannelImpl.checkConnect(Native Method)
   [junit4]   2> 	at sun.nio.ch.SocketChannelImpl.finishConnect(SocketChannelImpl.java:717)
   [junit4]   2> 	at org.apache.zookeeper.ClientCnxnSocketNIO.doTransport(ClientCnxnSocketNIO.java:361)
   [junit4]   2> 	at org.apache.zookeeper.ClientCnxn$SendThread.run(ClientCnxn.java:1141)
   [junit4]   2> 2760034 WARN  (jetty-launcher-3227-thread-1-SendThread(127.0.0.1:46445)) [n:127.0.0.1:46365_solr    ] o.a.z.ClientCnxn Session 0x0 for server null, unexpected error, closing socket connection and attempting reconnect
   [junit4]   2> java.net.ConnectException: Connection refused
   [junit4]   2> 	at sun.nio.ch.SocketChannelImpl.checkConnect(Native Method)
   [junit4]   2> 	at sun.nio.ch.SocketChannelImpl.finishConnect(SocketChannelImpl.java:717)
   [junit4]   2> 	at org.apache.zookeeper.ClientCnxnSocketNIO.doTransport(ClientCnxnSocketNIO.java:361)
   [junit4]   2> 	at org.apache.zookeeper.ClientCnxn$SendThread.run(ClientCnxn.java:1141)
   [junit4]   2> 2760034 WARN  (jetty-launcher-3227-thread-2-SendThread(127.0.0.1:46445)) [n:127.0.0.1:41915_solr    ] o.a.z.ClientCnxn Session 0x0 for server null, unexpected error, closing socket connection and attempting reconnect
   [junit4]   2> java.net.ConnectException: Connection refused
   [junit4]   2> 	at sun.nio.ch.SocketChannelImpl.checkConnect(Native Method)
   [junit4]   2> 	at sun.nio.ch.SocketChannelImpl.finishConnect(SocketChannelImpl.java:717)
   [junit4]   2> 	at org.apache.zookeeper.ClientCnxnSocketNIO.doTransport(ClientCnxnSocketNIO.java:361)
   [junit4]   2> 	at org.apache.zookeeper.ClientCnxn$SendThread.run(ClientCnxn.java:1141)
   [junit4]   2> NOTE: test params are: codec=Asserting(Lucene70): {field6=Lucene50(blocksize=128), field8=PostingsFormat(name=LuceneFixedGap), field2=Lucene50(blocksize=128), field4=PostingsFormat(name=LuceneFixedGap)}, docValues:{}, maxPointsInLeafNode=190, maxMBSortInHeap=6.814158382877657, sim=RandomSimilarity(queryNorm=true): {}, locale=es-US, timezone=Asia/Krasnoyarsk
   [junit4]   2> NOTE: Linux 4.10.0-33-generic i386/Oracle Corporation 1.8.0_144 (32-bit)/cpus=8,threads=1,free=178641112,total=518979584
   [junit4]   2> NOTE: All tests run in this JVM: [HdfsChaosMonkeyNothingIsSafeTest, RecoveryZkTest, SolrTestCaseJ4Test, TestSchemaResource, BufferStoreTest, TestPointFields, AnalysisErrorHandlingTest, ChaosMonkeyNothingIsSafeWithPullReplicasTest, SimpleMLTQParserTest, TestImplicitCoreProperties, TimeZoneUtilsTest, BasicDistributedZk2Test, SuggesterFSTTest, TestExactStatsCache, SolrShardReporterTest, TestSearcherReuse, TestStressLiveNodes, HLLUtilTest, ShowFileRequestHandlerTest, HdfsNNFailoverTest, TestSort, DeleteReplicaTest, TestAnalyzedSuggestions, TermVectorComponentDistributedTest, TestFastWriter, TestZkAclsWithHadoopAuth, CloneFieldUpdateProcessorFactoryTest, TestLeaderInitiatedRecoveryThread, BlockJoinFacetRandomTest, CachingDirectoryFactoryTest, FastVectorHighlighterTest, TestRequestForwarding, SpatialHeatmapFacetsTest, TestDynamicFieldResource, TestRestoreCore, TestInitQParser, ManagedSchemaRoundRobinCloudTest, TestSolrDeletionPolicy2, HardAutoCommitTest, CircularListTest, VMParamsZkACLAndCredentialsProvidersTest, TestPivotHelperCode, BadIndexSchemaTest, NumericFieldsTest, ConnectionReuseTest, TestHdfsCloudBackupRestore, TemplateUpdateProcessorTest, TestDistributedStatsComponentCardinality, BooleanFieldTest, TestRetrieveFieldsOptimizer, MetricsHandlerTest, TestPseudoReturnFields, SolrCoreCheckLockOnStartupTest, MultiTermTest, DistributedDebugComponentTest, RegexBoostProcessorTest, PrimitiveFieldTypeTest, DistribCursorPagingTest, DirectUpdateHandlerTest, CleanupOldIndexTest, SolrJmxReporterTest, ConjunctionSolrSpellCheckerTest, ResponseLogComponentTest, TestManagedSchema, TestComplexPhraseQParserPlugin, DateFieldTest, TestSolrCloudSnapshots, TestJmxIntegration, UninvertDocValuesMergePolicyTest, CollectionsAPISolrJTest, DirectoryFactoryTest, TestSerializedLuceneMatchVersion, SolrInfoBeanTest, ConnectionManagerTest, RemoteQueryErrorTest, InfixSuggestersTest, DistributedQueryComponentOptimizationTest, TestNumericRangeQuery64, XsltUpdateRequestHandlerTest, ExplicitHLLTest, TestUseDocValuesAsStored, TestSolrCloudWithSecureImpersonation, MinimalSchemaTest, SimplePostToolTest, TestBulkSchemaAPI, StressHdfsTest, AssignBackwardCompatibilityTest, TestUtils, TestPullReplica, ParsingFieldUpdateProcessorsTest, OverseerTest, TestCloudNestedDocsSort, TestEmbeddedSolrServerConstructors, TestMacros, TestCollectionsAPIViaSolrCloudCluster, TestQuerySenderListener, OverseerTaskQueueTest, TestHdfsBackupRestoreCore, TestZkChroot, TestNonDefinedSimilarityFactory, StatsComponentTest, RulesTest, TestFieldTypeCollectionResource, SpatialRPTFieldTypeTest, TestTrie, TestPushWriter, TestRandomRequestDistribution, RestartWhileUpdatingTest, PolyFieldTest, DeleteInactiveReplicaTest, TestAddFieldRealTimeGet, TestLFUCache, SuggesterTest, TestBinaryResponseWriter, AddSchemaFieldsUpdateProcessorFactoryTest, TestSolrCoreProperties, SignatureUpdateProcessorFactoryTest, TestConfigSetImmutable, TestFilteredDocIdSet, LeaderElectionTest, TestRandomDVFaceting, TestFaceting, TestRecovery, ZkControllerTest, TestJoin, SolrCoreTest, TestGroupingSearch, PeerSyncTest, TestFunctionQuery, BasicFunctionalityTest, TestBadConfig, TestIndexSearcher, SoftAutoCommitTest, DirectSolrSpellCheckerTest, TestReversedWildcardFilterFactory, RequestHandlersTest, DocumentBuilderTest, PathHierarchyTokenizerFactoryTest, MoreLikeThisHandlerTest, TestSolrQueryParser, SolrPluginUtilsTest, TestCSVResponseWriter, JsonLoaderTest, TestPartialUpdateDeduplication, CSVRequestHandlerTest, SearchHandlerTest, UpdateParamsTest, TestStressRecovery, TestTolerantSearch, TestLuceneIndexBackCompat, TestEmbeddedSolrServerSchemaAPI, TestJettySolrRunner, BaseCdcrDistributedZkTest, CdcrReplicationDistributedZkTest, CdcrReplicationHandlerTest, CloudExitableDirectoryReaderTest, CollectionReloadTest, CollectionTooManyReplicasTest, DeleteStatusTest, DistributedQueueTest, HealthCheckHandlerTest, LeaderElectionContextKeyTest, LeaderFailoverAfterPartitionTest, LeaderFailureAfterFreshStartTest, MigrateRouteKeyTest, MoveReplicaTest, ReplaceNodeTest, RollingRestartTest, SolrXmlInZkTest, TestCloudInspectUtil, TestCloudPivotFacet, TestClusterProperties, TestCollectionAPI, TestConfigSetsAPIZkFailure, TestDistribDocBasedVersion, TestLeaderElectionZkExpiry, TestPrepRecovery, TestSegmentSorting, TestShortCircuitedRequests, TestSizeLimitedDistributedMap, TestTlogReplica, ImplicitSnitchTest, QueryResultKeyTest, TestCorePropertiesReload, TestInfoStreamLogging, TestNRTOpen, TestSimpleTextCodec, RequestLoggingTest, SearchHandlerTest, TestBlobHandler, TestSQLHandlerNonCloud, TestSolrConfigHandlerCloud, DistributedSuggestComponentTest, HighlighterMaxOffsetTest, TestUnifiedSolrHighlighter, TestLegacyField, TestLegacyNumericUtils, TestLegacyTerms, TestNumericRangeQuery32, JvmMetricsTest, SolrMetricManagerTest, SolrGangliaReporterTest, TestIntervalFaceting, TestReloadDeadlock, TestSmileRequest, TestSolr4Spatial2, TestSolrCoreParser, TestStandardQParsers, TestXmlQParser, TestXmlQParserPlugin, TestJsonFacetRefinement, TestJsonFacets, TestOrdValues, TestSortByMinMaxFunction, BJQParserTest, BlockJoinFacetDistribTest, BlockJoinFacetSimpleTest, GraphQueryTest, TestScoreJoinQPScore, TestJsonRequest, TestClassicSimilarityFactory, TestDefaultStatsCache, BasicAuthIntegrationTest, TestImpersonationWithHadoopAuth, TestLegacyFieldCache, TestNumericTerms64]
   [junit4]   2> NOTE: reproduce with: ant test  -Dtestcase=TestNumericTerms64 -Dtests.seed=3B85EF51F68AA083 -Dtests.multiplier=3 -Dtests.slow=true -Dtests.locale=es-US -Dtests.timezone=Asia/Krasnoyarsk -Dtests.asserts=true -Dtests.file.encoding=ISO-8859-1
   [junit4] ERROR   0.00s J2 | TestNumericTerms64 (suite) <<<
   [junit4]    > Throwable #1: java.lang.AssertionError: The test or suite printed 13416 bytes to stdout and stderr, even though the limit was set to 8192 bytes. Increase the limit with @Limit, ignore it completely with @SuppressSysoutChecks or run with -Dtests.verbose=true
   [junit4]    > 	at __randomizedtesting.SeedInfo.seed([3B85EF51F68AA083]:0)
   [junit4]    > 	at java.lang.Thread.run(Thread.java:748)
   [junit4] Completed [716/735 (2!)] on J2 in 7.08s, 4 tests, 1 failure <<< FAILURES!

[...truncated 42689 lines...]

Mime
View raw message