lucene-dev mailing list archives

Site index · List index
Message view « Date » · « Thread »
Top « Date » · « Thread »
From Policeman Jenkins Server <jenk...@thetaphi.de>
Subject [JENKINS] Lucene-Solr-5.5-Windows (64bit/jdk1.7.0_80) - Build # 149 - Still Unstable!
Date Sun, 22 Oct 2017 01:51:03 GMT
Build: https://jenkins.thetaphi.de/job/Lucene-Solr-5.5-Windows/149/
Java: 64bit/jdk1.7.0_80 -XX:+UseCompressedOops -XX:+UseG1GC

1 tests failed.
FAILED:  org.apache.solr.util.TestSolrCLIRunExample.testInteractiveSolrCloudExample

Error Message:
Expected 10 to be found in the testCloudExamplePrompt collection but only found 6

Stack Trace:
java.lang.AssertionError: Expected 10 to be found in the testCloudExamplePrompt collection but only found 6
	at __randomizedtesting.SeedInfo.seed([40CD794E777CF30C:9BBC99844009366A]:0)
	at org.junit.Assert.fail(Assert.java:93)
	at org.apache.solr.util.TestSolrCLIRunExample.testInteractiveSolrCloudExample(TestSolrCLIRunExample.java:450)
	at sun.reflect.NativeMethodAccessorImpl.invoke0(Native Method)
	at sun.reflect.NativeMethodAccessorImpl.invoke(NativeMethodAccessorImpl.java:57)
	at sun.reflect.DelegatingMethodAccessorImpl.invoke(DelegatingMethodAccessorImpl.java:43)
	at java.lang.reflect.Method.invoke(Method.java:606)
	at com.carrotsearch.randomizedtesting.RandomizedRunner.invoke(RandomizedRunner.java:1764)
	at com.carrotsearch.randomizedtesting.RandomizedRunner$8.evaluate(RandomizedRunner.java:871)
	at com.carrotsearch.randomizedtesting.RandomizedRunner$9.evaluate(RandomizedRunner.java:907)
	at com.carrotsearch.randomizedtesting.RandomizedRunner$10.evaluate(RandomizedRunner.java:921)
	at com.carrotsearch.randomizedtesting.rules.SystemPropertiesRestoreRule$1.evaluate(SystemPropertiesRestoreRule.java:57)
	at org.apache.lucene.util.TestRuleSetupTeardownChained$1.evaluate(TestRuleSetupTeardownChained.java:49)
	at org.apache.lucene.util.AbstractBeforeAfterRule$1.evaluate(AbstractBeforeAfterRule.java:45)
	at org.apache.lucene.util.TestRuleThreadAndTestName$1.evaluate(TestRuleThreadAndTestName.java:48)
	at org.apache.lucene.util.TestRuleIgnoreAfterMaxFailures$1.evaluate(TestRuleIgnoreAfterMaxFailures.java:64)
	at org.apache.lucene.util.TestRuleMarkFailure$1.evaluate(TestRuleMarkFailure.java:47)
	at com.carrotsearch.randomizedtesting.rules.StatementAdapter.evaluate(StatementAdapter.java:36)
	at com.carrotsearch.randomizedtesting.ThreadLeakControl$StatementRunner.run(ThreadLeakControl.java:367)
	at com.carrotsearch.randomizedtesting.ThreadLeakControl.forkTimeoutingTask(ThreadLeakControl.java:809)
	at com.carrotsearch.randomizedtesting.ThreadLeakControl$3.evaluate(ThreadLeakControl.java:460)
	at com.carrotsearch.randomizedtesting.RandomizedRunner.runSingleTest(RandomizedRunner.java:880)
	at com.carrotsearch.randomizedtesting.RandomizedRunner$5.evaluate(RandomizedRunner.java:781)
	at com.carrotsearch.randomizedtesting.RandomizedRunner$6.evaluate(RandomizedRunner.java:816)
	at com.carrotsearch.randomizedtesting.RandomizedRunner$7.evaluate(RandomizedRunner.java:827)
	at com.carrotsearch.randomizedtesting.rules.StatementAdapter.evaluate(StatementAdapter.java:36)
	at com.carrotsearch.randomizedtesting.rules.SystemPropertiesRestoreRule$1.evaluate(SystemPropertiesRestoreRule.java:57)
	at org.apache.lucene.util.AbstractBeforeAfterRule$1.evaluate(AbstractBeforeAfterRule.java:45)
	at com.carrotsearch.randomizedtesting.rules.StatementAdapter.evaluate(StatementAdapter.java:36)
	at org.apache.lucene.util.TestRuleStoreClassName$1.evaluate(TestRuleStoreClassName.java:41)
	at com.carrotsearch.randomizedtesting.rules.NoShadowingOrOverridesOnMethodsRule$1.evaluate(NoShadowingOrOverridesOnMethodsRule.java:40)
	at com.carrotsearch.randomizedtesting.rules.NoShadowingOrOverridesOnMethodsRule$1.evaluate(NoShadowingOrOverridesOnMethodsRule.java:40)
	at com.carrotsearch.randomizedtesting.rules.StatementAdapter.evaluate(StatementAdapter.java:36)
	at com.carrotsearch.randomizedtesting.rules.StatementAdapter.evaluate(StatementAdapter.java:36)
	at com.carrotsearch.randomizedtesting.rules.StatementAdapter.evaluate(StatementAdapter.java:36)
	at org.apache.lucene.util.TestRuleAssertionsRequired$1.evaluate(TestRuleAssertionsRequired.java:53)
	at org.apache.lucene.util.TestRuleMarkFailure$1.evaluate(TestRuleMarkFailure.java:47)
	at org.apache.lucene.util.TestRuleIgnoreAfterMaxFailures$1.evaluate(TestRuleIgnoreAfterMaxFailures.java:64)
	at org.apache.lucene.util.TestRuleIgnoreTestSuites$1.evaluate(TestRuleIgnoreTestSuites.java:54)
	at com.carrotsearch.randomizedtesting.rules.StatementAdapter.evaluate(StatementAdapter.java:36)
	at com.carrotsearch.randomizedtesting.ThreadLeakControl$StatementRunner.run(ThreadLeakControl.java:367)
	at java.lang.Thread.run(Thread.java:745)




Build Log:
[...truncated 12403 lines...]
   [junit4] Suite: org.apache.solr.util.TestSolrCLIRunExample
   [junit4]   2> Creating dataDir: C:\Users\jenkins\workspace\Lucene-Solr-5.5-Windows\solr\build\solr-core\test\J0\temp\solr.util.TestSolrCLIRunExample_40CD794E777CF30C-001\init-core-data-001
   [junit4]   2> 2901578 INFO  (TEST-TestSolrCLIRunExample.testInteractiveSolrCloudExample-seed#[40CD794E777CF30C]) [    ] o.a.s.SolrTestCaseJ4 ###Starting testInteractiveSolrCloudExample
   [junit4]   2> 2903694 INFO  (TEST-TestSolrCLIRunExample.testInteractiveSolrCloudExample-seed#[40CD794E777CF30C]) [    ] o.a.s.c.ZkTestServer STARTING ZK TEST SERVER
   [junit4]   2> 2903695 INFO  (Thread-8945) [    ] o.a.s.c.ZkTestServer client port:0.0.0.0/0.0.0.0:0
   [junit4]   2> 2903695 INFO  (Thread-8945) [    ] o.a.s.c.ZkTestServer Starting server
   [junit4]   2> 2903795 INFO  (TEST-TestSolrCLIRunExample.testInteractiveSolrCloudExample-seed#[40CD794E777CF30C]) [    ] o.a.s.c.ZkTestServer start zk server on port:51892
   [junit4]   2> 2903795 INFO  (TEST-TestSolrCLIRunExample.testInteractiveSolrCloudExample-seed#[40CD794E777CF30C]) [    ] o.a.s.c.c.SolrZkClient Using default ZkCredentialsProvider
   [junit4]   2> 2903796 INFO  (TEST-TestSolrCLIRunExample.testInteractiveSolrCloudExample-seed#[40CD794E777CF30C]) [    ] o.a.s.c.c.ConnectionManager Waiting for client to connect to ZooKeeper
   [junit4]   2> 2903798 INFO  (zkCallback-9007-thread-1) [    ] o.a.s.c.c.ConnectionManager Watcher org.apache.solr.common.cloud.ConnectionManager@399e8083 name:ZooKeeperConnection Watcher:127.0.0.1:51892 got event WatchedEvent state:SyncConnected type:None path:null path:null type:None
   [junit4]   2> 2903800 INFO  (TEST-TestSolrCLIRunExample.testInteractiveSolrCloudExample-seed#[40CD794E777CF30C]) [    ] o.a.s.c.c.ConnectionManager Client is connected to ZooKeeper
   [junit4]   2> 2903800 INFO  (TEST-TestSolrCLIRunExample.testInteractiveSolrCloudExample-seed#[40CD794E777CF30C]) [    ] o.a.s.c.c.SolrZkClient Using default ZkACLProvider
   [junit4]   2> 2903800 INFO  (TEST-TestSolrCLIRunExample.testInteractiveSolrCloudExample-seed#[40CD794E777CF30C]) [    ] o.a.s.c.c.SolrZkClient makePath: /solr/solr.xml
   [junit4]   2> 2903802 WARN  (NIOServerCxn.Factory:0.0.0.0/0.0.0.0:0) [    ] o.a.z.s.NIOServerCnxn caught end of stream exception
   [junit4]   2> EndOfStreamException: Unable to read additional data from client sessionid 0x15f41b34fec0000, likely client has closed socket
   [junit4]   2> 	at org.apache.zookeeper.server.NIOServerCnxn.doIO(NIOServerCnxn.java:228)
   [junit4]   2> 	at org.apache.zookeeper.server.NIOServerCnxnFactory.run(NIOServerCnxnFactory.java:208)
   [junit4]   2> 	at java.lang.Thread.run(Thread.java:745)
   [junit4]   2> 2903804 INFO  (jetty-launcher-9006-thread-1) [    ] o.e.j.s.Server jetty-9.2.13.v20150730
   [junit4]   2> 2903804 INFO  (jetty-launcher-9006-thread-1) [    ] o.e.j.s.h.ContextHandler Started o.e.j.s.ServletContextHandler@66d93475{/solr,null,AVAILABLE}
   [junit4]   2> 2903805 INFO  (jetty-launcher-9006-thread-1) [    ] o.e.j.s.ServerConnector Started ServerConnector@3e032213{HTTP/1.1}{127.0.0.1:51887}
   [junit4]   2> 2903805 INFO  (jetty-launcher-9006-thread-1) [    ] o.e.j.s.Server Started @2906743ms
   [junit4]   2> 2903805 INFO  (jetty-launcher-9006-thread-1) [    ] o.a.s.c.s.e.JettySolrRunner Jetty properties: {hostContext=/solr, hostPort=51887}
   [junit4]   2> 2903805 INFO  (jetty-launcher-9006-thread-1) [    ] o.a.s.s.SolrDispatchFilter SolrDispatchFilter.init(): sun.misc.Launcher$AppClassLoader@f7e5307
   [junit4]   2> 2903806 INFO  (jetty-launcher-9006-thread-1) [    ] o.a.s.c.SolrResourceLoader new SolrResourceLoader for directory: 'C:\Users\jenkins\workspace\Lucene-Solr-5.5-Windows\solr\build\solr-core\test\J0\temp\solr.util.TestSolrCLIRunExample_40CD794E777CF30C-001\tempDir-002\node1'
   [junit4]   2> 2903806 INFO  (jetty-launcher-9006-thread-1) [    ] o.a.s.c.SolrResourceLoader JNDI not configured for solr (NoInitialContextEx)
   [junit4]   2> 2903806 INFO  (jetty-launcher-9006-thread-1) [    ] o.a.s.c.SolrResourceLoader solr home defaulted to 'solr/' (could not find system property or JNDI)
   [junit4]   2> 2903806 INFO  (jetty-launcher-9006-thread-1) [    ] o.a.s.c.c.SolrZkClient Using default ZkCredentialsProvider
   [junit4]   2> 2903807 INFO  (jetty-launcher-9006-thread-1) [    ] o.a.s.c.c.ConnectionManager Waiting for client to connect to ZooKeeper
   [junit4]   2> 2903808 INFO  (zkCallback-9008-thread-1) [    ] o.a.s.c.c.ConnectionManager Watcher org.apache.solr.common.cloud.ConnectionManager@7ae4531 name:ZooKeeperConnection Watcher:127.0.0.1:51892/solr got event WatchedEvent state:SyncConnected type:None path:null path:null type:None
   [junit4]   2> 2903808 INFO  (jetty-launcher-9006-thread-1) [    ] o.a.s.c.c.ConnectionManager Client is connected to ZooKeeper
   [junit4]   2> 2903808 INFO  (jetty-launcher-9006-thread-1) [    ] o.a.s.c.c.SolrZkClient Using default ZkACLProvider
   [junit4]   2> 2903808 INFO  (jetty-launcher-9006-thread-1) [    ] o.a.s.s.SolrDispatchFilter solr.xml found in ZooKeeper. Loading...
   [junit4]   2> 2903826 INFO  (jetty-launcher-9006-thread-1) [    ] o.a.s.c.CorePropertiesLocator Config-defined core root directory: C:\Users\jenkins\workspace\Lucene-Solr-5.5-Windows\solr\build\solr-core\test\J0\temp\solr.util.TestSolrCLIRunExample_40CD794E777CF30C-001\tempDir-002\node1
   [junit4]   2> 2903826 INFO  (jetty-launcher-9006-thread-1) [    ] o.a.s.c.CoreContainer New CoreContainer 248366436
   [junit4]   2> 2903826 INFO  (jetty-launcher-9006-thread-1) [    ] o.a.s.c.CoreContainer Loading cores into CoreContainer [instanceDir=C:\Users\jenkins\workspace\Lucene-Solr-5.5-Windows\solr\build\solr-core\test\J0\temp\solr.util.TestSolrCLIRunExample_40CD794E777CF30C-001\tempDir-002\node1]
   [junit4]   2> 2903826 WARN  (jetty-launcher-9006-thread-1) [    ] o.a.s.c.CoreContainer Couldn't add files from C:\Users\jenkins\workspace\Lucene-Solr-5.5-Windows\solr\build\solr-core\test\J0\temp\solr.util.TestSolrCLIRunExample_40CD794E777CF30C-001\tempDir-002\node1\lib to classpath: C:\Users\jenkins\workspace\Lucene-Solr-5.5-Windows\solr\build\solr-core\test\J0\temp\solr.util.TestSolrCLIRunExample_40CD794E777CF30C-001\tempDir-002\node1\lib
   [junit4]   2> 2903826 INFO  (jetty-launcher-9006-thread-1) [    ] o.a.s.h.c.HttpShardHandlerFactory created with socketTimeout : 600000,connTimeout : 60000,maxConnectionsPerHost : 20,maxConnections : 10000,corePoolSize : 0,maximumPoolSize : 2147483647,maxThreadIdleTime : 5,sizeOfQueue : -1,fairnessPolicy : false,useRetries : false,connectionsEvictorSleepDelay : 5000,maxConnectionIdleTime : 40000,
   [junit4]   2> 2903828 INFO  (jetty-launcher-9006-thread-1) [    ] o.a.s.u.UpdateShardHandler Creating UpdateShardHandler HTTP client with params: socketTimeout=600000&connTimeout=60000&retry=true
   [junit4]   2> 2903828 INFO  (jetty-launcher-9006-thread-1) [    ] o.a.s.l.LogWatcher SLF4J impl is org.slf4j.impl.Log4jLoggerFactory
   [junit4]   2> 2903830 INFO  (jetty-launcher-9006-thread-1) [    ] o.a.s.l.LogWatcher Registering Log Listener [Log4j (org.slf4j.impl.Log4jLoggerFactory)]
   [junit4]   2> 2903830 INFO  (jetty-launcher-9006-thread-1) [    ] o.a.s.c.ZkContainer Zookeeper client=127.0.0.1:51892/solr
   [junit4]   2> 2903830 INFO  (jetty-launcher-9006-thread-1) [    ] o.a.s.c.ZkController zkHost includes chroot
   [junit4]   2> 2903830 INFO  (jetty-launcher-9006-thread-1) [    ] o.a.s.c.c.SolrZkClient Using default ZkCredentialsProvider
   [junit4]   2> 2903830 INFO  (jetty-launcher-9006-thread-1) [    ] o.a.s.c.c.ConnectionManager Waiting for client to connect to ZooKeeper
   [junit4]   2> 2903832 INFO  (zkCallback-9011-thread-1) [    ] o.a.s.c.c.ConnectionManager Watcher org.apache.solr.common.cloud.ConnectionManager@955ac47 name:ZooKeeperConnection Watcher:127.0.0.1:51892 got event WatchedEvent state:SyncConnected type:None path:null path:null type:None
   [junit4]   2> 2903832 INFO  (jetty-launcher-9006-thread-1) [    ] o.a.s.c.c.ConnectionManager Client is connected to ZooKeeper
   [junit4]   2> 2903832 INFO  (jetty-launcher-9006-thread-1) [    ] o.a.s.c.c.SolrZkClient Using default ZkACLProvider
   [junit4]   2> 2903833 WARN  (NIOServerCxn.Factory:0.0.0.0/0.0.0.0:0) [    ] o.a.z.s.NIOServerCnxn caught end of stream exception
   [junit4]   2> EndOfStreamException: Unable to read additional data from client sessionid 0x15f41b34fec0002, likely client has closed socket
   [junit4]   2> 	at org.apache.zookeeper.server.NIOServerCnxn.doIO(NIOServerCnxn.java:228)
   [junit4]   2> 	at org.apache.zookeeper.server.NIOServerCnxnFactory.run(NIOServerCnxnFactory.java:208)
   [junit4]   2> 	at java.lang.Thread.run(Thread.java:745)
   [junit4]   2> 2903833 INFO  (jetty-launcher-9006-thread-1) [n:localhost:51887_solr    ] o.a.s.c.ZkController Added new OnReconnect listener org.apache.solr.cloud.ZkController$6@749c9dbe
   [junit4]   2> 2903834 INFO  (jetty-launcher-9006-thread-1) [n:localhost:51887_solr    ] o.a.s.c.c.ConnectionManager Waiting for client to connect to ZooKeeper
   [junit4]   2> 2903835 INFO  (zkCallback-9012-thread-1-processing-n:localhost:51887_solr) [n:localhost:51887_solr    ] o.a.s.c.c.ConnectionManager Watcher org.apache.solr.common.cloud.ConnectionManager@53b30322 name:ZooKeeperConnection Watcher:127.0.0.1:51892/solr got event WatchedEvent state:SyncConnected type:None path:null path:null type:None
   [junit4]   2> 2903835 INFO  (jetty-launcher-9006-thread-1) [n:localhost:51887_solr    ] o.a.s.c.c.ConnectionManager Client is connected to ZooKeeper
   [junit4]   2> 2903836 INFO  (jetty-launcher-9006-thread-1) [n:localhost:51887_solr    ] o.a.s.c.c.SolrZkClient makePath: /overseer/queue
   [junit4]   2> 2903837 INFO  (jetty-launcher-9006-thread-1) [n:localhost:51887_solr    ] o.a.s.c.c.SolrZkClient makePath: /overseer/collection-queue-work
   [junit4]   2> 2903839 INFO  (jetty-launcher-9006-thread-1) [n:localhost:51887_solr    ] o.a.s.c.c.SolrZkClient makePath: /overseer/collection-map-running
   [junit4]   2> 2903840 INFO  (jetty-launcher-9006-thread-1) [n:localhost:51887_solr    ] o.a.s.c.c.SolrZkClient makePath: /overseer/collection-map-completed
   [junit4]   2> 2903842 INFO  (jetty-launcher-9006-thread-1) [n:localhost:51887_solr    ] o.a.s.c.c.SolrZkClient makePath: /overseer/collection-map-failure
   [junit4]   2> 2903843 INFO  (jetty-launcher-9006-thread-1) [n:localhost:51887_solr    ] o.a.s.c.c.SolrZkClient makePath: /live_nodes
   [junit4]   2> 2903844 INFO  (jetty-launcher-9006-thread-1) [n:localhost:51887_solr    ] o.a.s.c.c.SolrZkClient makePath: /collections
   [junit4]   2> 2903845 INFO  (jetty-launcher-9006-thread-1) [n:localhost:51887_solr    ] o.a.s.c.c.SolrZkClient makePath: /aliases.json
   [junit4]   2> 2903846 INFO  (jetty-launcher-9006-thread-1) [n:localhost:51887_solr    ] o.a.s.c.c.SolrZkClient makePath: /clusterstate.json
   [junit4]   2> 2903847 INFO  (jetty-launcher-9006-thread-1) [n:localhost:51887_solr    ] o.a.s.c.c.SolrZkClient makePath: /security.json
   [junit4]   2> 2903848 INFO  (jetty-launcher-9006-thread-1) [n:localhost:51887_solr    ] o.a.s.c.ZkController Register node as live in ZooKeeper:/live_nodes/localhost:51887_solr
   [junit4]   2> 2903848 INFO  (jetty-launcher-9006-thread-1) [n:localhost:51887_solr    ] o.a.s.c.c.SolrZkClient makePath: /live_nodes/localhost:51887_solr
   [junit4]   2> 2903849 INFO  (jetty-launcher-9006-thread-1) [n:localhost:51887_solr    ] o.a.s.c.c.SolrZkClient makePath: /overseer_elect
   [junit4]   2> 2903850 INFO  (jetty-launcher-9006-thread-1) [n:localhost:51887_solr    ] o.a.s.c.c.SolrZkClient makePath: /overseer_elect/election
   [junit4]   2> 2903851 INFO  (jetty-launcher-9006-thread-1) [n:localhost:51887_solr    ] o.a.s.c.Overseer Overseer (id=null) closing
   [junit4]   2> 2903851 INFO  (jetty-launcher-9006-thread-1) [n:localhost:51887_solr    ] o.a.s.c.LeaderElector Joined leadership election with path: /overseer_elect/election/98869955221258243-localhost:51887_solr-n_0000000000
   [junit4]   2> 2903851 INFO  (jetty-launcher-9006-thread-1) [n:localhost:51887_solr    ] o.a.s.c.OverseerElectionContext I am going to be the leader localhost:51887_solr
   [junit4]   2> 2903851 INFO  (jetty-launcher-9006-thread-1) [n:localhost:51887_solr    ] o.a.s.c.c.SolrZkClient makePath: /overseer_elect/leader
   [junit4]   2> 2903852 INFO  (jetty-launcher-9006-thread-1) [n:localhost:51887_solr    ] o.a.s.c.Overseer Overseer (id=98869955221258243-localhost:51887_solr-n_0000000000) starting
   [junit4]   2> 2903853 INFO  (jetty-launcher-9006-thread-1) [n:localhost:51887_solr    ] o.a.s.c.c.SolrZkClient makePath: /overseer/queue-work
   [junit4]   2> 2903858 INFO  (jetty-launcher-9006-thread-1) [n:localhost:51887_solr    ] o.a.s.c.OverseerAutoReplicaFailoverThread Starting OverseerAutoReplicaFailoverThread autoReplicaFailoverWorkLoopDelay=10000 autoReplicaFailoverWaitAfterExpiration=30000 autoReplicaFailoverBadNodeExpiration=60000
   [junit4]   2> 2903858 INFO  (jetty-launcher-9006-thread-1) [n:localhost:51887_solr    ] o.a.s.c.c.ZkStateReader Updating cluster state from ZooKeeper... 
   [junit4]   2> 2903858 INFO  (OverseerCollectionConfigSetProcessor-98869955221258243-localhost:51887_solr-n_0000000000) [n:localhost:51887_solr    ] o.a.s.c.OverseerTaskProcessor Process current queue of overseer operations
   [junit4]   2> 2903858 INFO  (OverseerStateUpdate-98869955221258243-localhost:51887_solr-n_0000000000) [n:localhost:51887_solr    ] o.a.s.c.Overseer Starting to work on the main queue
   [junit4]   2> 2903884 INFO  (jetty-launcher-9006-thread-1) [n:localhost:51887_solr    ] o.a.s.c.CoreContainer Security conf doesn't exist. Skipping setup for authorization module.
   [junit4]   2> 2903884 INFO  (jetty-launcher-9006-thread-1) [n:localhost:51887_solr    ] o.a.s.c.CoreContainer No authentication plugin used.
   [junit4]   2> 2903885 INFO  (jetty-launcher-9006-thread-1) [n:localhost:51887_solr    ] o.a.s.c.CorePropertiesLocator Looking for core definitions underneath C:\Users\jenkins\workspace\Lucene-Solr-5.5-Windows\solr\build\solr-core\test\J0\temp\solr.util.TestSolrCLIRunExample_40CD794E777CF30C-001\tempDir-002\node1
   [junit4]   2> 2903886 INFO  (jetty-launcher-9006-thread-1) [n:localhost:51887_solr    ] o.a.s.c.CorePropertiesLocator Found 0 core definitions
   [junit4]   2> 2903886 INFO  (jetty-launcher-9006-thread-1) [n:localhost:51887_solr    ] o.a.s.s.SolrDispatchFilter user.dir=C:\Users\jenkins\workspace\Lucene-Solr-5.5-Windows\solr\build\solr-core\test\J0
   [junit4]   2> 2903886 INFO  (jetty-launcher-9006-thread-1) [n:localhost:51887_solr    ] o.a.s.s.SolrDispatchFilter SolrDispatchFilter.init() done
   [junit4]   2> 2903886 INFO  (TEST-TestSolrCLIRunExample.testInteractiveSolrCloudExample-seed#[40CD794E777CF30C]) [    ] o.a.s.c.c.SolrZkClient Using default ZkCredentialsProvider
   [junit4]   2> 2903887 INFO  (TEST-TestSolrCLIRunExample.testInteractiveSolrCloudExample-seed#[40CD794E777CF30C]) [    ] o.a.s.c.c.ConnectionManager Waiting for client to connect to ZooKeeper
   [junit4]   2> 2903888 INFO  (zkCallback-9013-thread-1) [    ] o.a.s.c.c.ConnectionManager Watcher org.apache.solr.common.cloud.ConnectionManager@5d5ad81d name:ZooKeeperConnection Watcher:127.0.0.1:51892 got event WatchedEvent state:SyncConnected type:None path:null path:null type:None
   [junit4]   2> 2903888 INFO  (TEST-TestSolrCLIRunExample.testInteractiveSolrCloudExample-seed#[40CD794E777CF30C]) [    ] o.a.s.c.c.ConnectionManager Client is connected to ZooKeeper
   [junit4]   2> 2903889 INFO  (TEST-TestSolrCLIRunExample.testInteractiveSolrCloudExample-seed#[40CD794E777CF30C]) [    ] o.a.s.c.c.SolrZkClient Using default ZkACLProvider
   [junit4]   2> 2903889 WARN  (NIOServerCxn.Factory:0.0.0.0/0.0.0.0:0) [    ] o.a.z.s.NIOServerCnxn caught end of stream exception
   [junit4]   2> EndOfStreamException: Unable to read additional data from client sessionid 0x15f41b34fec0004, likely client has closed socket
   [junit4]   2> 	at org.apache.zookeeper.server.NIOServerCnxn.doIO(NIOServerCnxn.java:228)
   [junit4]   2> 	at org.apache.zookeeper.server.NIOServerCnxnFactory.run(NIOServerCnxnFactory.java:208)
   [junit4]   2> 	at java.lang.Thread.run(Thread.java:745)
   [junit4]   2> 2907010 INFO  (qtp1401988559-44913) [n:localhost:51887_solr    ] o.a.s.s.HttpSolrCall [admin] webapp=null path=/admin/info/system params={wt=json} status=0 QTime=105
   [junit4]   2> 2907012 INFO  (qtp1401988559-44914) [n:localhost:51887_solr    ] o.a.s.h.a.CollectionsHandler Invoked Collection Action :clusterstatus with params action=CLUSTERSTATUS&wt=json and sendToOCPQueue=true
   [junit4]   2> 2907014 INFO  (qtp1401988559-44914) [n:localhost:51887_solr    ] o.a.s.s.HttpSolrCall [admin] webapp=null path=/admin/collections params={action=CLUSTERSTATUS&wt=json} status=0 QTime=2
   [junit4]   2> 2907014 INFO  (TEST-TestSolrCLIRunExample.testInteractiveSolrCloudExample-seed#[40CD794E777CF30C]) [    ] o.a.s.c.c.SolrZkClient Using default ZkCredentialsProvider
   [junit4]   2> 2907015 INFO  (TEST-TestSolrCLIRunExample.testInteractiveSolrCloudExample-seed#[40CD794E777CF30C]) [    ] o.a.s.c.c.ConnectionManager Waiting for client to connect to ZooKeeper
   [junit4]   2> 2907016 INFO  (zkCallback-9016-thread-1) [    ] o.a.s.c.c.ConnectionManager Watcher org.apache.solr.common.cloud.ConnectionManager@148e1a90 name:ZooKeeperConnection Watcher:127.0.0.1:51892/solr got event WatchedEvent state:SyncConnected type:None path:null path:null type:None
   [junit4]   2> 2907017 INFO  (TEST-TestSolrCLIRunExample.testInteractiveSolrCloudExample-seed#[40CD794E777CF30C]) [    ] o.a.s.c.c.ConnectionManager Client is connected to ZooKeeper
   [junit4]   2> 2907017 INFO  (TEST-TestSolrCLIRunExample.testInteractiveSolrCloudExample-seed#[40CD794E777CF30C]) [    ] o.a.s.c.c.SolrZkClient Using default ZkACLProvider
   [junit4]   2> 2907017 INFO  (TEST-TestSolrCLIRunExample.testInteractiveSolrCloudExample-seed#[40CD794E777CF30C]) [    ] o.a.s.c.c.ZkStateReader Updating cluster state from ZooKeeper... 
   [junit4]   2> 2907022 INFO  (qtp1401988559-44916) [n:localhost:51887_solr    ] o.a.s.h.a.CollectionsHandler Invoked Collection Action :list with params action=list&wt=json and sendToOCPQueue=true
   [junit4]   2> 2907022 INFO  (qtp1401988559-44916) [n:localhost:51887_solr    ] o.a.s.s.HttpSolrCall [admin] webapp=null path=/admin/collections params={action=list&wt=json} status=0 QTime=0
   [junit4]   2> 2907030 INFO  (qtp1401988559-44918) [n:localhost:51887_solr    ] o.a.s.s.HttpSolrCall [admin] webapp=null path=/admin/info/system params={wt=json} status=0 QTime=3
   [junit4]   2> 2907032 INFO  (qtp1401988559-44913) [n:localhost:51887_solr    ] o.a.s.h.a.CollectionsHandler Invoked Collection Action :clusterstatus with params action=CLUSTERSTATUS&wt=json and sendToOCPQueue=true
   [junit4]   2> 2907035 INFO  (qtp1401988559-44913) [n:localhost:51887_solr    ] o.a.s.s.HttpSolrCall [admin] webapp=null path=/admin/collections params={action=CLUSTERSTATUS&wt=json} status=0 QTime=2
   [junit4]   2> 2907035 INFO  (TEST-TestSolrCLIRunExample.testInteractiveSolrCloudExample-seed#[40CD794E777CF30C]) [    ] o.a.s.c.c.SolrZkClient Using default ZkCredentialsProvider
   [junit4]   2> 2907036 INFO  (TEST-TestSolrCLIRunExample.testInteractiveSolrCloudExample-seed#[40CD794E777CF30C]) [    ] o.a.s.c.c.ConnectionManager Waiting for client to connect to ZooKeeper
   [junit4]   2> 2907036 INFO  (zkCallback-9018-thread-1) [    ] o.a.s.c.c.ConnectionManager Watcher org.apache.solr.common.cloud.ConnectionManager@3e658659 name:ZooKeeperConnection Watcher:127.0.0.1:51892/solr got event WatchedEvent state:SyncConnected type:None path:null path:null type:None
   [junit4]   2> 2907036 INFO  (TEST-TestSolrCLIRunExample.testInteractiveSolrCloudExample-seed#[40CD794E777CF30C]) [    ] o.a.s.c.c.ConnectionManager Client is connected to ZooKeeper
   [junit4]   2> 2907036 INFO  (TEST-TestSolrCLIRunExample.testInteractiveSolrCloudExample-seed#[40CD794E777CF30C]) [    ] o.a.s.c.c.SolrZkClient Using default ZkACLProvider
   [junit4]   2> 2907036 INFO  (TEST-TestSolrCLIRunExample.testInteractiveSolrCloudExample-seed#[40CD794E777CF30C]) [    ] o.a.s.c.c.ZkStateReader Updating cluster state from ZooKeeper... 
   [junit4]   2> 2907041 INFO  (TEST-TestSolrCLIRunExample.testInteractiveSolrCloudExample-seed#[40CD794E777CF30C]) [    ] o.a.s.c.c.SolrZkClient makePath: /configs/testCloudExamplePrompt/currency.xml
   [junit4]   2> 2907043 INFO  (TEST-TestSolrCLIRunExample.testInteractiveSolrCloudExample-seed#[40CD794E777CF30C]) [    ] o.a.s.c.c.SolrZkClient makePath: /configs/testCloudExamplePrompt/elevate.xml
   [junit4]   2> 2907045 INFO  (TEST-TestSolrCLIRunExample.testInteractiveSolrCloudExample-seed#[40CD794E777CF30C]) [    ] o.a.s.c.c.SolrZkClient makePath: /configs/testCloudExamplePrompt/lang/contractions_ca.txt
   [junit4]   2> 2907047 INFO  (TEST-TestSolrCLIRunExample.testInteractiveSolrCloudExample-seed#[40CD794E777CF30C]) [    ] o.a.s.c.c.SolrZkClient makePath: /configs/testCloudExamplePrompt/lang/contractions_fr.txt
   [junit4]   2> 2907049 INFO  (TEST-TestSolrCLIRunExample.testInteractiveSolrCloudExample-seed#[40CD794E777CF30C]) [    ] o.a.s.c.c.SolrZkClient makePath: /configs/testCloudExamplePrompt/lang/contractions_ga.txt
   [junit4]   2> 2907050 INFO  (TEST-TestSolrCLIRunExample.testInteractiveSolrCloudExample-seed#[40CD794E777CF30C]) [    ] o.a.s.c.c.SolrZkClient makePath: /configs/testCloudExamplePrompt/lang/contractions_it.txt
   [junit4]   2> 2907052 INFO  (TEST-TestSolrCLIRunExample.testInteractiveSolrCloudExample-seed#[40CD794E777CF30C]) [    ] o.a.s.c.c.SolrZkClient makePath: /configs/testCloudExamplePrompt/lang/hyphenations_ga.txt
   [junit4]   2> 2907054 INFO  (TEST-TestSolrCLIRunExample.testInteractiveSolrCloudExample-seed#[40CD794E777CF30C]) [    ] o.a.s.c.c.SolrZkClient makePath: /configs/testCloudExamplePrompt/lang/stemdict_nl.txt
   [junit4]   2> 2907055 INFO  (TEST-TestSolrCLIRunExample.testInteractiveSolrCloudExample-seed#[40CD794E777CF30C]) [    ] o.a.s.c.c.SolrZkClient makePath: /configs/testCloudExamplePrompt/lang/stoptags_ja.txt
   [junit4]   2> 2907057 INFO  (TEST-TestSolrCLIRunExample.testInteractiveSolrCloudExample-seed#[40CD794E777CF30C]) [    ] o.a.s.c.c.SolrZkClient makePath: /configs/testCloudExamplePrompt/lang/stopwords_ar.txt
   [junit4]   2> 2907059 INFO  (TEST-TestSolrCLIRunExample.testInteractiveSolrCloudExample-seed#[40CD794E777CF30C]) [    ] o.a.s.c.c.SolrZkClient makePath: /configs/testCloudExamplePrompt/lang/stopwords_bg.txt
   [junit4]   2> 2907061 INFO  (TEST-TestSolrCLIRunExample.testInteractiveSolrCloudExample-seed#[40CD794E777CF30C]) [    ] o.a.s.c.c.SolrZkClient makePath: /configs/testCloudExamplePrompt/lang/stopwords_ca.txt
   [junit4]   2> 2907062 INFO  (TEST-TestSolrCLIRunExample.testInteractiveSolrCloudExample-seed#[40CD794E777CF30C]) [    ] o.a.s.c.c.SolrZkClient makePath: /configs/testCloudExamplePrompt/lang/stopwords_cz.txt
   [junit4]   2> 2907064 INFO  (TEST-TestSolrCLIRunExample.testInteractiveSolrCloudExample-seed#[40CD794E777CF30C]) [    ] o.a.s.c.c.SolrZkClient makePath: /configs/testCloudExamplePrompt/lang/stopwords_da.txt
   [junit4]   2> 2907066 INFO  (TEST-TestSolrCLIRunExample.testInteractiveSolrCloudExample-seed#[40CD794E777CF30C]) [    ] o.a.s.c.c.SolrZkClient makePath: /configs/testCloudExamplePrompt/lang/stopwords_de.txt
   [junit4]   2> 2907068 INFO  (TEST-TestSolrCLIRunExample.testInteractiveSolrCloudExample-seed#[40CD794E777CF30C]) [    ] o.a.s.c.c.SolrZkClient makePath: /configs/testCloudExamplePrompt/lang/stopwords_el.txt
   [junit4]   2> 2907069 INFO  (TEST-TestSolrCLIRunExample.testInteractiveSolrCloudExample-seed#[40CD794E777CF30C]) [    ] o.a.s.c.c.SolrZkClient makePath: /configs/testCloudExamplePrompt/lang/stopwords_en.txt
   [junit4]   2> 2907071 INFO  (TEST-TestSolrCLIRunExample.testInteractiveSolrCloudExample-seed#[40CD794E777CF30C]) [    ] o.a.s.c.c.SolrZkClient makePath: /configs/testCloudExamplePrompt/lang/stopwords_es.txt
   [junit4]   2> 2907073 INFO  (TEST-TestSolrCLIRunExample.testInteractiveSolrCloudExample-seed#[40CD794E777CF30C]) [    ] o.a.s.c.c.SolrZkClient makePath: /configs/testCloudExamplePrompt/lang/stopwords_eu.txt
   [junit4]   2> 2907075 INFO  (TEST-TestSolrCLIRunExample.testInteractiveSolrCloudExample-seed#[40CD794E777CF30C]) [    ] o.a.s.c.c.SolrZkClient makePath: /configs/testCloudExamplePrompt/lang/stopwords_fa.txt
   [junit4]   2> 2907077 INFO  (TEST-TestSolrCLIRunExample.testInteractiveSolrCloudExample-seed#[40CD794E777CF30C]) [    ] o.a.s.c.c.SolrZkClient makePath: /configs/testCloudExamplePrompt/lang/stopwords_fi.txt
   [junit4]   2> 2907078 INFO  (TEST-TestSolrCLIRunExample.testInteractiveSolrCloudExample-seed#[40CD794E777CF30C]) [    ] o.a.s.c.c.SolrZkClient makePath: /configs/testCloudExamplePrompt/lang/stopwords_fr.txt
   [junit4]   2> 2907080 INFO  (TEST-TestSolrCLIRunExample.testInteractiveSolrCloudExample-seed#[40CD794E777CF30C]) [    ] o.a.s.c.c.SolrZkClient makePath: /configs/testCloudExamplePrompt/lang/stopwords_ga.txt
   [junit4]   2> 2907082 INFO  (TEST-TestSolrCLIRunExample.testInteractiveSolrCloudExample-seed#[40CD794E777CF30C]) [    ] o.a.s.c.c.SolrZkClient makePath: /configs/testCloudExamplePrompt/lang/stopwords_gl.txt
   [junit4]   2> 2907084 INFO  (TEST-TestSolrCLIRunExample.testInteractiveSolrCloudExample-seed#[40CD794E777CF30C]) [    ] o.a.s.c.c.SolrZkClient makePath: /configs/testCloudExamplePrompt/lang/stopwords_hi.txt
   [junit4]   2> 2907085 INFO  (TEST-TestSolrCLIRunExample.testInteractiveSolrCloudExample-seed#[40CD794E777CF30C]) [    ] o.a.s.c.c.SolrZkClient makePath: /configs/testCloudExamplePrompt/lang/stopwords_hu.txt
   [junit4]   2> 2907087 INFO  (TEST-TestSolrCLIRunExample.testInteractiveSolrCloudExample-seed#[40CD794E777CF30C]) [    ] o.a.s.c.c.SolrZkClient makePath: /configs/testCloudExamplePrompt/lang/stopwords_hy.txt
   [junit4]   2> 2907089 INFO  (TEST-TestSolrCLIRunExample.testInteractiveSolrCloudExample-seed#[40CD794E777CF30C]) [    ] o.a.s.c.c.SolrZkClient makePath: /configs/testCloudExamplePrompt/lang/stopwords_id.txt
   [junit4]   2> 2907090 INFO  (TEST-TestSolrCLIRunExample.testInteractiveSolrCloudExample-seed#[40CD794E777CF30C]) [    ] o.a.s.c.c.SolrZkClient makePath: /configs/testCloudExamplePrompt/lang/stopwords_it.txt
   [junit4]   2> 2907092 INFO  (TEST-TestSolrCLIRunExample.testInteractiveSolrCloudExample-seed#[40CD794E777CF30C]) [    ] o.a.s.c.c.SolrZkClient makePath: /configs/testCloudExamplePrompt/lang/stopwords_ja.txt
   [junit4]   2> 2907094 INFO  (TEST-TestSolrCLIRunExample.testInteractiveSolrCloudExample-seed#[40CD794E777CF30C]) [    ] o.a.s.c.c.SolrZkClient makePath: /configs/testCloudExamplePrompt/lang/stopwords_lv.txt
   [junit4]   2> 2907096 INFO  (TEST-TestSolrCLIRunExample.testInteractiveSolrCloudExample-seed#[40CD794E777CF30C]) [    ] o.a.s.c.c.SolrZkClient makePath: /configs/testCloudExamplePrompt/lang/stopwords_nl.txt
   [junit4]   2> 2907097 INFO  (TEST-TestSolrCLIRunExample.testInteractiveSolrCloudExample-seed#[40CD794E777CF30C]) [    ] o.a.s.c.c.SolrZkClient makePath: /configs/testCloudExamplePrompt/lang/stopwords_no.txt
   [junit4]   2> 2907099 INFO  (TEST-TestSolrCLIRunExample.testInteractiveSolrCloudExample-seed#[40CD794E777CF30C]) [    ] o.a.s.c.c.SolrZkClient makePath: /configs/testCloudExamplePrompt/lang/stopwords_pt.txt
   [junit4]   2> 2907101 INFO  (TEST-TestSolrCLIRunExample.testInteractiveSolrCloudExample-seed#[40CD794E777CF30C]) [    ] o.a.s.c.c.SolrZkClient makePath: /configs/testCloudExamplePrompt/lang/stopwords_ro.txt
   [junit4]   2> 2907103 INFO  (TEST-TestSolrCLIRunExample.testInteractiveSolrCloudExample-seed#[40CD794E777CF30C]) [    ] o.a.s.c.c.SolrZkClient makePath: /configs/testCloudExamplePrompt/lang/stopwords_ru.txt
   [junit4]   2> 2907104 INFO  (TEST-TestSolrCLIRunExample.testInteractiveSolrCloudExample-seed#[40CD794E777CF30C]) [    ] o.a.s.c.c.SolrZkClient makePath: /configs/testCloudExamplePrompt/lang/stopwords_sv.txt
   [junit4]   2> 2907106 INFO  (TEST-TestSolrCLIRunExample.testInteractiveSolrCloudExample-seed#[40CD794E777CF30C]) [    ] o.a.s.c.c.SolrZkClient makePath: /configs/testCloudExamplePrompt/lang/stopwords_th.txt
   [junit4]   2> 2907108 INFO  (TEST-TestSolrCLIRunExample.testInteractiveSolrCloudExample-seed#[40CD794E777CF30C]) [    ] o.a.s.c.c.SolrZkClient makePath: /configs/testCloudExamplePrompt/lang/stopwords_tr.txt
   [junit4]   2> 2907109 INFO  (TEST-TestSolrCLIRunExample.testInteractiveSolrCloudExample-seed#[40CD794E777CF30C]) [    ] o.a.s.c.c.SolrZkClient makePath: /configs/testCloudExamplePrompt/lang/userdict_ja.txt
   [junit4]   2> 2907111 INFO  (TEST-TestSolrCLIRunExample.testInteractiveSolrCloudExample-seed#[40CD794E777CF30C]) [    ] o.a.s.c.c.SolrZkClient makePath: /configs/testCloudExamplePrompt/managed-schema
   [junit4]   2> 2907113 INFO  (TEST-TestSolrCLIRunExample.testInteractiveSolrCloudExample-seed#[40CD794E777CF30C]) [    ] o.a.s.c.c.SolrZkClient makePath: /configs/testCloudExamplePrompt/params.json
   [junit4]   2> 2907114 INFO  (TEST-TestSolrCLIRunExample.testInteractiveSolrCloudExample-seed#[40CD794E777CF30C]) [    ] o.a.s.c.c.SolrZkClient makePath: /configs/testCloudExamplePrompt/protwords.txt
   [junit4]   2> 2907116 INFO  (TEST-TestSolrCLIRunExample.testInteractiveSolrCloudExample-seed#[40CD794E777CF30C]) [    ] o.a.s.c.c.SolrZkClient makePath: /configs/testCloudExamplePrompt/solrconfig.xml
   [junit4]   2> 2907118 INFO  (TEST-TestSolrCLIRunExample.testInteractiveSolrCloudExample-seed#[40CD794E777CF30C]) [    ] o.a.s.c.c.SolrZkClient makePath: /configs/testCloudExamplePrompt/stopwords.txt
   [junit4]   2> 2907119 INFO  (TEST-TestSolrCLIRunExample.testInteractiveSolrCloudExample-seed#[40CD794E777CF30C]) [    ] o.a.s.c.c.SolrZkClient makePath: /configs/testCloudExamplePrompt/synonyms.txt
   [junit4]   2> 2907122 INFO  (qtp1401988559-44915) [n:localhost:51887_solr    ] o.a.s.h.a.CollectionsHandler Invoked Collection Action :list with params action=list&wt=json and sendToOCPQueue=true
   [junit4]   2> 2907122 INFO  (qtp1401988559-44915) [n:localhost:51887_solr    ] o.a.s.s.HttpSolrCall [admin] webapp=null path=/admin/collections params={action=list&wt=json} status=0 QTime=0
   [junit4]   2> 2907124 INFO  (qtp1401988559-44917) [n:localhost:51887_solr    ] o.a.s.h.a.CollectionsHandler Invoked Collection Action :create with params replicationFactor=2&maxShardsPerNode=4&action=CREATE&numShards=2&name=testCloudExamplePrompt&wt=json&collection.configName=testCloudExamplePrompt and sendToOCPQueue=true
   [junit4]   2> 2907126 INFO  (OverseerCollectionConfigSetProcessor-98869955221258243-localhost:51887_solr-n_0000000000) [n:localhost:51887_solr    ] o.a.s.c.OverseerTaskProcessor Overseer Collection Message Handler: Get the message id:/overseer/collection-queue-work/qn-0000000000 message:{
   [junit4]   2>   "name":"testCloudExamplePrompt",
   [junit4]   2>   "fromApi":"true",
   [junit4]   2>   "replicationFactor":"2",
   [junit4]   2>   "collection.configName":"testCloudExamplePrompt",
   [junit4]   2>   "numShards":"2",
   [junit4]   2>   "maxShardsPerNode":"4",
   [junit4]   2>   "stateFormat":"2",
   [junit4]   2>   "operation":"create"}
   [junit4]   2> 2907127 INFO  (OverseerThreadFactory-11622-thread-1-processing-n:localhost:51887_solr) [n:localhost:51887_solr    ] o.a.s.c.OverseerCollectionMessageHandler OverseerCollectionMessageHandler.processMessage : create , {
   [junit4]   2>   "name":"testCloudExamplePrompt",
   [junit4]   2>   "fromApi":"true",
   [junit4]   2>   "replicationFactor":"2",
   [junit4]   2>   "collection.configName":"testCloudExamplePrompt",
   [junit4]   2>   "numShards":"2",
   [junit4]   2>   "maxShardsPerNode":"4",
   [junit4]   2>   "stateFormat":"2",
   [junit4]   2>   "operation":"create"}
   [junit4]   2> 2907127 INFO  (OverseerThreadFactory-11622-thread-1-processing-n:localhost:51887_solr) [n:localhost:51887_solr    ] o.a.s.c.OverseerCollectionMessageHandler Create collection testCloudExamplePrompt
   [junit4]   2> 2907128 WARN  (OverseerThreadFactory-11622-thread-1-processing-n:localhost:51887_solr) [n:localhost:51887_solr    ] o.a.s.c.OverseerCollectionMessageHandler Specified replicationFactor of 2 on collection testCloudExamplePrompt is higher than or equal to the number of Solr instances currently live or live and part of your createNodeSet(1). It's unusual to run two replica of the same slice on the same Solr-instance.
   [junit4]   2> 2907128 INFO  (OverseerThreadFactory-11622-thread-1-processing-n:localhost:51887_solr) [n:localhost:51887_solr    ] o.a.s.c.OverseerCollectionMessageHandler creating collections conf node /collections/testCloudExamplePrompt 
   [junit4]   2> 2907128 INFO  (OverseerThreadFactory-11622-thread-1-processing-n:localhost:51887_solr) [n:localhost:51887_solr    ] o.a.s.c.c.SolrZkClient makePath: /collections/testCloudExamplePrompt
   [junit4]   2> 2907129 INFO  (zkCallback-9012-thread-1-processing-n:localhost:51887_solr) [n:localhost:51887_solr    ] o.a.s.c.c.ZkStateReader A collections change: [WatchedEvent state:SyncConnected type:NodeChildrenChanged path:/collections], has occurred - updating...
   [junit4]   2> 2907129 INFO  (zkCallback-9018-thread-1) [    ] o.a.s.c.c.ZkStateReader A collections change: [WatchedEvent state:SyncConnected type:NodeChildrenChanged path:/collections], has occurred - updating...
   [junit4]   2> 2907131 INFO  (OverseerStateUpdate-98869955221258243-localhost:51887_solr-n_0000000000) [n:localhost:51887_solr    ] o.a.s.c.Overseer processMessage: queueSize: 1, message = {
   [junit4]   2>   "name":"testCloudExamplePrompt",
   [junit4]   2>   "fromApi":"true",
   [junit4]   2>   "replicationFactor":"2",
   [junit4]   2>   "collection.configName":"testCloudExamplePrompt",
   [junit4]   2>   "numShards":"2",
   [junit4]   2>   "maxShardsPerNode":"4",
   [junit4]   2>   "stateFormat":"2",
   [junit4]   2>   "operation":"create"} current state version: 0
   [junit4]   2> 2907131 INFO  (OverseerStateUpdate-98869955221258243-localhost:51887_solr-n_0000000000) [n:localhost:51887_solr    ] o.a.s.c.o.ClusterStateMutator building a new cName: testCloudExamplePrompt
   [junit4]   2> 2907132 INFO  (OverseerStateUpdate-98869955221258243-localhost:51887_solr-n_0000000000) [n:localhost:51887_solr    ] o.a.s.c.o.ZkStateWriter going to create_collection /collections/testCloudExamplePrompt/state.json
   [junit4]   2> 2907232 INFO  (OverseerThreadFactory-11622-thread-1-processing-n:localhost:51887_solr) [n:localhost:51887_solr    ] o.a.s.c.OverseerCollectionMessageHandler Creating SolrCores for new collection testCloudExamplePrompt, shardNames [shard1, shard2] , replicationFactor : 2
   [junit4]   2> 2907232 INFO  (OverseerThreadFactory-11622-thread-1-processing-n:localhost:51887_solr) [n:localhost:51887_solr    ] o.a.s.c.OverseerCollectionMessageHandler Creating core testCloudExamplePrompt_shard2_replica1 as part of shard shard2 of collection testCloudExamplePrompt on localhost:51887_solr
   [junit4]   2> 2907233 INFO  (OverseerThreadFactory-11622-thread-1-processing-n:localhost:51887_solr) [n:localhost:51887_solr    ] o.a.s.c.OverseerCollectionMessageHandler Creating core testCloudExamplePrompt_shard1_replica2 as part of shard shard1 of collection testCloudExamplePrompt on localhost:51887_solr
   [junit4]   2> 2907234 INFO  (OverseerThreadFactory-11622-thread-1-processing-n:localhost:51887_solr) [n:localhost:51887_solr    ] o.a.s.c.OverseerCollectionMessageHandler Creating core testCloudExamplePrompt_shard2_replica2 as part of shard shard2 of collection testCloudExamplePrompt on localhost:51887_solr
   [junit4]   2> 2907239 INFO  (OverseerThreadFactory-11622-thread-1-processing-n:localhost:51887_solr) [n:localhost:51887_solr    ] o.a.s.c.OverseerCollectionMessageHandler Creating core testCloudExamplePrompt_shard1_replica1 as part of shard shard1 of collection testCloudExamplePrompt on localhost:51887_solr
   [junit4]   2> 2907239 INFO  (qtp1401988559-44913) [n:localhost:51887_solr    ] o.a.s.h.a.CoreAdminOperation core create command collection=testCloudExamplePrompt&qt=/admin/cores&action=CREATE&version=2&shard=shard1&name=testCloudExamplePrompt_shard1_replica2&numShards=2&collection.configName=testCloudExamplePrompt&wt=javabin
   [junit4]   2> 2907239 INFO  (qtp1401988559-44918) [n:localhost:51887_solr    ] o.a.s.h.a.CoreAdminOperation core create command collection=testCloudExamplePrompt&qt=/admin/cores&action=CREATE&version=2&shard=shard2&name=testCloudExamplePrompt_shard2_replica1&numShards=2&collection.configName=testCloudExamplePrompt&wt=javabin
   [junit4]   2> 2907240 INFO  (qtp1401988559-44914) [n:localhost:51887_solr    ] o.a.s.h.a.CoreAdminOperation core create command collection=testCloudExamplePrompt&qt=/admin/cores&action=CREATE&version=2&shard=shard2&name=testCloudExamplePrompt_shard2_replica2&numShards=2&collection.configName=testCloudExamplePrompt&wt=javabin
   [junit4]   2> 2907241 INFO  (qtp1401988559-44913) [n:localhost:51887_solr    ] o.a.s.c.CoreDescriptor Created CoreDescriptor: {configSetProperties=configsetprops.json, config=solrconfig.xml, shard=shard1, transient=false, collection=testCloudExamplePrompt, numShards=2, loadOnStartup=true, schema=schema.xml, dataDir=data\, collection.configName=testCloudExamplePrompt, name=testCloudExamplePrompt_shard1_replica2}
   [junit4]   2> 2907241 INFO  (qtp1401988559-44918) [n:localhost:51887_solr    ] o.a.s.c.CoreDescriptor Created CoreDescriptor: {transient=false, shard=shard2, collection.configName=testCloudExamplePrompt, name=testCloudExamplePrompt_shard2_replica1, collection=testCloudExamplePrompt, configSetProperties=configsetprops.json, loadOnStartup=true, schema=schema.xml, numShards=2, config=solrconfig.xml, dataDir=data\}
   [junit4]   2> 2907242 INFO  (qtp1401988559-44914) [n:localhost:51887_solr    ] o.a.s.c.CoreDescriptor Created CoreDescriptor: {shard=shard2, numShards=2, dataDir=data\, collection=testCloudExamplePrompt, name=testCloudExamplePrompt_shard2_replica2, transient=false, loadOnStartup=true, config=solrconfig.xml, collection.configName=testCloudExamplePrompt, configSetProperties=configsetprops.json, schema=schema.xml}
   [junit4]   2> 2907245 INFO  (qtp1401988559-44913) [n:localhost:51887_solr c:testCloudExamplePrompt s:shard1  x:testCloudExamplePrompt_shard1_replica2] o.a.s.c.ZkController publishing state=down
   [junit4]   2> 2907245 INFO  (qtp1401988559-44915) [n:localhost:51887_solr    ] o.a.s.h.a.CoreAdminOperation core create command collection=testCloudExamplePrompt&qt=/admin/cores&action=CREATE&version=2&shard=shard1&name=testCloudExamplePrompt_shard1_replica1&numShards=2&collection.configName=testCloudExamplePrompt&wt=javabin
   [junit4]   2> 2907246 INFO  (qtp1401988559-44914) [n:localhost:51887_solr c:testCloudExamplePrompt s:shard2  x:testCloudExamplePrompt_shard2_replica2] o.a.s.c.ZkController publishing state=down
   [junit4]   2> 2907245 INFO  (qtp1401988559-44918) [n:localhost:51887_solr c:testCloudExamplePrompt s:shard2  x:testCloudExamplePrompt_shard2_replica1] o.a.s.c.ZkController publishing state=down
   [junit4]   2> 2907247 INFO  (qtp1401988559-44915) [n:localhost:51887_solr    ] o.a.s.c.CoreDescriptor Created CoreDescriptor: {collection=testCloudExamplePrompt, shard=shard1, config=solrconfig.xml, numShards=2, dataDir=data\, collection.configName=testCloudExamplePrompt, name=testCloudExamplePrompt_shard1_replica1, loadOnStartup=true, configSetProperties=configsetprops.json, transient=false, schema=schema.xml}
   [junit4]   2> 2907249 INFO  (qtp1401988559-44913) [n:localhost:51887_solr c:testCloudExamplePrompt s:shard1  x:testCloudExamplePrompt_shard1_replica2] o.a.s.c.ZkController Registering watch for collection testCloudExamplePrompt
   [junit4]   2> 2907249 INFO  (qtp1401988559-44913) [n:localhost:51887_solr c:testCloudExamplePrompt s:shard1  x:testCloudExamplePrompt_shard1_replica2] o.a.s.c.c.ZkStateReader addZkWatch [testCloudExamplePrompt]
   [junit4]   2> 2907249 INFO  (qtp1401988559-44914) [n:localhost:51887_solr c:testCloudExamplePrompt s:shard2  x:testCloudExamplePrompt_shard2_replica2] o.a.s.c.ZkController Registering watch for collection testCloudExamplePrompt
   [junit4]   2> 2907249 INFO  (qtp1401988559-44914) [n:localhost:51887_solr c:testCloudExamplePrompt s:shard2  x:testCloudExamplePrompt_shard2_replica2] o.a.s.c.ZkController look for our core node name
   [junit4]   2> 2907249 INFO  (qtp1401988559-44918) [n:localhost:51887_solr c:testCloudExamplePrompt s:shard2  x:testCloudExamplePrompt_shard2_replica1] o.a.s.c.ZkController Registering watch for collection testCloudExamplePrompt
   [junit4]   2> 2907249 INFO  (qtp1401988559-44918) [n:localhost:51887_solr c:testCloudExamplePrompt s:shard2  x:testCloudExamplePrompt_shard2_replica1] o.a.s.c.ZkController look for our core node name
   [junit4]   2> 2907249 INFO  (OverseerStateUpdate-98869955221258243-localhost:51887_solr-n_0000000000) [n:localhost:51887_solr    ] o.a.s.c.Overseer processMessage: queueSize: 3, message = {
   [junit4]   2>   "operation":"state",
   [junit4]   2>   "collection":"testCloudExamplePrompt",
   [junit4]   2>   "roles":null,
   [junit4]   2>   "core":"testCloudExamplePrompt_shard1_replica2",
   [junit4]   2>   "shard":"shard1",
   [junit4]   2>   "state":"down",
   [junit4]   2>   "numShards":"2",
   [junit4]   2>   "node_name":"localhost:51887_solr",
   [junit4]   2>   "base_url":"http://localhost:51887/solr"} current state version: 0
   [junit4]   2> 2907251 INFO  (qtp1401988559-44913) [n:localhost:51887_solr c:testCloudExamplePrompt s:shard1  x:testCloudExamplePrompt_shard1_replica2] o.a.s.c.c.ZkStateReader Add data for [testCloudExamplePrompt] ver [0]
   [junit4]   2> 2907251 INFO  (qtp1401988559-44913) [n:localhost:51887_solr c:testCloudExamplePrompt s:shard1  x:testCloudExamplePrompt_shard1_replica2] o.a.s.c.ZkController look for our core node name
   [junit4]   2> 2907251 INFO  (qtp1401988559-44915) [n:localhost:51887_solr c:testCloudExamplePrompt s:shard1  x:testCloudExamplePrompt_shard1_replica1] o.a.s.c.ZkController publishing state=down
   [junit4]   2> 2907251 INFO  (OverseerStateUpdate-98869955221258243-localhost:51887_solr-n_0000000000) [n:localhost:51887_solr    ] o.a.s.c.o.ReplicaMutator Update state numShards=2 message={
   [junit4]   2>   "operation":"state",
   [junit4]   2>   "collection":"testCloudExamplePrompt",
   [junit4]   2>   "roles":null,
   [junit4]   2>   "core":"testCloudExamplePrompt_shard1_replica2",
   [junit4]   2>   "shard":"shard1",
   [junit4]   2>   "state":"down",
   [junit4]   2>   "numShards":"2",
   [junit4]   2>   "node_name":"localhost:51887_solr",
   [junit4]   2>   "base_url":"http://localhost:51887/solr"}
   [junit4]   2> 2907252 INFO  (qtp1401988559-44915) [n:localhost:51887_solr c:testCloudExamplePrompt s:shard1  x:testCloudExamplePrompt_shard1_replica1] o.a.s.c.ZkController Registering watch for collection testCloudExamplePrompt
   [junit4]   2> 2907252 INFO  (qtp1401988559-44915) [n:localhost:51887_solr c:testCloudExamplePrompt s:shard1  x:testCloudExamplePrompt_shard1_replica1] o.a.s.c.ZkController look for our core node name
   [junit4]   2> 2907256 INFO  (OverseerStateUpdate-98869955221258243-localhost:51887_solr-n_0000000000) [n:localhost:51887_solr    ] o.a.s.c.Overseer processMessage: queueSize: 3, message = {
   [junit4]   2>   "operation":"state",
   [junit4]   2>   "collection":"testCloudExamplePrompt",
   [junit4]   2>   "roles":null,
   [junit4]   2>   "core":"testCloudExamplePrompt_shard2_replica2",
   [junit4]   2>   "shard":"shard2",
   [junit4]   2>   "state":"down",
   [junit4]   2>   "numShards":"2",
   [junit4]   2>   "node_name":"localhost:51887_solr",
   [junit4]   2>   "base_url":"http://localhost:51887/solr"} current state version: 0
   [junit4]   2> 2907256 INFO  (OverseerStateUpdate-98869955221258243-localhost:51887_solr-n_0000000000) [n:localhost:51887_solr    ] o.a.s.c.o.ReplicaMutator Update state numShards=2 message={
   [junit4]   2>   "operation":"state",
   [junit4]   2>   "collection":"testCloudExamplePrompt",
   [junit4]   2>   "roles":null,
   [junit4]   2>   "core":"testCloudExamplePrompt_shard2_replica2",
   [junit4]   2>   "shard":"shard2",
   [junit4]   2>   "state":"down",
   [junit4]   2>   "numShards":"2",
   [junit4]   2>   "node_name":"localhost:51887_solr",
   [junit4]   2>   "base_url":"http://localhost:51887/solr"}
   [junit4]   2> 2907260 INFO  (OverseerStateUpdate-98869955221258243-localhost:51887_solr-n_0000000000) [n:localhost:51887_solr    ] o.a.s.c.Overseer processMessage: queueSize: 2, message = {
   [junit4]   2>   "operation":"state",
   [junit4]   2>   "collection":"testCloudExamplePrompt",
   [junit4]   2>   "roles":null,
   [junit4]   2>   "core":"testCloudExamplePrompt_shard2_replica1",
   [junit4]   2>   "shard":"shard2",
   [junit4]   2>   "state":"down",
   [junit4]   2>   "numShards":"2",
   [junit4]   2>   "node_name":"localhost:51887_solr",
   [junit4]   2>   "base_url":"http://localhost:51887/solr"} current state version: 0
   [junit4]   2> 2907261 INFO  (OverseerStateUpdate-98869955221258243-localhost:51887_solr-n_0000000000) [n:localhost:51887_solr    ] o.a.s.c.o.ReplicaMutator Update state numShards=2 message={
   [junit4]   2>   "operation":"state",
   [junit4]   2>   "collection":"testCloudExamplePrompt",
   [junit4]   2>   "roles":null,
   [junit4]   2>   "core":"testCloudExamplePrompt_shard2_replica1",
   [junit4]   2>   "shard":"shard2",
   [junit4]   2>   "state":"down",
   [junit4]   2>   "numShards":"2",
   [junit4]   2>   "node_name":"localhost:51887_solr",
   [junit4]   2>   "base_url":"http://localhost:51887/solr"}
   [junit4]   2> 2907265 INFO  (OverseerStateUpdate-98869955221258243-localhost:51887_solr-n_0000000000) [n:localhost:51887_solr    ] o.a.s.c.Overseer processMessage: queueSize: 2, message = {
   [junit4]   2>   "operation":"state",
   [junit4]   2>   "collection":"testCloudExamplePrompt",
   [junit4]   2>   "roles":null,
   [junit4]   2>   "core":"testCloudExamplePrompt_shard1_replica1",
   [junit4]   2>   "shard":"shard1",
   [junit4]   2>   "state":"down",
   [junit4]   2>   "numShards":"2",
   [junit4]   2>   "node_name":"localhost:51887_solr",
   [junit4]   2>   "base_url":"http://localhost:51887/solr"} current state version: 0
   [junit4]   2> 2907265 INFO  (OverseerStateUpdate-98869955221258243-localhost:51887_solr-n_0000000000) [n:localhost:51887_solr    ] o.a.s.c.o.ReplicaMutator Update state numShards=2 message={
   [junit4]   2>   "operation":"state",
   [junit4]   2>   "collection":"testCloudExamplePrompt",
   [junit4]   2>   "roles":null,
   [junit4]   2>   "core":"testCloudExamplePrompt_shard1_replica1",
   [junit4]   2>   "shard":"shard1",
   [junit4]   2>   "state":"down",
   [junit4]   2>   "numShards":"2",
   [junit4]   2>   "node_name":"localhost:51887_solr",
   [junit4]   2>   "base_url":"http://localhost:51887/solr"}
   [junit4]   2> 2907370 INFO  (OverseerStateUpdate-98869955221258243-localhost:51887_solr-n_0000000000) [n:localhost:51887_solr    ] o.a.s.c.o.ZkStateWriter going to update_collection /collections/testCloudExamplePrompt/state.json version: 0
   [junit4]   2> 2907371 INFO  (zkCallback-9012-thread-1-processing-n:localhost:51887_solr) [n:localhost:51887_solr    ] o.a.s.c.c.ZkStateReader A cluster state change: [WatchedEvent state:SyncConnected type:NodeDataChanged path:/collections/testCloudExamplePrompt/state.json] for collection [testCloudExamplePrompt] has occurred - updating... (live nodes size: [1])
   [junit4]   2> 2907372 INFO  (zkCallback-9012-thread-1-processing-n:localhost:51887_solr) [n:localhost:51887_solr    ] o.a.s.c.c.ZkStateReader Updating data for [testCloudExamplePrompt] from [0] to [1]
   [junit4]   2> 2908251 INFO  (qtp1401988559-44918) [n:localhost:51887_solr c:testCloudExamplePrompt s:shard2  x:testCloudExamplePrompt_shard2_replica1] o.a.s.c.ZkController waiting to find shard id in clusterstate for testCloudExamplePrompt_shard2_replica1
   [junit4]   2> 2908251 INFO  (qtp1401988559-44918) [n:localhost:51887_solr c:testCloudExamplePrompt s:shard2  x:testCloudExamplePrompt_shard2_replica1] o.a.s.c.ZkController Check for collection zkNode:testCloudExamplePrompt
   [junit4]   2> 2908251 INFO  (qtp1401988559-44913) [n:localhost:51887_solr c:testCloudExamplePrompt s:shard1  x:testCloudExamplePrompt_shard1_replica2] o.a.s.c.ZkController waiting to find shard id in clusterstate for testCloudExamplePrompt_shard1_replica2
   [junit4]   2> 2908251 INFO  (qtp1401988559-44913) [n:localhost:51887_solr c:testCloudExamplePrompt s:shard1  x:testCloudExamplePrompt_shard1_replica2] o.a.s.c.ZkController Check for collection zkNode:testCloudExamplePrompt
   [junit4]   2> 2908251 INFO  (qtp1401988559-44914) [n:localhost:51887_solr c:testCloudExamplePrompt s:shard2  x:testCloudExamplePrompt_shard2_replica2] o.a.s.c.ZkController waiting to find shard id in clusterstate for testCloudExamplePrompt_shard2_replica2
   [junit4]   2> 2908252 INFO  (qtp1401988559-44915) [n:localhost:51887_solr c:testCloudExamplePrompt s:shard1  x:testCloudExamplePrompt_shard1_replica1] o.a.s.c.ZkController waiting to find shard id in clusterstate for testCloudExamplePrompt_shard1_replica1
   [junit4]   2> 2908252 INFO  (qtp1401988559-44915) [n:localhost:51887_solr c:testCloudExamplePrompt s:shard1  x:testCloudExamplePrompt_shard1_replica1] o.a.s.c.ZkController Check for collection zkNode:testCloudExamplePrompt
   [junit4]   2> 2908252 INFO  (qtp1401988559-44913) [n:localhost:51887_solr c:testCloudExamplePrompt s:shard1  x:testCloudExamplePrompt_shard1_replica2] o.a.s.c.ZkController Collection zkNode exists
   [junit4]   2> 2908252 INFO  (qtp1401988559-44918) [n:localhost:51887_solr c:testCloudExamplePrompt s:shard2  x:testCloudExamplePrompt_shard2_replica1] o.a.s.c.ZkController Collection zkNode exists
   [junit4]   2> 2908253 INFO  (qtp1401988559-44918) [n:localhost:51887_solr c:testCloudExamplePrompt s:shard2  x:testCloudExamplePrompt_shard2_replica1] o.a.s.c.c.ZkStateReader Load collection config from: [/collections/testCloudExamplePrompt]
   [junit4]   2> 2908253 INFO  (qtp1401988559-44915) [n:localhost:51887_solr c:testCloudExamplePrompt s:shard1  x:testCloudExamplePrompt_shard1_replica1] o.a.s.c.ZkController Collection zkNode exists
   [junit4]   2> 2908253 INFO  (qtp1401988559-44915) [n:localhost:51887_solr c:testCloudExamplePrompt s:shard1  x:testCloudExamplePrompt_shard1_replica1] o.a.s.c.c.ZkStateReader Load collection config from: [/collections/testCloudExamplePrompt]
   [junit4]   2> 2908252 INFO  (qtp1401988559-44914) [n:localhost:51887_solr c:testCloudExamplePrompt s:shard2  x:testCloudExamplePrompt_shard2_replica2] o.a.s.c.ZkController Check for collection zkNode:testCloudExamplePrompt
   [junit4]   2> 2908253 INFO  (qtp1401988559-44913) [n:localhost:51887_solr c:testCloudExamplePrompt s:shard1  x:testCloudExamplePrompt_shard1_replica2] o.a.s.c.c.ZkStateReader Load collection config from: [/collections/testCloudExamplePrompt]
   [junit4]   2> 2908254 INFO  (qtp1401988559-44918) [n:localhost:51887_solr c:testCloudExamplePrompt s:shard2  x:testCloudExamplePrompt_shard2_replica1] o.a.s.c.c.ZkStateReader path=[/collections/testCloudExamplePrompt] [configName]=[testCloudExamplePrompt] specified config exists in ZooKeeper
   [junit4]   2> 2908255 INFO  (qtp1401988559-44915) [n:localhost:51887_solr c:testCloudExamplePrompt s:shard1  x:testCloudExamplePrompt_shard1_replica1] o.a.s.c.c.ZkStateReader path=[/collections/testCloudExamplePrompt] [configName]=[testCloudExamplePrompt] specified config exists in ZooKeeper
   [junit4]   2> 2908255 INFO  (qtp1401988559-44918) [n:localhost:51887_solr c:testCloudExamplePrompt s:shard2  x:testCloudExamplePrompt_shard2_replica1] o.a.s.c.SolrResourceLoader new SolrResourceLoader for directory: 'C:\Users\jenkins\workspace\Lucene-Solr-5.5-Windows\solr\build\solr-core\test\J0\temp\solr.util.TestSolrCLIRunExample_40CD794E777CF30C-001\tempDir-002\node1\testCloudExamplePrompt_shard2_replica1'
   [junit4]   2> 2908255 INFO  (qtp1401988559-44913) [n:localhost:51887_solr c:testCloudExamplePrompt s:shard1  x:testCloudExamplePrompt_shard1_replica2] o.a.s.c.c.ZkStateReader path=[/collections/testCloudExamplePrompt] [configName]=[testCloudExamplePrompt] specified config exists in ZooKeeper
   [junit4]   2> 2908255 INFO  (qtp1401988559-44918) [n:localhost:51887_solr c:testCloudExamplePrompt s:shard2  x:testCloudExamplePrompt_shard2_replica1] o.a.s.c.SolrResourceLoader JNDI not configured for solr (NoInitialContextEx)
   [junit4]   2> 2908256 INFO  (qtp1401988559-44913) [n:localhost:51887_solr c:testCloudExamplePrompt s:shard1  x:testCloudExamplePrompt_shard1_replica2] o.a.s.c.SolrResourceLoader new SolrResourceLoader for directory: 'C:\Users\jenkins\workspace\Lucene-Solr-5.5-Windows\solr\build\solr-core\test\J0\temp\solr.util.TestSolrCLIRunExample_40CD794E777CF30C-001\tempDir-002\node1\testCloudExamplePrompt_shard1_replica2'
   [junit4]   2> 2908255 INFO  (qtp1401988559-44915) [n:localhost:51887_solr c:testCloudExamplePrompt s:shard1  x:testCloudExamplePrompt_shard1_replica1] o.a.s.c.SolrResourceLoader new SolrResourceLoader for directory: 'C:\Users\jenkins\workspace\Lucene-Solr-5.5-Windows\solr\build\solr-core\test\J0\temp\solr.util.TestSolrCLIRunExample_40CD794E777CF30C-001\tempDir-002\node1\testCloudExamplePrompt_shard1_replica1'
   [junit4]   2> 2908256 INFO  (qtp1401988559-44913) [n:localhost:51887_solr c:testCloudExamplePrompt s:shard1  x:testCloudExamplePrompt_shard1_replica2] o.a.s.c.SolrResourceLoader JNDI not configured for solr (NoInitialContextEx)
   [junit4]   2> 2908256 INFO  (qtp1401988559-44915) [n:localhost:51887_solr c:testCloudExamplePrompt s:shard1  x:testCloudExamplePrompt_shard1_replica1] o.a.s.c.SolrResourceLoader JNDI not configured for solr (NoInitialContextEx)
   [junit4]   2> 2908256 INFO  (qtp1401988559-44913) [n:localhost:51887_solr c:testCloudExamplePrompt s:shard1  x:testCloudExamplePrompt_shard1_replica2] o.a.s.c.SolrResourceLoader solr home defaulted to 'solr/' (could not find system property or JNDI)
   [junit4]   2> 2908254 INFO  (qtp1401988559-44914) [n:localhost:51887_solr c:testCloudExamplePrompt s:shard2  x:testCloudExamplePrompt_shard2_replica2] o.a.s.c.ZkController Collection zkNode exists
   [junit4]   2> 2908256 INFO  (qtp1401988559-44915) [n:localhost:51887_solr c:testCloudExamplePrompt s:shard1  x:testCloudExamplePrompt_shard1_replica1] o.a.s.c.SolrResourceLoader solr home defaulted to 'solr/' (could not find system property or JNDI)
   [junit4]   2> 2908257 INFO  (qtp1401988559-44914) [n:localhost:51887_solr c:testCloudExamplePrompt s:shard2  x:testCloudExamplePrompt_shard2_replica2] o.a.s.c.c.ZkStateReader Load collection config from: [/collections/testCloudExamplePrompt]
   [junit4]   2> 2908256 INFO  (qtp1401988559-44918) [n:localhost:51887_solr c:testCloudExamplePrompt s:shard2  x:testCloudExamplePrompt_shard2_replica1] o.a.s.c.SolrResourceLoader solr home defaulted to 'solr/' (could not find system property or JNDI)
   [junit4]   2> 2908260 INFO  (qtp1401988559-44914) [n:localhost:51887_solr c:testCloudExamplePrompt s:shard2  x:testCloudExamplePrompt_shard2_replica2] o.a.s.c.c.ZkStateReader path=[/collections/testCloudExamplePrompt] [configName]=[testCloudExamplePrompt] specified config exists in ZooKeeper
   [junit4]   2> 2908260 INFO  (qtp1401988559-44914) [n:localhost:51887_solr c:testCloudExamplePrompt s:shard2  x:testCloudExamplePrompt_shard2_replica2] o.a.s.c.SolrResourceLoader new SolrResourceLoader for directory: 'C:\Users\jenkins\workspace\Lucene-Solr-5.5-Windows\solr\build\solr-core\test\J0\temp\solr.util.TestSolrCLIRunExample_40CD794E777CF30C-001\tempDir-002\node1\testCloudExamplePrompt_shard2_replica2'
   [junit4]   2> 2908260 INFO  (qtp1401988559-44914) [n:localhost:51887_solr c:testCloudExamplePrompt s:shard2  x:testCloudExamplePrompt_shard2_replica2] o.a.s.c.SolrResourceLoader JNDI not configured for solr (NoInitialContextEx)
   [junit4]   2> 2908261 INFO  (qtp1401988559-44914) [n:localhost:51887_solr c:testCloudExamplePrompt s:shard2  x:testCloudExamplePrompt_shard2_replica2] o.a.s.c.SolrResourceLoader solr home defaulted to 'solr/' (could not find system property or JNDI)
   [junit4]   2> 2908261 INFO  (qtp1401988559-44915) [n:localhost:51887_solr c:testCloudExamplePrompt s:shard1  x:testCloudExamplePrompt_shard1_replica1] o.a.s.c.Config loaded config solrconfig.xml with version 0 
   [junit4]   2> 2908264 INFO  (qtp1401988559-44918) [n:localhost:51887_solr c:testCloudExamplePrompt s:shard2  x:testCloudExamplePrompt_shard2_replica1] o.a.s.c.Config loaded config solrconfig.xml with version 0 
   [junit4]   2> 2908266 INFO  (qtp1401988559-44913) [n:localhost:51887_solr c:testCloudExamplePrompt s:shard1  x:testCloudExamplePrompt_shard1_replica2] o.a.s.c.Config loaded config solrconfig.xml with version 0 
   [junit4]   2> 2908272 INFO  (qtp1401988559-44914) [n:localhost:51887_solr c:testCloudExamplePrompt s:shard2  x:testCloudExamplePrompt_shard2_replica2] o.a.s.c.Config loaded config solrconfig.xml with version 0 
   [junit4]   2> 2908280 INFO  (qtp1401988559-44915) [n:localhost:51887_solr c:testCloudExamplePrompt s:shard1  x:testCloudExamplePrompt_shard1_replica1] o.a.s.c.RequestParams conf resource params.json loaded . version : 0 
   [junit4]   2> 2908281 INFO  (qtp1401988559-44915) [n:localhost:51887_solr c:testCloudExamplePrompt s:shard1  x:testCloudExamplePrompt_shard1_replica1] o.a.s.c.RequestParams request params refreshed to version 0
   [junit4]   2> 2908281 INFO  (qtp1401988559-44913) [n:localhost:51887_solr c:testCloudExamplePrompt s:shard1  x:testCloudExamplePrompt_shard1_replica2] o.a.s.c.RequestParams conf resource params.json loaded . version : 0 
   [junit4]   2> 2908281 INFO  (qtp1401988559-44918) [n:localhost:51887_solr c:testCloudExamplePrompt s:shard2  x:testCloudExamplePrompt_shard2_replica1] o.a.s.c.RequestParams conf resource params.json loaded . version : 0 
   [junit4]   2> 2908281 INFO  (qtp1401988559-44913) [n:localhost:51887_solr c:testCloudExamplePrompt s:shard1  x:testCloudExamplePrompt_shard1_replica2] o.a.s.c.RequestParams request params refreshed to version 0
   [junit4]   2> 2908281 INFO  (qtp1401988559-44918) [n:localhost:51887_solr c:testCloudExamplePrompt s:shard2  x:testCloudExamplePrompt_shard2_replica1] o.a.s.c.RequestParams request params refreshed to version 0
   [junit4]   2> 2908281 INFO  (qtp1401988559-44913) [n:localhost:51887_solr c:testCloudExamplePrompt s:shard1  x:testCloudExamplePrompt_shard1_replica2] o.a.s.c.SolrConfig current version of requestparams : 0
   [junit4]   2> 2908281 INFO  (qtp1401988559-44918) [n:localhost:51887_solr c:testCloudExamplePrompt s:shard2  x:testCloudExamplePrompt_shard2_replica1] o.a.s.c.SolrConfig current version of requestparams : 0
   [junit4]   2> 2908281 INFO  (qtp1401988559-44915) [n:localhost:51887_solr c:testCloudExamplePrompt s:shard1  x:testCloudExamplePrompt_shard1_replica1] o.a.s.c.SolrConfig current version of requestparams : 0
   [junit4]   2> 2908283 INFO  (qtp1401988559-44913) [n:localhost:51887_solr c:testCloudExamplePrompt s:shard1  x:testCloudExamplePrompt_shard1_replica2] o.a.s.c.SolrConfig Adding specified lib dirs to ClassLoader
   [junit4]   2> 2908283 INFO  (qtp1401988559-44915) [n:localhost:51887_solr c:testCloudExamplePrompt s:shard1  x:testCloudExamplePrompt_shard1_replica1] o.a.s.c.SolrConfig Adding specified lib dirs to ClassLoader
   [junit4]   2> 2908283 INFO  (qtp1401988559-44918) [n:localhost:51887_solr c:testCloudExamplePrompt s:shard2  x:testCloudExamplePrompt_shard2_replica1] o.a.s.c.SolrConfig Adding specified lib dirs to ClassLoader
   [junit4]   2> 2908284 WARN  (qtp1401988559-44913) [n:localhost:51887_solr c:testCloudExamplePrompt s:shard1  x:testCloudExamplePrompt_shard1_replica2] o.a.s.c.SolrConfig Couldn't add files from C:\Users\jenkins\workspace\Lucene-Solr-5.5-Windows\solr\build\solr-core\test\J0\temp\solr.util.TestSolrCLIRunExample_40CD794E777CF30C-001\tempDir-002\node1\testCloudExamplePrompt_shard1_replica2\..\..\..\..\contrib\extraction\lib filtered by .*\.jar to classpath: C:\Users\jenkins\workspace\Lucene-Solr-5.5-Windows\solr\build\solr-core\test\J0\temp\solr.util.TestSolrCLIRunExample_40CD794E777CF30C-001\tempDir-002\node1\testCloudExamplePrompt_shard1_replica2\..\..\..\..\contrib\extraction\lib
   [junit4]   2> 2908284 WARN  (qtp1401988559-44918) [n:localhost:51887_solr c:testCloudExamplePrompt s:shard2  x:testCloudExamplePrompt_shard2_replica1] o.a.s.c.SolrConfig Couldn't add files from C:\Users\jenkins\workspace\Lucene-Solr-5.5-Windows\solr\build\solr-core\test\J0\temp\solr.util.TestSolrCLIRunExample_40CD794E777CF30C-001\tempDir-002\node1\testCloudExamplePrompt_shard2_replica1\..\..\..\..\contrib\extraction\lib filtered by .*\.jar to classpath: C:\Users\jenkins\workspace\Lucene-Solr-5.5-Windows\solr\build\solr-core\test\J0\temp\solr.util.TestSolrCLIRunExample_40CD794E777CF30C-001\tempDir-002\node1\testCloudExamplePrompt_shard2_replica1\..\..\..\..\contrib\extraction\lib
   [junit4]   2> 2908284 WARN  (qtp1401988559-44915) [n:localhost:51887_solr c:testCloudExamplePrompt s:shard1  x:testCloudExamplePrompt_shard1_replica1] o.a.s.c.SolrConfig Couldn't add files from C:\Users\jenkins\workspace\Lucene-Solr-5.5-Windows\solr\build\solr-core\test\J0\temp\solr.util.TestSolrCLIRunExample_40CD794E777CF30C-001\tempDir-002\node1\testCloudExamplePrompt_shard1_replica1\..\..\..\..\contrib\extraction\lib filtered by .*\.jar to classpath: C:\Users\jenkins\workspace\Lucene-Solr-5.5-Windows\solr\build\solr-core\test\J0\temp\solr.util.TestSolrCLIRunExample_40CD794E777CF30C-001\tempDir-002\node1\testCloudExamplePrompt_shard1_replica1\..\..\..\..\contrib\extraction\lib
   [junit4]   2> 2908285 WARN  (qtp1401988559-44913) [n:localhost:51887_solr c:testCloudExamplePrompt s:shard1  x:testCloudExamplePrompt_shard1_replica2] o.a.s.c.SolrConfig Couldn't add files from C:\Users\jenkins\workspace\Lucene-Solr-5.5-Windows\solr\build\solr-core\test\J0\temp\solr.util.TestSolrCLIRunExample_40CD794E777CF30C-001\tempDir-002\node1\testCloudExamplePrompt_shard1_replica2\..\..\..\..\dist filtered by solr-cell-\d.*\.jar to classpath: C:\Users\jenkins\workspace\Lucene-Solr-5.5-Windows\solr\build\solr-core\test\J0\temp\solr.util.TestSolrCLIRunExample_40CD794E777CF30C-001\tempDir-002\node1\testCloudExamplePrompt_shard1_replica2\..\..\..\..\dist
   [junit4]   2> 2908286 WARN  (qtp1401988559-44918) [n:localhost:51887_solr c:testCloudExamplePrompt s:shard2  x:testCloudExamplePrompt_shard2_replica1] o.a.s.c.SolrConfig Couldn't add files from C:\Users\jenkins\workspace\Lucene-Solr-5.5-Windows\solr\build\solr-core\test\J0\temp\solr.util.TestSolrCLIRunExample_40CD794E777CF30C-001\tempDir-002\node1\testCloudExamplePrompt_shard2_replica1\..\..\..\..\dist filtered by solr-cell-\d.*\.jar to classpath: C:\Users\jenkins\workspace\Lucene-Solr-5.5-Windows\solr\build\solr-core\test\J0\temp\solr.util.TestSolrCLIRunExample_40CD794E777CF30C-001\tempDir-002\node1\testCloudExamplePrompt_shard2_replica1\..\..\..\..\dist
   [junit4]   2> 2908286 WARN  (qtp1401988559-44915) [n:localhost:51887_solr c:testCloudExamplePrompt s:shard1  x:testCloudExamplePrompt_shard1_replica1] o.a.s.c.SolrConfig Couldn't add files from C:\Users\jenkins\workspace\Lucene-Solr-5.5-Windows\solr\build\solr-core\test\J0\temp\solr.util.TestSolrCLIRunExample_40CD794E777CF30C-001\tempDir-002\node1\testCloudExamplePrompt_shard1_replica1\..\..\..\..\dist filtered by solr-cell-\d.*\.jar to classpath: C:\Users\jenkins\workspace\Lucene-Solr-5.5-Windows\solr\build\solr-core\test\J0\temp\solr.util.TestSolrCLIRunExample_40CD794E777CF30C-001\tempDir-002\node1\testCloudExamplePrompt_shard1_replica1\..\..\..\..\dist
   [junit4]   2> 2908287 INFO  (qtp1401988559-44914) [n:localhost:51887_solr c:testCloudExamplePrompt s:shard2  x:testCloudExamplePrompt_shard2_replica2] o.a.s.c.RequestParams conf resource params.json loaded . version : 0 
   [junit4]   2> 2908287 WARN  (qtp1401988559-44913) [n:localhost:51887_solr c:testCloudExamplePrompt s:shard1  x:testCloudExamplePrompt_shard1_replica2] o.a.s.c.SolrConfig Couldn't add files from C:\Users\jenkins\workspace\Lucene-Solr-5.5-Windows\solr\build\solr-core\test\J0\temp\solr.util.TestSolrCLIRunExample_40CD794E777CF30C-001\tempDir-002\node1\testCloudExamplePrompt_shard1_replica2\..\..\..\..\contrib\clustering\lib filtered by .*\.jar to classpath: C:\Users\jenkins\workspace\Lucene-Solr-5.5-Windows\solr\build\solr-core\test\J0\temp\solr.util.TestSolrCLIRunExample_40CD794E777CF30C-001\tempDir-002\node1\testCloudExamplePrompt_shard1_replica2\..\..\..\..\contrib\clustering\lib
   [junit4]   2> 2908287 WARN  (qtp1401988559-44918) [n:localhost:51887_solr c:testCloudExamplePrompt s:shard2  x:testCloudExamplePrompt_shard2_replica1] o.a.s.c.SolrConfig Couldn't add files from C:\Users\jenkins\workspace\Lucene-Solr-5.5-Windows\solr\build\solr-core\test\J0\temp\solr.util.TestSolrCLIRunExample_40CD794E777CF30C-001\tempDir-002\node1\testCloudExamplePrompt_shard2_replica1\..\..\..\..\contrib\clustering\lib filtered by .*\.jar to classpath: C:\Users\jenkins\workspace\Lucene-Solr-5.5-Windows\solr\build\solr-core\test\J0\temp\solr.util.TestSolrCLIRunExample_40CD794E777CF30C-001\tempDir-002\node1\testCloudExamplePrompt_shard2_replica1\..\..\..\..\contrib\clustering\lib
   [junit4]   2> 2908287 WARN  (qtp1401988559-44913) [n:localhost:51887_solr c:testCloudExamplePrompt s:shard1  x:testCloudExamplePrompt_shard1_replica2] o.a.s.c.SolrConfig Couldn't add files from C:\Users\jenkins\workspace\Lucene-Solr-5.5-Windows\solr\build\solr-core\test\J0\temp\solr.util.TestSolrCLIRunExample_40CD794E777CF30C-001\tempDir-002\node1\testCloudExamplePrompt_shard1_replica2\..\..\..\..\dist filtered by solr-clustering-\d.*\.jar to classpath: C:\Users\jenkins\workspace\Lucene-Solr-5.5-Windows\solr\build\solr-core\test\J0\temp\solr.util.TestSolrCLIRunExample_40CD794E777CF30C-001\tempDir-002\node1\testCloudExamplePrompt_shard1_replica2\..\..\..\..\dist
   [junit4]   2> 2908287 WARN  (qtp1401988559-44918) [n:localhost:51887_solr c:testCloudExamplePrompt s:shard2  x:testCloudExamplePrompt_shard2_replica1] o.a.s.c.SolrConfig Couldn't add files from C:\Users\jenkins\workspace\Lucene-Solr-5.5-Windows\solr\build\solr-core\test\J0\temp\solr.util.TestSolrCLIRunExample_40CD794E777CF30C-001\tempDir-002\node1\testCloudExamplePrompt_shard2_replica1\..\..\..\..\dist filtered by solr-clustering-\d.*\.jar to classpath: C:\Users\jenkins\workspace\Lucene-Solr-5.5-Windows\solr\build\solr-core\test\J0\temp\solr.util.TestSolrCLIRunExample_40CD794E777CF30C-001\tempDir-002\node1\testCloudExamplePrompt_shard2_replica1\..\..\..\..\dist
   [junit4]   2> 2908287 INFO  (qtp1401988559-44914) [n:localhost:51887_solr c:testCloudExamplePrompt s:shard2  x:testCloudExamplePrompt_shard2_replica2] o.a.s.c.RequestParams request params refreshed to version 0
   [junit4]   2> 2908288 INFO  (qtp1401988559-44914) [n:localhost:51887_solr c:testCloudExamplePrompt s:shard2  x:testCloudExamplePrompt_shard2_replica2] o.a.s.c.SolrConfig current version of requestparams : 0
   [junit4]   2> 2908288 WARN  (qtp1401988559-44913) [n:localhost:51887_solr c:testCloudExamplePrompt s:shard1  x:testCloudExamplePrompt_shard1_replica2] o.a.s.c.SolrConfig Couldn't add files from C:\Users\jenkins\workspace\Lucene-Solr-5.5-Windows\solr\build\solr-core\test\J0\temp\solr.util.TestSolrCLIRunExample_40CD794E777CF30C-001\tempDir-002\node1\testCloudExamplePrompt_shard1_replica2\..\..\..\..\contrib\langid\lib filtered by .*\.jar to classpath: C:\Users\jenkins\workspace\Lucene-Solr-5.5-Windows\solr\build\solr-core\test\J0\temp\solr.util.TestSolrCLIRunExample_40CD794E777CF30C-001\tempDir-002\node1\testCloudExamplePrompt_shard1_replica2\..\..\..\..\contrib\langid\lib
   [junit4]   2> 2908288 WARN  (qtp1401988559-44918) [n:localhost:51887_solr c:testCloudExamplePrompt s:shard2  x:testCloudExamplePrompt_shard2_replica1] o.a.s.c.SolrConfig Couldn't add files from C:\Users\jenkins\workspace\Lucene-Solr-5.5-Windows\solr\build\solr-core\test\J0\temp\solr.util.TestSolrCLIRunExample_40CD794E777CF30C-001\tempDir-002\node1\testCloudExamplePrompt_shard2_replica1\..\..\..\..\contrib\langid\lib filtered by .*\.jar to classpath: C:\Users\jenkins\workspace\Lucene-Solr-5.5-Windows\solr\build\solr-core\test\J0\temp\solr.util.TestSolrCLIRunExample_40CD794E777CF30C-001\tempDir-002\node1\testCloudExamplePrompt_shard2_replica1\..\..\..\..\contrib\langid\lib
   [junit4]   2> 2908288 WARN  (qtp1401988559-44913) [n:localhost:51887_solr c:testCloudExamplePrompt s:shard1  x:testCloudExamplePrompt_shard1_replica2] o.a.s.c.SolrConfig Couldn't add files from C:\Users\jenkins\workspace\Lucene-Solr-5.5-Windows\solr\build\solr-core\test\J0\temp\solr.util.TestSolrCLIRunExample_40CD794E777CF30C-001\tempDir-002\node1\testCloudExamplePrompt_shard1_replica2\..\..\..\..\dist filtered by solr-langid-\d.*\.jar to classpath: C:\Users\jenkins\workspace\Lucene-Solr-5.5-Windows\solr\build\solr-core\test\J0\temp\solr.util.TestSolrCLIRunExample_40CD794E777CF30C-001\tempDir-002\node1\testCloudExamplePrompt_shard1_replica2\..\..\..\..\dist
   [junit4]   2> 2908288 WARN  (qtp1401988559-44918) [n:localhost:51887_solr c:testCloudExamplePrompt s:shard2  x:testCloudExamplePrompt_shard2_replica1] o.a.s.c.SolrConfig Couldn't add files from C:\Users\jenkins\workspace\Lucene-Solr-5.5-Windows\solr\build\solr-core\test\J0\temp\solr.util.TestSolrCLIRunExample_40CD794E777CF30C-001\tempDir-002\node1\testCloudExamplePrompt_shard2_replica1\..\..\..\..\dist filtered by solr-langid-\d.*\.jar to classpath: C:\Users\jenkins\workspace\Lucene-Solr-5.5-Windows\solr\build\solr-core\test\J0\temp\solr.util.TestSolrCLIRunExample_40CD794E777CF30C-001\tempDir-002\node1\testCloudExamplePrompt_shard2_replica1\..\..\..\..\dist
   [junit4]   2> 2908289 INFO  (qtp1401988559-44914) [n:localhost:51887_solr c:testCloudExamplePrompt s:shard2  x:testCloudExamplePrompt_shard2_replica2] o.a.s.c.SolrConfig Adding specified lib dirs to ClassLoader
   [junit4]   2> 2908287 WARN  (qtp1401988559-44915) [n:localhost:51887_solr c:testCloudExamplePrompt s:shard1  x:testCloudExamplePrompt_shard1_replica1] o.a.s.c.SolrConfig Couldn't add files from C:\Users\jenkins\workspace\Lucene-Solr-5.5-Windows\solr\build\solr-core\test\J0\temp\solr.util.TestSolrCLIRunExample_40CD794E777CF30C-001\tempDir-002\node1\testCloudExamplePrompt_shard1_replica1\..\..\..\..\contrib\clustering\lib filtered by .*\.jar to classpath: C:\Users\jenkins\workspace\Lucene-Solr-5.5-Windows\solr\build\solr-core\test\J0\temp\solr.util.TestSolrCLIRunExample_40CD794E777CF30C-001\tempDir-002\node1\testCloudExamplePrompt_shard1_replica1\..\..\..\..\contrib\clustering\lib
   [junit4]   2> 2908289 WARN  (qtp1401988559-44915) [n:localhost:51887_solr c:testCloudExamplePrompt s:shard1  x:testCloudExamplePrompt_shard1_replica1] o.a.s.c.SolrConfig Couldn't add files from C:\Users\jenkins\workspace\Lucene-Solr-5.5-Windows\solr\build\solr-core\test\J0\temp\solr.util.TestSolrCLIRunExample_40CD794E777CF30C-001\tempDir-002\node1\testCloudExamplePrompt_shard1_replica1\..\..\..\..\dist filtered by solr-clustering-\d.*\.jar to classpath: C:\Users\jenkins\workspace\Lucene-Solr-5.5-Windows\solr\build\solr-core\test\J0\temp\solr.util.TestSolrCLIRunExample_40CD794E777CF30C-001\tempDir-002\node1\testCloudExamplePrompt_shard1_replica1\..\..\..\..\dist
   [junit4]   2> 2908289 WARN  (qtp1401988559-44913) [n:localhost:51887_solr c:testCloudExamplePrompt s:shard1  x:testCloudExamplePrompt_shard1_replica2] o.a.s.c.SolrConfig Couldn't add files from C:\Users\jenkins\workspace\Lucene-Solr-5.5-Windows\solr\build\solr-core\test\J0\temp\solr.util.TestSolrCLIRunExample_40CD794E777CF30C-001\tempDir-002\node1\testCloudExamplePrompt_shard1_replica2\..\..\..\..\contrib\velocity\lib filtered by .*\.jar to classpath: C:\Users\jenkins\workspace\Lucene-Solr-5.5-Windows\solr\build\solr-core\test\J0\temp\solr.util.TestSolrCLIRunExample_40CD794E777CF30C-001\tempDir-002\node1\testCloudExamplePrompt_shard1_replica2\..\..\..\..\contrib\velocity\lib
   [junit4]   2> 2908289 WARN  (qtp1401988559-44914) [n:localhost:51887_solr c:testCloudExamplePrompt s:shard2  x:testCloudExamplePrompt_shard2_replica2] o.a.s.c.SolrConfig Couldn't add files from C:\Users\jenkins\workspace\Lucene-Solr-5.5-Windows\solr\build\solr-core\test\J0\temp\solr.util.TestSolrCLIRunExample_40CD794E777CF30C-001\tempDir-002\node1\testCloudExamplePrompt_shard2_replica2\..\..\..\..\contrib\extraction\lib filtered by .*\.jar to classpath: C:\Users\jenkins\workspace\Lucene-Solr-5.5-Windows\solr\build\solr-core\test\J0\temp\solr.util.TestSolrCLIRunExample_40CD794E777CF30C-001\tempDir-002\node1\testCloudExamplePrompt_shard2_replica2\..\..\..\..\contrib\extraction\lib
   [junit4]   2> 2908289 WARN  (qtp1401988559-44913) [n:localhost:51887_solr c:testCloudExamplePrompt s:shard1  x:testCloudExamplePrompt_shard1_replica2] o.a.s.c.SolrConfig Couldn't add files from C:\Users\jenkins\workspace\Lucene-Solr-5.5-Windows\solr\build\solr-core\test\J0\temp\solr.util.TestSolrCLIRunExample_40CD794E777CF30C-001\tempDir-002\node1\testCloudExamplePrompt_shard1_replica2\..\..\..\..\dist filtered by solr-velocity-\d.*\.jar to classpath: C:\Users\jenkins\workspace\Lucene-Solr-5.5-Windows\solr\build\solr-core\test\J0\temp\solr.util.TestSolrCLIRunExample_40CD794E777CF30C-001\tempDir-002\node1\testCloudExamplePrompt_shard1_replica2\..\..\..\..\dist
   [junit4]   2> 2908290 WARN  (qtp1401988559-44918) [n:localhost:51887_solr c:testCloudExamplePrompt s:shard2  x:testCloudExamplePrompt_shard2_replica1] o.a.s.c.SolrConfig Couldn't add files from C:\Users\jenkins\workspace\Lucene-Solr-5.5-Windows\solr\build\solr-core\test\J0\temp\solr.util.TestSolrCLIRunExample_40CD794E777CF30C-001\tempDir-002\node1\testCloudExamplePrompt_shard2_replica1\..\..\..\..\contrib\velocity\lib filtered by .*\.jar to classpath: C:\Users\jenkins\workspace\Lucene-Solr-5.5-Windows\solr\build\solr-core\test\J0\temp\solr.util.TestSolrCLIRunExample_40CD794E777CF30C-001\tempDir-002\node1\testCloudExamplePrompt_shard2_replica1\..\..\..\..\contrib\velocity\lib
   [junit4]   2> 2908290 WARN  (qtp1401988559-44914) [n:localhost:51887_solr c:testCloudExamplePrompt s:shard2  x:testCloudExamplePrompt_shard2_replica2] o.a.s.c.SolrConfig Couldn't add files from C:\Users\jenkins\workspace\Lucene-Solr-5.5-Windows\solr\build\solr-core\test\J0\temp\solr.util.TestSolrCLIRunExample_40CD794E777CF30C-001\tempDir-002\node1\testCloudExamplePrompt_shard2_replica2\..\..\..\..\dist filtered by solr-cell-\d.*\.jar to classpath: C:\Users\jenkins\workspace\Lucene-Solr-5.5-Windows\solr\build\solr-core\test\J0\temp\solr.util.TestSolrCLIRunExample_40CD794E777CF30C-001\tempDir-002\node1\testCloudExamplePrompt_shard2_replica2\..\..\..\..\dist
   [junit4]   2> 2908290 WARN  (qtp1401988559-44918) [n:localhost:51887_solr c:testCloudExamplePrompt s:shard2  x:testCloudExamplePrompt_shard2_replica1] o.a.s.c.SolrConfig Couldn't add files from C:\Users\jenkins\workspace\Lucene-Solr-5.5-Windows\solr\build\solr-core\test\J0\temp\solr.util.TestSolrCLIRunExample_40CD794E777CF30C-001\tempDir-002\node1\testCloudExamplePrompt_shard2_replica1\..\..\..\..\dist filtered by solr-velocity-\d.*\.jar to classpath: C:\Users\jenkins\workspace\Lucene-Solr-5.5-Windows\solr\build\solr-core\test\J0\temp\solr.util.TestSolrCLIRunExample_40CD794E777CF30C-001\tempDir-002\node1\testCloudExamplePrompt_shard2_replica1\..\..\..\..\dist
   [junit4]   2> 2908290 WARN  (qtp1401988559-44915) [n:localhost:51887_solr c:testCloudExamplePrompt s:shard1  x:testCloudExamplePrompt_shard1_replica1] o.a.s.c.SolrConfig Couldn't add files from C:\Users\jenkins\workspace\Lucene-Solr-5.5-Windows\solr\build\solr-core\test\J0\temp\solr.util.TestSolrCLIRunExample_40CD794E777CF30C-001\tempDir-002\node1\testCloudExamplePrompt_shard1_replica1\..\..\..\..\contrib\langid\lib filtered by .*\.jar to classpath: C:\Users\jenkins\workspace\Lucene-Solr-5.5-Windows\solr\build\solr-core\test\J0\temp\solr.util.TestSolrCLIRunExample_40CD794E777CF30C-001\tempDir-002\node1\testCloudExamplePrompt_shard1_replica1\..\..\..\..\contrib\langid\lib
   [junit4]   2> 2908290 WARN  (qtp1401988559-44915) [n:localhost:51887_solr c:testCloudExamplePrompt s:shard1  x:testCloudExamplePrompt_shard1_replica1] o.a.s.c.SolrConfig Couldn't add files from C:\Users\jenkins\workspace\Lucene-Solr-5.5-Windows\solr\build\solr-core\test\J0\temp\solr.util.TestSolrCLIRunExample_40CD794E777CF30C-001\tempDir-002\node1\testCloudExamplePrompt_shard1_replica1\..\..\..\..\dist filtered by solr-langid-\d.*\.jar to classpath: C:\Users\jenkins\workspace\Lucene-Solr-5.5-Windows\solr\build\solr-core\test\J0\temp\solr.util.TestSolrCLIRunExample_40CD794E777CF30C-001\tempDir-002\node1\testCloudExamplePrompt_shard1_replica1\..\..\..\..\dist
   [junit4]   2> 2908290 WARN  (qtp1401988559-44914) [n:localhost:51887_solr c:testCloudExamplePrompt s:shard2  x:testCloudExamplePrompt_shard2_replica2] o.a.s.c.SolrConfig Couldn't add files from C:\Users\jenkins\workspace\Lucene-Solr-5.5-Windows\solr\build\solr-core\test\J0\temp\solr.util.TestSolrCLIRunExample_40CD794E777CF30C-001\tempDir-002\node1\testCloudExamplePrompt_shard2_replica2\..\..\..\..\contrib\clustering\lib filtered by .*\.jar to classpath: C:\Users\jenkins\workspace\Lucene-Solr-5.5-Windows\solr\build\solr-core\test\J0\temp\solr.util.TestSolrCLIRunExample_40CD794E777CF30C-001\tempDir-002\node1\testCloudExamplePrompt_shard2_replica2\..\..\..\..\contrib\clustering\lib
   [junit4]   2> 2908291 WARN  (qtp1401988559-44914) [n:localhost:51887_solr c:testCloudExamplePrompt s:shard2  x:testCloudExamplePrompt_shard2_replica2] o.a.s.c.SolrConfig Couldn't add files from C:\Users\jenkins\workspace\Lucene-Solr-5.5-Windows\solr\build\solr-core\test\J0\temp\solr.util.TestSolrCLIRunExample_40CD794E777CF30C-001\tempDir-002\node1\testCloudExamplePrompt_shard2_replica2\..\..\..\..\dist filtered by solr-clustering-\d.*\.jar to classpath: C:\Users\jenkins\workspace\Lucene-Solr-5.5-Windows\solr\build\solr-core\test\J0\temp\solr.util.TestSolrCLIRunExample_40CD794E777CF30C-001\tempDir-002\node1\testCloudExamplePrompt_shard2_replica2\..\..\..\..\dist
   [junit4]   2> 2908291 WARN  (qtp1401988559-44915) [n:localhost:51887_solr c:testCloudExamplePrompt s:shard1  x:testCloudExamplePrompt_shard1_replica1] o.a.s.c.SolrConfig Couldn't add files from C:\Users\jenkins\workspace\Lucene-Solr-5.5-Windows\solr\build\solr-core\test\J0\temp\solr.util.TestSolrCLIRunExample_40CD794E777CF30C-001\tempDir-002\node1\testCloudExamplePrompt_shard1_replica1\..\..\..\..\contrib\velocity\lib filtered by .*\.jar to classpath: C:\Users\jenkins\workspace\Lucene-Solr-5.5-Windows\solr\build\solr-core\test\J0\temp\solr.util.TestSolrCLIRunExample_40CD794E777CF30C-001\tempDir-002\node1\testCloudExamplePrompt_shard1_replica1\..\..\..\..\contrib\velocity\lib
   [junit4]   2> 2908291 WARN  (qtp1401988559-44915) [n:localhost:51887_solr c:testCloudExamplePrompt s:shard1  x:testCloudExamplePrompt_shard1_replica1] o.a.s.c.SolrConfig Couldn't add files from C:\Users\jenkins\workspace\Lucene-Solr-5.5-Windows\solr\build\solr-core\test\J0\temp\solr.util.TestSolrCLIRunExample_40CD794E777CF30C-001\tempDir-002\node1\testCloudExamplePrompt_shard1_replica1\..\..\..\..\dist filtered by solr-velocity-\d.*\.jar to classpath: C:\Users\jenkins\workspace\Lucene-Solr-5.5-Windows\solr\build\solr-core\test\J0\temp\solr.util.TestSolrCLIRunExample_40CD794E777CF30C-001\tempDir-002\node1\testCloudExamplePrompt_shard1_replica1\..\..\..\..\dist
   [junit4]   2> 2908291 WARN  (qtp1401988559-44914) [n:localhost:51887_solr c:testCloudExamplePrompt s:shard2  x:testCloudExamplePrompt_shard2_replica2] o.a.s.c.SolrConfig Couldn't add files from C:\Users\jenkins\workspace\Lucene-Solr-5.5-Windows\solr\build\solr-core\test\J0\temp\solr.util.TestSolrCLIRunExample_40CD794E777CF30C-001\tempDir-002\node1\testCloudExamplePrompt_shard2_replica2\..\..\..\..\contrib\langid\lib filtered by .*\.jar to classpath: C:\Users\jenkins\workspace\Lucene-Solr-5.5-Windows\solr\build\solr-core\test\J0\temp\solr.util.TestSolrCLIRunExample_40CD794E777CF30C-001\tempDir-002\node1\testCloudExamplePrompt_shard2_replica2\..\..\..\..\contrib\langid\lib
   [junit4]   2> 2908292 WARN  (qtp1401988559-44914) [n:localhost:51887_solr c:testCloudExamplePrompt s:shard2  x:testCloudExamplePrompt_shard2_replica2] o.a.s.c.SolrConfig Couldn't add files from C:\Users\jenkins\workspace\Lucene-Solr-5.5-Windows\solr\build\solr-core\test\J0\temp\solr.util.TestSolrCLIRunExample_40CD794E777CF30C-001\tempDir-002\node1\testCloudExamplePrompt_shard2_replica2\..\..\..\..\dist filtered by solr-langid-\d.*\.jar to classpath: C:\Users\jenkins\workspace\Lucene-Solr-5.5-Windows\solr\build\solr-core\test\J0\temp\solr.util.TestSolrCLIRunExample_40CD794E777CF30C-001\tempDir-002\node1\testCloudExamplePrompt_shard2_replica2\..\..\..\..\dist
   [junit4]   2> 2908292 WARN  (qtp1401988559-44914) [n:localhost:51887_solr c:testCloudExamplePrompt s:shard2  x:testCloudExamplePrompt_shard2_replica2] o.a.s.c.SolrConfig Couldn't add files from C:\Users\jenkins\workspace\Lucene-Solr-5.5-Windows\solr\build\solr-core\test\J0\temp\solr.util.TestSolrCLIRunExample_40CD794E777CF30C-001\tempDir-002\node1\testCloudExamplePrompt_shard2_replica2\..\..\..\..\contrib\velocity\lib filtered by .*\.jar to classpath: C:\Users\jenkins\workspace\Lucene-Solr-5.5-Windows\solr\build\solr-core\test\J0\temp\solr.util.TestSolrCLIRunExample_40CD794E777CF30C-001\tempDir-002\node1\testCloudExamplePrompt_shard2_replica2\..\..\..\..\contrib\velocity\lib
   [junit4]   2> 2908293 WARN  (qtp1401988559-44914) [n:localhost:51887_solr c:testCloudExamplePrompt s:shard2  x:testCloudExamplePrompt_shard2_replica2] o.a.s.c.SolrConfig Couldn't add files from C:\Users\jenkins\workspace\Lucene-Solr-5.5-Windows\solr\build\solr-core\test\J0\temp\solr.util.TestSolrCLIRunExample_40CD794E777CF30C-001\tempDir-002\node1\testCloudExamplePrompt_shard2_replica2\..\..\..\..\dist filtered by solr-velocity-\d.*\.jar to classpath: C:\Users\jenkins\workspace\Lucene-Solr-5.5-Windows\solr\build\solr-core\test\J0\temp\solr.util.TestSolrCLIRunExample_40CD794E777CF30C-001\tempDir-002\node1\testCloudExamplePrompt_shard2_replica2\..\..\..\..\dist
   [junit4]   2> 2908309 INFO  (qtp1401988559-44918) [n:localhost:51887_solr c:testCloudExamplePrompt s:shard2  x:testCloudExamplePrompt_shard2_replica1] o.a.s.c.SolrConfig Using Lucene MatchVersion: 5.5.5
   [junit4]   2> 2908310 INFO  (qtp1401988559-44913) [n:localhost:51887_solr c:testCloudExamplePrompt s:shard1  x:testCloudExamplePrompt_shard1_replica2] o.a.s.c.SolrConfig Using Lucene MatchVersion: 5.5.5
   [junit4]   2> 2908311 INFO  (qtp1401988559-44915) [n:localhost:51887_solr c:testCloudExamplePrompt s:shard1  x:testCloudExamplePrompt_shard1_replica1] o.a.s.c.SolrConfig Using Lucene MatchVersion: 5.5.5
   [junit4]   2> 2908312 INFO  (qtp1401988559-44914) [n:localhost:51887_solr c:testCloudExamplePrompt s:shard2  x:testCloudExamplePrompt_shard2_replica2] o.a.s.c.SolrConfig Using Lucene MatchVersion: 5.5.5
   [junit4]   2> 2908342 INFO  (qtp1401988559-44914) [n:localhost:51887_solr c:testCloudExamplePrompt s:shard2  x:testCloudExamplePrompt_shard2_replica2] o.a.s.c.SolrConfig Loaded SolrConfig: solrconfig.xml
   [junit4]   2> 2908348 INFO  (qtp1401988559-44915) [n:localhost:51887_solr c:testCloudExamplePrompt s:shard1  x:testCloudExamplePrompt_shard1_replica1] o.a.s.c.SolrConfig Loaded SolrConfig: solrconfig.xml
   [junit4]   2> 2908355 INFO  (qtp1401988559-44918) [n:localhost:51887_solr c:testCloudExamplePrompt s:shard2  x:testCloudExamplePrompt_shard2_replica1] o.a.s.c.SolrConfig Loaded SolrConfig: solrconfig.xml
   [junit4]   2> 2908359 INFO  (qtp1401988559-44915) [n:localhost:51887_solr c:testCloudExamplePrompt s:shard1  x:testCloudExamplePrompt_shard1_replica1] o.a.s.s.IndexSchema [testCloudExamplePrompt_shard1_replica1] Schema name=example-data-driven-schema
   [junit4]   2> 2908361 INFO  (qtp1401988559-44918) [n:localhost:51887_solr c:testCloudExamplePrompt s:shard2  x:testCloudExamplePrompt_shard2_replica1] o.a.s.s.IndexSchema [testCloudExamplePrompt_shard2_replica1] Schema name=example-data-driven-schema
   [junit4]   2> 2908361 INFO  (qtp1401988559-44914) [n:localhost:51887_solr c:testCloudExamplePrompt s:shard2  x:testCloudExamplePrompt_shard2_replica2] o.a.s.s.IndexSchema [testCloudExamplePrompt_shard2_replica2] Schema name=example-data-driven-schema
   [junit4]   2> 2908401 INFO  (qtp1401988559-44913) [n:localhost:51887_solr c:testCloudExamplePrompt s:shard1  x:testCloudExamplePrompt_shard1_replica2] o.a.s.c.SolrConfig Loaded SolrConfig: solrconfig.xml
   [junit4]   2> 2908421 INFO  (qtp1401988559-44913) [n:localhost:51887_solr c:testCloudExamplePrompt s:shard1  x:testCloudExamplePrompt_shard1_replica2] o.a.s.s.IndexSchema [testCloudExamplePrompt_shard1_replica2] Schema name=example-data-driven-schema
   [junit4]   2> 2908739 INFO  (qtp1401988559-44914) [n:localhost:51887_solr c:testCloudExamplePrompt s:shard2  

[...truncated too long message...]

ed] o.a.s.c.SolrCore [gettingstarted] Closing main searcher on request.
   [junit4]   2> 2925368 INFO  (coreCloseExecutor-11683-thread-1) [    x:gettingstarted] o.a.s.c.CachingDirectoryFactory Closing MockDirectoryFactory - 2 directories currently being tracked
   [junit4]   2> 2925368 INFO  (coreCloseExecutor-11683-thread-1) [    x:gettingstarted] o.a.s.c.CachingDirectoryFactory looking to close C:\Users\jenkins\workspace\Lucene-Solr-5.5-Windows\solr\build\solr-core\test\J0\temp\solr.util.TestSolrCLIRunExample_40CD794E777CF30C-001\tempDir-003\schemaless\solr\gettingstarted\data\index [CachedDir<<refCount=0;path=C:\Users\jenkins\workspace\Lucene-Solr-5.5-Windows\solr\build\solr-core\test\J0\temp\solr.util.TestSolrCLIRunExample_40CD794E777CF30C-001\tempDir-003\schemaless\solr\gettingstarted\data\index;done=false>>]
   [junit4]   2> 2925368 INFO  (coreCloseExecutor-11683-thread-1) [    x:gettingstarted] o.a.s.c.CachingDirectoryFactory Closing directory: C:\Users\jenkins\workspace\Lucene-Solr-5.5-Windows\solr\build\solr-core\test\J0\temp\solr.util.TestSolrCLIRunExample_40CD794E777CF30C-001\tempDir-003\schemaless\solr\gettingstarted\data\index
   [junit4]   2> 2925368 INFO  (coreCloseExecutor-11683-thread-1) [    x:gettingstarted] o.a.s.c.CachingDirectoryFactory looking to close C:\Users\jenkins\workspace\Lucene-Solr-5.5-Windows\solr\build\solr-core\test\J0\temp\solr.util.TestSolrCLIRunExample_40CD794E777CF30C-001\tempDir-003\schemaless\solr\gettingstarted\data\ [CachedDir<<refCount=0;path=C:\Users\jenkins\workspace\Lucene-Solr-5.5-Windows\solr\build\solr-core\test\J0\temp\solr.util.TestSolrCLIRunExample_40CD794E777CF30C-001\tempDir-003\schemaless\solr\gettingstarted\data\;done=false>>]
   [junit4]   2> 2925368 INFO  (coreCloseExecutor-11683-thread-1) [    x:gettingstarted] o.a.s.c.CachingDirectoryFactory Closing directory: C:\Users\jenkins\workspace\Lucene-Solr-5.5-Windows\solr\build\solr-core\test\J0\temp\solr.util.TestSolrCLIRunExample_40CD794E777CF30C-001\tempDir-003\schemaless\solr\gettingstarted\data\
   [junit4]   2> 2925370 INFO  (TEST-TestSolrCLIRunExample.testSchemalessExample-seed#[40CD794E777CF30C]) [    ] o.e.j.s.h.ContextHandler Stopped o.e.j.s.ServletContextHandler@57441604{/solr,null,UNAVAILABLE}
   [junit4]   2> 2925370 INFO  (TEST-TestSolrCLIRunExample.testSchemalessExample-seed#[40CD794E777CF30C]) [    ] o.a.s.u.TestSolrCLIRunExample Stopped standalone Solr instance running on port 51966
   [junit4]   2> 2925370 INFO  (TEST-TestSolrCLIRunExample.testSchemalessExample-seed#[40CD794E777CF30C]) [    ] o.a.s.SolrTestCaseJ4 ###Ending testSchemalessExample
   [junit4]   2> 2925371 INFO  (SUITE-TestSolrCLIRunExample-seed#[40CD794E777CF30C]-worker) [    ] o.a.s.SolrTestCaseJ4 ###deleteCore
   [junit4]   2> NOTE: leaving temporary files on disk at: C:\Users\jenkins\workspace\Lucene-Solr-5.5-Windows\solr\build\solr-core\test\J0\temp\solr.util.TestSolrCLIRunExample_40CD794E777CF30C-001
   [junit4]   2> NOTE: test params are: codec=Asserting(Lucene54): {}, docValues:{}, sim=DefaultSimilarity, locale=el-GR, timezone=America/Argentina/ComodRivadavia
   [junit4]   2> NOTE: Windows 8.1 6.3 amd64/Oracle Corporation 1.7.0_80 (64-bit)/cpus=3,threads=1,free=216364288,total=536870912
   [junit4]   2> NOTE: All tests run in this JVM: [HLLUtilTest, SegmentsInfoRequestHandlerTest, TestDefaultSearchFieldResource, XsltUpdateRequestHandlerTest, DocumentBuilderTest, TestXIncludeConfig, TestExclusionRuleCollectionAccess, UUIDUpdateProcessorFallbackTest, SampleTest, TestManagedSchema, TestReplicaProperties, TestSolrQueryParserDefaultOperatorResource, HdfsRestartWhileUpdatingTest, CleanupOldIndexTest, AnalysisAfterCoreReloadTest, TestRemoteStreaming, CheckHdfsIndexTest, TestStressVersions, PreAnalyzedUpdateProcessorTest, ReplicationFactorTest, TestSort, TestSurroundQueryParser, TestConfigSets, TestInitQParser, TestCoreContainer, StatelessScriptUpdateProcessorFactoryTest, LeaderElectionTest, IgnoreCommitOptimizeUpdateProcessorFactoryTest, TestWordDelimiterFilterFactory, TriLevelCompositeIdRoutingTest, UnloadDistributedZkTest, TestCloudDeleteByQuery, BlockCacheTest, TestRandomDVFaceting, TestPseudoReturnFields, TestClusterStateMutator, CoreAdminRequestStatusTest, TestMiniSolrCloudClusterSSL, JSONWriterTest, TestSmileRequest, ConjunctionSolrSpellCheckerTest, ScriptEngineTest, TermsComponentTest, TestMergePolicyConfig, TestTolerantSearch, SuggesterFSTTest, TestFreeTextSuggestions, AnalysisErrorHandlingTest, TestRestManager, TestDocSet, TestChildDocTransformer, TestSolrDeletionPolicy1, DistributedQueueTest, PrimUtilsTest, SolrIndexConfigTest, DOMUtilTest, TestPKIAuthenticationPlugin, TestSolrConfigHandler, HdfsCollectionsAPIDistributedZkTest, ClusterStateUpdateTest, DeleteInactiveReplicaTest, CursorPagingTest, UUIDFieldTest, TestManagedSynonymFilterFactory, TestTrackingShardHandlerFactory, OverseerTest, SpatialFilterTest, SimpleMLTQParserTest, OverseerRolesTest, HighlighterMaxOffsetTest, TestArbitraryIndexDir, JsonLoaderTest, TestStressReorder, DistributedFacetPivotSmallTest, TestSchemaManager, TestDynamicFieldResource, TestRemoveLastDynamicCopyField, BJQParserTest, ChangedSchemaMergeTest, TestScoreJoinQPNoScore, PrimitiveFieldTypeTest, FullHLLTest, TestCloudSchemaless, TestObjectReleaseTracker, TestSolrXml, HdfsWriteToMultipleCollectionsTest, TestOrdValues, SchemaVersionSpecificBehaviorTest, TestClassNameShortening, URLClassifyProcessorTest, ActionThrottleTest, TestSolrQueryResponse, DisMaxRequestHandlerTest, SuggestComponentTest, CollectionsAPISolrJTest, TestDFISimilarityFactory, ReturnFieldsTest, CreateCollectionCleanupTest, TestManagedResource, TestSolrCloudWithKerberosAlt, SliceStateTest, TestDistributedSearch, ShardRoutingTest, TestConfigSetsAPI, TestCodecSupport, RecoveryZkTest, TestBlendedInfixSuggestions, TestFieldTypeResource, DistributedFacetPivotLongTailTest, TestLeaderInitiatedRecoveryThread, PreAnalyzedFieldTest, AsyncMigrateRouteKeyTest, DistributedExpandComponentTest, TestGroupingSearch, SolrCoreTest, TestUseDocValuesAsStored2, TestJsonRequest, AnalyticsQueryTest, TestHdfsUpdateLog, HdfsBasicDistributedZk2Test, TestIntervalFaceting, TestStressLucene, DocValuesTest, TestConfigSetsAPIZkFailure, TestRestoreCore, PeerSyncTest, TestDocBasedVersionConstraints, ForceLeaderTest, TestPartialUpdateDeduplication, PingRequestHandlerTest, ExternalFileFieldSortTest, SimpleFacetsTest, TestDefaultStatsCache, TestUniqueKeyFieldResource, TestLFUCache, TestComponentsName, ExitableDirectoryReaderTest, TestLRUCache, XmlUpdateRequestHandlerTest, HighlighterTest, TestFieldSortValues, RollingRestartTest, CollectionsAPIDistributedZkTest, TestReplicationHandler, TestSolr4Spatial, StatsComponentTest, DistributedQueryElevationComponentTest, CoreAdminHandlerTest, SuggesterTest, PolyFieldTest, TestUpdate, FieldMutatingUpdateProcessorTest, SortByFunctionTest, DistanceFunctionTest, IndexBasedSpellCheckerTest, DirectSolrSpellCheckerTest, DocumentAnalysisRequestHandlerTest, FileBasedSpellCheckerTest, PathHierarchyTokenizerFactoryTest, TestIndexingPerformance, RequiredFieldsTest, FastVectorHighlighterTest, TestJmxIntegration, UpdateRequestProcessorFactoryTest, QueryParsingTest, UniqFieldsUpdateProcessorFactoryTest, SearchHandlerTest, SOLR749Test, UpdateParamsTest, TestQuerySenderNoQuery, TestSolrDeletionPolicy2, TestSearchPerf, MinimalSchemaTest, TestConfig, NotRequiredUniqueKeyTest, TestPhraseSuggestions, TestSweetSpotSimilarityFactory, TestPerFieldSimilarity, TestLMJelinekMercerSimilarityFactory, TestBM25SimilarityFactory, TimeZoneUtilsTest, PluginInfoTest, ChaosMonkeyNothingIsSafeTest, CollectionReloadTest, CollectionsAPIAsyncDistributedZkTest, ConnectionManagerTest, CustomCollectionTest, DistribCursorPagingTest, DistribDocExpirationUpdateProcessorTest, LeaderFailoverAfterPartitionTest, LeaderInitiatedRecoveryOnShardRestartTest, MigrateRouteKeyTest, MultiThreadedOCPTest, OverseerStatusTest, RecoveryAfterSoftCommitTest, RemoteQueryErrorTest, SSLMigrationTest, SaslZkACLProviderTest, SharedFSAutoReplicaFailoverTest, SharedFSAutoReplicaFailoverUtilsTest, SimpleCollectionCreateDeleteTest, SolrCloudExampleTest, SolrXmlInZkTest, TestCloudInspectUtil, TestCloudPivotFacet, TestDistribDocBasedVersion, TestMiniSolrCloudCluster, TestRequestForwarding, TestRequestStatusCollectionAPI, TestStressLiveNodes, CachingDirectoryFactoryTest, CoreSorterTest, QueryResultKeyTest, TestConfigOverlay, TestConfigSetImmutable, TestConfigSetProperties, TestImplicitCoreProperties, TestInitParams, TestReloadAndDeleteDocs, TestShardHandlerFactory, RequestLoggingTest, TestBlobHandler, TestConfigReload, TestReplicationHandlerBackup, TestSolrConfigHandlerConcurrent, DistributedQueryComponentCustomSortTest, DistributedSuggestComponentTest, FacetPivotSmallTest, SpatialHeatmapFacetsTest, TestExpandComponent, SmileWriterTest, TestRawResponseWriter, TestRawTransformer, TestSortingResponseWriter, TestManagedResourceStorage, TestBulkSchemaAPI, TestCopyFieldCollectionResource, TestFieldCollectionResource, TestFieldResource, TestManagedSchemaFieldResource, TestSchemaResource, TestSchemaVersionResource, TestSerializedLuceneMatchVersion, TestSolrQueryParserResource, BadCopyFieldTest, DateRangeFieldTest, DocValuesMissingTest, TestBulkSchemaConcurrent, AnalyticsMergeStrategyTest, MergeStrategyTest, TestOverriddenPrefixQueryForCustomFieldType, TestRandomCollapseQParserPlugin, BlockJoinFacetDistribTest, BlockJoinFacetRandomTest, TestScoreJoinQPScore, TestExactSharedStatsCache, TestExactStatsCache, TestLRUStatsCache, TestSha256AuthenticationProvider, TestHighFrequencyDictionaryFactory, BlockDirectoryTest, BufferStoreTest, HdfsDirectoryTest, HdfsLockFactoryTest, DataDrivenBlockJoinTest, VersionInfoTest, AddSchemaFieldsUpdateProcessorFactoryTest, CloneFieldUpdateProcessorFactoryTest, ParsingFieldUpdateProcessorsTest, DistanceUnitsTest, TestSolrCLIRunExample]
   [junit4] Completed [575/575 (1!)] on J0 in 23.81s, 3 tests, 1 failure, 1 skipped <<< FAILURES!

[...truncated 56646 lines...]

Mime
View raw message