lucene-dev mailing list archives

Site index · List index
Message view « Date » · « Thread »
Top « Date » · « Thread »
From Policeman Jenkins Server <jenk...@thetaphi.de>
Subject [JENKINS] Lucene-Solr-master-Solaris (64bit/jdk1.8.0) - Build # 1466 - Still Unstable!
Date Wed, 11 Oct 2017 13:12:19 GMT
Build: https://jenkins.thetaphi.de/job/Lucene-Solr-master-Solaris/1466/
Java: 64bit/jdk1.8.0 -XX:+UseCompressedOops -XX:+UseG1GC

3 tests failed.
FAILED:  org.apache.solr.handler.admin.AutoscalingHistoryHandlerTest.testHistory

Error Message:
replica never fully recovered

Stack Trace:
java.lang.AssertionError: replica never fully recovered
	at __randomizedtesting.SeedInfo.seed([505893396797EE99:3DA437C4DDDF119E]:0)
	at org.junit.Assert.fail(Assert.java:93)
	at org.junit.Assert.assertTrue(Assert.java:43)
	at org.apache.solr.handler.admin.AutoscalingHistoryHandlerTest.waitForRecovery(AutoscalingHistoryHandlerTest.java:303)
	at org.apache.solr.handler.admin.AutoscalingHistoryHandlerTest.testHistory(AutoscalingHistoryHandlerTest.java:255)
	at sun.reflect.NativeMethodAccessorImpl.invoke0(Native Method)
	at sun.reflect.NativeMethodAccessorImpl.invoke(NativeMethodAccessorImpl.java:62)
	at sun.reflect.DelegatingMethodAccessorImpl.invoke(DelegatingMethodAccessorImpl.java:43)
	at java.lang.reflect.Method.invoke(Method.java:498)
	at com.carrotsearch.randomizedtesting.RandomizedRunner.invoke(RandomizedRunner.java:1737)
	at com.carrotsearch.randomizedtesting.RandomizedRunner$8.evaluate(RandomizedRunner.java:934)
	at com.carrotsearch.randomizedtesting.RandomizedRunner$9.evaluate(RandomizedRunner.java:970)
	at com.carrotsearch.randomizedtesting.RandomizedRunner$10.evaluate(RandomizedRunner.java:984)
	at com.carrotsearch.randomizedtesting.rules.SystemPropertiesRestoreRule$1.evaluate(SystemPropertiesRestoreRule.java:57)
	at org.apache.lucene.util.TestRuleSetupTeardownChained$1.evaluate(TestRuleSetupTeardownChained.java:49)
	at org.apache.lucene.util.AbstractBeforeAfterRule$1.evaluate(AbstractBeforeAfterRule.java:45)
	at org.apache.lucene.util.TestRuleThreadAndTestName$1.evaluate(TestRuleThreadAndTestName.java:48)
	at org.apache.lucene.util.TestRuleIgnoreAfterMaxFailures$1.evaluate(TestRuleIgnoreAfterMaxFailures.java:64)
	at org.apache.lucene.util.TestRuleMarkFailure$1.evaluate(TestRuleMarkFailure.java:47)
	at com.carrotsearch.randomizedtesting.rules.StatementAdapter.evaluate(StatementAdapter.java:36)
	at com.carrotsearch.randomizedtesting.ThreadLeakControl$StatementRunner.run(ThreadLeakControl.java:368)
	at com.carrotsearch.randomizedtesting.ThreadLeakControl.forkTimeoutingTask(ThreadLeakControl.java:817)
	at com.carrotsearch.randomizedtesting.ThreadLeakControl$3.evaluate(ThreadLeakControl.java:468)
	at com.carrotsearch.randomizedtesting.RandomizedRunner.runSingleTest(RandomizedRunner.java:943)
	at com.carrotsearch.randomizedtesting.RandomizedRunner$5.evaluate(RandomizedRunner.java:829)
	at com.carrotsearch.randomizedtesting.RandomizedRunner$6.evaluate(RandomizedRunner.java:879)
	at com.carrotsearch.randomizedtesting.RandomizedRunner$7.evaluate(RandomizedRunner.java:890)
	at com.carrotsearch.randomizedtesting.rules.StatementAdapter.evaluate(StatementAdapter.java:36)
	at com.carrotsearch.randomizedtesting.rules.SystemPropertiesRestoreRule$1.evaluate(SystemPropertiesRestoreRule.java:57)
	at org.apache.lucene.util.AbstractBeforeAfterRule$1.evaluate(AbstractBeforeAfterRule.java:45)
	at com.carrotsearch.randomizedtesting.rules.StatementAdapter.evaluate(StatementAdapter.java:36)
	at org.apache.lucene.util.TestRuleStoreClassName$1.evaluate(TestRuleStoreClassName.java:41)
	at com.carrotsearch.randomizedtesting.rules.NoShadowingOrOverridesOnMethodsRule$1.evaluate(NoShadowingOrOverridesOnMethodsRule.java:40)
	at com.carrotsearch.randomizedtesting.rules.NoShadowingOrOverridesOnMethodsRule$1.evaluate(NoShadowingOrOverridesOnMethodsRule.java:40)
	at com.carrotsearch.randomizedtesting.rules.StatementAdapter.evaluate(StatementAdapter.java:36)
	at com.carrotsearch.randomizedtesting.rules.StatementAdapter.evaluate(StatementAdapter.java:36)
	at com.carrotsearch.randomizedtesting.rules.StatementAdapter.evaluate(StatementAdapter.java:36)
	at org.apache.lucene.util.TestRuleAssertionsRequired$1.evaluate(TestRuleAssertionsRequired.java:53)
	at org.apache.lucene.util.TestRuleMarkFailure$1.evaluate(TestRuleMarkFailure.java:47)
	at org.apache.lucene.util.TestRuleIgnoreAfterMaxFailures$1.evaluate(TestRuleIgnoreAfterMaxFailures.java:64)
	at org.apache.lucene.util.TestRuleIgnoreTestSuites$1.evaluate(TestRuleIgnoreTestSuites.java:54)
	at com.carrotsearch.randomizedtesting.rules.StatementAdapter.evaluate(StatementAdapter.java:36)
	at com.carrotsearch.randomizedtesting.ThreadLeakControl$StatementRunner.run(ThreadLeakControl.java:368)
	at java.lang.Thread.run(Thread.java:748)


FAILED:  junit.framework.TestSuite.org.apache.solr.cloud.TestSolrCloudWithSecureImpersonation

Error Message:
2 threads leaked from SUITE scope at org.apache.solr.cloud.TestSolrCloudWithSecureImpersonation:     1) Thread[id=17704, name=jetty-launcher-3653-thread-1-EventThread, state=TIMED_WAITING, group=TGRP-TestSolrCloudWithSecureImpersonation]         at sun.misc.Unsafe.park(Native Method)         at java.util.concurrent.locks.LockSupport.parkNanos(LockSupport.java:215)         at java.util.concurrent.locks.AbstractQueuedSynchronizer.doAcquireSharedNanos(AbstractQueuedSynchronizer.java:1037)         at java.util.concurrent.locks.AbstractQueuedSynchronizer.tryAcquireSharedNanos(AbstractQueuedSynchronizer.java:1328)         at java.util.concurrent.CountDownLatch.await(CountDownLatch.java:277)         at org.apache.curator.CuratorZookeeperClient.internalBlockUntilConnectedOrTimedOut(CuratorZookeeperClient.java:323)         at org.apache.curator.RetryLoop.callWithRetry(RetryLoop.java:105)         at org.apache.curator.framework.imps.GetDataBuilderImpl.pathInForeground(GetDataBuilderImpl.java:288)         at org.apache.curator.framework.imps.GetDataBuilderImpl.forPath(GetDataBuilderImpl.java:279)         at org.apache.curator.framework.imps.GetDataBuilderImpl.forPath(GetDataBuilderImpl.java:41)         at org.apache.curator.framework.recipes.shared.SharedValue.readValue(SharedValue.java:244)         at org.apache.curator.framework.recipes.shared.SharedValue.access$100(SharedValue.java:44)         at org.apache.curator.framework.recipes.shared.SharedValue$1.process(SharedValue.java:61)         at org.apache.curator.framework.imps.NamespaceWatcher.process(NamespaceWatcher.java:67)         at org.apache.zookeeper.ClientCnxn$EventThread.processEvent(ClientCnxn.java:530)         at org.apache.zookeeper.ClientCnxn$EventThread.run(ClientCnxn.java:505)    2) Thread[id=17700, name=jetty-launcher-3653-thread-2-EventThread, state=TIMED_WAITING, group=TGRP-TestSolrCloudWithSecureImpersonation]         at sun.misc.Unsafe.park(Native Method)         at java.util.concurrent.locks.LockSupport.parkNanos(LockSupport.java:215)         at java.util.concurrent.locks.AbstractQueuedSynchronizer.doAcquireSharedNanos(AbstractQueuedSynchronizer.java:1037)         at java.util.concurrent.locks.AbstractQueuedSynchronizer.tryAcquireSharedNanos(AbstractQueuedSynchronizer.java:1328)         at java.util.concurrent.CountDownLatch.await(CountDownLatch.java:277)         at org.apache.curator.CuratorZookeeperClient.internalBlockUntilConnectedOrTimedOut(CuratorZookeeperClient.java:323)         at org.apache.curator.RetryLoop.callWithRetry(RetryLoop.java:105)         at org.apache.curator.framework.imps.GetDataBuilderImpl.pathInForeground(GetDataBuilderImpl.java:288)         at org.apache.curator.framework.imps.GetDataBuilderImpl.forPath(GetDataBuilderImpl.java:279)         at org.apache.curator.framework.imps.GetDataBuilderImpl.forPath(GetDataBuilderImpl.java:41)         at org.apache.curator.framework.recipes.shared.SharedValue.readValue(SharedValue.java:244)         at org.apache.curator.framework.recipes.shared.SharedValue.access$100(SharedValue.java:44)         at org.apache.curator.framework.recipes.shared.SharedValue$1.process(SharedValue.java:61)         at org.apache.curator.framework.imps.NamespaceWatcher.process(NamespaceWatcher.java:67)         at org.apache.zookeeper.ClientCnxn$EventThread.processEvent(ClientCnxn.java:530)         at org.apache.zookeeper.ClientCnxn$EventThread.run(ClientCnxn.java:505)

Stack Trace:
com.carrotsearch.randomizedtesting.ThreadLeakError: 2 threads leaked from SUITE scope at org.apache.solr.cloud.TestSolrCloudWithSecureImpersonation: 
   1) Thread[id=17704, name=jetty-launcher-3653-thread-1-EventThread, state=TIMED_WAITING, group=TGRP-TestSolrCloudWithSecureImpersonation]
        at sun.misc.Unsafe.park(Native Method)
        at java.util.concurrent.locks.LockSupport.parkNanos(LockSupport.java:215)
        at java.util.concurrent.locks.AbstractQueuedSynchronizer.doAcquireSharedNanos(AbstractQueuedSynchronizer.java:1037)
        at java.util.concurrent.locks.AbstractQueuedSynchronizer.tryAcquireSharedNanos(AbstractQueuedSynchronizer.java:1328)
        at java.util.concurrent.CountDownLatch.await(CountDownLatch.java:277)
        at org.apache.curator.CuratorZookeeperClient.internalBlockUntilConnectedOrTimedOut(CuratorZookeeperClient.java:323)
        at org.apache.curator.RetryLoop.callWithRetry(RetryLoop.java:105)
        at org.apache.curator.framework.imps.GetDataBuilderImpl.pathInForeground(GetDataBuilderImpl.java:288)
        at org.apache.curator.framework.imps.GetDataBuilderImpl.forPath(GetDataBuilderImpl.java:279)
        at org.apache.curator.framework.imps.GetDataBuilderImpl.forPath(GetDataBuilderImpl.java:41)
        at org.apache.curator.framework.recipes.shared.SharedValue.readValue(SharedValue.java:244)
        at org.apache.curator.framework.recipes.shared.SharedValue.access$100(SharedValue.java:44)
        at org.apache.curator.framework.recipes.shared.SharedValue$1.process(SharedValue.java:61)
        at org.apache.curator.framework.imps.NamespaceWatcher.process(NamespaceWatcher.java:67)
        at org.apache.zookeeper.ClientCnxn$EventThread.processEvent(ClientCnxn.java:530)
        at org.apache.zookeeper.ClientCnxn$EventThread.run(ClientCnxn.java:505)
   2) Thread[id=17700, name=jetty-launcher-3653-thread-2-EventThread, state=TIMED_WAITING, group=TGRP-TestSolrCloudWithSecureImpersonation]
        at sun.misc.Unsafe.park(Native Method)
        at java.util.concurrent.locks.LockSupport.parkNanos(LockSupport.java:215)
        at java.util.concurrent.locks.AbstractQueuedSynchronizer.doAcquireSharedNanos(AbstractQueuedSynchronizer.java:1037)
        at java.util.concurrent.locks.AbstractQueuedSynchronizer.tryAcquireSharedNanos(AbstractQueuedSynchronizer.java:1328)
        at java.util.concurrent.CountDownLatch.await(CountDownLatch.java:277)
        at org.apache.curator.CuratorZookeeperClient.internalBlockUntilConnectedOrTimedOut(CuratorZookeeperClient.java:323)
        at org.apache.curator.RetryLoop.callWithRetry(RetryLoop.java:105)
        at org.apache.curator.framework.imps.GetDataBuilderImpl.pathInForeground(GetDataBuilderImpl.java:288)
        at org.apache.curator.framework.imps.GetDataBuilderImpl.forPath(GetDataBuilderImpl.java:279)
        at org.apache.curator.framework.imps.GetDataBuilderImpl.forPath(GetDataBuilderImpl.java:41)
        at org.apache.curator.framework.recipes.shared.SharedValue.readValue(SharedValue.java:244)
        at org.apache.curator.framework.recipes.shared.SharedValue.access$100(SharedValue.java:44)
        at org.apache.curator.framework.recipes.shared.SharedValue$1.process(SharedValue.java:61)
        at org.apache.curator.framework.imps.NamespaceWatcher.process(NamespaceWatcher.java:67)
        at org.apache.zookeeper.ClientCnxn$EventThread.processEvent(ClientCnxn.java:530)
        at org.apache.zookeeper.ClientCnxn$EventThread.run(ClientCnxn.java:505)
	at __randomizedtesting.SeedInfo.seed([505893396797EE99]:0)


FAILED:  junit.framework.TestSuite.org.apache.solr.security.hadoop.TestImpersonationWithHadoopAuth

Error Message:
1 thread leaked from SUITE scope at org.apache.solr.security.hadoop.TestImpersonationWithHadoopAuth:     1) Thread[id=12621, name=jetty-launcher-1513-thread-2-EventThread, state=TIMED_WAITING, group=TGRP-TestImpersonationWithHadoopAuth]         at sun.misc.Unsafe.park(Native Method)         at java.util.concurrent.locks.LockSupport.parkNanos(LockSupport.java:215)         at java.util.concurrent.locks.AbstractQueuedSynchronizer.doAcquireSharedNanos(AbstractQueuedSynchronizer.java:1037)         at java.util.concurrent.locks.AbstractQueuedSynchronizer.tryAcquireSharedNanos(AbstractQueuedSynchronizer.java:1328)         at java.util.concurrent.CountDownLatch.await(CountDownLatch.java:277)         at org.apache.curator.CuratorZookeeperClient.internalBlockUntilConnectedOrTimedOut(CuratorZookeeperClient.java:323)         at org.apache.curator.RetryLoop.callWithRetry(RetryLoop.java:105)         at org.apache.curator.framework.imps.GetDataBuilderImpl.pathInForeground(GetDataBuilderImpl.java:288)         at org.apache.curator.framework.imps.GetDataBuilderImpl.forPath(GetDataBuilderImpl.java:279)         at org.apache.curator.framework.imps.GetDataBuilderImpl.forPath(GetDataBuilderImpl.java:41)         at org.apache.curator.framework.recipes.shared.SharedValue.readValue(SharedValue.java:244)         at org.apache.curator.framework.recipes.shared.SharedValue.access$100(SharedValue.java:44)         at org.apache.curator.framework.recipes.shared.SharedValue$1.process(SharedValue.java:61)         at org.apache.curator.framework.imps.NamespaceWatcher.process(NamespaceWatcher.java:67)         at org.apache.zookeeper.ClientCnxn$EventThread.processEvent(ClientCnxn.java:530)         at org.apache.zookeeper.ClientCnxn$EventThread.run(ClientCnxn.java:505)

Stack Trace:
com.carrotsearch.randomizedtesting.ThreadLeakError: 1 thread leaked from SUITE scope at org.apache.solr.security.hadoop.TestImpersonationWithHadoopAuth: 
   1) Thread[id=12621, name=jetty-launcher-1513-thread-2-EventThread, state=TIMED_WAITING, group=TGRP-TestImpersonationWithHadoopAuth]
        at sun.misc.Unsafe.park(Native Method)
        at java.util.concurrent.locks.LockSupport.parkNanos(LockSupport.java:215)
        at java.util.concurrent.locks.AbstractQueuedSynchronizer.doAcquireSharedNanos(AbstractQueuedSynchronizer.java:1037)
        at java.util.concurrent.locks.AbstractQueuedSynchronizer.tryAcquireSharedNanos(AbstractQueuedSynchronizer.java:1328)
        at java.util.concurrent.CountDownLatch.await(CountDownLatch.java:277)
        at org.apache.curator.CuratorZookeeperClient.internalBlockUntilConnectedOrTimedOut(CuratorZookeeperClient.java:323)
        at org.apache.curator.RetryLoop.callWithRetry(RetryLoop.java:105)
        at org.apache.curator.framework.imps.GetDataBuilderImpl.pathInForeground(GetDataBuilderImpl.java:288)
        at org.apache.curator.framework.imps.GetDataBuilderImpl.forPath(GetDataBuilderImpl.java:279)
        at org.apache.curator.framework.imps.GetDataBuilderImpl.forPath(GetDataBuilderImpl.java:41)
        at org.apache.curator.framework.recipes.shared.SharedValue.readValue(SharedValue.java:244)
        at org.apache.curator.framework.recipes.shared.SharedValue.access$100(SharedValue.java:44)
        at org.apache.curator.framework.recipes.shared.SharedValue$1.process(SharedValue.java:61)
        at org.apache.curator.framework.imps.NamespaceWatcher.process(NamespaceWatcher.java:67)
        at org.apache.zookeeper.ClientCnxn$EventThread.processEvent(ClientCnxn.java:530)
        at org.apache.zookeeper.ClientCnxn$EventThread.run(ClientCnxn.java:505)
	at __randomizedtesting.SeedInfo.seed([505893396797EE99]:0)




Build Log:
[...truncated 11962 lines...]
   [junit4] Suite: org.apache.solr.handler.admin.AutoscalingHistoryHandlerTest
   [junit4]   2> 929947 INFO  (SUITE-AutoscalingHistoryHandlerTest-seed#[505893396797EE99]-worker) [    ] o.a.s.SolrTestCaseJ4 SecureRandom sanity checks: test.solr.allowed.securerandom=null & java.security.egd=file:/dev/./urandom
   [junit4]   2> Creating dataDir: /export/home/jenkins/workspace/Lucene-Solr-master-Solaris/solr/build/solr-core/test/J0/temp/solr.handler.admin.AutoscalingHistoryHandlerTest_505893396797EE99-001/init-core-data-001
   [junit4]   2> 929948 WARN  (SUITE-AutoscalingHistoryHandlerTest-seed#[505893396797EE99]-worker) [    ] o.a.s.SolrTestCaseJ4 startTrackingSearchers: numOpens=21 numCloses=21
   [junit4]   2> 929948 INFO  (SUITE-AutoscalingHistoryHandlerTest-seed#[505893396797EE99]-worker) [    ] o.a.s.SolrTestCaseJ4 Using PointFields (NUMERIC_POINTS_SYSPROP=true) w/NUMERIC_DOCVALUES_SYSPROP=false
   [junit4]   2> 929949 INFO  (SUITE-AutoscalingHistoryHandlerTest-seed#[505893396797EE99]-worker) [    ] o.a.s.SolrTestCaseJ4 Randomized ssl (false) and clientAuth (true) via: @org.apache.solr.util.RandomizeSSL(reason=, value=NaN, ssl=NaN, clientAuth=NaN)
   [junit4]   2> 929950 INFO  (SUITE-AutoscalingHistoryHandlerTest-seed#[505893396797EE99]-worker) [    ] o.a.s.c.MiniSolrCloudCluster Starting cluster of 3 servers in /export/home/jenkins/workspace/Lucene-Solr-master-Solaris/solr/build/solr-core/test/J0/temp/solr.handler.admin.AutoscalingHistoryHandlerTest_505893396797EE99-001/tempDir-001
   [junit4]   2> 929950 INFO  (SUITE-AutoscalingHistoryHandlerTest-seed#[505893396797EE99]-worker) [    ] o.a.s.c.ZkTestServer STARTING ZK TEST SERVER
   [junit4]   2> 929950 INFO  (Thread-1029) [    ] o.a.s.c.ZkTestServer client port:0.0.0.0/0.0.0.0:0
   [junit4]   2> 929950 INFO  (Thread-1029) [    ] o.a.s.c.ZkTestServer Starting server
   [junit4]   2> 929953 ERROR (Thread-1029) [    ] o.a.z.s.ZooKeeperServer ZKShutdownHandler is not registered, so ZooKeeper server won't take any action on ERROR or SHUTDOWN server state changes
   [junit4]   2> 930050 INFO  (SUITE-AutoscalingHistoryHandlerTest-seed#[505893396797EE99]-worker) [    ] o.a.s.c.ZkTestServer start zk server on port:33082
   [junit4]   2> 930059 INFO  (jetty-launcher-988-thread-2) [    ] o.e.j.s.Server jetty-9.3.20.v20170531
   [junit4]   2> 930059 INFO  (jetty-launcher-988-thread-3) [    ] o.e.j.s.Server jetty-9.3.20.v20170531
   [junit4]   2> 930060 INFO  (jetty-launcher-988-thread-1) [    ] o.e.j.s.Server jetty-9.3.20.v20170531
   [junit4]   2> 930063 INFO  (jetty-launcher-988-thread-3) [    ] o.e.j.s.h.ContextHandler Started o.e.j.s.ServletContextHandler@66d4e73f{/solr,null,AVAILABLE}
   [junit4]   2> 930063 INFO  (jetty-launcher-988-thread-2) [    ] o.e.j.s.h.ContextHandler Started o.e.j.s.ServletContextHandler@6438e506{/solr,null,AVAILABLE}
   [junit4]   2> 930064 INFO  (jetty-launcher-988-thread-1) [    ] o.e.j.s.h.ContextHandler Started o.e.j.s.ServletContextHandler@536f8238{/solr,null,AVAILABLE}
   [junit4]   2> 930065 INFO  (jetty-launcher-988-thread-2) [    ] o.e.j.s.AbstractConnector Started ServerConnector@d62efba{HTTP/1.1,[http/1.1]}{127.0.0.1:48455}
   [junit4]   2> 930065 INFO  (jetty-launcher-988-thread-2) [    ] o.e.j.s.Server Started @933075ms
   [junit4]   2> 930065 INFO  (jetty-launcher-988-thread-2) [    ] o.a.s.c.s.e.JettySolrRunner Jetty properties: {hostContext=/solr, hostPort=48455}
   [junit4]   2> 930065 ERROR (jetty-launcher-988-thread-2) [    ] o.a.s.u.StartupLoggingUtils Missing Java Option solr.log.dir. Logging may be missing or incomplete.
   [junit4]   2> 930067 INFO  (jetty-launcher-988-thread-2) [    ] o.a.s.s.SolrDispatchFilter  ___      _       Welcome to Apache Solr? version 8.0.0
   [junit4]   2> 930066 INFO  (jetty-launcher-988-thread-3) [    ] o.e.j.s.AbstractConnector Started ServerConnector@56b55bba{HTTP/1.1,[http/1.1]}{127.0.0.1:36340}
   [junit4]   2> 930067 INFO  (jetty-launcher-988-thread-2) [    ] o.a.s.s.SolrDispatchFilter / __| ___| |_ _   Starting in cloud mode on port null
   [junit4]   2> 930067 INFO  (jetty-launcher-988-thread-3) [    ] o.e.j.s.Server Started @933078ms
   [junit4]   2> 930067 INFO  (jetty-launcher-988-thread-2) [    ] o.a.s.s.SolrDispatchFilter \__ \/ _ \ | '_|  Install dir: null, Default config dir: null
   [junit4]   2> 930067 INFO  (jetty-launcher-988-thread-3) [    ] o.a.s.c.s.e.JettySolrRunner Jetty properties: {hostContext=/solr, hostPort=36340}
   [junit4]   2> 930067 INFO  (jetty-launcher-988-thread-2) [    ] o.a.s.s.SolrDispatchFilter |___/\___/_|_|    Start time: 2017-10-11T11:51:36.423Z
   [junit4]   2> 930067 ERROR (jetty-launcher-988-thread-3) [    ] o.a.s.u.StartupLoggingUtils Missing Java Option solr.log.dir. Logging may be missing or incomplete.
   [junit4]   2> 930067 INFO  (jetty-launcher-988-thread-3) [    ] o.a.s.s.SolrDispatchFilter  ___      _       Welcome to Apache Solr? version 8.0.0
   [junit4]   2> 930067 INFO  (jetty-launcher-988-thread-3) [    ] o.a.s.s.SolrDispatchFilter / __| ___| |_ _   Starting in cloud mode on port null
   [junit4]   2> 930068 INFO  (jetty-launcher-988-thread-3) [    ] o.a.s.s.SolrDispatchFilter \__ \/ _ \ | '_|  Install dir: null, Default config dir: null
   [junit4]   2> 930068 INFO  (jetty-launcher-988-thread-3) [    ] o.a.s.s.SolrDispatchFilter |___/\___/_|_|    Start time: 2017-10-11T11:51:36.424Z
   [junit4]   2> 930066 INFO  (jetty-launcher-988-thread-1) [    ] o.e.j.s.AbstractConnector Started ServerConnector@78a9eee5{HTTP/1.1,[http/1.1]}{127.0.0.1:59883}
   [junit4]   2> 930068 INFO  (jetty-launcher-988-thread-1) [    ] o.e.j.s.Server Started @933079ms
   [junit4]   2> 930068 INFO  (jetty-launcher-988-thread-1) [    ] o.a.s.c.s.e.JettySolrRunner Jetty properties: {hostContext=/solr, hostPort=59883}
   [junit4]   2> 930068 ERROR (jetty-launcher-988-thread-1) [    ] o.a.s.u.StartupLoggingUtils Missing Java Option solr.log.dir. Logging may be missing or incomplete.
   [junit4]   2> 930069 INFO  (jetty-launcher-988-thread-1) [    ] o.a.s.s.SolrDispatchFilter  ___      _       Welcome to Apache Solr? version 8.0.0
   [junit4]   2> 930069 INFO  (jetty-launcher-988-thread-1) [    ] o.a.s.s.SolrDispatchFilter / __| ___| |_ _   Starting in cloud mode on port null
   [junit4]   2> 930069 INFO  (jetty-launcher-988-thread-1) [    ] o.a.s.s.SolrDispatchFilter \__ \/ _ \ | '_|  Install dir: null, Default config dir: null
   [junit4]   2> 930069 INFO  (jetty-launcher-988-thread-1) [    ] o.a.s.s.SolrDispatchFilter |___/\___/_|_|    Start time: 2017-10-11T11:51:36.425Z
   [junit4]   2> 930072 INFO  (jetty-launcher-988-thread-2) [    ] o.a.s.s.SolrDispatchFilter solr.xml found in ZooKeeper. Loading...
   [junit4]   2> 930072 INFO  (jetty-launcher-988-thread-1) [    ] o.a.s.s.SolrDispatchFilter solr.xml found in ZooKeeper. Loading...
   [junit4]   2> 930079 INFO  (jetty-launcher-988-thread-3) [    ] o.a.s.s.SolrDispatchFilter solr.xml found in ZooKeeper. Loading...
   [junit4]   2> 930082 INFO  (jetty-launcher-988-thread-2) [    ] o.a.s.c.ZkContainer Zookeeper client=127.0.0.1:33082/solr
   [junit4]   2> 930082 INFO  (jetty-launcher-988-thread-1) [    ] o.a.s.c.ZkContainer Zookeeper client=127.0.0.1:33082/solr
   [junit4]   2> 930132 INFO  (jetty-launcher-988-thread-3) [    ] o.a.s.c.ZkContainer Zookeeper client=127.0.0.1:33082/solr
   [junit4]   2> 930272 INFO  (jetty-launcher-988-thread-3) [n:127.0.0.1:36340_solr    ] o.a.s.c.Overseer Overseer (id=null) closing
   [junit4]   2> 930272 INFO  (jetty-launcher-988-thread-2) [n:127.0.0.1:48455_solr    ] o.a.s.c.Overseer Overseer (id=null) closing
   [junit4]   2> 930273 INFO  (jetty-launcher-988-thread-3) [n:127.0.0.1:36340_solr    ] o.a.s.c.OverseerElectionContext I am going to be the leader 127.0.0.1:36340_solr
   [junit4]   2> 930274 INFO  (jetty-launcher-988-thread-2) [n:127.0.0.1:48455_solr    ] o.a.s.c.ZkController Register node as live in ZooKeeper:/live_nodes/127.0.0.1:48455_solr
   [junit4]   2> 930274 INFO  (jetty-launcher-988-thread-3) [n:127.0.0.1:36340_solr    ] o.a.s.c.Overseer Overseer (id=98810114625241097-127.0.0.1:36340_solr-n_0000000000) starting
   [junit4]   2> 930277 INFO  (zkCallback-1005-thread-1-processing-n:127.0.0.1:36340_solr) [n:127.0.0.1:36340_solr    ] o.a.s.c.c.ZkStateReader Updated live nodes from ZooKeeper... (0) -> (1)
   [junit4]   2> 930277 INFO  (zkCallback-1000-thread-1-processing-n:127.0.0.1:48455_solr) [n:127.0.0.1:48455_solr    ] o.a.s.c.c.ZkStateReader Updated live nodes from ZooKeeper... (0) -> (1)
   [junit4]   2> 930283 DEBUG (OverseerStateUpdate-98810114625241097-127.0.0.1:36340_solr-n_0000000000) [n:127.0.0.1:36340_solr    ] o.a.s.c.Overseer Starting to work on the main queue
   [junit4]   2> 930283 DEBUG (OverseerAutoScalingTriggerThread-98810114625241097-127.0.0.1:36340_solr-n_0000000000) [n:127.0.0.1:36340_solr    ] o.a.s.c.a.OverseerTriggerThread Adding .autoAddReplicas trigger
   [junit4]   2> 930284 DEBUG (OverseerAutoScalingTriggerThread-98810114625241097-127.0.0.1:36340_solr-n_0000000000) [n:127.0.0.1:36340_solr    ] o.a.s.c.a.OverseerTriggerThread Refreshing /autoscaling.json with znode version 1
   [junit4]   2> 930285 INFO  (jetty-launcher-988-thread-3) [n:127.0.0.1:36340_solr    ] o.a.s.c.ZkController Register node as live in ZooKeeper:/live_nodes/127.0.0.1:36340_solr
   [junit4]   2> 930287 INFO  (zkCallback-1005-thread-1-processing-n:127.0.0.1:36340_solr) [n:127.0.0.1:36340_solr    ] o.a.s.c.c.ZkStateReader Updated live nodes from ZooKeeper... (1) -> (2)
   [junit4]   2> 930287 INFO  (zkCallback-1000-thread-1-processing-n:127.0.0.1:48455_solr) [n:127.0.0.1:48455_solr    ] o.a.s.c.c.ZkStateReader Updated live nodes from ZooKeeper... (1) -> (2)
   [junit4]   2> 930287 DEBUG (OverseerAutoScalingTriggerThread-98810114625241097-127.0.0.1:36340_solr-n_0000000000) [n:127.0.0.1:36340_solr    ] o.a.s.c.a.NodeLostTrigger Initial livenodes: [127.0.0.1:36340_solr, 127.0.0.1:48455_solr]
   [junit4]   2> 930287 DEBUG (OverseerAutoScalingTriggerThread-98810114625241097-127.0.0.1:36340_solr-n_0000000000) [n:127.0.0.1:36340_solr    ] o.a.s.c.a.OverseerTriggerThread Current znodeVersion 1, lastZnodeVersion -1
   [junit4]   2> 930287 DEBUG (OverseerAutoScalingTriggerThread-98810114625241097-127.0.0.1:36340_solr-n_0000000000) [n:127.0.0.1:36340_solr    ] o.a.s.c.a.OverseerTriggerThread Processed trigger updates upto znodeVersion 1
   [junit4]   2> 930288 DEBUG (OverseerStateUpdate-98810114625241097-127.0.0.1:36340_solr-n_0000000000) [n:127.0.0.1:36340_solr    ] o.a.s.c.Overseer processMessage: queueSize: 1, message = {
   [junit4]   2>   "operation":"downnode",
   [junit4]   2>   "node_name":"127.0.0.1:36340_solr"} current state version: 0
   [junit4]   2> 930288 DEBUG (OverseerStateUpdate-98810114625241097-127.0.0.1:36340_solr-n_0000000000) [n:127.0.0.1:36340_solr    ] o.a.s.c.o.NodeMutator DownNode state invoked for node: 127.0.0.1:36340_solr
   [junit4]   2> 930289 INFO  (jetty-launcher-988-thread-1) [n:127.0.0.1:59883_solr    ] o.a.s.c.c.ZkStateReader Updated live nodes from ZooKeeper... (0) -> (2)
   [junit4]   2> 930291 DEBUG (OverseerAutoScalingTriggerThread-98810114625241097-127.0.0.1:36340_solr-n_0000000000) [n:127.0.0.1:36340_solr    ] o.a.s.c.a.OverseerTriggerThread -- clean old nodeAdded markers
   [junit4]   2> 930291 DEBUG (OverseerAutoScalingTriggerThread-98810114625241097-127.0.0.1:36340_solr-n_0000000000) [n:127.0.0.1:36340_solr    ] o.a.s.c.a.OverseerTriggerThread Current znodeVersion 1, lastZnodeVersion 1
   [junit4]   2> 930292 DEBUG (ScheduledTrigger-2412-thread-1) [n:127.0.0.1:36340_solr    ] o.a.s.c.a.NodeLostTrigger Running NodeLostTrigger: .auto_add_replicas with currently live nodes: [127.0.0.1:36340_solr, 127.0.0.1:48455_solr]
   [junit4]   2> 930293 INFO  (jetty-launcher-988-thread-1) [n:127.0.0.1:59883_solr    ] o.a.s.c.Overseer Overseer (id=null) closing
   [junit4]   2> 930295 INFO  (jetty-launcher-988-thread-1) [n:127.0.0.1:59883_solr    ] o.a.s.c.ZkController Register node as live in ZooKeeper:/live_nodes/127.0.0.1:59883_solr
   [junit4]   2> 930295 DEBUG (OverseerStateUpdate-98810114625241097-127.0.0.1:36340_solr-n_0000000000) [n:127.0.0.1:36340_solr    ] o.a.s.c.Overseer processMessage: queueSize: 1, message = {
   [junit4]   2>   "operation":"downnode",
   [junit4]   2>   "node_name":"127.0.0.1:59883_solr"} current state version: 0
   [junit4]   2> 930295 DEBUG (OverseerStateUpdate-98810114625241097-127.0.0.1:36340_solr-n_0000000000) [n:127.0.0.1:36340_solr    ] o.a.s.c.o.NodeMutator DownNode state invoked for node: 127.0.0.1:59883_solr
   [junit4]   2> 930305 INFO  (zkCallback-1004-thread-1-processing-n:127.0.0.1:59883_solr) [n:127.0.0.1:59883_solr    ] o.a.s.c.c.ZkStateReader Updated live nodes from ZooKeeper... (2) -> (3)
   [junit4]   2> 930313 INFO  (zkCallback-1005-thread-1-processing-n:127.0.0.1:36340_solr) [n:127.0.0.1:36340_solr    ] o.a.s.c.c.ZkStateReader Updated live nodes from ZooKeeper... (2) -> (3)
   [junit4]   2> 930313 INFO  (zkCallback-1000-thread-1-processing-n:127.0.0.1:48455_solr) [n:127.0.0.1:48455_solr    ] o.a.s.c.c.ZkStateReader Updated live nodes from ZooKeeper... (2) -> (3)
   [junit4]   2> 930411 INFO  (jetty-launcher-988-thread-1) [n:127.0.0.1:59883_solr    ] o.a.s.m.r.SolrJmxReporter JMX monitoring for 'solr_59883.solr.node' (registry 'solr.node') enabled at server: com.sun.jmx.mbeanserver.JmxMBeanServer@66646dc2
   [junit4]   2> 930413 INFO  (jetty-launcher-988-thread-2) [n:127.0.0.1:48455_solr    ] o.a.s.m.r.SolrJmxReporter JMX monitoring for 'solr_48455.solr.node' (registry 'solr.node') enabled at server: com.sun.jmx.mbeanserver.JmxMBeanServer@66646dc2
   [junit4]   2> 930420 INFO  (jetty-launcher-988-thread-1) [n:127.0.0.1:59883_solr    ] o.a.s.m.r.SolrJmxReporter JMX monitoring for 'solr_59883.solr.jvm' (registry 'solr.jvm') enabled at server: com.sun.jmx.mbeanserver.JmxMBeanServer@66646dc2
   [junit4]   2> 930420 INFO  (jetty-launcher-988-thread-1) [n:127.0.0.1:59883_solr    ] o.a.s.m.r.SolrJmxReporter JMX monitoring for 'solr_59883.solr.jetty' (registry 'solr.jetty') enabled at server: com.sun.jmx.mbeanserver.JmxMBeanServer@66646dc2
   [junit4]   2> 930420 INFO  (jetty-launcher-988-thread-2) [n:127.0.0.1:48455_solr    ] o.a.s.m.r.SolrJmxReporter JMX monitoring for 'solr_48455.solr.jvm' (registry 'solr.jvm') enabled at server: com.sun.jmx.mbeanserver.JmxMBeanServer@66646dc2
   [junit4]   2> 930420 INFO  (jetty-launcher-988-thread-2) [n:127.0.0.1:48455_solr    ] o.a.s.m.r.SolrJmxReporter JMX monitoring for 'solr_48455.solr.jetty' (registry 'solr.jetty') enabled at server: com.sun.jmx.mbeanserver.JmxMBeanServer@66646dc2
   [junit4]   2> 930420 INFO  (jetty-launcher-988-thread-1) [n:127.0.0.1:59883_solr    ] o.a.s.c.CorePropertiesLocator Found 0 core definitions underneath /export/home/jenkins/workspace/Lucene-Solr-master-Solaris/solr/build/solr-core/test/J0/temp/solr.handler.admin.AutoscalingHistoryHandlerTest_505893396797EE99-001/tempDir-001/node1/.
   [junit4]   2> 930421 INFO  (jetty-launcher-988-thread-2) [n:127.0.0.1:48455_solr    ] o.a.s.c.CorePropertiesLocator Found 0 core definitions underneath /export/home/jenkins/workspace/Lucene-Solr-master-Solaris/solr/build/solr-core/test/J0/temp/solr.handler.admin.AutoscalingHistoryHandlerTest_505893396797EE99-001/tempDir-001/node2/.
   [junit4]   2> 930441 INFO  (jetty-launcher-988-thread-3) [n:127.0.0.1:36340_solr    ] o.a.s.m.r.SolrJmxReporter JMX monitoring for 'solr_36340.solr.node' (registry 'solr.node') enabled at server: com.sun.jmx.mbeanserver.JmxMBeanServer@66646dc2
   [junit4]   2> 930447 INFO  (jetty-launcher-988-thread-3) [n:127.0.0.1:36340_solr    ] o.a.s.m.r.SolrJmxReporter JMX monitoring for 'solr_36340.solr.jvm' (registry 'solr.jvm') enabled at server: com.sun.jmx.mbeanserver.JmxMBeanServer@66646dc2
   [junit4]   2> 930448 INFO  (jetty-launcher-988-thread-3) [n:127.0.0.1:36340_solr    ] o.a.s.m.r.SolrJmxReporter JMX monitoring for 'solr_36340.solr.jetty' (registry 'solr.jetty') enabled at server: com.sun.jmx.mbeanserver.JmxMBeanServer@66646dc2
   [junit4]   2> 930448 INFO  (jetty-launcher-988-thread-3) [n:127.0.0.1:36340_solr    ] o.a.s.c.CorePropertiesLocator Found 0 core definitions underneath /export/home/jenkins/workspace/Lucene-Solr-master-Solaris/solr/build/solr-core/test/J0/temp/solr.handler.admin.AutoscalingHistoryHandlerTest_505893396797EE99-001/tempDir-001/node3/.
   [junit4]   2> 930478 INFO  (SUITE-AutoscalingHistoryHandlerTest-seed#[505893396797EE99]-worker) [    ] o.a.s.c.c.ZkStateReader Updated live nodes from ZooKeeper... (0) -> (3)
   [junit4]   2> 930480 INFO  (SUITE-AutoscalingHistoryHandlerTest-seed#[505893396797EE99]-worker) [    ] o.a.s.c.s.i.ZkClientClusterStateProvider Cluster at 127.0.0.1:33082/solr ready
   [junit4]   2> 930486 INFO  (qtp311902191-6292) [n:127.0.0.1:59883_solr    ] o.a.s.h.a.CollectionsHandler Invoked Collection Action :create with params replicationFactor=3&name=AutoscalingHistoryHandlerTest_collection&nrtReplicas=3&action=CREATE&numShards=1&wt=javabin&version=2 and sendToOCPQueue=true
   [junit4]   2> 930489 INFO  (OverseerThreadFactory-2414-thread-1-processing-n:127.0.0.1:36340_solr) [n:127.0.0.1:36340_solr    ] o.a.s.c.CreateCollectionCmd Create collection AutoscalingHistoryHandlerTest_collection
   [junit4]   2> 930489 INFO  (OverseerThreadFactory-2414-thread-1-processing-n:127.0.0.1:36340_solr) [n:127.0.0.1:36340_solr    ] o.a.s.c.CreateCollectionCmd Only _default config set found, using it.
   [junit4]   2> 930490 INFO  (OverseerThreadFactory-2414-thread-1-processing-n:127.0.0.1:36340_solr) [n:127.0.0.1:36340_solr    ] o.a.s.c.c.ZkConfigManager Copying zk node /configs/_default/protwords.txt to /configs/AutoscalingHistoryHandlerTest_collection/protwords.txt
   [junit4]   2> 930492 INFO  (OverseerThreadFactory-2414-thread-1-processing-n:127.0.0.1:36340_solr) [n:127.0.0.1:36340_solr    ] o.a.s.c.c.ZkConfigManager Copying zk node /configs/_default/managed-schema to /configs/AutoscalingHistoryHandlerTest_collection/managed-schema
   [junit4]   2> 930494 INFO  (OverseerThreadFactory-2414-thread-1-processing-n:127.0.0.1:36340_solr) [n:127.0.0.1:36340_solr    ] o.a.s.c.c.ZkConfigManager Copying zk node /configs/_default/solrconfig.xml to /configs/AutoscalingHistoryHandlerTest_collection/solrconfig.xml
   [junit4]   2> 930496 INFO  (OverseerThreadFactory-2414-thread-1-processing-n:127.0.0.1:36340_solr) [n:127.0.0.1:36340_solr    ] o.a.s.c.c.ZkConfigManager Copying zk node /configs/_default/synonyms.txt to /configs/AutoscalingHistoryHandlerTest_collection/synonyms.txt
   [junit4]   2> 930498 INFO  (OverseerThreadFactory-2414-thread-1-processing-n:127.0.0.1:36340_solr) [n:127.0.0.1:36340_solr    ] o.a.s.c.c.ZkConfigManager Copying zk node /configs/_default/stopwords.txt to /configs/AutoscalingHistoryHandlerTest_collection/stopwords.txt
   [junit4]   2> 930500 INFO  (OverseerThreadFactory-2414-thread-1-processing-n:127.0.0.1:36340_solr) [n:127.0.0.1:36340_solr    ] o.a.s.c.c.ZkConfigManager Copying zk node /configs/_default/params.json to /configs/AutoscalingHistoryHandlerTest_collection/params.json
   [junit4]   2> 930503 INFO  (OverseerThreadFactory-2414-thread-1-processing-n:127.0.0.1:36340_solr) [n:127.0.0.1:36340_solr    ] o.a.s.c.c.ZkConfigManager Copying zk node /configs/_default/lang/contractions_it.txt to /configs/AutoscalingHistoryHandlerTest_collection/lang/contractions_it.txt
   [junit4]   2> 930506 INFO  (OverseerThreadFactory-2414-thread-1-processing-n:127.0.0.1:36340_solr) [n:127.0.0.1:36340_solr    ] o.a.s.c.c.ZkConfigManager Copying zk node /configs/_default/lang/stemdict_nl.txt to /configs/AutoscalingHistoryHandlerTest_collection/lang/stemdict_nl.txt
   [junit4]   2> 930508 INFO  (OverseerThreadFactory-2414-thread-1-processing-n:127.0.0.1:36340_solr) [n:127.0.0.1:36340_solr    ] o.a.s.c.c.ZkConfigManager Copying zk node /configs/_default/lang/stopwords_no.txt to /configs/AutoscalingHistoryHandlerTest_collection/lang/stopwords_no.txt
   [junit4]   2> 930510 INFO  (OverseerThreadFactory-2414-thread-1-processing-n:127.0.0.1:36340_solr) [n:127.0.0.1:36340_solr    ] o.a.s.c.c.ZkConfigManager Copying zk node /configs/_default/lang/stopwords_hy.txt to /configs/AutoscalingHistoryHandlerTest_collection/lang/stopwords_hy.txt
   [junit4]   2> 930512 INFO  (OverseerThreadFactory-2414-thread-1-processing-n:127.0.0.1:36340_solr) [n:127.0.0.1:36340_solr    ] o.a.s.c.c.ZkConfigManager Copying zk node /configs/_default/lang/contractions_ca.txt to /configs/AutoscalingHistoryHandlerTest_collection/lang/contractions_ca.txt
   [junit4]   2> 930514 INFO  (OverseerThreadFactory-2414-thread-1-processing-n:127.0.0.1:36340_solr) [n:127.0.0.1:36340_solr    ] o.a.s.c.c.ZkConfigManager Copying zk node /configs/_default/lang/stopwords_id.txt to /configs/AutoscalingHistoryHandlerTest_collection/lang/stopwords_id.txt
   [junit4]   2> 930516 INFO  (OverseerThreadFactory-2414-thread-1-processing-n:127.0.0.1:36340_solr) [n:127.0.0.1:36340_solr    ] o.a.s.c.c.ZkConfigManager Copying zk node /configs/_default/lang/stopwords_ga.txt to /configs/AutoscalingHistoryHandlerTest_collection/lang/stopwords_ga.txt
   [junit4]   2> 930519 INFO  (OverseerThreadFactory-2414-thread-1-processing-n:127.0.0.1:36340_solr) [n:127.0.0.1:36340_solr    ] o.a.s.c.c.ZkConfigManager Copying zk node /configs/_default/lang/stopwords_da.txt to /configs/AutoscalingHistoryHandlerTest_collection/lang/stopwords_da.txt
   [junit4]   2> 930522 INFO  (OverseerThreadFactory-2414-thread-1-processing-n:127.0.0.1:36340_solr) [n:127.0.0.1:36340_solr    ] o.a.s.c.c.ZkConfigManager Copying zk node /configs/_default/lang/stopwords_hi.txt to /configs/AutoscalingHistoryHandlerTest_collection/lang/stopwords_hi.txt
   [junit4]   2> 930524 INFO  (OverseerThreadFactory-2414-thread-1-processing-n:127.0.0.1:36340_solr) [n:127.0.0.1:36340_solr    ] o.a.s.c.c.ZkConfigManager Copying zk node /configs/_default/lang/stopwords_ja.txt to /configs/AutoscalingHistoryHandlerTest_collection/lang/stopwords_ja.txt
   [junit4]   2> 930526 INFO  (OverseerThreadFactory-2414-thread-1-processing-n:127.0.0.1:36340_solr) [n:127.0.0.1:36340_solr    ] o.a.s.c.c.ZkConfigManager Copying zk node /configs/_default/lang/stopwords_pt.txt to /configs/AutoscalingHistoryHandlerTest_collection/lang/stopwords_pt.txt
   [junit4]   2> 930528 INFO  (OverseerThreadFactory-2414-thread-1-processing-n:127.0.0.1:36340_solr) [n:127.0.0.1:36340_solr    ] o.a.s.c.c.ZkConfigManager Copying zk node /configs/_default/lang/stopwords_hu.txt to /configs/AutoscalingHistoryHandlerTest_collection/lang/stopwords_hu.txt
   [junit4]   2> 930530 INFO  (OverseerThreadFactory-2414-thread-1-processing-n:127.0.0.1:36340_solr) [n:127.0.0.1:36340_solr    ] o.a.s.c.c.ZkConfigManager Copying zk node /configs/_default/lang/stopwords_el.txt to /configs/AutoscalingHistoryHandlerTest_collection/lang/stopwords_el.txt
   [junit4]   2> 930532 INFO  (OverseerThreadFactory-2414-thread-1-processing-n:127.0.0.1:36340_solr) [n:127.0.0.1:36340_solr    ] o.a.s.c.c.ZkConfigManager Copying zk node /configs/_default/lang/stopwords_ru.txt to /configs/AutoscalingHistoryHandlerTest_collection/lang/stopwords_ru.txt
   [junit4]   2> 930534 INFO  (OverseerThreadFactory-2414-thread-1-processing-n:127.0.0.1:36340_solr) [n:127.0.0.1:36340_solr    ] o.a.s.c.c.ZkConfigManager Copying zk node /configs/_default/lang/stopwords_tr.txt to /configs/AutoscalingHistoryHandlerTest_collection/lang/stopwords_tr.txt
   [junit4]   2> 930537 INFO  (OverseerThreadFactory-2414-thread-1-processing-n:127.0.0.1:36340_solr) [n:127.0.0.1:36340_solr    ] o.a.s.c.c.ZkConfigManager Copying zk node /configs/_default/lang/stopwords_ar.txt to /configs/AutoscalingHistoryHandlerTest_collection/lang/stopwords_ar.txt
   [junit4]   2> 930539 INFO  (OverseerThreadFactory-2414-thread-1-processing-n:127.0.0.1:36340_solr) [n:127.0.0.1:36340_solr    ] o.a.s.c.c.ZkConfigManager Copying zk node /configs/_default/lang/userdict_ja.txt to /configs/AutoscalingHistoryHandlerTest_collection/lang/userdict_ja.txt
   [junit4]   2> 930541 INFO  (OverseerThreadFactory-2414-thread-1-processing-n:127.0.0.1:36340_solr) [n:127.0.0.1:36340_solr    ] o.a.s.c.c.ZkConfigManager Copying zk node /configs/_default/lang/stopwords_eu.txt to /configs/AutoscalingHistoryHandlerTest_collection/lang/stopwords_eu.txt
   [junit4]   2> 930543 INFO  (OverseerThreadFactory-2414-thread-1-processing-n:127.0.0.1:36340_solr) [n:127.0.0.1:36340_solr    ] o.a.s.c.c.ZkConfigManager Copying zk node /configs/_default/lang/stopwords_it.txt to /configs/AutoscalingHistoryHandlerTest_collection/lang/stopwords_it.txt
   [junit4]   2> 930545 INFO  (OverseerThreadFactory-2414-thread-1-processing-n:127.0.0.1:36340_solr) [n:127.0.0.1:36340_solr    ] o.a.s.c.c.ZkConfigManager Copying zk node /configs/_default/lang/stopwords_cz.txt to /configs/AutoscalingHistoryHandlerTest_collection/lang/stopwords_cz.txt
   [junit4]   2> 930548 INFO  (OverseerThreadFactory-2414-thread-1-processing-n:127.0.0.1:36340_solr) [n:127.0.0.1:36340_solr    ] o.a.s.c.c.ZkConfigManager Copying zk node /configs/_default/lang/stoptags_ja.txt to /configs/AutoscalingHistoryHandlerTest_collection/lang/stoptags_ja.txt
   [junit4]   2> 930550 INFO  (OverseerThreadFactory-2414-thread-1-processing-n:127.0.0.1:36340_solr) [n:127.0.0.1:36340_solr    ] o.a.s.c.c.ZkConfigManager Copying zk node /configs/_default/lang/contractions_fr.txt to /configs/AutoscalingHistoryHandlerTest_collection/lang/contractions_fr.txt
   [junit4]   2> 930552 INFO  (OverseerThreadFactory-2414-thread-1-processing-n:127.0.0.1:36340_solr) [n:127.0.0.1:36340_solr    ] o.a.s.c.c.ZkConfigManager Copying zk node /configs/_default/lang/stopwords_de.txt to /configs/AutoscalingHistoryHandlerTest_collection/lang/stopwords_de.txt
   [junit4]   2> 930554 INFO  (OverseerThreadFactory-2414-thread-1-processing-n:127.0.0.1:36340_solr) [n:127.0.0.1:36340_solr    ] o.a.s.c.c.ZkConfigManager Copying zk node /configs/_default/lang/stopwords_fa.txt to /configs/AutoscalingHistoryHandlerTest_collection/lang/stopwords_fa.txt
   [junit4]   2> 930557 INFO  (OverseerThreadFactory-2414-thread-1-processing-n:127.0.0.1:36340_solr) [n:127.0.0.1:36340_solr    ] o.a.s.c.c.ZkConfigManager Copying zk node /configs/_default/lang/contractions_ga.txt to /configs/AutoscalingHistoryHandlerTest_collection/lang/contractions_ga.txt
   [junit4]   2> 930559 INFO  (OverseerThreadFactory-2414-thread-1-processing-n:127.0.0.1:36340_solr) [n:127.0.0.1:36340_solr    ] o.a.s.c.c.ZkConfigManager Copying zk node /configs/_default/lang/stopwords_ca.txt to /configs/AutoscalingHistoryHandlerTest_collection/lang/stopwords_ca.txt
   [junit4]   2> 930561 INFO  (OverseerThreadFactory-2414-thread-1-processing-n:127.0.0.1:36340_solr) [n:127.0.0.1:36340_solr    ] o.a.s.c.c.ZkConfigManager Copying zk node /configs/_default/lang/stopwords_nl.txt to /configs/AutoscalingHistoryHandlerTest_collection/lang/stopwords_nl.txt
   [junit4]   2> 930563 INFO  (OverseerThreadFactory-2414-thread-1-processing-n:127.0.0.1:36340_solr) [n:127.0.0.1:36340_solr    ] o.a.s.c.c.ZkConfigManager Copying zk node /configs/_default/lang/stopwords_bg.txt to /configs/AutoscalingHistoryHandlerTest_collection/lang/stopwords_bg.txt
   [junit4]   2> 930566 INFO  (OverseerThreadFactory-2414-thread-1-processing-n:127.0.0.1:36340_solr) [n:127.0.0.1:36340_solr    ] o.a.s.c.c.ZkConfigManager Copying zk node /configs/_default/lang/stopwords_lv.txt to /configs/AutoscalingHistoryHandlerTest_collection/lang/stopwords_lv.txt
   [junit4]   2> 930568 INFO  (OverseerThreadFactory-2414-thread-1-processing-n:127.0.0.1:36340_solr) [n:127.0.0.1:36340_solr    ] o.a.s.c.c.ZkConfigManager Copying zk node /configs/_default/lang/stopwords_en.txt to /configs/AutoscalingHistoryHandlerTest_collection/lang/stopwords_en.txt
   [junit4]   2> 930570 INFO  (OverseerThreadFactory-2414-thread-1-processing-n:127.0.0.1:36340_solr) [n:127.0.0.1:36340_solr    ] o.a.s.c.c.ZkConfigManager Copying zk node /configs/_default/lang/stopwords_es.txt to /configs/AutoscalingHistoryHandlerTest_collection/lang/stopwords_es.txt
   [junit4]   2> 930572 INFO  (OverseerThreadFactory-2414-thread-1-processing-n:127.0.0.1:36340_solr) [n:127.0.0.1:36340_solr    ] o.a.s.c.c.ZkConfigManager Copying zk node /configs/_default/lang/stopwords_ro.txt to /configs/AutoscalingHistoryHandlerTest_collection/lang/stopwords_ro.txt
   [junit4]   2> 930575 INFO  (OverseerThreadFactory-2414-thread-1-processing-n:127.0.0.1:36340_solr) [n:127.0.0.1:36340_solr    ] o.a.s.c.c.ZkConfigManager Copying zk node /configs/_default/lang/stopwords_th.txt to /configs/AutoscalingHistoryHandlerTest_collection/lang/stopwords_th.txt
   [junit4]   2> 930577 INFO  (OverseerThreadFactory-2414-thread-1-processing-n:127.0.0.1:36340_solr) [n:127.0.0.1:36340_solr    ] o.a.s.c.c.ZkConfigManager Copying zk node /configs/_default/lang/stopwords_fr.txt to /configs/AutoscalingHistoryHandlerTest_collection/lang/stopwords_fr.txt
   [junit4]   2> 930579 INFO  (OverseerThreadFactory-2414-thread-1-processing-n:127.0.0.1:36340_solr) [n:127.0.0.1:36340_solr    ] o.a.s.c.c.ZkConfigManager Copying zk node /configs/_default/lang/stopwords_sv.txt to /configs/AutoscalingHistoryHandlerTest_collection/lang/stopwords_sv.txt
   [junit4]   2> 930582 INFO  (OverseerThreadFactory-2414-thread-1-processing-n:127.0.0.1:36340_solr) [n:127.0.0.1:36340_solr    ] o.a.s.c.c.ZkConfigManager Copying zk node /configs/_default/lang/stopwords_fi.txt to /configs/AutoscalingHistoryHandlerTest_collection/lang/stopwords_fi.txt
   [junit4]   2> 930584 INFO  (OverseerThreadFactory-2414-thread-1-processing-n:127.0.0.1:36340_solr) [n:127.0.0.1:36340_solr    ] o.a.s.c.c.ZkConfigManager Copying zk node /configs/_default/lang/hyphenations_ga.txt to /configs/AutoscalingHistoryHandlerTest_collection/lang/hyphenations_ga.txt
   [junit4]   2> 930586 INFO  (OverseerThreadFactory-2414-thread-1-processing-n:127.0.0.1:36340_solr) [n:127.0.0.1:36340_solr    ] o.a.s.c.c.ZkConfigManager Copying zk node /configs/_default/lang/stopwords_gl.txt to /configs/AutoscalingHistoryHandlerTest_collection/lang/stopwords_gl.txt
   [junit4]   2> 930594 DEBUG (OverseerStateUpdate-98810114625241097-127.0.0.1:36340_solr-n_0000000000) [n:127.0.0.1:36340_solr    ] o.a.s.c.Overseer processMessage: queueSize: 1, message = {
   [junit4]   2>   "name":"AutoscalingHistoryHandlerTest_collection",
   [junit4]   2>   "fromApi":"true",
   [junit4]   2>   "replicationFactor":"3",
   [junit4]   2>   "numShards":"1",
   [junit4]   2>   "nrtReplicas":"3",
   [junit4]   2>   "stateFormat":"2",
   [junit4]   2>   "operation":"create"} current state version: 0
   [junit4]   2> 930594 DEBUG (OverseerStateUpdate-98810114625241097-127.0.0.1:36340_solr-n_0000000000) [n:127.0.0.1:36340_solr    ] o.a.s.c.o.ClusterStateMutator building a new cName: AutoscalingHistoryHandlerTest_collection
   [junit4]   2> 930595 DEBUG (OverseerStateUpdate-98810114625241097-127.0.0.1:36340_solr-n_0000000000) [n:127.0.0.1:36340_solr    ] o.a.s.c.o.ZkStateWriter going to create_collection /collections/AutoscalingHistoryHandlerTest_collection/state.json
   [junit4]   2> 930706 DEBUG (OverseerStateUpdate-98810114625241097-127.0.0.1:36340_solr-n_0000000000) [n:127.0.0.1:36340_solr    ] o.a.s.c.Overseer processMessage: queueSize: 1, message = {
   [junit4]   2>   "operation":"ADDREPLICA",
   [junit4]   2>   "collection":"AutoscalingHistoryHandlerTest_collection",
   [junit4]   2>   "shard":"shard1",
   [junit4]   2>   "core":"AutoscalingHistoryHandlerTest_collection_shard1_replica_n1",
   [junit4]   2>   "state":"down",
   [junit4]   2>   "base_url":"http://127.0.0.1:59883/solr",
   [junit4]   2>   "type":"NRT"} current state version: 0
   [junit4]   2> 930707 INFO  (OverseerStateUpdate-98810114625241097-127.0.0.1:36340_solr-n_0000000000) [n:127.0.0.1:36340_solr    ] o.a.s.c.o.SliceMutator createReplica() {
   [junit4]   2>   "operation":"ADDREPLICA",
   [junit4]   2>   "collection":"AutoscalingHistoryHandlerTest_collection",
   [junit4]   2>   "shard":"shard1",
   [junit4]   2>   "core":"AutoscalingHistoryHandlerTest_collection_shard1_replica_n1",
   [junit4]   2>   "state":"down",
   [junit4]   2>   "base_url":"http://127.0.0.1:59883/solr",
   [junit4]   2>   "type":"NRT"} 
   [junit4]   2> 930710 DEBUG (OverseerStateUpdate-98810114625241097-127.0.0.1:36340_solr-n_0000000000) [n:127.0.0.1:36340_solr    ] o.a.s.c.o.SliceMutator Old Slice: shard1:{
   [junit4]   2>   "range":"80000000-7fffffff",
   [junit4]   2>   "state":"active",
   [junit4]   2>   "replicas":{}}
   [junit4]   2> 930710 DEBUG (OverseerStateUpdate-98810114625241097-127.0.0.1:36340_solr-n_0000000000) [n:127.0.0.1:36340_solr    ] o.a.s.c.o.SliceMutator New Slice: shard1:{
   [junit4]   2>   "range":"80000000-7fffffff",
   [junit4]   2>   "state":"active",
   [junit4]   2>   "replicas":{"core_node3":{
   [junit4]   2>       "core":"AutoscalingHistoryHandlerTest_collection_shard1_replica_n1",
   [junit4]   2>       "base_url":"http://127.0.0.1:59883/solr",
   [junit4]   2>       "state":"down",
   [junit4]   2>       "node_name":null,
   [junit4]   2>       "type":"NRT"}}}
   [junit4]   2> 930714 DEBUG (OverseerStateUpdate-98810114625241097-127.0.0.1:36340_solr-n_0000000000) [n:127.0.0.1:36340_solr    ] o.a.s.c.Overseer processMessage: queueSize: 1, message = {
   [junit4]   2>   "operation":"ADDREPLICA",
   [junit4]   2>   "collection":"AutoscalingHistoryHandlerTest_collection",
   [junit4]   2>   "shard":"shard1",
   [junit4]   2>   "core":"AutoscalingHistoryHandlerTest_collection_shard1_replica_n2",
   [junit4]   2>   "state":"down",
   [junit4]   2>   "base_url":"http://127.0.0.1:48455/solr",
   [junit4]   2>   "type":"NRT"} current state version: 0
   [junit4]   2> 930714 INFO  (OverseerStateUpdate-98810114625241097-127.0.0.1:36340_solr-n_0000000000) [n:127.0.0.1:36340_solr    ] o.a.s.c.o.SliceMutator createReplica() {
   [junit4]   2>   "operation":"ADDREPLICA",
   [junit4]   2>   "collection":"AutoscalingHistoryHandlerTest_collection",
   [junit4]   2>   "shard":"shard1",
   [junit4]   2>   "core":"AutoscalingHistoryHandlerTest_collection_shard1_replica_n2",
   [junit4]   2>   "state":"down",
   [junit4]   2>   "base_url":"http://127.0.0.1:48455/solr",
   [junit4]   2>   "type":"NRT"} 
   [junit4]   2> 930717 DEBUG (OverseerStateUpdate-98810114625241097-127.0.0.1:36340_solr-n_0000000000) [n:127.0.0.1:36340_solr    ] o.a.s.c.o.SliceMutator Old Slice: shard1:{
   [junit4]   2>   "range":"80000000-7fffffff",
   [junit4]   2>   "state":"active",
   [junit4]   2>   "replicas":{"core_node3":{
   [junit4]   2>       "core":"AutoscalingHistoryHandlerTest_collection_shard1_replica_n1",
   [junit4]   2>       "base_url":"http://127.0.0.1:59883/solr",
   [junit4]   2>       "state":"down",
   [junit4]   2>       "node_name":null,
   [junit4]   2>       "type":"NRT"}}}
   [junit4]   2> 930717 DEBUG (OverseerStateUpdate-98810114625241097-127.0.0.1:36340_solr-n_0000000000) [n:127.0.0.1:36340_solr    ] o.a.s.c.o.SliceMutator New Slice: shard1:{
   [junit4]   2>   "range":"80000000-7fffffff",
   [junit4]   2>   "state":"active",
   [junit4]   2>   "replicas":{
   [junit4]   2>     "core_node3":{
   [junit4]   2>       "core":"AutoscalingHistoryHandlerTest_collection_shard1_replica_n1",
   [junit4]   2>       "base_url":"http://127.0.0.1:59883/solr",
   [junit4]   2>       "state":"down",
   [junit4]   2>       "node_name":null,
   [junit4]   2>       "type":"NRT"},
   [junit4]   2>     "core_node5":{
   [junit4]   2>       "core":"AutoscalingHistoryHandlerTest_collection_shard1_replica_n2",
   [junit4]   2>       "base_url":"http://127.0.0.1:48455/solr",
   [junit4]   2>       "state":"down",
   [junit4]   2>       "node_name":null,
   [junit4]   2>       "type":"NRT"}}}
   [junit4]   2> 930721 DEBUG (OverseerStateUpdate-98810114625241097-127.0.0.1:36340_solr-n_0000000000) [n:127.0.0.1:36340_solr    ] o.a.s.c.Overseer processMessage: queueSize: 1, message = {
   [junit4]   2>   "operation":"ADDREPLICA",
   [junit4]   2>   "collection":"AutoscalingHistoryHandlerTest_collection",
   [junit4]   2>   "shard":"shard1",
   [junit4]   2>   "core":"AutoscalingHistoryHandlerTest_collection_shard1_replica_n4",
   [junit4]   2>   "state":"down",
   [junit4]   2>   "base_url":"http://127.0.0.1:36340/solr",
   [junit4]   2>   "type":"NRT"} current state version: 0
   [junit4]   2> 930721 INFO  (OverseerStateUpdate-98810114625241097-127.0.0.1:36340_solr-n_0000000000) [n:127.0.0.1:36340_solr    ] o.a.s.c.o.SliceMutator createReplica() {
   [junit4]   2>   "operation":"ADDREPLICA",
   [junit4]   2>   "collection":"AutoscalingHistoryHandlerTest_collection",
   [junit4]   2>   "shard":"shard1",
   [junit4]   2>   "core":"AutoscalingHistoryHandlerTest_collection_shard1_replica_n4",
   [junit4]   2>   "state":"down",
   [junit4]   2>   "base_url":"http://127.0.0.1:36340/solr",
   [junit4]   2>   "type":"NRT"} 
   [junit4]   2> 930724 DEBUG (OverseerStateUpdate-98810114625241097-127.0.0.1:36340_solr-n_0000000000) [n:127.0.0.1:36340_solr    ] o.a.s.c.o.SliceMutator Old Slice: shard1:{
   [junit4]   2>   "range":"80000000-7fffffff",
   [junit4]   2>   "state":"active",
   [junit4]   2>   "replicas":{
   [junit4]   2>     "core_node3":{
   [junit4]   2>       "core":"AutoscalingHistoryHandlerTest_collection_shard1_replica_n1",
   [junit4]   2>       "base_url":"http://127.0.0.1:59883/solr",
   [junit4]   2>       "state":"down",
   [junit4]   2>       "node_name":null,
   [junit4]   2>       "type":"NRT"},
   [junit4]   2>     "core_node5":{
   [junit4]   2>       "core":"AutoscalingHistoryHandlerTest_collection_shard1_replica_n2",
   [junit4]   2>       "base_url":"http://127.0.0.1:48455/solr",
   [junit4]   2>       "state":"down",
   [junit4]   2>       "node_name":null,
   [junit4]   2>       "type":"NRT"}}}
   [junit4]   2> 930724 DEBUG (OverseerStateUpdate-98810114625241097-127.0.0.1:36340_solr-n_0000000000) [n:127.0.0.1:36340_solr    ] o.a.s.c.o.SliceMutator New Slice: shard1:{
   [junit4]   2>   "range":"80000000-7fffffff",
   [junit4]   2>   "state":"active",
   [junit4]   2>   "replicas":{
   [junit4]   2>     "core_node3":{
   [junit4]   2>       "core":"AutoscalingHistoryHandlerTest_collection_shard1_replica_n1",
   [junit4]   2>       "base_url":"http://127.0.0.1:59883/solr",
   [junit4]   2>       "state":"down",
   [junit4]   2>       "node_name":null,
   [junit4]   2>       "type":"NRT"},
   [junit4]   2>     "core_node5":{
   [junit4]   2>       "core":"AutoscalingHistoryHandlerTest_collection_shard1_replica_n2",
   [junit4]   2>       "base_url":"http://127.0.0.1:48455/solr",
   [junit4]   2>       "state":"down",
   [junit4]   2>       "node_name":null,
   [junit4]   2>       "type":"NRT"},
   [junit4]   2>     "core_node6":{
   [junit4]   2>       "core":"AutoscalingHistoryHandlerTest_collection_shard1_replica_n4",
   [junit4]   2>       "base_url":"http://127.0.0.1:36340/solr",
   [junit4]   2>       "state":"down",
   [junit4]   2>       "node_name":null,
   [junit4]   2>       "type":"NRT"}}}
   [junit4]   2> 930830 DEBUG (OverseerStateUpdate-98810114625241097-127.0.0.1:36340_solr-n_0000000000) [n:127.0.0.1:36340_solr    ] o.a.s.c.o.ZkStateWriter going to update_collection /collections/AutoscalingHistoryHandlerTest_collection/state.json version: 0
   [junit4]   2> 930924 INFO  (qtp311902191-6293) [n:127.0.0.1:59883_solr    ] o.a.s.h.a.CoreAdminOperation core create command qt=/admin/cores&coreNodeName=core_node3&collection.configName=AutoscalingHistoryHandlerTest_collection&newCollection=true&name=AutoscalingHistoryHandlerTest_collection_shard1_replica_n1&action=CREATE&numShards=1&collection=AutoscalingHistoryHandlerTest_collection&shard=shard1&wt=javabin&version=2&replicaType=NRT
   [junit4]   2> 930924 INFO  (qtp311902191-6293) [n:127.0.0.1:59883_solr    ] o.a.s.c.TransientSolrCoreCacheDefault Allocating transient cache for 2147483647 transient cores
   [junit4]   2> 930932 INFO  (qtp240054577-6278) [n:127.0.0.1:48455_solr    ] o.a.s.h.a.CoreAdminOperation core create command qt=/admin/cores&coreNodeName=core_node5&collection.configName=AutoscalingHistoryHandlerTest_collection&newCollection=true&name=AutoscalingHistoryHandlerTest_collection_shard1_replica_n2&action=CREATE&numShards=1&collection=AutoscalingHistoryHandlerTest_collection&shard=shard1&wt=javabin&version=2&replicaType=NRT
   [junit4]   2> 930932 INFO  (qtp1269889132-6279) [n:127.0.0.1:36340_solr    ] o.a.s.h.a.CoreAdminOperation core create command qt=/admin/cores&coreNodeName=core_node6&collection.configName=AutoscalingHistoryHandlerTest_collection&newCollection=true&name=AutoscalingHistoryHandlerTest_collection_shard1_replica_n4&action=CREATE&numShards=1&collection=AutoscalingHistoryHandlerTest_collection&shard=shard1&wt=javabin&version=2&replicaType=NRT
   [junit4]   2> 930932 INFO  (qtp240054577-6278) [n:127.0.0.1:48455_solr    ] o.a.s.c.TransientSolrCoreCacheDefault Allocating transient cache for 2147483647 transient cores
   [junit4]   2> 930932 INFO  (qtp1269889132-6279) [n:127.0.0.1:36340_solr    ] o.a.s.c.TransientSolrCoreCacheDefault Allocating transient cache for 2147483647 transient cores
   [junit4]   2> 930936 DEBUG (OverseerStateUpdate-98810114625241097-127.0.0.1:36340_solr-n_0000000000) [n:127.0.0.1:36340_solr    ] o.a.s.c.Overseer processMessage: queueSize: 1, message = {
   [junit4]   2>   "core":"AutoscalingHistoryHandlerTest_collection_shard1_replica_n1",
   [junit4]   2>   "core_node_name":"core_node3",
   [junit4]   2>   "roles":null,
   [junit4]   2>   "base_url":"http://127.0.0.1:59883/solr",
   [junit4]   2>   "node_name":"127.0.0.1:59883_solr",
   [junit4]   2>   "numShards":"1",
   [junit4]   2>   "state":"down",
   [junit4]   2>   "shard":"shard1",
   [junit4]   2>   "collection":"AutoscalingHistoryHandlerTest_collection",
   [junit4]   2>   "type":"NRT",
   [junit4]   2>   "operation":"state"} current state version: 0
   [junit4]   2> 930936 DEBUG (OverseerStateUpdate-98810114625241097-127.0.0.1:36340_solr-n_0000000000) [n:127.0.0.1:36340_solr    ] o.a.s.c.o.ReplicaMutator Update state numShards=1 message={
   [junit4]   2>   "core":"AutoscalingHistoryHandlerTest_collection_shard1_replica_n1",
   [junit4]   2>   "core_node_name":"core_node3",
   [junit4]   2>   "roles":null,
   [junit4]   2>   "base_url":"http://127.0.0.1:59883/solr",
   [junit4]   2>   "node_name":"127.0.0.1:59883_solr",
   [junit4]   2>   "numShards":"1",
   [junit4]   2>   "state":"down",
   [junit4]   2>   "shard":"shard1",
   [junit4]   2>   "collection":"AutoscalingHistoryHandlerTest_collection",
   [junit4]   2>   "type":"NRT",
   [junit4]   2>   "operation":"state"}
   [junit4]   2> 930936 DEBUG (OverseerStateUpdate-98810114625241097-127.0.0.1:36340_solr-n_0000000000) [n:127.0.0.1:36340_solr    ] o.a.s.c.o.ReplicaMutator Will update state for replica: core_node3:{"core":"AutoscalingHistoryHandlerTest_collection_shard1_replica_n1","base_url":"http://127.0.0.1:59883/solr","node_name":"127.0.0.1:59883_solr","state":"down","type":"NRT"}
   [junit4]   2> 930936 DEBUG (OverseerStateUpdate-98810114625241097-127.0.0.1:36340_solr-n_0000000000) [n:127.0.0.1:36340_solr    ] o.a.s.c.o.ReplicaMutator Collection is now: DocCollection(AutoscalingHistoryHandlerTest_collection//collections/AutoscalingHistoryHandlerTest_collection/state.json/1)={
   [junit4]   2>   "pullReplicas":"0",
   [junit4]   2>   "replicationFactor":"3",
   [junit4]   2>   "router":{"name":"compositeId"},
   [junit4]   2>   "maxShardsPerNode":"1",
   [junit4]   2>   "autoAddReplicas":"false",
   [junit4]   2>   "nrtReplicas":"3",
   [junit4]   2>   "tlogReplicas":"0",
   [junit4]   2>   "shards":{"shard1":{
   [junit4]   2>       "range":"80000000-7fffffff",
   [junit4]   2>       "state":"active",
   [junit4]   2>       "replicas":{
   [junit4]   2>         "core_node3":{
   [junit4]   2>           "core":"AutoscalingHistoryHandlerTest_collection_shard1_replica_n1",
   [junit4]   2>           "base_url":"http://127.0.0.1:59883/solr",
   [junit4]   2>           "node_name":"127.0.0.1:59883_solr",
   [junit4]   2>           "state":"down",
   [junit4]   2>           "type":"NRT"},
   [junit4]   2>         "core_node5":{
   [junit4]   2>           "core":"AutoscalingHistoryHandlerTest_collection_shard1_replica_n2",
   [junit4]   2>           "base_url":"http://127.0.0.1:48455/solr",
   [junit4]   2>           "state":"down",
   [junit4]   2>           "node_name":null,
   [junit4]   2>           "type":"NRT"},
   [junit4]   2>         "core_node6":{
   [junit4]   2>           "core":"AutoscalingHistoryHandlerTest_collection_shard1_replica_n4",
   [junit4]   2>           "base_url":"http://127.0.0.1:36340/solr",
   [junit4]   2>           "state":"down",
   [junit4]   2>           "node_name":null,
   [junit4]   2>           "type":"NRT"}}}}}
   [junit4]   2> 930939 DEBUG (OverseerStateUpdate-98810114625241097-127.0.0.1:36340_solr-n_0000000000) [n:127.0.0.1:36340_solr    ] o.a.s.c.Overseer processMessage: queueSize: 2, message = {
   [junit4]   2>   "core":"AutoscalingHistoryHandlerTest_collection_shard1_replica_n2",
   [junit4]   2>   "core_node_name":"core_node5",
   [junit4]   2>   "roles":null,
   [junit4]   2>   "base_url":"http://127.0.0.1:48455/solr",
   [junit4]   2>   "node_name":"127.0.0.1:48455_solr",
   [junit4]   2>   "numShards":"1",
   [junit4]   2>   "state":"down",
   [junit4]   2>   "shard":"shard1",
   [junit4]   2>   "collection":"AutoscalingHistoryHandlerTest_collection",
   [junit4]   2>   "type":"NRT",
   [junit4]   2>   "operation":"state"} current state version: 0
   [junit4]   2> 930939 DEBUG (OverseerStateUpdate-98810114625241097-127.0.0.1:36340_solr-n_0000000000) [n:127.0.0.1:36340_solr    ] o.a.s.c.o.ReplicaMutator Update state numShards=1 message={
   [junit4]   2>   "core":"AutoscalingHistoryHandlerTest_collection_shard1_replica_n2",
   [junit4]   2>   "core_node_name":"core_node5",
   [junit4]   2>   "roles":null,
   [junit4]   2>   "base_url":"http://127.0.0.1:48455/solr",
   [junit4]   2>   "node_name":"127.0.0.1:48455_solr",
   [junit4]   2>   "numShards":"1",
   [junit4]   2>   "state":"down",
   [junit4]   2>   "shard":"shard1",
   [junit4]   2>   "collection":"AutoscalingHistoryHandlerTest_collection",
   [junit4]   2>   "type":"NRT",
   [junit4]   2>   "operation":"state"}
   [junit4]   2> 930939 DEBUG (OverseerStateUpdate-98810114625241097-127.0.0.1:36340_solr-n_0000000000) [n:127.0.0.1:36340_solr    ] o.a.s.c.o.ReplicaMutator Will update state for replica: core_node5:{"core":"AutoscalingHistoryHandlerTest_collection_shard1_replica_n2","base_url":"http://127.0.0.1:48455/solr","node_name":"127.0.0.1:48455_solr","state":"down","type":"NRT"}
   [junit4]   2> 930939 DEBUG (OverseerStateUpdate-98810114625241097-127.0.0.1:36340_solr-n_0000000000) [n:127.0.0.1:36340_solr    ] o.a.s.c.o.ReplicaMutator Collection is now: DocCollection(AutoscalingHistoryHandlerTest_collection//collections/AutoscalingHistoryHandlerTest_collection/state.json/1)={
   [junit4]   2>   "pullReplicas":"0",
   [junit4]   2>   "replicationFactor":"3",
   [junit4]   2>   "router":{"name":"compositeId"},
   [junit4]   2>   "maxShardsPerNode":"1",
   [junit4]   2>   "autoAddReplicas":"false",
   [junit4]   2>   "nrtReplicas":"3",
   [junit4]   2>   "tlogReplicas":"0",
   [junit4]   2>   "shards":{"shard1":{
   [junit4]   2>       "range":"80000000-7fffffff",
   [junit4]   2>       "state":"active",
   [junit4]   2>       "replicas":{
   [junit4]   2>         "core_node3":{
   [junit4]   2>           "core":"AutoscalingHistoryHandlerTest_collection_shard1_replica_n1",
   [junit4]   2>           "base_url":"http://127.0.0.1:59883/solr",
   [junit4]   2>           "node_name":"127.0.0.1:59883_solr",
   [junit4]   2>           "state":"down",
   [junit4]   2>           "type":"NRT"},
   [junit4]   2>         "core_node5":{
   [junit4]   2>           "core":"AutoscalingHistoryHandlerTest_collection_shard1_replica_n2",
   [junit4]   2>           "base_url":"http://127.0.0.1:48455/solr",
   [junit4]   2>           "node_name":"127.0.0.1:48455_solr",
   [junit4]   2>           "state":"down",
   [junit4]   2>           "type":"NRT"},
   [junit4]   2>         "core_node6":{
   [junit4]   2>           "core":"AutoscalingHistoryHandlerTest_collection_shard1_replica_n4",
   [junit4]   2>           "base_url":"http://127.0.0.1:36340/solr",
   [junit4]   2>           "state":"down",
   [junit4]   2>           "node_name":null,
   [junit4]   2>           "type":"NRT"}}}}}
   [junit4]   2> 930941 DEBUG (OverseerStateUpdate-98810114625241097-127.0.0.1:36340_solr-n_0000000000) [n:127.0.0.1:36340_solr    ] o.a.s.c.Overseer processMessage: queueSize: 1, message = {
   [junit4]   2>   "core":"AutoscalingHistoryHandlerTest_collection_shard1_replica_n4",
   [junit4]   2>   "core_node_name":"core_node6",
   [junit4]   2>   "roles":null,
   [junit4]   2>   "base_url":"http://127.0.0.1:36340/solr",
   [junit4]   2>   "node_name":"127.0.0.1:36340_solr",
   [junit4]   2>   "numShards":"1",
   [junit4]   2>   "state":"down",
   [junit4]   2>   "shard":"shard1",
   [junit4]   2>   "collection":"AutoscalingHistoryHandlerTest_collection",
   [junit4]   2>   "type":"NRT",
   [junit4]   2>   "operation":"state"} current state version: 0
   [junit4]   2> 930942 DEBUG (OverseerStateUpdate-98810114625241097-127.0.0.1:36340_solr-n_0000000000) [n:127.0.0.1:36340_solr    ] o.a.s.c.o.ReplicaMutator Update state numShards=1 message={
   [junit4]   2>   "core":"AutoscalingHistoryHandlerTest_collection_shard1_replica_n4",
   [junit4]   2>   "core_node_name":"core_node6",
   [junit4]   2>   "roles":null,
   [junit4]   2>   "base_url":"http://127.0.0.1:36340/solr",
   [junit4]   2>   "node_name":"127.0.0.1:36340_solr",
   [junit4]   2>   "numShards":"1",
   [junit4]   2>   "state":"down",
   [junit4]   2>   "shard":"shard1",
   [junit4]   2>   "collection":"AutoscalingHistoryHandlerTest_collection",
   [junit4]   2>   "type":"NRT",
   [junit4]   2>   "operation":"state"}
   [junit4]   2> 930942 DEBUG (OverseerStateUpdate-98810114625241097-127.0.0.1:36340_solr-n_0000000000) [n:127.0.0.1:36340_solr    ] o.a.s.c.o.ReplicaMutator Will update state for replica: core_node6:{"core":"AutoscalingHistoryHandlerTest_collection_shard1_replica_n4","base_url":"http://127.0.0.1:36340/solr","node_name":"127.0.0.1:36340_solr","state":"down","type":"NRT"}
   [junit4]   2> 930942 DEBUG (OverseerStateUpdate-98810114625241097-127.0.0.1:36340_solr-n_0000000000) [n:127.0.0.1:36340_solr    ] o.a.s.c.o.ReplicaMutator Collection is now: DocCollection(AutoscalingHistoryHandlerTest_collection//collections/AutoscalingHistoryHandlerTest_collection/state.json/1)={
   [junit4]   2>   "pullReplicas":"0",
   [junit4]   2>   "replicationFactor":"3",
   [junit4]   2>   "router":{"name":"compositeId"},
   [junit4]   2>   "maxShardsPerNode":"1",
   [junit4]   2>   "autoAddReplicas":"false",
   [junit4]   2>   "nrtReplicas":"3",
   [junit4]   2>   "tlogReplicas":"0",
   [junit4]   2>   "shards":{"shard1":{
   [junit4]   2>       "range":"80000000-7fffffff",
   [junit4]   2>       "state":"active",
   [junit4]   2>       "replicas":{
   [junit4]   2>         "core_node3":{
   [junit4]   2>           "core":"AutoscalingHistoryHandlerTest_collection_shard1_replica_n1",
   [junit4]   2>           "base_url":"http://127.0.0.1:59883/solr",
   [junit4]   2>           "node_name":"127.0.0.1:59883_solr",
   [junit4]   2>           "state":"down",
   [junit4]   2>           "type":"NRT"},
   [junit4]   2>         "core_node5":{
   [junit4]   2>           "core":"AutoscalingHistoryHandlerTest_collection_shard1_replica_n2",
   [junit4]   2>           "base_url":"http://127.0.0.1:48455/solr",
   [junit4]   2>           "node_name":"127.0.0.1:48455_solr",
   [junit4]   2>           "state":"down",
   [junit4]   2>           "type":"NRT"},
   [junit4]   2>         "core_node6":{
   [junit4]   2>           "core":"AutoscalingHistoryHandlerTest_collection_shard1_replica_n4",
   [junit4]   2>           "base_url":"http://127.0.0.1:36340/solr",
   [junit4]   2>           "node_name":"127.0.0.1:36340_solr",
   [junit4]   2>           "state":"down",
   [junit4]   2>           "type":"NRT"}}}}}
   [junit4]   2> 931044 DEBUG (OverseerStateUpdate-98810114625241097-127.0.0.1:36340_solr-n_0000000000) [n:127.0.0.1:36340_solr    ] o.a.s.c.o.ZkStateWriter going to update_collection /collections/AutoscalingHistoryHandlerTest_collection/state.json version: 1
   [junit4]   2> 931045 INFO  (zkCallback-1004-thread-1-processing-n:127.0.0.1:59883_solr) [n:127.0.0.1:59883_solr    ] o.a.s.c.c.ZkStateReader A cluster state change: [WatchedEvent state:SyncConnected type:NodeDataChanged path:/collections/AutoscalingHistoryHandlerTest_collection/state.json] for collection [AutoscalingHistoryHandlerTest_collection] has occurred - updating... (live nodes size: [3])
   [junit4]   2> 931045 INFO  (zkCallback-1000-thread-1-processing-n:127.0.0.1:48455_solr) [n:127.0.0.1:48455_solr    ] o.a.s.c.c.ZkStateReader A cluster state change: [WatchedEvent state:SyncConnected type:NodeDataChanged path:/collections/AutoscalingHistoryHandlerTest_collection/state.json] for collection [AutoscalingHistoryHandlerTest_collection] has occurred - updating... (live nodes size: [3])
   [junit4]   2> 931045 INFO  (zkCallback-1004-thread-2-processing-n:127.0.0.1:59883_solr) [n:127.0.0.1:59883_solr    ] o.a.s.c.c.ZkStateReader A cluster state change: [WatchedEvent state:SyncConnected type:NodeDataChanged path:/collections/AutoscalingHistoryHandlerTest_collection/state.json] for collection [AutoscalingHistoryHandlerTest_collection] has occurred - updating... (live nodes size: [3])
   [junit4]   2> 931045 INFO  (zkCallback-1000-thread-2-processing-n:127.0.0.1:48455_solr) [n:127.0.0.1:48455_solr    ] o.a.s.c.c.ZkStateReader A cluster state change: [WatchedEvent state:SyncConnected type:NodeDataChanged path:/collections/AutoscalingHistoryHandlerTest_collection/state.json] for collection [AutoscalingHistoryHandlerTest_collection] has occurred - updating... (live nodes size: [3])
   [junit4]   2> 931046 INFO  (zkCallback-1005-thread-2-processing-n:127.0.0.1:36340_solr) [n:127.0.0.1:36340_solr    ] o.a.s.c.c.ZkStateReader A cluster state change: [WatchedEvent state:SyncConnected type:NodeDataChanged path:/collections/AutoscalingHistoryHandlerTest_collection/state.json] for collection [AutoscalingHistoryHandlerTest_collection] has occurred - updating... (live nodes size: [3])
   [junit4]   2> 931045 INFO  (zkCallback-1005-thread-1-processing-n:127.0.0.1:36340_solr) [n:127.0.0.1:36340_solr    ] o.a.s.c.c.ZkStateReader A cluster state change: [WatchedEvent state:SyncConnected type:NodeDataChanged path:/collections/AutoscalingHistoryHandlerTest_collection/state.json] for collection [AutoscalingHistoryHandlerTest_collection] has occurred - updating... (live nodes size: [3])
   [junit4]   2> 931296 DEBUG (ScheduledTrigger-2412-thread-1) [n:127.0.0.1:36340_solr    ] o.a.s.c.a.NodeLostTrigger Running NodeLostTrigger: .auto_add_replicas with currently live nodes: [127.0.0.1:59883_solr, 127.0.0.1:48455_solr, 127.0.0.1:36340_solr]
   [junit4]   2> 931963 INFO  (qtp311902191-6293) [n:127.0.0.1:59883_solr c:AutoscalingHistoryHandlerTest_collection s:shard1 r:core_node3 x:AutoscalingHistoryHandlerTest_collection_shard1_replica_n1] o.a.s.c.RequestParams conf resource params.json loaded . version : 0 
   [junit4]   2> 931963 INFO  (qtp1269889132-6279) [n:127.0.0.1:36340_solr c:AutoscalingHistoryHandlerTest_collection s:shard1 r:core_node6 x:AutoscalingHistoryHandlerTest_collection_shard1_replica_n4] o.a.s.c.RequestParams conf resource params.json loaded . version : 0 
   [junit4]   2> 931963 INFO  (qtp240054577-6278) [n:127.0.0.1:48455_solr c:AutoscalingHistoryHandlerTest_collection s:shard1 r:core_node5 x:AutoscalingHistoryHandlerTest_collection_shard1_replica_n2] o.a.s.c.RequestParams conf resource params.json loaded . version : 0 
   [junit4]   2> 931966 INFO  (qtp240054577-6278) [n:127.0.0.1:48455_solr c:AutoscalingHistoryHandlerTest_collection s:shard1 r:core_node5 x:AutoscalingHistoryHandlerTest_collection_shard1_replica_n2] o.a.s.c.RequestParams request params refreshed to version 0
   [junit4]   2> 931966 INFO  (qtp311902191-6293) [n:127.0.0.1:59883_solr c:AutoscalingHistoryHandlerTest_collection s:shard1 r:core_node3 x:AutoscalingHistoryHandlerTest_collection_shard1_replica_n1] o.a.s.c.RequestParams request params refreshed to version 0
   [junit4]   2> 931966 INFO  (qtp1269889132-6279) [n:127.0.0.1:36340_solr c:AutoscalingHistoryHandlerTest_collection s:shard1 r:core_node6 x:AutoscalingHistoryHandlerTest_collection_shard1_replica_n4] o.a.s.c.RequestParams request params refreshed to version 0
   [junit4]   2> 931970 WARN  (qtp311902191-6293) [n:127.0.0.1:59883_solr c:AutoscalingHistoryHandlerTest_collection s:shard1 r:core_node3 x:AutoscalingHistoryHandlerTest_collection_shard1_replica_n1] o.a.s.c.SolrConfig Couldn't add files from /export/home/jenkins/workspace/Lucene-Solr-master-Solaris/solr/build/solr-core/test/J0/temp/solr.handler.admin.AutoscalingHistoryHandlerTest_505893396797EE99-001/tempDir-001/node1/AutoscalingHistoryHandlerTest_collection_shard1_replica_n1/../../../../contrib/extraction/lib filtered by .*\.jar to classpath: /export/home/jenkins/workspace/Lucene-Solr-master-Solaris/solr/build/solr-core/test/J0/temp/solr.handler.admin.AutoscalingHistoryHandlerTest_505893396797EE99-001/tempDir-001/node1/AutoscalingHistoryHandlerTest_collection_shard1_replica_n1/../../../../contrib/extraction/lib
   [junit4]   2> 931970 WARN  (qtp1269889132-6279) [n:127.0.0.1:36340_solr c:AutoscalingHistoryHandlerTest_collection s:shard1 r:core_node6 x:AutoscalingHistoryHandlerTest_collection_shard1_replica_n4] o.a.s.c.SolrConfig Couldn't add files from /export/home/jenkins/workspace/Lucene-Solr-master-Solaris/solr/build/solr-core/test/J0/temp/solr.handler.admin.AutoscalingHistoryHandlerTest_505893396797EE99-001/tempDir-001/node3/AutoscalingHistoryHandlerTest_collection_shard1_replica_n4/../../../../contrib/extraction/lib filtered by .*\.jar to classpath: /export/home/jenkins/workspace/Lucene-Solr-master-Solaris/solr/build/solr-core/test/J0/temp/solr.handler.admin.AutoscalingHistoryHandlerTest_505893396797EE99-001/tempDir-001/node3/AutoscalingHistoryHandlerTest_collection_shard1_replica_n4/../../../../contrib/extraction/lib
   [junit4]   2> 931970 WARN  (qtp240054577-6278) [n:127.0.0.1:48455_solr c:AutoscalingHistoryHandlerTest_collection s:shard1 r:core_node5 x:AutoscalingHistoryHandlerTest_collection_shard1_replica_n2] o.a.s.c.SolrConfig Couldn't add files from /export/home/jenkins/workspace/Lucene-Solr-master-Solaris/solr/build/solr-core/test/J0/temp/solr.handler.admin.AutoscalingHistoryHandlerTest_505893396797EE99-001/tempDir-001/node2/AutoscalingHistoryHandlerTest_collection_shard1_replica_n2/../../../../contrib/extraction/lib filtered by .*\.jar to classpath: /export/home/jenkins/workspace/Lucene-Solr-master-Solaris/solr/build/solr-core/test/J0/temp/solr.handler.admin.AutoscalingHistoryHandlerTest_505893396797EE99-001/tempDir-001/node2/AutoscalingHistoryHandlerTest_collection_shard1_replica_n2/../../../../contrib/extraction/lib
   [junit4]   2> 931973 WARN  (qtp1269889132-6279) [n:127.0.0.1:36340_solr c:AutoscalingHistoryHandlerTest_collection s:shard1 r:core_node6 x:AutoscalingHistoryHandlerTest_collection_shard1_replica_n4] o.a.s.c.SolrConfig Couldn't add files from /export/home/jenkins/workspace/Lucene-Solr-master-Solaris/solr/build/solr-core/test/J0/temp/solr.handler.admin.AutoscalingHistoryHandlerTest_505893396797EE99-001/tempDir-001/node3/AutoscalingHistoryHandlerTest_collection_shard1_replica_n4/../../../../dist filtered by solr-cell-\d.*\.jar to classpath: /export/home/jenkins/workspace/Lucene-Solr-master-Solaris/solr/build/solr-core/test/J0/temp/solr.handler.admin.AutoscalingHistoryHandlerTest_505893396797EE99-001/tempDir-001/node3/AutoscalingHistoryHandlerTest_collection_shard1_replica_n4/../../../../dist
   [junit4]   2> 931970 WARN  (qtp311902191-6293) [n:127.0.0.1:59883_solr c:AutoscalingHistoryHandlerTest_collection s:shard1 r:core_node3 x:AutoscalingHistoryHandlerTest_collection_shard1_replica_n1] o.a.s.c.SolrConfig Couldn't add files from /export/home/jenkins/workspace/Lucene-Solr-master-Solaris/solr/build/solr-core/test/J0/temp/solr.handler.admin.AutoscalingHistoryHandlerTest_505893396797EE99-001/tempDir-001/node1/AutoscalingHistoryHandlerTest_collection_shard1_replica_n1/../../../../dist filtered by solr-cell-\d.*\.jar to classpath: /export/home/jenkins/workspace/Lucene-Solr-master-Solaris/solr/build/solr-core/test/J0/temp/solr.handler.admin.AutoscalingHistoryHandlerTest_505893396797EE99-001/tempDir-001/node1/AutoscalingHistoryHandlerTest_collection_shard1_replica_n1/../../../../dist
   [junit4]   2> 931973 WARN  (qtp1269889132-6279) [n:127.0.0.1:36340_solr c:AutoscalingHistoryHandlerTest_collection s:shard1 r:core_node6 x:AutoscalingHistoryHandlerTest_collection_shard1_replica_n4] o.a.s.c.SolrConfig Couldn't add files from /export/home/jenkins/workspace/Lucene-Solr-master-Solaris/solr/build/solr-core/test/J0/temp/solr.handler.admin.AutoscalingHistoryHandlerTest_505893396797EE99-001/tempDir-001/node3/AutoscalingHistoryHandlerTest_collection_shard1_replica_n4/../../../../contrib/clustering/lib filtered by .*\.jar to classpath: /export/home/jenkins/workspace/Lucene-Solr-master-Solaris/solr/build/solr-core/test/J0/temp/solr.handler.admin.AutoscalingHistoryHandlerTest_505893396797EE99-001/tempDir-001/node3/AutoscalingHistoryHandlerTest_collection_shard1_replica_n4/../../../../contrib/clustering/lib
   [junit4]   2> 931973 WARN  (qtp240054577-6278) [n:127.0.0.1:48455_solr c:AutoscalingHistoryHandlerTest_collection s:shard1 r:core_node5 x:AutoscalingHistoryHandlerTest_collection_shard1_replica_n2] o.a.s.c.SolrConfig Couldn't add files from /export/home/jenkins/workspace/Lucene-Solr-master-Solaris/solr/build/solr-core/test/J0/temp/solr.handler.admin.AutoscalingHistoryHandlerTest_505893396797EE99-001/tempDir-001/node2/AutoscalingHistoryHandlerTest_collection_shard1_replica_n2/../../../../dist filtered by solr-cell-\d.*\.jar to classpath: /export/home/jenkins/workspace/Lucene-Solr-master-Solaris/solr/build/solr-core/test/J0/temp/solr.handler.admin.AutoscalingHistoryHandlerTest_505893396797EE99-001/tempDir-001/node2/AutoscalingHistoryHandlerTest_collection_shard1_replica_n2/../../../../dist
   [junit4]   2> 931974 WARN  (qtp311902191-6293) [n:127.0.0.1:59883_solr c:AutoscalingHistoryHandlerTest_collection s:shard1 r:core_node3 x:AutoscalingHistoryHandlerTest_collection_shard1_replica_n1] o.a.s.c.SolrConfig Couldn't add files from /export/home/jenkins/workspace/Lucene-Solr-master-Solaris/solr/build/solr-core/test/J0/temp/solr.handler.admin.AutoscalingHistoryHandlerTest_505893396797EE99-001/tempDir-001/node1/AutoscalingHistoryHandlerTest_collection_shard1_replica_n1/../../../../contrib/clustering/lib filtered by .*\.jar to classpath: /export/home/jenkins/workspace/Lucene-Solr-master-Solaris/solr/build/solr-core/test/J0/temp/solr.handler.admin.AutoscalingHistoryHandlerTest_505893396797EE99-001/tempDir-001/node1/AutoscalingHistoryHandlerTest_collection_shard1_replica_n1/../../../../contrib/clustering/lib
   [junit4]   2> 931974 WARN  (qtp1269889132-6279) [n:127.0.0.1:36340_solr c:AutoscalingHistoryHandlerTest_collection s:shard1 r:core_node6 x:AutoscalingHistoryHandlerTest_collection_shard1_replica_n4] o.a.s.c.SolrConfig Couldn't add files from /export/home/jenkins/workspace/Lucene-Solr-master-Solaris/solr/build/solr-core/test/J0/temp/solr.handler.admin.AutoscalingHistoryHandlerTest_505893396797EE99-001/tempDir-001/node3/AutoscalingHistoryHandlerTest_collection_shard1_replica_n4/../../../../dist filtered by solr-clustering-\d.*\.jar to classpath: /export/home/jenkins/workspace/Lucene-Solr-master-Solaris/solr/build/solr-core/test/J0/temp/solr.handler.admin.AutoscalingHistoryHandlerTest_505893396797EE99-001/tempDir-001/node3/AutoscalingHistoryHandlerTest_collection_shard1_replica_n4/../../../../dist
   [junit4]   2> 931974 WARN  (qtp311902191-6293) [n:127.0.0.1:59883_solr c:AutoscalingHistoryHandlerTest_collection s:shard1 r:core_node3 x:AutoscalingHistoryHandlerTest_collection_shard1_replica_n1] o.a.s.c.SolrConfig Couldn't add files from /export/home/jenkins/workspace/Lucene-Solr-master-Solaris/solr/build/solr-core/test/J0/temp/solr.handler.admin.AutoscalingHistoryHandlerTest_505893396797EE99-001/tempDir-001/node1/AutoscalingHistoryHandlerTest_collection_shard1_replica_n1/../../../../dist filtered by solr-clustering-\d.*\.jar to classpath: /export/home/jenkins/workspace/Lucene-Solr-master-Solaris/solr/build/solr-core/test/J0/temp/solr.handler.admin.AutoscalingHistoryHandlerTest_505893396797EE99-001/tempDir-001/node1/AutoscalingHistoryHandlerTest_collection_shard1_replica_n1/../../../../dist
   [junit4]   2> 931974 WARN  (qtp1269889132-6279) [n:127.0.0.1:36340_solr c:AutoscalingHistoryHandlerTest_collection s:shard1 r:core_node6 x:AutoscalingHistoryHandlerTest_collection_shard1_replica_n4] o.a.s.c.SolrConfig Couldn't add files from /export/home/jenkins/workspace/Lucene-Solr-master-Solaris/solr/build/solr-core/test/J0/temp/solr.handler.admin.AutoscalingHistoryHandlerTest_505893396797EE99-001/tempDir-001/node3/AutoscalingHistoryHandlerTest_collection_shard1_replica_n4/../../../../contrib/langid/lib filtered by .*\.jar to classpath: /export/home/jenkins/workspace/Lucene-Solr-master-Solaris/solr/build/solr-core/test/J0/temp/solr.handler.admin.AutoscalingHistoryHandlerTest_505893396797EE99-001/tempDir-001/node3/AutoscalingHistoryHandlerTest_collection_shard1_replica_n4/../../../../contrib/langid/lib
   [junit4]   2> 931974 WARN  (qtp240054577-6278) [n:127.0.0.1:48455_solr c:AutoscalingHistoryHandlerTest_collection s:shard1 r:core_node5 x:AutoscalingHistoryHandlerTest_collection_shard1_replica_n2] o.a.s.c.SolrConfig Couldn't add files from /export/home/jenkins/workspace/Lucene-Solr-master-Solaris/solr/build/solr-core/test/J0/temp/solr.handler.admin.AutoscalingHistoryHandlerTest_505893396797EE99-001/tempDir-001/node2/AutoscalingHistoryHandlerTest_collection_shard1_replica_n2/../../../../contrib/clustering/lib filtered by .*\.jar to classpath: /export/home/jenkins/workspace/Lucene-Solr-master-Solaris/solr/build/solr-core/test/J0/temp/solr.handler.admin.AutoscalingHistoryHandlerTest_505893396797EE99-001/tempDir-001/node2/AutoscalingHistoryHandlerTest_collection_shard1_replica_n2/../../../../contrib/clustering/lib
   [junit4]   2> 931975 WARN  (qtp1269889132-6279) [n:127.0.0.1:36340_solr c:AutoscalingHistoryHandlerTest_collection s:shard1 r:core_node6 x:AutoscalingHistoryHandlerTest_collection_shard1_replica_n4] o.a.s.c.SolrConfig Couldn't add files from /export/home/jenkins/workspace/Lucene-Solr-master-Solaris/solr/build/solr-core/test/J0/temp/solr.handler.admin.AutoscalingHistoryHandlerTest_505893396797EE99-001/tempDir-001/node3/AutoscalingHistoryHandlerTest_collection_shard1_replica_n4/../../../../dist filtered by solr-langid-\d.*\.jar to classpath: /export/home/jenkins/workspace/Lucene-Solr-master-Solaris/solr/build/solr-core/test/J0/temp/solr.handler.admin.AutoscalingHistoryHandlerTest_505893396797EE99-001/tempDir-001/node3/AutoscalingHistoryHandlerTest_collection_shard1_replica_n4/../../../../dist
   [junit4]   2> 931975 WARN  (qtp311902191-6293) [n:127.0.0.1:59883_solr c:AutoscalingHistoryHandlerTest_collection s:shard1 r:core_node3 x:AutoscalingHistoryHandlerTest_collection_shard1_replica_n1] o.a.s.c.SolrConfig Couldn't add files from /export/home/jenkins/workspace/Lucene-Solr-master-Solaris/solr/build/solr-core/test/J0/temp/solr.handler.admin.AutoscalingHistoryHandlerTest_505893396797EE99-001/tempDir-001/node1/AutoscalingHistoryHandlerTest_collection_shard1_replica_n1/../../../../contrib/langid/lib filtered by .*\.jar to classpath: /export/home/jenkins/workspace/Lucene-Solr-master-Solaris/solr/build/solr-core/test/J0/temp/solr.handler.admin.AutoscalingHistoryHandlerTest_505893396797EE99-001/tempDir-001/node1/AutoscalingHistoryHandlerTest_collection_shard1_replica_n1/../../../../contrib/langid/lib
   [junit4]   2> 931975 WARN  (qtp240054577-6278) [n:127.0.0.1:48455_solr c:AutoscalingHistoryHandlerTest_collection s:shard1 r:core_node5 x:AutoscalingHistoryHandlerTest_collection_shard1_replica_n2] o.a.s.c.SolrConfig Couldn't add files from /export/home/jenkins/workspace/Lucene-Solr-master-Solaris/solr/build/solr-core/test/J0/temp/solr.handler.admin.AutoscalingHistoryHandlerTest_505893396797EE99-001/tempDir-001/node2/AutoscalingHistoryHandlerTest_collection_shard1_replica_n2/../../../../dist filtered by solr-clustering-\d.*\.jar to classpath: /export/home/jenkins/workspace/Lucene-Solr-master-Solaris/solr/build/solr-core/test/J0/temp/solr.handler.admin.AutoscalingHistoryHandlerTest_505893396797EE99-001/tempDir-001/node2/AutoscalingHistoryHandlerTest_collection_shard1_replica_n2/../../../../dist
   [junit4]   2> 931975 WARN  (qtp1269889132-6279) [n:127.0.0.1:36340_solr c:AutoscalingHistoryHandlerTest_collection s:shard1 r:core_node6 x:AutoscalingHistoryHandlerTest_collection_shard1_replica_n4] o.a.s.c.SolrConfig Couldn't add files from /export/home/jenkins/workspace/Lucene-Solr-master-Solaris/solr/build/solr-core/test/J0/temp/solr.handler.admin.AutoscalingHistoryHandlerTest_505893396797EE99-001/tempDir-001/node3/AutoscalingHistoryHandlerTest_collection_shard1_replica_n4/../../../../contrib/velocity/lib filtered by .*\.jar to classpath: /export/home/jenkins/workspace/Lucene-Solr-master-Solaris/solr/build/solr-core/test/J0/temp/solr.handler.admin.AutoscalingHistoryHandlerTest_505893396797EE99-001/tempDir-001/node3/AutoscalingHistoryHandlerTest_collection_shard1_replica_n4/../../../../contrib/velocity/lib
   [junit4]   2> 931975 WARN  (qtp311902191-6293) [n:127.0.0.1:59883_solr c:AutoscalingHistoryHandlerTest_collection s:shard1 r:core_node3 x:AutoscalingHistoryHandlerTest_collection_shard1_replica_n1] o.a.s.c.SolrConfig Couldn't add files from /export/home/jenkins/workspace/Lucene-Solr-master-Solaris/solr/build/solr-core/test/J0/temp/solr.handler.admin.AutoscalingHistoryHandlerTest_505893396797EE99-001/tempDir-001/node1/AutoscalingHistoryHandlerTest_collection_shard1_replica_n1/../../../../dist filtered by solr-langid-\d.*\.jar to classpath: /export/home/jenkins/workspace/Lucene-Solr-master-Solaris/solr/build/solr-core/test/J0/temp/solr.handler.admin.AutoscalingHistoryHandlerTest_505893396797EE99-001/tempDir-001/node1/AutoscalingHistoryHandlerTest_collection_shard1_replica_n1/../../../../dist
   [junit4]   2> 931976 WARN  (qtp1269889132-6279) [n:127.0.0.1:36340_solr c:AutoscalingHistoryHandlerTest_collection s:shard1 r:core_node6 x:AutoscalingHistoryHandlerTest_collection_shard1_replica_n4] o.a.s.c.SolrConfig Couldn't add files from /export/home/jenkins/workspace/Lucene-Solr-master-Solaris/solr/build/solr-core/test/J0/temp/solr.handler.admin.AutoscalingHistoryHandlerTest_505893396797EE99-001/tempDir-001/node3/AutoscalingHistoryHandlerTest_collection_shard1_replica_n4/../../../../dist filtered by solr-velocity-\d.*\.jar to classpath: /export/home/jenkins/workspace/Lucene-Solr-master-Solaris/solr/build/solr-core/test/J0/temp/solr.handler.admin.AutoscalingHistoryHandlerTest_505893396797EE99-001/tempDir-001/node3/AutoscalingHistoryHandlerTest_collection_shard1_replica_n4/../../../../dist
   [junit4]   2> 931976 WARN  (qtp311902191-6293) [n:127.0.0.1:59883_solr c:AutoscalingHistoryHandlerTest_collection s:shard1 r:core_node3 x:AutoscalingHistoryHandlerTest_collection_shard1_replica_n1] o.a.s.c.SolrConfig Couldn't add files from /export/home/jenkins/workspace/Lucene-Solr-master-Solaris/solr/build/solr-core/test/J0/temp/solr.handler.admin.AutoscalingHistoryHandlerTest_505893396797EE99-001/tempDir-001/node1/AutoscalingHistoryHandlerTest_collection_shard1_replica_n1/../../../../contrib/velocity/lib filtered by .*\.jar to classpath: /export/home/jenkins/workspace/Lucene-Solr-master-Solaris/solr/build/solr-core/test/J0/temp/solr.handler.admin.AutoscalingHistoryHandlerTest_505893396797EE99-001/tempDir-001/node1/AutoscalingHistoryHandlerTest_collection_shard1_replica_n1/../../../../contrib/velocity/lib
   [junit4]   2> 931976 WARN  (qtp240054577-6278) [n:127.0.0.1:48455_solr c:AutoscalingHistoryHandlerTest_collection s:shard1 r:core_node5 x:AutoscalingHistoryHandlerTest_collection_shard1_replica_n2] o.a.s.c.SolrConfig Couldn't add files from /export/home/jenkins/workspace/Lucene-Solr-master-Solaris/solr/build/solr-core/test/J0/temp/solr.handler.admin.AutoscalingHistoryHandlerTest_505893396797EE99-001/tempDir-001/node2/AutoscalingHistoryHandlerTest_collection_shard1_replica_n2/../../../../contrib/langid/lib filtered by .*\.jar to classpath: /export/home/jenkins/workspace/Lucene-Solr-master-Solaris/solr/build/solr-core/test/J0/temp/solr.handler.admin.AutoscalingHistoryHandlerTest_505893396797EE99-001/tempDir-001/node2/AutoscalingHistoryHandlerTest_collection_shard1_replica_n2/../../../../contrib/langid/lib
   [junit4]   2> 931976 WARN  (qtp311902191-6293) [n:127.0.0.1:59883_solr c:AutoscalingHistoryHandlerTest_collection s:shard1 r:core_node3 x:AutoscalingHistoryHandlerTest_collection_shard1_replica_n1] o.a.s.c.SolrConfig Couldn't add files from /export/home/jenkins/workspace/Lucene-Solr-master-Solaris/solr/build/solr-core/test/J0/temp/solr.handler.admin.AutoscalingHistoryHandlerTest_505893396797EE99-001/tempDir-001/node1/AutoscalingHistoryHandlerTest_collection_shard1_replica_n1/../../../../dist filtered by solr-velocity-\d.*\.jar to classpath: /export/home/jenkins/workspace/Lucene-Solr-master-Solaris/solr/build/solr-core/test/J0/temp/solr.handler.admin.AutoscalingHistoryHandlerTest_505893396797EE99-001/tempDir-001/node1/AutoscalingHistoryHandlerTest_collection_shard1_replica_n1/../../../../dist
   [junit4]   2> 931976 WARN  (qtp240054577-6278) [n:127.0.0.1:48455_solr c:AutoscalingHistoryHandlerTest_collection s:shard1 r:core_node5 x:AutoscalingHistoryHandlerTest_collection_shard1_replica_n2] o.a.s.c.SolrConfig Couldn't add files from /export/home/jenkins/workspace/Lucene-Solr-master-Solaris/solr/build/solr-core/test/J0/temp/solr.handler.admin.AutoscalingHistoryHandlerTest_505893396797EE99-001/tempDir-001/node2/AutoscalingHistoryHandlerTest_collection_shard1_replica_n2/../../../../dist filtered by solr-langid-\d.*\.jar to classpath: /export/home/jenkins/workspace/Lucene-Solr-master-Solaris/solr/build/solr-core/test/J0/temp/solr.handler.admin.AutoscalingHistoryHandlerTest_505893396797EE99-001/tempDir-001/node2/AutoscalingHistoryHandlerTest_col

[...truncated too long message...]

_4
   [junit4]   2> 
   [junit4]   2> Maximum concurrent children watches above limit:
   [junit4]   2> 
   [junit4]   2> 	3	/solr/live_nodes
   [junit4]   2> 	3	/solr/collections
   [junit4]   2> 	3	/solr/security/zkdtsm/ZKDTSMRoot/ZKDTSMMasterKeyRoot
   [junit4]   2> 	3	/solr/security/zkdtsm/ZKDTSMRoot/ZKDTSMTokensRoot
   [junit4]   2> 
   [junit4]   2> 1593728 INFO  (SUITE-TestImpersonationWithHadoopAuth-seed#[505893396797EE99]-worker) [    ] o.a.s.SolrTestCaseJ4 ------------------------------------------------------- Done waiting for tracked resources to be released
   [junit4]   2> Oct 11, 2017 12:02:40 PM com.carrotsearch.randomizedtesting.ThreadLeakControl checkThreadLeaks
   [junit4]   2> WARNING: Will linger awaiting termination of 1 leaked thread(s).
   [junit4]   2> Oct 11, 2017 12:03:00 PM com.carrotsearch.randomizedtesting.ThreadLeakControl checkThreadLeaks
   [junit4]   2> SEVERE: 1 thread leaked from SUITE scope at org.apache.solr.security.hadoop.TestImpersonationWithHadoopAuth: 
   [junit4]   2>    1) Thread[id=12621, name=jetty-launcher-1513-thread-2-EventThread, state=TIMED_WAITING, group=TGRP-TestImpersonationWithHadoopAuth]
   [junit4]   2>         at sun.misc.Unsafe.park(Native Method)
   [junit4]   2>         at java.util.concurrent.locks.LockSupport.parkNanos(LockSupport.java:215)
   [junit4]   2>         at java.util.concurrent.locks.AbstractQueuedSynchronizer.doAcquireSharedNanos(AbstractQueuedSynchronizer.java:1037)
   [junit4]   2>         at java.util.concurrent.locks.AbstractQueuedSynchronizer.tryAcquireSharedNanos(AbstractQueuedSynchronizer.java:1328)
   [junit4]   2>         at java.util.concurrent.CountDownLatch.await(CountDownLatch.java:277)
   [junit4]   2>         at org.apache.curator.CuratorZookeeperClient.internalBlockUntilConnectedOrTimedOut(CuratorZookeeperClient.java:323)
   [junit4]   2>         at org.apache.curator.RetryLoop.callWithRetry(RetryLoop.java:105)
   [junit4]   2>         at org.apache.curator.framework.imps.GetDataBuilderImpl.pathInForeground(GetDataBuilderImpl.java:288)
   [junit4]   2>         at org.apache.curator.framework.imps.GetDataBuilderImpl.forPath(GetDataBuilderImpl.java:279)
   [junit4]   2>         at org.apache.curator.framework.imps.GetDataBuilderImpl.forPath(GetDataBuilderImpl.java:41)
   [junit4]   2>         at org.apache.curator.framework.recipes.shared.SharedValue.readValue(SharedValue.java:244)
   [junit4]   2>         at org.apache.curator.framework.recipes.shared.SharedValue.access$100(SharedValue.java:44)
   [junit4]   2>         at org.apache.curator.framework.recipes.shared.SharedValue$1.process(SharedValue.java:61)
   [junit4]   2>         at org.apache.curator.framework.imps.NamespaceWatcher.process(NamespaceWatcher.java:67)
   [junit4]   2>         at org.apache.zookeeper.ClientCnxn$EventThread.processEvent(ClientCnxn.java:530)
   [junit4]   2>         at org.apache.zookeeper.ClientCnxn$EventThread.run(ClientCnxn.java:505)
   [junit4]   2> Oct 11, 2017 12:03:00 PM com.carrotsearch.randomizedtesting.ThreadLeakControl tryToInterruptAll
   [junit4]   2> INFO: Starting to interrupt leaked threads:
   [junit4]   2>    1) Thread[id=12621, name=jetty-launcher-1513-thread-2-EventThread, state=TIMED_WAITING, group=TGRP-TestImpersonationWithHadoopAuth]
   [junit4]   2> 1613951 ERROR (jetty-launcher-1513-thread-2-EventThread) [n:127.0.0.1:34908_solr    ] o.a.c.f.i.CuratorFrameworkImpl Watcher exception
   [junit4]   2> java.lang.InterruptedException
   [junit4]   2> 	at java.util.concurrent.locks.AbstractQueuedSynchronizer.doAcquireSharedNanos(AbstractQueuedSynchronizer.java:1039)
   [junit4]   2> 	at java.util.concurrent.locks.AbstractQueuedSynchronizer.tryAcquireSharedNanos(AbstractQueuedSynchronizer.java:1328)
   [junit4]   2> 	at java.util.concurrent.CountDownLatch.await(CountDownLatch.java:277)
   [junit4]   2> 	at org.apache.curator.CuratorZookeeperClient.internalBlockUntilConnectedOrTimedOut(CuratorZookeeperClient.java:323)
   [junit4]   2> 	at org.apache.curator.RetryLoop.callWithRetry(RetryLoop.java:105)
   [junit4]   2> 	at org.apache.curator.framework.imps.GetDataBuilderImpl.pathInForeground(GetDataBuilderImpl.java:288)
   [junit4]   2> 	at org.apache.curator.framework.imps.GetDataBuilderImpl.forPath(GetDataBuilderImpl.java:279)
   [junit4]   2> 	at org.apache.curator.framework.imps.GetDataBuilderImpl.forPath(GetDataBuilderImpl.java:41)
   [junit4]   2> 	at org.apache.curator.framework.recipes.shared.SharedValue.readValue(SharedValue.java:244)
   [junit4]   2> 	at org.apache.curator.framework.recipes.shared.SharedValue.access$100(SharedValue.java:44)
   [junit4]   2> 	at org.apache.curator.framework.recipes.shared.SharedValue$1.process(SharedValue.java:61)
   [junit4]   2> 	at org.apache.curator.framework.imps.NamespaceWatcher.process(NamespaceWatcher.java:67)
   [junit4]   2> 	at org.apache.zookeeper.ClientCnxn$EventThread.processEvent(ClientCnxn.java:530)
   [junit4]   2> 	at org.apache.zookeeper.ClientCnxn$EventThread.run(ClientCnxn.java:505)
   [junit4]   2> Oct 11, 2017 12:03:00 PM com.carrotsearch.randomizedtesting.ThreadLeakControl tryToInterruptAll
   [junit4]   2> INFO: All leaked threads terminated.
   [junit4]   2> NOTE: test params are: codec=Asserting(Lucene70): {}, docValues:{}, maxPointsInLeafNode=449, maxMBSortInHeap=5.816291962414255, sim=RandomSimilarity(queryNorm=true): {}, locale=de-AT, timezone=America/Coral_Harbour
   [junit4]   2> NOTE: SunOS 5.11 amd64/Oracle Corporation 1.8.0_141 (64-bit)/cpus=3,threads=1,free=382494088,total=536870912
   [junit4]   2> NOTE: All tests run in this JVM: [TestTolerantSearch, CloudMLTQParserTest, HighlighterConfigTest, TestMacroExpander, TestFieldTypeCollectionResource, MultiTermTest, ShardSplitTest, TestQuerySenderNoQuery, TestSolrConfigHandlerConcurrent, InfoHandlerTest, TestRandomFlRTGCloud, SpatialFilterTest, LeaderInitiatedRecoveryOnShardRestartTest, BJQParserTest, AlternateDirectoryTest, DistanceFunctionTest, TestPullReplica, HdfsDirectoryFactoryTest, DocExpirationUpdateProcessorFactoryTest, CustomCollectionTest, SimplePostToolTest, TestStandardQParsers, ImplicitSnitchTest, TestDistribIDF, ChaosMonkeyNothingIsSafeWithPullReplicasTest, TestMissingGroups, HdfsUnloadDistributedZkTest, TestStressRecovery, TestTrieFacet, UUIDUpdateProcessorFallbackTest, TestLegacyNumericUtils, TestDocBasedVersionConstraints, TestFreeTextSuggestions, TestCryptoKeys, VMParamsZkACLAndCredentialsProvidersTest, TestFieldCacheVsDocValues, TestConfigsApi, OverseerCollectionConfigSetProcessorTest, HdfsChaosMonkeyNothingIsSafeTest, TestPKIAuthenticationPlugin, AddBlockUpdateTest, TestCloudSchemaless, TestDistribDocBasedVersion, AutoscalingHistoryHandlerTest, TestRecoveryHdfs, TestFieldCache, TestHttpShardHandlerFactory, RequiredFieldsTest, TestReplicationHandler, TestExtendedDismaxParser, BlockCacheTest, ResponseLogComponentTest, SpellCheckCollatorWithCollapseTest, TestTolerantUpdateProcessorCloud, FastVectorHighlighterTest, TestSmileRequest, URLClassifyProcessorTest, TestBinaryResponseWriter, ClusterStateTest, TestPayloadCheckQParserPlugin, ShardRoutingTest, RecoveryAfterSoftCommitTest, CloudExitableDirectoryReaderTest, TestOmitPositions, IndexSchemaTest, DistributedFacetPivotLongTailTest, VersionInfoTest, HdfsLockFactoryTest, SolrCloudExampleTest, TestImpersonationWithHadoopAuth]
   [junit4]   2> NOTE: reproduce with: ant test  -Dtestcase=TestImpersonationWithHadoopAuth -Dtests.seed=505893396797EE99 -Dtests.slow=true -Dtests.locale=de-AT -Dtests.timezone=America/Coral_Harbour -Dtests.asserts=true -Dtests.file.encoding=US-ASCII
   [junit4] ERROR   0.00s J0 | TestImpersonationWithHadoopAuth (suite) <<<
   [junit4]    > Throwable #1: com.carrotsearch.randomizedtesting.ThreadLeakError: 1 thread leaked from SUITE scope at org.apache.solr.security.hadoop.TestImpersonationWithHadoopAuth: 
   [junit4]    >    1) Thread[id=12621, name=jetty-launcher-1513-thread-2-EventThread, state=TIMED_WAITING, group=TGRP-TestImpersonationWithHadoopAuth]
   [junit4]    >         at sun.misc.Unsafe.park(Native Method)
   [junit4]    >         at java.util.concurrent.locks.LockSupport.parkNanos(LockSupport.java:215)
   [junit4]    >         at java.util.concurrent.locks.AbstractQueuedSynchronizer.doAcquireSharedNanos(AbstractQueuedSynchronizer.java:1037)
   [junit4]    >         at java.util.concurrent.locks.AbstractQueuedSynchronizer.tryAcquireSharedNanos(AbstractQueuedSynchronizer.java:1328)
   [junit4]    >         at java.util.concurrent.CountDownLatch.await(CountDownLatch.java:277)
   [junit4]    >         at org.apache.curator.CuratorZookeeperClient.internalBlockUntilConnectedOrTimedOut(CuratorZookeeperClient.java:323)
   [junit4]    >         at org.apache.curator.RetryLoop.callWithRetry(RetryLoop.java:105)
   [junit4]    >         at org.apache.curator.framework.imps.GetDataBuilderImpl.pathInForeground(GetDataBuilderImpl.java:288)
   [junit4]    >         at org.apache.curator.framework.imps.GetDataBuilderImpl.forPath(GetDataBuilderImpl.java:279)
   [junit4]    >         at org.apache.curator.framework.imps.GetDataBuilderImpl.forPath(GetDataBuilderImpl.java:41)
   [junit4]    >         at org.apache.curator.framework.recipes.shared.SharedValue.readValue(SharedValue.java:244)
   [junit4]    >         at org.apache.curator.framework.recipes.shared.SharedValue.access$100(SharedValue.java:44)
   [junit4]    >         at org.apache.curator.framework.recipes.shared.SharedValue$1.process(SharedValue.java:61)
   [junit4]    >         at org.apache.curator.framework.imps.NamespaceWatcher.process(NamespaceWatcher.java:67)
   [junit4]    >         at org.apache.zookeeper.ClientCnxn$EventThread.processEvent(ClientCnxn.java:530)
   [junit4]    >         at org.apache.zookeeper.ClientCnxn$EventThread.run(ClientCnxn.java:505)
   [junit4]    > 	at __randomizedtesting.SeedInfo.seed([505893396797EE99]:0)
   [junit4] Completed [227/745 (3!)] on J0 in 44.63s, 10 tests, 1 error, 1 skipped <<< FAILURES!

[...truncated 48651 lines...]

Mime
View raw message