lucene-dev mailing list archives

Site index · List index
Message view « Date » · « Thread »
Top « Date » · « Thread »
From Policeman Jenkins Server <jenk...@thetaphi.de>
Subject [JENKINS] Lucene-Solr-master-Linux (32bit/jdk1.8.0_144) - Build # 20610 - Still Failing!
Date Thu, 05 Oct 2017 08:54:30 GMT
Build: https://jenkins.thetaphi.de/job/Lucene-Solr-master-Linux/20610/
Java: 32bit/jdk1.8.0_144 -server -XX:+UseSerialGC

2 tests failed.
FAILED:  org.apache.solr.cloud.TestAuthenticationFramework.testBasics

Error Message:
Error from server at https://127.0.0.1:36027/solr/testcollection_shard1_replica_n3: Expected mime type application/octet-stream but got text/html. <html> <head> <meta http-equiv="Content-Type" content="text/html;charset=ISO-8859-1"/> <title>Error 404 </title> </head> <body> <h2>HTTP ERROR: 404</h2> <p>Problem accessing /solr/testcollection_shard1_replica_n3/update. Reason: <pre>    Can not find: /solr/testcollection_shard1_replica_n3/update</pre></p> <hr /><a href="http://eclipse.org/jetty">Powered by Jetty:// 9.3.20.v20170531</a><hr/> </body> </html> 

Stack Trace:
org.apache.solr.client.solrj.impl.CloudSolrClient$RouteException: Error from server at https://127.0.0.1:36027/solr/testcollection_shard1_replica_n3: Expected mime type application/octet-stream but got text/html. <html>
<head>
<meta http-equiv="Content-Type" content="text/html;charset=ISO-8859-1"/>
<title>Error 404 </title>
</head>
<body>
<h2>HTTP ERROR: 404</h2>
<p>Problem accessing /solr/testcollection_shard1_replica_n3/update. Reason:
<pre>    Can not find: /solr/testcollection_shard1_replica_n3/update</pre></p>
<hr /><a href="http://eclipse.org/jetty">Powered by Jetty:// 9.3.20.v20170531</a><hr/>
</body>
</html>

	at __randomizedtesting.SeedInfo.seed([A077203D4C55F456:9DAF8E1174BBAA26]:0)
	at org.apache.solr.client.solrj.impl.CloudSolrClient.directUpdate(CloudSolrClient.java:539)
	at org.apache.solr.client.solrj.impl.CloudSolrClient.sendRequest(CloudSolrClient.java:993)
	at org.apache.solr.client.solrj.impl.CloudSolrClient.requestWithRetryOnStaleState(CloudSolrClient.java:862)
	at org.apache.solr.client.solrj.impl.CloudSolrClient.request(CloudSolrClient.java:793)
	at org.apache.solr.client.solrj.SolrRequest.process(SolrRequest.java:178)
	at org.apache.solr.client.solrj.request.UpdateRequest.commit(UpdateRequest.java:233)
	at org.apache.solr.cloud.TestAuthenticationFramework.collectionCreateSearchDeleteTwice(TestAuthenticationFramework.java:126)
	at org.apache.solr.cloud.TestAuthenticationFramework.testBasics(TestAuthenticationFramework.java:74)
	at sun.reflect.NativeMethodAccessorImpl.invoke0(Native Method)
	at sun.reflect.NativeMethodAccessorImpl.invoke(NativeMethodAccessorImpl.java:62)
	at sun.reflect.DelegatingMethodAccessorImpl.invoke(DelegatingMethodAccessorImpl.java:43)
	at java.lang.reflect.Method.invoke(Method.java:498)
	at com.carrotsearch.randomizedtesting.RandomizedRunner.invoke(RandomizedRunner.java:1737)
	at com.carrotsearch.randomizedtesting.RandomizedRunner$8.evaluate(RandomizedRunner.java:934)
	at com.carrotsearch.randomizedtesting.RandomizedRunner$9.evaluate(RandomizedRunner.java:970)
	at com.carrotsearch.randomizedtesting.RandomizedRunner$10.evaluate(RandomizedRunner.java:984)
	at com.carrotsearch.randomizedtesting.rules.SystemPropertiesRestoreRule$1.evaluate(SystemPropertiesRestoreRule.java:57)
	at org.apache.lucene.util.TestRuleSetupTeardownChained$1.evaluate(TestRuleSetupTeardownChained.java:49)
	at org.apache.lucene.util.AbstractBeforeAfterRule$1.evaluate(AbstractBeforeAfterRule.java:45)
	at org.apache.lucene.util.TestRuleThreadAndTestName$1.evaluate(TestRuleThreadAndTestName.java:48)
	at org.apache.lucene.util.TestRuleIgnoreAfterMaxFailures$1.evaluate(TestRuleIgnoreAfterMaxFailures.java:64)
	at org.apache.lucene.util.TestRuleMarkFailure$1.evaluate(TestRuleMarkFailure.java:47)
	at com.carrotsearch.randomizedtesting.rules.StatementAdapter.evaluate(StatementAdapter.java:36)
	at com.carrotsearch.randomizedtesting.ThreadLeakControl$StatementRunner.run(ThreadLeakControl.java:368)
	at com.carrotsearch.randomizedtesting.ThreadLeakControl.forkTimeoutingTask(ThreadLeakControl.java:817)
	at com.carrotsearch.randomizedtesting.ThreadLeakControl$3.evaluate(ThreadLeakControl.java:468)
	at com.carrotsearch.randomizedtesting.RandomizedRunner.runSingleTest(RandomizedRunner.java:943)
	at com.carrotsearch.randomizedtesting.RandomizedRunner$5.evaluate(RandomizedRunner.java:829)
	at com.carrotsearch.randomizedtesting.RandomizedRunner$6.evaluate(RandomizedRunner.java:879)
	at com.carrotsearch.randomizedtesting.RandomizedRunner$7.evaluate(RandomizedRunner.java:890)
	at com.carrotsearch.randomizedtesting.rules.StatementAdapter.evaluate(StatementAdapter.java:36)
	at com.carrotsearch.randomizedtesting.rules.SystemPropertiesRestoreRule$1.evaluate(SystemPropertiesRestoreRule.java:57)
	at org.apache.lucene.util.AbstractBeforeAfterRule$1.evaluate(AbstractBeforeAfterRule.java:45)
	at com.carrotsearch.randomizedtesting.rules.StatementAdapter.evaluate(StatementAdapter.java:36)
	at org.apache.lucene.util.TestRuleStoreClassName$1.evaluate(TestRuleStoreClassName.java:41)
	at com.carrotsearch.randomizedtesting.rules.NoShadowingOrOverridesOnMethodsRule$1.evaluate(NoShadowingOrOverridesOnMethodsRule.java:40)
	at com.carrotsearch.randomizedtesting.rules.NoShadowingOrOverridesOnMethodsRule$1.evaluate(NoShadowingOrOverridesOnMethodsRule.java:40)
	at com.carrotsearch.randomizedtesting.rules.StatementAdapter.evaluate(StatementAdapter.java:36)
	at com.carrotsearch.randomizedtesting.rules.StatementAdapter.evaluate(StatementAdapter.java:36)
	at com.carrotsearch.randomizedtesting.rules.StatementAdapter.evaluate(StatementAdapter.java:36)
	at org.apache.lucene.util.TestRuleAssertionsRequired$1.evaluate(TestRuleAssertionsRequired.java:53)
	at org.apache.lucene.util.TestRuleMarkFailure$1.evaluate(TestRuleMarkFailure.java:47)
	at org.apache.lucene.util.TestRuleIgnoreAfterMaxFailures$1.evaluate(TestRuleIgnoreAfterMaxFailures.java:64)
	at org.apache.lucene.util.TestRuleIgnoreTestSuites$1.evaluate(TestRuleIgnoreTestSuites.java:54)
	at com.carrotsearch.randomizedtesting.rules.StatementAdapter.evaluate(StatementAdapter.java:36)
	at com.carrotsearch.randomizedtesting.ThreadLeakControl$StatementRunner.run(ThreadLeakControl.java:368)
	at java.lang.Thread.run(Thread.java:748)
Caused by: org.apache.solr.client.solrj.impl.HttpSolrClient$RemoteSolrException: Error from server at https://127.0.0.1:36027/solr/testcollection_shard1_replica_n3: Expected mime type application/octet-stream but got text/html. <html>
<head>
<meta http-equiv="Content-Type" content="text/html;charset=ISO-8859-1"/>
<title>Error 404 </title>
</head>
<body>
<h2>HTTP ERROR: 404</h2>
<p>Problem accessing /solr/testcollection_shard1_replica_n3/update. Reason:
<pre>    Can not find: /solr/testcollection_shard1_replica_n3/update</pre></p>
<hr /><a href="http://eclipse.org/jetty">Powered by Jetty:// 9.3.20.v20170531</a><hr/>
</body>
</html>

	at org.apache.solr.client.solrj.impl.HttpSolrClient.executeMethod(HttpSolrClient.java:590)
	at org.apache.solr.client.solrj.impl.HttpSolrClient.request(HttpSolrClient.java:253)
	at org.apache.solr.client.solrj.impl.HttpSolrClient.request(HttpSolrClient.java:242)
	at org.apache.solr.client.solrj.impl.LBHttpSolrClient.doRequest(LBHttpSolrClient.java:483)
	at org.apache.solr.client.solrj.impl.LBHttpSolrClient.request(LBHttpSolrClient.java:413)
	at org.apache.solr.client.solrj.impl.CloudSolrClient.lambda$directUpdate$0(CloudSolrClient.java:516)
	at java.util.concurrent.FutureTask.run(FutureTask.java:266)
	at org.apache.solr.common.util.ExecutorUtil$MDCAwareThreadPoolExecutor.lambda$execute$0(ExecutorUtil.java:188)
	at java.util.concurrent.ThreadPoolExecutor.runWorker(ThreadPoolExecutor.java:1149)
	at java.util.concurrent.ThreadPoolExecutor$Worker.run(ThreadPoolExecutor.java:624)
	... 1 more


FAILED:  org.apache.solr.cloud.autoscaling.ComputePlanActionTest.testNodeLost

Error Message:
The operations computed by ComputePlanAction should not be null

Stack Trace:
java.lang.AssertionError: The operations computed by ComputePlanAction should not be null
	at __randomizedtesting.SeedInfo.seed([A077203D4C55F456:1F62EEC3CFBF91D0]:0)
	at org.junit.Assert.fail(Assert.java:93)
	at org.junit.Assert.assertTrue(Assert.java:43)
	at org.junit.Assert.assertNotNull(Assert.java:526)
	at org.apache.solr.cloud.autoscaling.ComputePlanActionTest.testNodeLost(ComputePlanActionTest.java:193)
	at sun.reflect.NativeMethodAccessorImpl.invoke0(Native Method)
	at sun.reflect.NativeMethodAccessorImpl.invoke(NativeMethodAccessorImpl.java:62)
	at sun.reflect.DelegatingMethodAccessorImpl.invoke(DelegatingMethodAccessorImpl.java:43)
	at java.lang.reflect.Method.invoke(Method.java:498)
	at com.carrotsearch.randomizedtesting.RandomizedRunner.invoke(RandomizedRunner.java:1737)
	at com.carrotsearch.randomizedtesting.RandomizedRunner$8.evaluate(RandomizedRunner.java:934)
	at com.carrotsearch.randomizedtesting.RandomizedRunner$9.evaluate(RandomizedRunner.java:970)
	at com.carrotsearch.randomizedtesting.RandomizedRunner$10.evaluate(RandomizedRunner.java:984)
	at com.carrotsearch.randomizedtesting.rules.SystemPropertiesRestoreRule$1.evaluate(SystemPropertiesRestoreRule.java:57)
	at org.apache.lucene.util.TestRuleSetupTeardownChained$1.evaluate(TestRuleSetupTeardownChained.java:49)
	at org.apache.lucene.util.AbstractBeforeAfterRule$1.evaluate(AbstractBeforeAfterRule.java:45)
	at org.apache.lucene.util.TestRuleThreadAndTestName$1.evaluate(TestRuleThreadAndTestName.java:48)
	at org.apache.lucene.util.TestRuleIgnoreAfterMaxFailures$1.evaluate(TestRuleIgnoreAfterMaxFailures.java:64)
	at org.apache.lucene.util.TestRuleMarkFailure$1.evaluate(TestRuleMarkFailure.java:47)
	at com.carrotsearch.randomizedtesting.rules.StatementAdapter.evaluate(StatementAdapter.java:36)
	at com.carrotsearch.randomizedtesting.ThreadLeakControl$StatementRunner.run(ThreadLeakControl.java:368)
	at com.carrotsearch.randomizedtesting.ThreadLeakControl.forkTimeoutingTask(ThreadLeakControl.java:817)
	at com.carrotsearch.randomizedtesting.ThreadLeakControl$3.evaluate(ThreadLeakControl.java:468)
	at com.carrotsearch.randomizedtesting.RandomizedRunner.runSingleTest(RandomizedRunner.java:943)
	at com.carrotsearch.randomizedtesting.RandomizedRunner$5.evaluate(RandomizedRunner.java:829)
	at com.carrotsearch.randomizedtesting.RandomizedRunner$6.evaluate(RandomizedRunner.java:879)
	at com.carrotsearch.randomizedtesting.RandomizedRunner$7.evaluate(RandomizedRunner.java:890)
	at com.carrotsearch.randomizedtesting.rules.StatementAdapter.evaluate(StatementAdapter.java:36)
	at com.carrotsearch.randomizedtesting.rules.SystemPropertiesRestoreRule$1.evaluate(SystemPropertiesRestoreRule.java:57)
	at org.apache.lucene.util.AbstractBeforeAfterRule$1.evaluate(AbstractBeforeAfterRule.java:45)
	at com.carrotsearch.randomizedtesting.rules.StatementAdapter.evaluate(StatementAdapter.java:36)
	at org.apache.lucene.util.TestRuleStoreClassName$1.evaluate(TestRuleStoreClassName.java:41)
	at com.carrotsearch.randomizedtesting.rules.NoShadowingOrOverridesOnMethodsRule$1.evaluate(NoShadowingOrOverridesOnMethodsRule.java:40)
	at com.carrotsearch.randomizedtesting.rules.NoShadowingOrOverridesOnMethodsRule$1.evaluate(NoShadowingOrOverridesOnMethodsRule.java:40)
	at com.carrotsearch.randomizedtesting.rules.StatementAdapter.evaluate(StatementAdapter.java:36)
	at com.carrotsearch.randomizedtesting.rules.StatementAdapter.evaluate(StatementAdapter.java:36)
	at com.carrotsearch.randomizedtesting.rules.StatementAdapter.evaluate(StatementAdapter.java:36)
	at org.apache.lucene.util.TestRuleAssertionsRequired$1.evaluate(TestRuleAssertionsRequired.java:53)
	at org.apache.lucene.util.TestRuleMarkFailure$1.evaluate(TestRuleMarkFailure.java:47)
	at org.apache.lucene.util.TestRuleIgnoreAfterMaxFailures$1.evaluate(TestRuleIgnoreAfterMaxFailures.java:64)
	at org.apache.lucene.util.TestRuleIgnoreTestSuites$1.evaluate(TestRuleIgnoreTestSuites.java:54)
	at com.carrotsearch.randomizedtesting.rules.StatementAdapter.evaluate(StatementAdapter.java:36)
	at com.carrotsearch.randomizedtesting.ThreadLeakControl$StatementRunner.run(ThreadLeakControl.java:368)
	at java.lang.Thread.run(Thread.java:748)




Build Log:
[...truncated 11706 lines...]
   [junit4] Suite: org.apache.solr.cloud.TestAuthenticationFramework
   [junit4]   2> Creating dataDir: /home/jenkins/workspace/Lucene-Solr-master-Linux/solr/build/solr-core/test/J0/temp/solr.cloud.TestAuthenticationFramework_A077203D4C55F456-001/init-core-data-001
   [junit4]   2> 252575 WARN  (SUITE-TestAuthenticationFramework-seed#[A077203D4C55F456]-worker) [    ] o.a.s.SolrTestCaseJ4 startTrackingSearchers: numOpens=1 numCloses=1
   [junit4]   2> 252575 INFO  (SUITE-TestAuthenticationFramework-seed#[A077203D4C55F456]-worker) [    ] o.a.s.SolrTestCaseJ4 Using TrieFields (NUMERIC_POINTS_SYSPROP=false) w/NUMERIC_DOCVALUES_SYSPROP=true
   [junit4]   2> 252577 INFO  (SUITE-TestAuthenticationFramework-seed#[A077203D4C55F456]-worker) [    ] o.a.s.SolrTestCaseJ4 Randomized ssl (true) and clientAuth (true) via: @org.apache.solr.util.RandomizeSSL(reason=, ssl=NaN, value=NaN, clientAuth=NaN)
   [junit4]   2> 252577 INFO  (SUITE-TestAuthenticationFramework-seed#[A077203D4C55F456]-worker) [    ] o.a.s.SolrTestCaseJ4 SecureRandom sanity checks: test.solr.allowed.securerandom=null & java.security.egd=file:/dev/./urandom
   [junit4]   2> 252579 INFO  (TEST-TestAuthenticationFramework.testBasics-seed#[A077203D4C55F456]) [    ] o.a.s.c.MiniSolrCloudCluster Starting cluster of 2 servers in /home/jenkins/workspace/Lucene-Solr-master-Linux/solr/build/solr-core/test/J0/temp/solr.cloud.TestAuthenticationFramework_A077203D4C55F456-001/tempDir-001
   [junit4]   2> 252579 INFO  (TEST-TestAuthenticationFramework.testBasics-seed#[A077203D4C55F456]) [    ] o.a.s.c.ZkTestServer STARTING ZK TEST SERVER
   [junit4]   2> 252582 INFO  (Thread-542) [    ] o.a.s.c.ZkTestServer client port:0.0.0.0/0.0.0.0:0
   [junit4]   2> 252582 INFO  (Thread-542) [    ] o.a.s.c.ZkTestServer Starting server
   [junit4]   2> 252583 ERROR (Thread-542) [    ] o.a.z.s.ZooKeeperServer ZKShutdownHandler is not registered, so ZooKeeper server won't take any action on ERROR or SHUTDOWN server state changes
   [junit4]   2> 252682 INFO  (TEST-TestAuthenticationFramework.testBasics-seed#[A077203D4C55F456]) [    ] o.a.s.c.ZkTestServer start zk server on port:44089
   [junit4]   2> 252686 INFO  (jetty-launcher-1869-thread-1) [    ] o.e.j.s.Server jetty-9.3.20.v20170531
   [junit4]   2> 252686 INFO  (jetty-launcher-1869-thread-2) [    ] o.e.j.s.Server jetty-9.3.20.v20170531
   [junit4]   2> 252694 INFO  (jetty-launcher-1869-thread-2) [    ] o.e.j.s.h.ContextHandler Started o.e.j.s.ServletContextHandler@179be68{/solr,null,AVAILABLE}
   [junit4]   2> 252694 INFO  (jetty-launcher-1869-thread-1) [    ] o.e.j.s.h.ContextHandler Started o.e.j.s.ServletContextHandler@d1117f{/solr,null,AVAILABLE}
   [junit4]   2> 252696 INFO  (jetty-launcher-1869-thread-2) [    ] o.e.j.s.AbstractConnector Started ServerConnector@1a1a801{SSL,[ssl, http/1.1]}{127.0.0.1:36027}
   [junit4]   2> 252696 INFO  (jetty-launcher-1869-thread-1) [    ] o.e.j.s.AbstractConnector Started ServerConnector@10b97a5{SSL,[ssl, http/1.1]}{127.0.0.1:41765}
   [junit4]   2> 252696 INFO  (jetty-launcher-1869-thread-2) [    ] o.e.j.s.Server Started @254904ms
   [junit4]   2> 252696 INFO  (jetty-launcher-1869-thread-1) [    ] o.e.j.s.Server Started @254904ms
   [junit4]   2> 252696 INFO  (jetty-launcher-1869-thread-2) [    ] o.a.s.c.s.e.JettySolrRunner Jetty properties: {hostContext=/solr, hostPort=36027}
   [junit4]   2> 252696 INFO  (jetty-launcher-1869-thread-1) [    ] o.a.s.c.s.e.JettySolrRunner Jetty properties: {hostContext=/solr, hostPort=41765}
   [junit4]   2> 252696 ERROR (jetty-launcher-1869-thread-2) [    ] o.a.s.u.StartupLoggingUtils Missing Java Option solr.log.dir. Logging may be missing or incomplete.
   [junit4]   2> 252696 ERROR (jetty-launcher-1869-thread-1) [    ] o.a.s.u.StartupLoggingUtils Missing Java Option solr.log.dir. Logging may be missing or incomplete.
   [junit4]   2> 252696 INFO  (jetty-launcher-1869-thread-2) [    ] o.a.s.s.SolrDispatchFilter  ___      _       Welcome to Apache Solr™ version 8.0.0
   [junit4]   2> 252696 INFO  (jetty-launcher-1869-thread-1) [    ] o.a.s.s.SolrDispatchFilter  ___      _       Welcome to Apache Solr™ version 8.0.0
   [junit4]   2> 252696 INFO  (jetty-launcher-1869-thread-2) [    ] o.a.s.s.SolrDispatchFilter / __| ___| |_ _   Starting in cloud mode on port null
   [junit4]   2> 252696 INFO  (jetty-launcher-1869-thread-1) [    ] o.a.s.s.SolrDispatchFilter / __| ___| |_ _   Starting in cloud mode on port null
   [junit4]   2> 252696 INFO  (jetty-launcher-1869-thread-2) [    ] o.a.s.s.SolrDispatchFilter \__ \/ _ \ | '_|  Install dir: null, Default config dir: null
   [junit4]   2> 252696 INFO  (jetty-launcher-1869-thread-1) [    ] o.a.s.s.SolrDispatchFilter \__ \/ _ \ | '_|  Install dir: null, Default config dir: null
   [junit4]   2> 252696 INFO  (jetty-launcher-1869-thread-2) [    ] o.a.s.s.SolrDispatchFilter |___/\___/_|_|    Start time: 2017-10-05T07:58:18.688Z
   [junit4]   2> 252696 INFO  (jetty-launcher-1869-thread-1) [    ] o.a.s.s.SolrDispatchFilter |___/\___/_|_|    Start time: 2017-10-05T07:58:18.688Z
   [junit4]   2> 252699 INFO  (jetty-launcher-1869-thread-2) [    ] o.a.s.s.SolrDispatchFilter solr.xml found in ZooKeeper. Loading...
   [junit4]   2> 252699 INFO  (jetty-launcher-1869-thread-1) [    ] o.a.s.s.SolrDispatchFilter solr.xml found in ZooKeeper. Loading...
   [junit4]   2> 252702 WARN  (NIOServerCxn.Factory:0.0.0.0/0.0.0.0:0) [    ] o.a.z.s.NIOServerCnxn caught end of stream exception
   [junit4]   2> EndOfStreamException: Unable to read additional data from client sessionid 0x15eeb8ad7cf0002, likely client has closed socket
   [junit4]   2> 	at org.apache.zookeeper.server.NIOServerCnxn.doIO(NIOServerCnxn.java:239)
   [junit4]   2> 	at org.apache.zookeeper.server.NIOServerCnxnFactory.run(NIOServerCnxnFactory.java:203)
   [junit4]   2> 	at java.lang.Thread.run(Thread.java:748)
   [junit4]   2> 252704 INFO  (jetty-launcher-1869-thread-2) [    ] o.a.s.c.ZkContainer Zookeeper client=127.0.0.1:44089/solr
   [junit4]   2> 252705 INFO  (jetty-launcher-1869-thread-1) [    ] o.a.s.c.ZkContainer Zookeeper client=127.0.0.1:44089/solr
   [junit4]   2> 252734 INFO  (jetty-launcher-1869-thread-1) [n:127.0.0.1:41765_solr    ] o.a.s.c.Overseer Overseer (id=null) closing
   [junit4]   2> 252734 INFO  (jetty-launcher-1869-thread-2) [n:127.0.0.1:36027_solr    ] o.a.s.c.Overseer Overseer (id=null) closing
   [junit4]   2> 252734 INFO  (jetty-launcher-1869-thread-1) [n:127.0.0.1:41765_solr    ] o.a.s.c.OverseerElectionContext I am going to be the leader 127.0.0.1:41765_solr
   [junit4]   2> 252734 INFO  (jetty-launcher-1869-thread-2) [n:127.0.0.1:36027_solr    ] o.a.s.c.ZkController Register node as live in ZooKeeper:/live_nodes/127.0.0.1:36027_solr
   [junit4]   2> 252735 INFO  (jetty-launcher-1869-thread-1) [n:127.0.0.1:41765_solr    ] o.a.s.c.Overseer Overseer (id=98775223407411206-127.0.0.1:41765_solr-n_0000000000) starting
   [junit4]   2> 252742 INFO  (zkCallback-1881-thread-1-processing-n:127.0.0.1:41765_solr) [n:127.0.0.1:41765_solr    ] o.a.s.c.c.ZkStateReader Updated live nodes from ZooKeeper... (0) -> (1)
   [junit4]   2> 252743 INFO  (zkCallback-1880-thread-1-processing-n:127.0.0.1:36027_solr) [n:127.0.0.1:36027_solr    ] o.a.s.c.c.ZkStateReader Updated live nodes from ZooKeeper... (0) -> (1)
   [junit4]   2> 252745 INFO  (jetty-launcher-1869-thread-1) [n:127.0.0.1:41765_solr    ] o.a.s.c.ZkController Register node as live in ZooKeeper:/live_nodes/127.0.0.1:41765_solr
   [junit4]   2> 252745 INFO  (zkCallback-1881-thread-1-processing-n:127.0.0.1:41765_solr) [n:127.0.0.1:41765_solr    ] o.a.s.c.c.ZkStateReader Updated live nodes from ZooKeeper... (1) -> (2)
   [junit4]   2> 252754 INFO  (zkCallback-1880-thread-1-processing-n:127.0.0.1:36027_solr) [n:127.0.0.1:36027_solr    ] o.a.s.c.c.ZkStateReader Updated live nodes from ZooKeeper... (1) -> (2)
   [junit4]   2> 252786 INFO  (jetty-launcher-1869-thread-1) [n:127.0.0.1:41765_solr    ] o.a.s.c.CoreContainer Initializing authentication plugin: org.apache.solr.cloud.TestAuthenticationFramework$MockAuthenticationPlugin
   [junit4]   2> 252812 INFO  (jetty-launcher-1869-thread-1) [n:127.0.0.1:41765_solr    ] o.a.s.m.r.SolrJmxReporter JMX monitoring for 'solr_41765.solr.node' (registry 'solr.node') enabled at server: com.sun.jmx.mbeanserver.JmxMBeanServer@ded075
   [junit4]   2> 252817 INFO  (jetty-launcher-1869-thread-1) [n:127.0.0.1:41765_solr    ] o.a.s.m.r.SolrJmxReporter JMX monitoring for 'solr_41765.solr.jvm' (registry 'solr.jvm') enabled at server: com.sun.jmx.mbeanserver.JmxMBeanServer@ded075
   [junit4]   2> 252817 INFO  (jetty-launcher-1869-thread-1) [n:127.0.0.1:41765_solr    ] o.a.s.m.r.SolrJmxReporter JMX monitoring for 'solr_41765.solr.jetty' (registry 'solr.jetty') enabled at server: com.sun.jmx.mbeanserver.JmxMBeanServer@ded075
   [junit4]   2> 252817 INFO  (jetty-launcher-1869-thread-1) [n:127.0.0.1:41765_solr    ] o.a.s.c.CorePropertiesLocator Found 0 core definitions underneath /home/jenkins/workspace/Lucene-Solr-master-Linux/solr/build/solr-core/test/J0/temp/solr.cloud.TestAuthenticationFramework_A077203D4C55F456-001/tempDir-001/node1/.
   [junit4]   2> 252839 INFO  (jetty-launcher-1869-thread-2) [n:127.0.0.1:36027_solr    ] o.a.s.c.CoreContainer Initializing authentication plugin: org.apache.solr.cloud.TestAuthenticationFramework$MockAuthenticationPlugin
   [junit4]   2> 252858 INFO  (jetty-launcher-1869-thread-2) [n:127.0.0.1:36027_solr    ] o.a.s.m.r.SolrJmxReporter JMX monitoring for 'solr_36027.solr.node' (registry 'solr.node') enabled at server: com.sun.jmx.mbeanserver.JmxMBeanServer@ded075
   [junit4]   2> 252870 INFO  (jetty-launcher-1869-thread-2) [n:127.0.0.1:36027_solr    ] o.a.s.m.r.SolrJmxReporter JMX monitoring for 'solr_36027.solr.jvm' (registry 'solr.jvm') enabled at server: com.sun.jmx.mbeanserver.JmxMBeanServer@ded075
   [junit4]   2> 252870 INFO  (jetty-launcher-1869-thread-2) [n:127.0.0.1:36027_solr    ] o.a.s.m.r.SolrJmxReporter JMX monitoring for 'solr_36027.solr.jetty' (registry 'solr.jetty') enabled at server: com.sun.jmx.mbeanserver.JmxMBeanServer@ded075
   [junit4]   2> 252871 INFO  (jetty-launcher-1869-thread-2) [n:127.0.0.1:36027_solr    ] o.a.s.c.CorePropertiesLocator Found 0 core definitions underneath /home/jenkins/workspace/Lucene-Solr-master-Linux/solr/build/solr-core/test/J0/temp/solr.cloud.TestAuthenticationFramework_A077203D4C55F456-001/tempDir-001/node2/.
   [junit4]   2> 252888 INFO  (TEST-TestAuthenticationFramework.testBasics-seed#[A077203D4C55F456]) [    ] o.a.s.c.c.ZkStateReader Updated live nodes from ZooKeeper... (0) -> (2)
   [junit4]   2> 252889 INFO  (TEST-TestAuthenticationFramework.testBasics-seed#[A077203D4C55F456]) [    ] o.a.s.c.s.i.ZkClientClusterStateProvider Cluster at 127.0.0.1:44089/solr ready
   [junit4]   2> 252890 INFO  (TEST-TestAuthenticationFramework.testBasics-seed#[A077203D4C55F456]) [    ] o.a.s.SolrTestCaseJ4 ###Starting testBasics
   [junit4]   2> 252931 INFO  (qtp32178861-4446) [n:127.0.0.1:36027_solr    ] o.a.s.h.a.CollectionsHandler Invoked Collection Action :create with params async=b874e66b-2385-4620-985d-af8d529fdc66&replicationFactor=2&collection.configName=solrCloudCollectionConfig&maxShardsPerNode=2&name=testcollection&nrtReplicas=2&action=CREATE&numShards=2&wt=javabin&version=2 and sendToOCPQueue=true
   [junit4]   2> 252932 INFO  (qtp32178861-4446) [n:127.0.0.1:36027_solr    ] o.a.s.s.HttpSolrCall [admin] webapp=null path=/admin/collections params={async=b874e66b-2385-4620-985d-af8d529fdc66&replicationFactor=2&collection.configName=solrCloudCollectionConfig&maxShardsPerNode=2&name=testcollection&nrtReplicas=2&action=CREATE&numShards=2&wt=javabin&version=2} status=0 QTime=0
   [junit4]   2> 252934 INFO  (OverseerThreadFactory-920-thread-1-processing-n:127.0.0.1:41765_solr) [n:127.0.0.1:41765_solr    ] o.a.s.c.CreateCollectionCmd Create collection testcollection
   [junit4]   2> 252934 INFO  (qtp32178861-4455) [n:127.0.0.1:36027_solr    ] o.a.s.h.a.CollectionsHandler Invoked Collection Action :requeststatus with params requestid=b874e66b-2385-4620-985d-af8d529fdc66&action=REQUESTSTATUS&wt=javabin&version=2 and sendToOCPQueue=true
   [junit4]   2> 252934 INFO  (qtp32178861-4455) [n:127.0.0.1:36027_solr    ] o.a.s.s.HttpSolrCall [admin] webapp=null path=/admin/collections params={requestid=b874e66b-2385-4620-985d-af8d529fdc66&action=REQUESTSTATUS&wt=javabin&version=2} status=0 QTime=0
   [junit4]   2> 253041 INFO  (OverseerStateUpdate-98775223407411206-127.0.0.1:41765_solr-n_0000000000) [n:127.0.0.1:41765_solr    ] o.a.s.c.o.SliceMutator createReplica() {
   [junit4]   2>   "operation":"ADDREPLICA",
   [junit4]   2>   "collection":"testcollection",
   [junit4]   2>   "shard":"shard1",
   [junit4]   2>   "core":"testcollection_shard1_replica_n1",
   [junit4]   2>   "state":"down",
   [junit4]   2>   "base_url":"https://127.0.0.1:41765/solr",
   [junit4]   2>   "type":"NRT"} 
   [junit4]   2> 253043 INFO  (OverseerStateUpdate-98775223407411206-127.0.0.1:41765_solr-n_0000000000) [n:127.0.0.1:41765_solr    ] o.a.s.c.o.SliceMutator createReplica() {
   [junit4]   2>   "operation":"ADDREPLICA",
   [junit4]   2>   "collection":"testcollection",
   [junit4]   2>   "shard":"shard1",
   [junit4]   2>   "core":"testcollection_shard1_replica_n3",
   [junit4]   2>   "state":"down",
   [junit4]   2>   "base_url":"https://127.0.0.1:36027/solr",
   [junit4]   2>   "type":"NRT"} 
   [junit4]   2> 253045 INFO  (OverseerStateUpdate-98775223407411206-127.0.0.1:41765_solr-n_0000000000) [n:127.0.0.1:41765_solr    ] o.a.s.c.o.SliceMutator createReplica() {
   [junit4]   2>   "operation":"ADDREPLICA",
   [junit4]   2>   "collection":"testcollection",
   [junit4]   2>   "shard":"shard2",
   [junit4]   2>   "core":"testcollection_shard2_replica_n4",
   [junit4]   2>   "state":"down",
   [junit4]   2>   "base_url":"https://127.0.0.1:41765/solr",
   [junit4]   2>   "type":"NRT"} 
   [junit4]   2> 253051 INFO  (OverseerStateUpdate-98775223407411206-127.0.0.1:41765_solr-n_0000000000) [n:127.0.0.1:41765_solr    ] o.a.s.c.o.SliceMutator createReplica() {
   [junit4]   2>   "operation":"ADDREPLICA",
   [junit4]   2>   "collection":"testcollection",
   [junit4]   2>   "shard":"shard2",
   [junit4]   2>   "core":"testcollection_shard2_replica_n6",
   [junit4]   2>   "state":"down",
   [junit4]   2>   "base_url":"https://127.0.0.1:36027/solr",
   [junit4]   2>   "type":"NRT"} 
   [junit4]   2> 253304 INFO  (qtp32178861-4450) [n:127.0.0.1:36027_solr    ] o.a.s.s.HttpSolrCall [admin] webapp=null path=/admin/cores params={qt=/admin/cores&collection.configName=solrCloudCollectionConfig&newCollection=true&collection=testcollection&version=2&replicaType=NRT&async=b874e66b-2385-4620-985d-af8d529fdc663109148355321940&coreNodeName=core_node8&name=testcollection_shard2_replica_n6&action=CREATE&numShards=2&shard=shard2&wt=javabin} status=0 QTime=2
   [junit4]   2> 253309 INFO  (parallelCoreAdminExecutor-923-thread-1-processing-n:127.0.0.1:36027_solr b874e66b-2385-4620-985d-af8d529fdc663109148355321940 CREATE) [n:127.0.0.1:36027_solr    ] o.a.s.h.a.CoreAdminOperation core create command qt=/admin/cores&collection.configName=solrCloudCollectionConfig&newCollection=true&collection=testcollection&version=2&replicaType=NRT&async=b874e66b-2385-4620-985d-af8d529fdc663109148355321940&coreNodeName=core_node8&name=testcollection_shard2_replica_n6&action=CREATE&numShards=2&shard=shard2&wt=javabin
   [junit4]   2> 253310 INFO  (parallelCoreAdminExecutor-923-thread-1-processing-n:127.0.0.1:36027_solr b874e66b-2385-4620-985d-af8d529fdc663109148355321940 CREATE) [n:127.0.0.1:36027_solr    ] o.a.s.c.TransientSolrCoreCacheDefault Allocating transient cache for 2147483647 transient cores
   [junit4]   2> 253318 INFO  (qtp32178861-4446) [n:127.0.0.1:36027_solr    ] o.a.s.s.HttpSolrCall [admin] webapp=null path=/admin/cores params={qt=/admin/cores&collection.configName=solrCloudCollectionConfig&newCollection=true&collection=testcollection&version=2&replicaType=NRT&async=b874e66b-2385-4620-985d-af8d529fdc663109148352552701&coreNodeName=core_node5&name=testcollection_shard1_replica_n3&action=CREATE&numShards=2&shard=shard1&wt=javabin} status=0 QTime=13
   [junit4]   2> 253323 INFO  (parallelCoreAdminExecutor-923-thread-2-processing-n:127.0.0.1:36027_solr b874e66b-2385-4620-985d-af8d529fdc663109148352552701 CREATE) [n:127.0.0.1:36027_solr    ] o.a.s.h.a.CoreAdminOperation core create command qt=/admin/cores&collection.configName=solrCloudCollectionConfig&newCollection=true&collection=testcollection&version=2&replicaType=NRT&async=b874e66b-2385-4620-985d-af8d529fdc663109148352552701&coreNodeName=core_node5&name=testcollection_shard1_replica_n3&action=CREATE&numShards=2&shard=shard1&wt=javabin
   [junit4]   2> 253414 INFO  (qtp19342888-4458) [n:127.0.0.1:41765_solr    ] o.a.s.s.HttpSolrCall [admin] webapp=null path=/admin/cores params={qt=/admin/cores&collection.configName=solrCloudCollectionConfig&newCollection=true&collection=testcollection&version=2&replicaType=NRT&async=b874e66b-2385-4620-985d-af8d529fdc663109148351002960&coreNodeName=core_node2&name=testcollection_shard1_replica_n1&action=CREATE&numShards=2&shard=shard1&wt=javabin} status=0 QTime=17
   [junit4]   2> 253414 INFO  (parallelCoreAdminExecutor-921-thread-1-processing-n:127.0.0.1:41765_solr b874e66b-2385-4620-985d-af8d529fdc663109148351002960 CREATE) [n:127.0.0.1:41765_solr    ] o.a.s.h.a.CoreAdminOperation core create command qt=/admin/cores&collection.configName=solrCloudCollectionConfig&newCollection=true&collection=testcollection&version=2&replicaType=NRT&async=b874e66b-2385-4620-985d-af8d529fdc663109148351002960&coreNodeName=core_node2&name=testcollection_shard1_replica_n1&action=CREATE&numShards=2&shard=shard1&wt=javabin
   [junit4]   2> 253420 INFO  (parallelCoreAdminExecutor-921-thread-1-processing-n:127.0.0.1:41765_solr b874e66b-2385-4620-985d-af8d529fdc663109148351002960 CREATE) [n:127.0.0.1:41765_solr    ] o.a.s.c.TransientSolrCoreCacheDefault Allocating transient cache for 2147483647 transient cores
   [junit4]   2> 253427 INFO  (zkCallback-1881-thread-1-processing-n:127.0.0.1:41765_solr) [n:127.0.0.1:41765_solr    ] o.a.s.c.c.ZkStateReader A cluster state change: [WatchedEvent state:SyncConnected type:NodeDataChanged path:/collections/testcollection/state.json] for collection [testcollection] has occurred - updating... (live nodes size: [2])
   [junit4]   2> 253430 INFO  (zkCallback-1880-thread-1-processing-n:127.0.0.1:36027_solr) [n:127.0.0.1:36027_solr    ] o.a.s.c.c.ZkStateReader A cluster state change: [WatchedEvent state:SyncConnected type:NodeDataChanged path:/collections/testcollection/state.json] for collection [testcollection] has occurred - updating... (live nodes size: [2])
   [junit4]   2> 253435 INFO  (qtp19342888-4458) [n:127.0.0.1:41765_solr    ] o.a.s.s.HttpSolrCall [admin] webapp=null path=/admin/cores params={qt=/admin/cores&collection.configName=solrCloudCollectionConfig&newCollection=true&collection=testcollection&version=2&replicaType=NRT&async=b874e66b-2385-4620-985d-af8d529fdc663109148354557835&coreNodeName=core_node7&name=testcollection_shard2_replica_n4&action=CREATE&numShards=2&shard=shard2&wt=javabin} status=0 QTime=9
   [junit4]   2> 253436 INFO  (parallelCoreAdminExecutor-921-thread-2-processing-n:127.0.0.1:41765_solr b874e66b-2385-4620-985d-af8d529fdc663109148354557835 CREATE) [n:127.0.0.1:41765_solr    ] o.a.s.h.a.CoreAdminOperation core create command qt=/admin/cores&collection.configName=solrCloudCollectionConfig&newCollection=true&collection=testcollection&version=2&replicaType=NRT&async=b874e66b-2385-4620-985d-af8d529fdc663109148354557835&coreNodeName=core_node7&name=testcollection_shard2_replica_n4&action=CREATE&numShards=2&shard=shard2&wt=javabin
   [junit4]   2> 253453 INFO  (qtp19342888-4462) [n:127.0.0.1:41765_solr    ] o.a.s.h.a.CoreAdminOperation Checking request status for : b874e66b-2385-4620-985d-af8d529fdc663109148354557835
   [junit4]   2> 253453 INFO  (qtp19342888-4462) [n:127.0.0.1:41765_solr    ] o.a.s.s.HttpSolrCall [admin] webapp=null path=/admin/cores params={qt=/admin/cores&requestid=b874e66b-2385-4620-985d-af8d529fdc663109148354557835&action=REQUESTSTATUS&wt=javabin&version=2} status=0 QTime=0
   [junit4]   2> 253555 INFO  (zkCallback-1880-thread-1-processing-n:127.0.0.1:36027_solr) [n:127.0.0.1:36027_solr    ] o.a.s.c.c.ZkStateReader A cluster state change: [WatchedEvent state:SyncConnected type:NodeDataChanged path:/collections/testcollection/state.json] for collection [testcollection] has occurred - updating... (live nodes size: [2])
   [junit4]   2> 253555 INFO  (zkCallback-1881-thread-3-processing-n:127.0.0.1:41765_solr) [n:127.0.0.1:41765_solr    ] o.a.s.c.c.ZkStateReader A cluster state change: [WatchedEvent state:SyncConnected type:NodeDataChanged path:/collections/testcollection/state.json] for collection [testcollection] has occurred - updating... (live nodes size: [2])
   [junit4]   2> 253935 INFO  (qtp32178861-4457) [n:127.0.0.1:36027_solr    ] o.a.s.h.a.CollectionsHandler Invoked Collection Action :requeststatus with params requestid=b874e66b-2385-4620-985d-af8d529fdc66&action=REQUESTSTATUS&wt=javabin&version=2 and sendToOCPQueue=true
   [junit4]   2> 253936 INFO  (qtp32178861-4457) [n:127.0.0.1:36027_solr    ] o.a.s.s.HttpSolrCall [admin] webapp=null path=/admin/collections params={requestid=b874e66b-2385-4620-985d-af8d529fdc66&action=REQUESTSTATUS&wt=javabin&version=2} status=0 QTime=0
   [junit4]   2> 254331 INFO  (parallelCoreAdminExecutor-923-thread-2-processing-n:127.0.0.1:36027_solr b874e66b-2385-4620-985d-af8d529fdc663109148352552701 CREATE) [n:127.0.0.1:36027_solr c:testcollection s:shard1 r:core_node5 x:testcollection_shard1_replica_n3] o.a.s.c.SolrConfig Using Lucene MatchVersion: 8.0.0
   [junit4]   2> 254341 INFO  (parallelCoreAdminExecutor-923-thread-1-processing-n:127.0.0.1:36027_solr b874e66b-2385-4620-985d-af8d529fdc663109148355321940 CREATE) [n:127.0.0.1:36027_solr c:testcollection s:shard2 r:core_node8 x:testcollection_shard2_replica_n6] o.a.s.c.SolrConfig Using Lucene MatchVersion: 8.0.0
   [junit4]   2> 254346 INFO  (parallelCoreAdminExecutor-923-thread-2-processing-n:127.0.0.1:36027_solr b874e66b-2385-4620-985d-af8d529fdc663109148352552701 CREATE) [n:127.0.0.1:36027_solr c:testcollection s:shard1 r:core_node5 x:testcollection_shard1_replica_n3] o.a.s.s.IndexSchema [testcollection_shard1_replica_n3] Schema name=minimal
   [junit4]   2> 254347 INFO  (parallelCoreAdminExecutor-923-thread-1-processing-n:127.0.0.1:36027_solr b874e66b-2385-4620-985d-af8d529fdc663109148355321940 CREATE) [n:127.0.0.1:36027_solr c:testcollection s:shard2 r:core_node8 x:testcollection_shard2_replica_n6] o.a.s.s.IndexSchema [testcollection_shard2_replica_n6] Schema name=minimal
   [junit4]   2> 254355 INFO  (parallelCoreAdminExecutor-923-thread-2-processing-n:127.0.0.1:36027_solr b874e66b-2385-4620-985d-af8d529fdc663109148352552701 CREATE) [n:127.0.0.1:36027_solr c:testcollection s:shard1 r:core_node5 x:testcollection_shard1_replica_n3] o.a.s.s.IndexSchema Loaded schema minimal/1.1 with uniqueid field id
   [junit4]   2> 254355 INFO  (parallelCoreAdminExecutor-923-thread-1-processing-n:127.0.0.1:36027_solr b874e66b-2385-4620-985d-af8d529fdc663109148355321940 CREATE) [n:127.0.0.1:36027_solr c:testcollection s:shard2 r:core_node8 x:testcollection_shard2_replica_n6] o.a.s.s.IndexSchema Loaded schema minimal/1.1 with uniqueid field id
   [junit4]   2> 254355 INFO  (parallelCoreAdminExecutor-923-thread-2-processing-n:127.0.0.1:36027_solr b874e66b-2385-4620-985d-af8d529fdc663109148352552701 CREATE) [n:127.0.0.1:36027_solr c:testcollection s:shard1 r:core_node5 x:testcollection_shard1_replica_n3] o.a.s.c.CoreContainer Creating SolrCore 'testcollection_shard1_replica_n3' using configuration from collection testcollection, trusted=true
   [junit4]   2> 254355 INFO  (parallelCoreAdminExecutor-923-thread-1-processing-n:127.0.0.1:36027_solr b874e66b-2385-4620-985d-af8d529fdc663109148355321940 CREATE) [n:127.0.0.1:36027_solr c:testcollection s:shard2 r:core_node8 x:testcollection_shard2_replica_n6] o.a.s.c.CoreContainer Creating SolrCore 'testcollection_shard2_replica_n6' using configuration from collection testcollection, trusted=true
   [junit4]   2> 254356 INFO  (parallelCoreAdminExecutor-923-thread-1-processing-n:127.0.0.1:36027_solr b874e66b-2385-4620-985d-af8d529fdc663109148355321940 CREATE) [n:127.0.0.1:36027_solr c:testcollection s:shard2 r:core_node8 x:testcollection_shard2_replica_n6] o.a.s.m.r.SolrJmxReporter JMX monitoring for 'solr_36027.solr.core.testcollection.shard2.replica_n6' (registry 'solr.core.testcollection.shard2.replica_n6') enabled at server: com.sun.jmx.mbeanserver.JmxMBeanServer@ded075
   [junit4]   2> 254356 INFO  (parallelCoreAdminExecutor-923-thread-2-processing-n:127.0.0.1:36027_solr b874e66b-2385-4620-985d-af8d529fdc663109148352552701 CREATE) [n:127.0.0.1:36027_solr c:testcollection s:shard1 r:core_node5 x:testcollection_shard1_replica_n3] o.a.s.m.r.SolrJmxReporter JMX monitoring for 'solr_36027.solr.core.testcollection.shard1.replica_n3' (registry 'solr.core.testcollection.shard1.replica_n3') enabled at server: com.sun.jmx.mbeanserver.JmxMBeanServer@ded075
   [junit4]   2> 254356 INFO  (parallelCoreAdminExecutor-923-thread-1-processing-n:127.0.0.1:36027_solr b874e66b-2385-4620-985d-af8d529fdc663109148355321940 CREATE) [n:127.0.0.1:36027_solr c:testcollection s:shard2 r:core_node8 x:testcollection_shard2_replica_n6] o.a.s.c.SolrCore solr.RecoveryStrategy.Builder
   [junit4]   2> 254356 INFO  (parallelCoreAdminExecutor-923-thread-2-processing-n:127.0.0.1:36027_solr b874e66b-2385-4620-985d-af8d529fdc663109148352552701 CREATE) [n:127.0.0.1:36027_solr c:testcollection s:shard1 r:core_node5 x:testcollection_shard1_replica_n3] o.a.s.c.SolrCore solr.RecoveryStrategy.Builder
   [junit4]   2> 254356 INFO  (parallelCoreAdminExecutor-923-thread-1-processing-n:127.0.0.1:36027_solr b874e66b-2385-4620-985d-af8d529fdc663109148355321940 CREATE) [n:127.0.0.1:36027_solr c:testcollection s:shard2 r:core_node8 x:testcollection_shard2_replica_n6] o.a.s.c.SolrCore [[testcollection_shard2_replica_n6] ] Opening new SolrCore at [/home/jenkins/workspace/Lucene-Solr-master-Linux/solr/build/solr-core/test/J0/temp/solr.cloud.TestAuthenticationFramework_A077203D4C55F456-001/tempDir-001/node2/testcollection_shard2_replica_n6], dataDir=[/home/jenkins/workspace/Lucene-Solr-master-Linux/solr/build/solr-core/test/J0/temp/solr.cloud.TestAuthenticationFramework_A077203D4C55F456-001/tempDir-001/node2/./testcollection_shard2_replica_n6/data/]
   [junit4]   2> 254356 INFO  (parallelCoreAdminExecutor-923-thread-2-processing-n:127.0.0.1:36027_solr b874e66b-2385-4620-985d-af8d529fdc663109148352552701 CREATE) [n:127.0.0.1:36027_solr c:testcollection s:shard1 r:core_node5 x:testcollection_shard1_replica_n3] o.a.s.c.SolrCore [[testcollection_shard1_replica_n3] ] Opening new SolrCore at [/home/jenkins/workspace/Lucene-Solr-master-Linux/solr/build/solr-core/test/J0/temp/solr.cloud.TestAuthenticationFramework_A077203D4C55F456-001/tempDir-001/node2/testcollection_shard1_replica_n3], dataDir=[/home/jenkins/workspace/Lucene-Solr-master-Linux/solr/build/solr-core/test/J0/temp/solr.cloud.TestAuthenticationFramework_A077203D4C55F456-001/tempDir-001/node2/./testcollection_shard1_replica_n3/data/]
   [junit4]   2> 254398 INFO  (parallelCoreAdminExecutor-923-thread-1-processing-n:127.0.0.1:36027_solr b874e66b-2385-4620-985d-af8d529fdc663109148355321940 CREATE) [n:127.0.0.1:36027_solr c:testcollection s:shard2 r:core_node8 x:testcollection_shard2_replica_n6] o.a.s.u.UpdateHandler Using UpdateLog implementation: org.apache.solr.update.UpdateLog
   [junit4]   2> 254398 INFO  (parallelCoreAdminExecutor-923-thread-1-processing-n:127.0.0.1:36027_solr b874e66b-2385-4620-985d-af8d529fdc663109148355321940 CREATE) [n:127.0.0.1:36027_solr c:testcollection s:shard2 r:core_node8 x:testcollection_shard2_replica_n6] o.a.s.u.UpdateLog Initializing UpdateLog: dataDir=null defaultSyncLevel=FLUSH numRecordsToKeep=100 maxNumLogsToKeep=10 numVersionBuckets=65536
   [junit4]   2> 254399 INFO  (parallelCoreAdminExecutor-923-thread-2-processing-n:127.0.0.1:36027_solr b874e66b-2385-4620-985d-af8d529fdc663109148352552701 CREATE) [n:127.0.0.1:36027_solr c:testcollection s:shard1 r:core_node5 x:testcollection_shard1_replica_n3] o.a.s.u.UpdateHandler Using UpdateLog implementation: org.apache.solr.update.UpdateLog
   [junit4]   2> 254399 INFO  (parallelCoreAdminExecutor-923-thread-2-processing-n:127.0.0.1:36027_solr b874e66b-2385-4620-985d-af8d529fdc663109148352552701 CREATE) [n:127.0.0.1:36027_solr c:testcollection s:shard1 r:core_node5 x:testcollection_shard1_replica_n3] o.a.s.u.UpdateLog Initializing UpdateLog: dataDir=null defaultSyncLevel=FLUSH numRecordsToKeep=100 maxNumLogsToKeep=10 numVersionBuckets=65536
   [junit4]   2> 254399 INFO  (parallelCoreAdminExecutor-923-thread-1-processing-n:127.0.0.1:36027_solr b874e66b-2385-4620-985d-af8d529fdc663109148355321940 CREATE) [n:127.0.0.1:36027_solr c:testcollection s:shard2 r:core_node8 x:testcollection_shard2_replica_n6] o.a.s.u.CommitTracker Hard AutoCommit: disabled
   [junit4]   2> 254399 INFO  (parallelCoreAdminExecutor-923-thread-1-processing-n:127.0.0.1:36027_solr b874e66b-2385-4620-985d-af8d529fdc663109148355321940 CREATE) [n:127.0.0.1:36027_solr c:testcollection s:shard2 r:core_node8 x:testcollection_shard2_replica_n6] o.a.s.u.CommitTracker Soft AutoCommit: disabled
   [junit4]   2> 254400 INFO  (parallelCoreAdminExecutor-923-thread-2-processing-n:127.0.0.1:36027_solr b874e66b-2385-4620-985d-af8d529fdc663109148352552701 CREATE) [n:127.0.0.1:36027_solr c:testcollection s:shard1 r:core_node5 x:testcollection_shard1_replica_n3] o.a.s.u.CommitTracker Hard AutoCommit: disabled
   [junit4]   2> 254400 INFO  (parallelCoreAdminExecutor-923-thread-2-processing-n:127.0.0.1:36027_solr b874e66b-2385-4620-985d-af8d529fdc663109148352552701 CREATE) [n:127.0.0.1:36027_solr c:testcollection s:shard1 r:core_node5 x:testcollection_shard1_replica_n3] o.a.s.u.CommitTracker Soft AutoCommit: disabled
   [junit4]   2> 254400 INFO  (parallelCoreAdminExecutor-923-thread-1-processing-n:127.0.0.1:36027_solr b874e66b-2385-4620-985d-af8d529fdc663109148355321940 CREATE) [n:127.0.0.1:36027_solr c:testcollection s:shard2 r:core_node8 x:testcollection_shard2_replica_n6] o.a.s.s.SolrIndexSearcher Opening [Searcher@437d91[testcollection_shard2_replica_n6] main]
   [junit4]   2> 254400 INFO  (parallelCoreAdminExecutor-923-thread-1-processing-n:127.0.0.1:36027_solr b874e66b-2385-4620-985d-af8d529fdc663109148355321940 CREATE) [n:127.0.0.1:36027_solr c:testcollection s:shard2 r:core_node8 x:testcollection_shard2_replica_n6] o.a.s.r.ManagedResourceStorage Configured ZooKeeperStorageIO with znodeBase: /configs/solrCloudCollectionConfig
   [junit4]   2> 254400 INFO  (parallelCoreAdminExecutor-923-thread-1-processing-n:127.0.0.1:36027_solr b874e66b-2385-4620-985d-af8d529fdc663109148355321940 CREATE) [n:127.0.0.1:36027_solr c:testcollection s:shard2 r:core_node8 x:testcollection_shard2_replica_n6] o.a.s.r.ManagedResourceStorage Loaded null at path _rest_managed.json using ZooKeeperStorageIO:path=/configs/solrCloudCollectionConfig
   [junit4]   2> 254401 INFO  (parallelCoreAdminExecutor-923-thread-1-processing-n:127.0.0.1:36027_solr b874e66b-2385-4620-985d-af8d529fdc663109148355321940 CREATE) [n:127.0.0.1:36027_solr c:testcollection s:shard2 r:core_node8 x:testcollection_shard2_replica_n6] o.a.s.h.ReplicationHandler Commits will be reserved for 10000ms.
   [junit4]   2> 254401 INFO  (parallelCoreAdminExecutor-923-thread-2-processing-n:127.0.0.1:36027_solr b874e66b-2385-4620-985d-af8d529fdc663109148352552701 CREATE) [n:127.0.0.1:36027_solr c:testcollection s:shard1 r:core_node5 x:testcollection_shard1_replica_n3] o.a.s.s.SolrIndexSearcher Opening [Searcher@f7bbe8[testcollection_shard1_replica_n3] main]
   [junit4]   2> 254402 INFO  (searcherExecutor-926-thread-1-processing-x:testcollection_shard2_replica_n6 r:core_node8 b874e66b-2385-4620-985d-af8d529fdc663109148355321940 CREATE n:127.0.0.1:36027_solr s:shard2 c:testcollection) [n:127.0.0.1:36027_solr c:testcollection s:shard2 r:core_node8 x:testcollection_shard2_replica_n6] o.a.s.c.SolrCore [testcollection_shard2_replica_n6] Registered new searcher Searcher@437d91[testcollection_shard2_replica_n6] main{ExitableDirectoryReader(UninvertingDirectoryReader())}
   [junit4]   2> 254402 INFO  (parallelCoreAdminExecutor-923-thread-1-processing-n:127.0.0.1:36027_solr b874e66b-2385-4620-985d-af8d529fdc663109148355321940 CREATE) [n:127.0.0.1:36027_solr c:testcollection s:shard2 r:core_node8 x:testcollection_shard2_replica_n6] o.a.s.u.UpdateLog Could not find max version in index or recent updates, using new clock 1580403576425938944
   [junit4]   2> 254402 INFO  (parallelCoreAdminExecutor-923-thread-2-processing-n:127.0.0.1:36027_solr b874e66b-2385-4620-985d-af8d529fdc663109148352552701 CREATE) [n:127.0.0.1:36027_solr c:testcollection s:shard1 r:core_node5 x:testcollection_shard1_replica_n3] o.a.s.r.ManagedResourceStorage Configured ZooKeeperStorageIO with znodeBase: /configs/solrCloudCollectionConfig
   [junit4]   2> 254402 INFO  (parallelCoreAdminExecutor-923-thread-2-processing-n:127.0.0.1:36027_solr b874e66b-2385-4620-985d-af8d529fdc663109148352552701 CREATE) [n:127.0.0.1:36027_solr c:testcollection s:shard1 r:core_node5 x:testcollection_shard1_replica_n3] o.a.s.r.ManagedResourceStorage Loaded null at path _rest_managed.json using ZooKeeperStorageIO:path=/configs/solrCloudCollectionConfig
   [junit4]   2> 254403 INFO  (parallelCoreAdminExecutor-923-thread-2-processing-n:127.0.0.1:36027_solr b874e66b-2385-4620-985d-af8d529fdc663109148352552701 CREATE) [n:127.0.0.1:36027_solr c:testcollection s:shard1 r:core_node5 x:testcollection_shard1_replica_n3] o.a.s.h.ReplicationHandler Commits will be reserved for 10000ms.
   [junit4]   2> 254419 INFO  (searcherExecutor-925-thread-1-processing-x:testcollection_shard1_replica_n3 r:core_node5 b874e66b-2385-4620-985d-af8d529fdc663109148352552701 CREATE n:127.0.0.1:36027_solr s:shard1 c:testcollection) [n:127.0.0.1:36027_solr c:testcollection s:shard1 r:core_node5 x:testcollection_shard1_replica_n3] o.a.s.c.SolrCore [testcollection_shard1_replica_n3] Registered new searcher Searcher@f7bbe8[testcollection_shard1_replica_n3] main{ExitableDirectoryReader(UninvertingDirectoryReader())}
   [junit4]   2> 254419 INFO  (parallelCoreAdminExecutor-923-thread-2-processing-n:127.0.0.1:36027_solr b874e66b-2385-4620-985d-af8d529fdc663109148352552701 CREATE) [n:127.0.0.1:36027_solr c:testcollection s:shard1 r:core_node5 x:testcollection_shard1_replica_n3] o.a.s.u.UpdateLog Could not find max version in index or recent updates, using new clock 1580403576443764736
   [junit4]   2> 254419 INFO  (parallelCoreAdminExecutor-923-thread-1-processing-n:127.0.0.1:36027_solr b874e66b-2385-4620-985d-af8d529fdc663109148355321940 CREATE) [n:127.0.0.1:36027_solr c:testcollection s:shard2 r:core_node8 x:testcollection_shard2_replica_n6] o.a.s.c.ShardLeaderElectionContext Waiting until we see more replicas up for shard shard2: total=2 found=1 timeoutin=9999ms
   [junit4]   2> 254421 INFO  (parallelCoreAdminExecutor-923-thread-2-processing-n:127.0.0.1:36027_solr b874e66b-2385-4620-985d-af8d529fdc663109148352552701 CREATE) [n:127.0.0.1:36027_solr c:testcollection s:shard1 r:core_node5 x:testcollection_shard1_replica_n3] o.a.s.c.ShardLeaderElectionContext Waiting until we see more replicas up for shard shard1: total=2 found=1 timeoutin=9999ms
   [junit4]   2> 254455 INFO  (qtp19342888-4447) [n:127.0.0.1:41765_solr    ] o.a.s.h.a.CoreAdminOperation Checking request status for : b874e66b-2385-4620-985d-af8d529fdc663109148354557835
   [junit4]   2> 254455 INFO  (qtp19342888-4447) [n:127.0.0.1:41765_solr    ] o.a.s.s.HttpSolrCall [admin] webapp=null path=/admin/cores params={qt=/admin/cores&requestid=b874e66b-2385-4620-985d-af8d529fdc663109148354557835&action=REQUESTSTATUS&wt=javabin&version=2} status=0 QTime=0
   [junit4]   2> 254461 INFO  (parallelCoreAdminExecutor-921-thread-2-processing-n:127.0.0.1:41765_solr b874e66b-2385-4620-985d-af8d529fdc663109148354557835 CREATE) [n:127.0.0.1:41765_solr c:testcollection s:shard2 r:core_node7 x:testcollection_shard2_replica_n4] o.a.s.c.SolrConfig Using Lucene MatchVersion: 8.0.0
   [junit4]   2> 254466 INFO  (parallelCoreAdminExecutor-921-thread-1-processing-n:127.0.0.1:41765_solr b874e66b-2385-4620-985d-af8d529fdc663109148351002960 CREATE) [n:127.0.0.1:41765_solr c:testcollection s:shard1 r:core_node2 x:testcollection_shard1_replica_n1] o.a.s.c.SolrConfig Using Lucene MatchVersion: 8.0.0
   [junit4]   2> 254490 INFO  (parallelCoreAdminExecutor-921-thread-1-processing-n:127.0.0.1:41765_solr b874e66b-2385-4620-985d-af8d529fdc663109148351002960 CREATE) [n:127.0.0.1:41765_solr c:testcollection s:shard1 r:core_node2 x:testcollection_shard1_replica_n1] o.a.s.s.IndexSchema [testcollection_shard1_replica_n1] Schema name=minimal
   [junit4]   2> 254492 INFO  (parallelCoreAdminExecutor-921-thread-1-processing-n:127.0.0.1:41765_solr b874e66b-2385-4620-985d-af8d529fdc663109148351002960 CREATE) [n:127.0.0.1:41765_solr c:testcollection s:shard1 r:core_node2 x:testcollection_shard1_replica_n1] o.a.s.s.IndexSchema Loaded schema minimal/1.1 with uniqueid field id
   [junit4]   2> 254492 INFO  (parallelCoreAdminExecutor-921-thread-1-processing-n:127.0.0.1:41765_solr b874e66b-2385-4620-985d-af8d529fdc663109148351002960 CREATE) [n:127.0.0.1:41765_solr c:testcollection s:shard1 r:core_node2 x:testcollection_shard1_replica_n1] o.a.s.c.CoreContainer Creating SolrCore 'testcollection_shard1_replica_n1' using configuration from collection testcollection, trusted=true
   [junit4]   2> 254492 INFO  (parallelCoreAdminExecutor-921-thread-2-processing-n:127.0.0.1:41765_solr b874e66b-2385-4620-985d-af8d529fdc663109148354557835 CREATE) [n:127.0.0.1:41765_solr c:testcollection s:shard2 r:core_node7 x:testcollection_shard2_replica_n4] o.a.s.s.IndexSchema [testcollection_shard2_replica_n4] Schema name=minimal
   [junit4]   2> 254492 INFO  (parallelCoreAdminExecutor-921-thread-1-processing-n:127.0.0.1:41765_solr b874e66b-2385-4620-985d-af8d529fdc663109148351002960 CREATE) [n:127.0.0.1:41765_solr c:testcollection s:shard1 r:core_node2 x:testcollection_shard1_replica_n1] o.a.s.m.r.SolrJmxReporter JMX monitoring for 'solr_41765.solr.core.testcollection.shard1.replica_n1' (registry 'solr.core.testcollection.shard1.replica_n1') enabled at server: com.sun.jmx.mbeanserver.JmxMBeanServer@ded075
   [junit4]   2> 254492 INFO  (parallelCoreAdminExecutor-921-thread-1-processing-n:127.0.0.1:41765_solr b874e66b-2385-4620-985d-af8d529fdc663109148351002960 CREATE) [n:127.0.0.1:41765_solr c:testcollection s:shard1 r:core_node2 x:testcollection_shard1_replica_n1] o.a.s.c.SolrCore solr.RecoveryStrategy.Builder
   [junit4]   2> 254492 INFO  (parallelCoreAdminExecutor-921-thread-1-processing-n:127.0.0.1:41765_solr b874e66b-2385-4620-985d-af8d529fdc663109148351002960 CREATE) [n:127.0.0.1:41765_solr c:testcollection s:shard1 r:core_node2 x:testcollection_shard1_replica_n1] o.a.s.c.SolrCore [[testcollection_shard1_replica_n1] ] Opening new SolrCore at [/home/jenkins/workspace/Lucene-Solr-master-Linux/solr/build/solr-core/test/J0/temp/solr.cloud.TestAuthenticationFramework_A077203D4C55F456-001/tempDir-001/node1/testcollection_shard1_replica_n1], dataDir=[/home/jenkins/workspace/Lucene-Solr-master-Linux/solr/build/solr-core/test/J0/temp/solr.cloud.TestAuthenticationFramework_A077203D4C55F456-001/tempDir-001/node1/./testcollection_shard1_replica_n1/data/]
   [junit4]   2> 254494 INFO  (parallelCoreAdminExecutor-921-thread-2-processing-n:127.0.0.1:41765_solr b874e66b-2385-4620-985d-af8d529fdc663109148354557835 CREATE) [n:127.0.0.1:41765_solr c:testcollection s:shard2 r:core_node7 x:testcollection_shard2_replica_n4] o.a.s.s.IndexSchema Loaded schema minimal/1.1 with uniqueid field id
   [junit4]   2> 254494 INFO  (parallelCoreAdminExecutor-921-thread-2-processing-n:127.0.0.1:41765_solr b874e66b-2385-4620-985d-af8d529fdc663109148354557835 CREATE) [n:127.0.0.1:41765_solr c:testcollection s:shard2 r:core_node7 x:testcollection_shard2_replica_n4] o.a.s.c.CoreContainer Creating SolrCore 'testcollection_shard2_replica_n4' using configuration from collection testcollection, trusted=true
   [junit4]   2> 254494 INFO  (parallelCoreAdminExecutor-921-thread-2-processing-n:127.0.0.1:41765_solr b874e66b-2385-4620-985d-af8d529fdc663109148354557835 CREATE) [n:127.0.0.1:41765_solr c:testcollection s:shard2 r:core_node7 x:testcollection_shard2_replica_n4] o.a.s.m.r.SolrJmxReporter JMX monitoring for 'solr_41765.solr.core.testcollection.shard2.replica_n4' (registry 'solr.core.testcollection.shard2.replica_n4') enabled at server: com.sun.jmx.mbeanserver.JmxMBeanServer@ded075
   [junit4]   2> 254494 INFO  (parallelCoreAdminExecutor-921-thread-2-processing-n:127.0.0.1:41765_solr b874e66b-2385-4620-985d-af8d529fdc663109148354557835 CREATE) [n:127.0.0.1:41765_solr c:testcollection s:shard2 r:core_node7 x:testcollection_shard2_replica_n4] o.a.s.c.SolrCore solr.RecoveryStrategy.Builder
   [junit4]   2> 254494 INFO  (parallelCoreAdminExecutor-921-thread-2-processing-n:127.0.0.1:41765_solr b874e66b-2385-4620-985d-af8d529fdc663109148354557835 CREATE) [n:127.0.0.1:41765_solr c:testcollection s:shard2 r:core_node7 x:testcollection_shard2_replica_n4] o.a.s.c.SolrCore [[testcollection_shard2_replica_n4] ] Opening new SolrCore at [/home/jenkins/workspace/Lucene-Solr-master-Linux/solr/build/solr-core/test/J0/temp/solr.cloud.TestAuthenticationFramework_A077203D4C55F456-001/tempDir-001/node1/testcollection_shard2_replica_n4], dataDir=[/home/jenkins/workspace/Lucene-Solr-master-Linux/solr/build/solr-core/test/J0/temp/solr.cloud.TestAuthenticationFramework_A077203D4C55F456-001/tempDir-001/node1/./testcollection_shard2_replica_n4/data/]
   [junit4]   2> 254523 INFO  (zkCallback-1880-thread-1-processing-n:127.0.0.1:36027_solr) [n:127.0.0.1:36027_solr    ] o.a.s.c.c.ZkStateReader A cluster state change: [WatchedEvent state:SyncConnected type:NodeDataChanged path:/collections/testcollection/state.json] for collection [testcollection] has occurred - updating... (live nodes size: [2])
   [junit4]   2> 254526 INFO  (zkCallback-1881-thread-3-processing-n:127.0.0.1:41765_solr) [n:127.0.0.1:41765_solr    ] o.a.s.c.c.ZkStateReader A cluster state change: [WatchedEvent state:SyncConnected type:NodeDataChanged path:/collections/testcollection/state.json] for collection [testcollection] has occurred - updating... (live nodes size: [2])
   [junit4]   2> 254539 INFO  (parallelCoreAdminExecutor-921-thread-1-processing-n:127.0.0.1:41765_solr b874e66b-2385-4620-985d-af8d529fdc663109148351002960 CREATE) [n:127.0.0.1:41765_solr c:testcollection s:shard1 r:core_node2 x:testcollection_shard1_replica_n1] o.a.s.u.UpdateHandler Using UpdateLog implementation: org.apache.solr.update.UpdateLog
   [junit4]   2> 254539 INFO  (parallelCoreAdminExecutor-921-thread-1-processing-n:127.0.0.1:41765_solr b874e66b-2385-4620-985d-af8d529fdc663109148351002960 CREATE) [n:127.0.0.1:41765_solr c:testcollection s:shard1 r:core_node2 x:testcollection_shard1_replica_n1] o.a.s.u.UpdateLog Initializing UpdateLog: dataDir=null defaultSyncLevel=FLUSH numRecordsToKeep=100 maxNumLogsToKeep=10 numVersionBuckets=65536
   [junit4]   2> 254540 INFO  (parallelCoreAdminExecutor-921-thread-1-processing-n:127.0.0.1:41765_solr b874e66b-2385-4620-985d-af8d529fdc663109148351002960 CREATE) [n:127.0.0.1:41765_solr c:testcollection s:shard1 r:core_node2 x:testcollection_shard1_replica_n1] o.a.s.u.CommitTracker Hard AutoCommit: disabled
   [junit4]   2> 254540 INFO  (parallelCoreAdminExecutor-921-thread-1-processing-n:127.0.0.1:41765_solr b874e66b-2385-4620-985d-af8d529fdc663109148351002960 CREATE) [n:127.0.0.1:41765_solr c:testcollection s:shard1 r:core_node2 x:testcollection_shard1_replica_n1] o.a.s.u.CommitTracker Soft AutoCommit: disabled
   [junit4]   2> 254541 INFO  (parallelCoreAdminExecutor-921-thread-2-processing-n:127.0.0.1:41765_solr b874e66b-2385-4620-985d-af8d529fdc663109148354557835 CREATE) [n:127.0.0.1:41765_solr c:testcollection s:shard2 r:core_node7 x:testcollection_shard2_replica_n4] o.a.s.u.UpdateHandler Using UpdateLog implementation: org.apache.solr.update.UpdateLog
   [junit4]   2> 254541 INFO  (parallelCoreAdminExecutor-921-thread-2-processing-n:127.0.0.1:41765_solr b874e66b-2385-4620-985d-af8d529fdc663109148354557835 CREATE) [n:127.0.0.1:41765_solr c:testcollection s:shard2 r:core_node7 x:testcollection_shard2_replica_n4] o.a.s.u.UpdateLog Initializing UpdateLog: dataDir=null defaultSyncLevel=FLUSH numRecordsToKeep=100 maxNumLogsToKeep=10 numVersionBuckets=65536
   [junit4]   2> 254541 INFO  (parallelCoreAdminExecutor-921-thread-1-processing-n:127.0.0.1:41765_solr b874e66b-2385-4620-985d-af8d529fdc663109148351002960 CREATE) [n:127.0.0.1:41765_solr c:testcollection s:shard1 r:core_node2 x:testcollection_shard1_replica_n1] o.a.s.s.SolrIndexSearcher Opening [Searcher@1802c9b[testcollection_shard1_replica_n1] main]
   [junit4]   2> 254542 INFO  (parallelCoreAdminExecutor-921-thread-2-processing-n:127.0.0.1:41765_solr b874e66b-2385-4620-985d-af8d529fdc663109148354557835 CREATE) [n:127.0.0.1:41765_solr c:testcollection s:shard2 r:core_node7 x:testcollection_shard2_replica_n4] o.a.s.u.CommitTracker Hard AutoCommit: disabled
   [junit4]   2> 254542 INFO  (parallelCoreAdminExecutor-921-thread-2-processing-n:127.0.0.1:41765_solr b874e66b-2385-4620-985d-af8d529fdc663109148354557835 CREATE) [n:127.0.0.1:41765_solr c:testcollection s:shard2 r:core_node7 x:testcollection_shard2_replica_n4] o.a.s.u.CommitTracker Soft AutoCommit: disabled
   [junit4]   2> 254542 INFO  (parallelCoreAdminExecutor-921-thread-1-processing-n:127.0.0.1:41765_solr b874e66b-2385-4620-985d-af8d529fdc663109148351002960 CREATE) [n:127.0.0.1:41765_solr c:testcollection s:shard1 r:core_node2 x:testcollection_shard1_replica_n1] o.a.s.r.ManagedResourceStorage Configured ZooKeeperStorageIO with znodeBase: /configs/solrCloudCollectionConfig
   [junit4]   2> 254542 INFO  (parallelCoreAdminExecutor-921-thread-1-processing-n:127.0.0.1:41765_solr b874e66b-2385-4620-985d-af8d529fdc663109148351002960 CREATE) [n:127.0.0.1:41765_solr c:testcollection s:shard1 r:core_node2 x:testcollection_shard1_replica_n1] o.a.s.r.ManagedResourceStorage Loaded null at path _rest_managed.json using ZooKeeperStorageIO:path=/configs/solrCloudCollectionConfig
   [junit4]   2> 254543 INFO  (parallelCoreAdminExecutor-921-thread-2-processing-n:127.0.0.1:41765_solr b874e66b-2385-4620-985d-af8d529fdc663109148354557835 CREATE) [n:127.0.0.1:41765_solr c:testcollection s:shard2 r:core_node7 x:testcollection_shard2_replica_n4] o.a.s.s.SolrIndexSearcher Opening [Searcher@28e1af[testcollection_shard2_replica_n4] main]
   [junit4]   2> 254543 INFO  (parallelCoreAdminExecutor-921-thread-1-processing-n:127.0.0.1:41765_solr b874e66b-2385-4620-985d-af8d529fdc663109148351002960 CREATE) [n:127.0.0.1:41765_solr c:testcollection s:shard1 r:core_node2 x:testcollection_shard1_replica_n1] o.a.s.h.ReplicationHandler Commits will be reserved for 10000ms.
   [junit4]   2> 254543 INFO  (parallelCoreAdminExecutor-921-thread-1-processing-n:127.0.0.1:41765_solr b874e66b-2385-4620-985d-af8d529fdc663109148351002960 CREATE) [n:127.0.0.1:41765_solr c:testcollection s:shard1 r:core_node2 x:testcollection_shard1_replica_n1] o.a.s.u.UpdateLog Could not find max version in index or recent updates, using new clock 1580403576573788160
   [junit4]   2> 254546 INFO  (searcherExecutor-935-thread-1-processing-x:testcollection_shard1_replica_n1 r:core_node2 b874e66b-2385-4620-985d-af8d529fdc663109148351002960 CREATE n:127.0.0.1:41765_solr s:shard1 c:testcollection) [n:127.0.0.1:41765_solr c:testcollection s:shard1 r:core_node2 x:testcollection_shard1_replica_n1] o.a.s.c.SolrCore [testcollection_shard1_replica_n1] Registered new searcher Searcher@1802c9b[testcollection_shard1_replica_n1] main{ExitableDirectoryReader(UninvertingDirectoryReader())}
   [junit4]   2> 254546 INFO  (parallelCoreAdminExecutor-921-thread-2-processing-n:127.0.0.1:41765_solr b874e66b-2385-4620-985d-af8d529fdc663109148354557835 CREATE) [n:127.0.0.1:41765_solr c:testcollection s:shard2 r:core_node7 x:testcollection_shard2_replica_n4] o.a.s.r.ManagedResourceStorage Configured ZooKeeperStorageIO with znodeBase: /configs/solrCloudCollectionConfig
   [junit4]   2> 254546 INFO  (parallelCoreAdminExecutor-921-thread-2-processing-n:127.0.0.1:41765_solr b874e66b-2385-4620-985d-af8d529fdc663109148354557835 CREATE) [n:127.0.0.1:41765_solr c:testcollection s:shard2 r:core_node7 x:testcollection_shard2_replica_n4] o.a.s.r.ManagedResourceStorage Loaded null at path _rest_managed.json using ZooKeeperStorageIO:path=/configs/solrCloudCollectionConfig
   [junit4]   2> 254547 INFO  (parallelCoreAdminExecutor-921-thread-2-processing-n:127.0.0.1:41765_solr b874e66b-2385-4620-985d-af8d529fdc663109148354557835 CREATE) [n:127.0.0.1:41765_solr c:testcollection s:shard2 r:core_node7 x:testcollection_shard2_replica_n4] o.a.s.h.ReplicationHandler Commits will be reserved for 10000ms.
   [junit4]   2> 254548 INFO  (searcherExecutor-936-thread-1-processing-x:testcollection_shard2_replica_n4 r:core_node7 b874e66b-2385-4620-985d-af8d529fdc663109148354557835 CREATE n:127.0.0.1:41765_solr s:shard2 c:testcollection) [n:127.0.0.1:41765_solr c:testcollection s:shard2 r:core_node7 x:testcollection_shard2_replica_n4] o.a.s.c.SolrCore [testcollection_shard2_replica_n4] Registered new searcher Searcher@28e1af[testcollection_shard2_replica_n4] main{ExitableDirectoryReader(UninvertingDirectoryReader())}
   [junit4]   2> 254548 INFO  (parallelCoreAdminExecutor-921-thread-2-processing-n:127.0.0.1:41765_solr b874e66b-2385-4620-985d-af8d529fdc663109148354557835 CREATE) [n:127.0.0.1:41765_solr c:testcollection s:shard2 r:core_node7 x:testcollection_shard2_replica_n4] o.a.s.u.UpdateLog Could not find max version in index or recent updates, using new clock 1580403576579031040
   [junit4]   2> 254919 INFO  (parallelCoreAdminExecutor-923-thread-1-processing-n:127.0.0.1:36027_solr b874e66b-2385-4620-985d-af8d529fdc663109148355321940 CREATE) [n:127.0.0.1:36027_solr c:testcollection s:shard2 r:core_node8 x:testcollection_shard2_replica_n6] o.a.s.c.ShardLeaderElectionContext Enough replicas found to continue.
   [junit4]   2> 254919 INFO  (parallelCoreAdminExecutor-923-thread-1-processing-n:127.0.0.1:36027_solr b874e66b-2385-4620-985d-af8d529fdc663109148355321940 CREATE) [n:127.0.0.1:36027_solr c:testcollection s:shard2 r:core_node8 x:testcollection_shard2_replica_n6] o.a.s.c.ShardLeaderElectionContext I may be the new leader - try and sync
   [junit4]   2> 254919 INFO  (parallelCoreAdminExecutor-923-thread-1-processing-n:127.0.0.1:36027_solr b874e66b-2385-4620-985d-af8d529fdc663109148355321940 CREATE) [n:127.0.0.1:36027_solr c:testcollection s:shard2 r:core_node8 x:testcollection_shard2_replica_n6] o.a.s.c.SyncStrategy Sync replicas to https://127.0.0.1:36027/solr/testcollection_shard2_replica_n6/
   [junit4]   2> 254920 INFO  (parallelCoreAdminExecutor-923-thread-1-processing-n:127.0.0.1:36027_solr b874e66b-2385-4620-985d-af8d529fdc663109148355321940 CREATE) [n:127.0.0.1:36027_solr c:testcollection s:shard2 r:core_node8 x:testcollection_shard2_replica_n6] o.a.s.u.PeerSync PeerSync: core=testcollection_shard2_replica_n6 url=https://127.0.0.1:36027/solr START replicas=[https://127.0.0.1:41765/solr/testcollection_shard2_replica_n4/] nUpdates=100
   [junit4]   2> 254922 INFO  (parallelCoreAdminExecutor-923-thread-2-processing-n:127.0.0.1:36027_solr b874e66b-2385-4620-985d-af8d529fdc663109148352552701 CREATE) [n:127.0.0.1:36027_solr c:testcollection s:shard1 r:core_node5 x:testcollection_shard1_replica_n3] o.a.s.c.ShardLeaderElectionContext Enough replicas found to continue.
   [junit4]   2> 254922 INFO  (parallelCoreAdminExecutor-923-thread-2-processing-n:127.0.0.1:36027_solr b874e66b-2385-4620-985d-af8d529fdc663109148352552701 CREATE) [n:127.0.0.1:36027_solr c:testcollection s:shard1 r:core_node5 x:testcollection_shard1_replica_n3] o.a.s.c.ShardLeaderElectionContext I may be the new leader - try and sync
   [junit4]   2> 254922 INFO  (parallelCoreAdminExecutor-923-thread-2-processing-n:127.0.0.1:36027_solr b874e66b-2385-4620-985d-af8d529fdc663109148352552701 CREATE) [n:127.0.0.1:36027_solr c:testcollection s:shard1 r:core_node5 x:testcollection_shard1_replica_n3] o.a.s.c.SyncStrategy Sync replicas to https://127.0.0.1:36027/solr/testcollection_shard1_replica_n3/
   [junit4]   2> 254922 INFO  (parallelCoreAdminExecutor-923-thread-2-processing-n:127.0.0.1:36027_solr b874e66b-2385-4620-985d-af8d529fdc663109148352552701 CREATE) [n:127.0.0.1:36027_solr c:testcollection s:shard1 r:core_node5 x:testcollection_shard1_replica_n3] o.a.s.u.PeerSync PeerSync: core=testcollection_shard1_replica_n3 url=https://127.0.0.1:36027/solr START replicas=[https://127.0.0.1:41765/solr/testcollection_shard1_replica_n1/] nUpdates=100
   [junit4]   2> 254931 INFO  (qtp19342888-4452) [n:127.0.0.1:41765_solr c:testcollection s:shard2 r:core_node7 x:testcollection_shard2_replica_n4] o.a.s.c.S.Request [testcollection_shard2_replica_n4]  webapp=/solr path=/get params={distrib=false&qt=/get&fingerprint=false&getVersions=100&wt=javabin&version=2} status=0 QTime=0
   [junit4]   2> 254937 INFO  (qtp19342888-4462) [n:127.0.0.1:41765_solr c:testcollection s:shard1 r:core_node2 x:testcollection_shard1_replica_n1] o.a.s.c.S.Request [testcollection_shard1_replica_n1]  webapp=/solr path=/get params={distrib=false&qt=/get&fingerprint=false&getVersions=100&wt=javabin&version=2} status=0 QTime=0
   [junit4]   2> 254937 INFO  (qtp32178861-4459) [n:127.0.0.1:36027_solr    ] o.a.s.h.a.CollectionsHandler Invoked Collection Action :requeststatus with params requestid=b874e66b-2385-4620-985d-af8d529fdc66&action=REQUESTSTATUS&wt=javabin&version=2 and sendToOCPQueue=true
   [junit4]   2> 254941 INFO  (qtp32178861-4459) [n:127.0.0.1:36027_solr    ] o.a.s.s.HttpSolrCall [admin] webapp=null path=/admin/collections params={requestid=b874e66b-2385-4620-985d-af8d529fdc66&action=REQUESTSTATUS&wt=javabin&version=2} status=0 QTime=4
   [junit4]   2> 255220 INFO  (parallelCoreAdminExecutor-923-thread-1-processing-n:127.0.0.1:36027_solr b874e66b-2385-4620-985d-af8d529fdc663109148355321940 CREATE) [n:127.0.0.1:36027_solr c:testcollection s:shard2 r:core_node8 x:testcollection_shard2_replica_n6] o.a.s.u.PeerSync PeerSync: core=testcollection_shard2_replica_n6 url=https://127.0.0.1:36027/solr DONE.  We have no versions.  sync failed.
   [junit4]   2> 255220 INFO  (parallelCoreAdminExecutor-923-thread-1-processing-n:127.0.0.1:36027_solr b874e66b-2385-4620-985d-af8d529fdc663109148355321940 CREATE) [n:127.0.0.1:36027_solr c:testcollection s:shard2 r:core_node8 x:testcollection_shard2_replica_n6] o.a.s.c.SyncStrategy Leader's attempt to sync with shard failed, moving to the next candidate
   [junit4]   2> 255220 INFO  (parallelCoreAdminExecutor-923-thread-1-processing-n:127.0.0.1:36027_solr b874e66b-2385-4620-985d-af8d529fdc663109148355321940 CREATE) [n:127.0.0.1:36027_solr c:testcollection s:shard2 r:core_node8 x:testcollection_shard2_replica_n6] o.a.s.c.ShardLeaderElectionContext We failed sync, but we have no versions - we can't sync in that case - we were active before, so become leader anyway
   [junit4]   2> 255220 INFO  (parallelCoreAdminExecutor-923-thread-1-processing-n:127.0.0.1:36027_solr b874e66b-2385-4620-985d-af8d529fdc663109148355321940 CREATE) [n:127.0.0.1:36027_solr c:testcollection s:shard2 r:core_node8 x:testcollection_shard2_replica_n6] o.a.s.c.ShardLeaderElectionContext Found all replicas participating in election, clear LIR
   [junit4]   2> 255222 INFO  (parallelCoreAdminExecutor-923-thread-1-processing-n:127.0.0.1:36027_solr b874e66b-2385-4620-985d-af8d529fdc663109148355321940 CREATE) [n:127.0.0.1:36027_solr c:testcollection s:shard2 r:core_node8 x:testcollection_shard2_replica_n6] o.a.s.c.ShardLeaderElectionContext I am the new leader: https://127.0.0.1:36027/solr/testcollection_shard2_replica_n6/ shard2
   [junit4]   2> 255222 INFO  (parallelCoreAdminExecutor-923-thread-2-processing-n:127.0.0.1:36027_solr b874e66b-2385-4620-985d-af8d529fdc663109148352552701 CREATE) [n:127.0.0.1:36027_solr c:testcollection s:shard1 r:core_node5 x:testcollection_shard1_replica_n3] o.a.s.u.PeerSync PeerSync: core=testcollection_shard1_replica_n3 url=https://127.0.0.1:36027/solr DONE.  We have no versions.  sync failed.
   [junit4]   2> 255222 INFO  (parallelCoreAdminExecutor-923-thread-2-processing-n:127.0.0.1:36027_solr b874e66b-2385-4620-985d-af8d529fdc663109148352552701 CREATE) [n:127.0.0.1:36027_solr c:testcollection s:shard1 r:core_node5 x:testcollection_shard1_replica_n3] o.a.s.c.SyncStrategy Leader's attempt to sync with shard failed, moving to the next candidate
   [junit4]   2> 255222 INFO  (parallelCoreAdminExecutor-923-thread-2-processing-n:127.0.0.1:36027_solr b874e66b-2385-4620-985d-af8d529fdc663109148352552701 CREATE) [n:127.0.0.1:36027_solr c:testcollection s:shard1 r:core_node5 x:testcollection_shard1_replica_n3] o.a.s.c.ShardLeaderElectionContext We failed sync, but we have no versions - we can't sync in that case - we were active before, so become leader anyway
   [junit4]   2> 255222 INFO  (parallelCoreAdminExecutor-923-thread-2-processing-n:127.0.0.1:36027_solr b874e66b-2385-4620-985d-af8d529fdc663109148352552701 CREATE) [n:127.0.0.1:36027_solr c:testcollection s:shard1 r:core_node5 x:testcollection_shard1_replica_n3] o.a.s.c.ShardLeaderElectionContext Found all replicas participating in election, clear LIR
   [junit4]   2> 255225 INFO  (parallelCoreAdminExecutor-923-thread-2-processing-n:127.0.0.1:36027_solr b874e66b-2385-4620-985d-af8d529fdc663109148352552701 CREATE) [n:127.0.0.1:36027_solr c:testcollection s:shard1 r:core_node5 x:testcollection_shard1_replica_n3] o.a.s.c.ShardLeaderElectionContext I am the new leader: https://127.0.0.1:36027/solr/testcollection_shard1_replica_n3/ shard1
   [junit4]   2> 255327 INFO  (zkCallback-1880-thread-1-processing-n:127.0.0.1:36027_solr) [n:127.0.0.1:36027_solr    ] o.a.s.c.c.ZkStateReader A cluster state change: [WatchedEvent state:SyncConnected type:NodeDataChanged path:/collections/testcollection/state.json] for collection [testcollection] has occurred - updating... (live nodes size: [2])
   [junit4]   2> 255327 INFO  (zkCallback-1881-thread-3-processing-n:127.0.0.1:41765_solr) [n:127.0.0.1:41765_solr    ] o.a.s.c.c.ZkStateReader A cluster state change: [WatchedEvent state:SyncConnected type:NodeDataChanged path:/collections/testcollection/state.json] for collection [testcollection] has occurred - updating... (live nodes size: [2])
   [junit4]   2> 255372 INFO  (parallelCoreAdminExecutor-923-thread-1-processing-n:127.0.0.1:36027_solr b874e66b-2385-4620-985d-af8d529fdc663109148355321940 CREATE) [n:127.0.0.1:36027_solr c:testcollection s:shard2 r:core_node8 x:testcollection_shard2_replica_n6] o.a.s.c.ZkController I am the leader, no recovery necessary
   [junit4]   2> 255376 INFO  (parallelCoreAdminExecutor-923-thread-2-processing-n:127.0.0.1:36027_solr b874e66b-2385-4620-985d-af8d529fdc663109148352552701 CREATE) [n:127.0.0.1:36027_solr c:testcollection s:shard1 r:core_node5 x:testcollection_shard1_replica_n3] o.a.s.c.ZkController I am the leader, no recovery necessary
   [junit4]   2> 255456 INFO  (qtp19342888-4447) [n:127.0.0.1:41765_solr    ] o.a.s.h.a.CoreAdminOperation Checking request status for : b874e66b-2385-4620-985d-af8d529fdc663109148354557835
   [junit4]   2> 255456 INFO  (qtp19342888-4447) [n:127.0.0.1:41765_solr    ] o.a.s.s.HttpSolrCall [admin] webapp=null path=/admin/cores params={qt=/admin/cores&requestid=b874e66b-2385-4620-985d-af8d529fdc663109148354557835&action=REQUESTSTATUS&wt=javabin&version=2} status=0 QTime=0
   [junit4]   2> 255478 INFO  (zkCallback-1880-thread-1-processing-n:127.0.0.1:36027_solr) [n:127.0.0.1:36027_solr    ] o.a.s.c.c.ZkStateReader A cluster state change: [WatchedEvent state:SyncConnected type:NodeDataChanged path:/collections/testcollection/state.json] for collection [testcollection] has occurred - updating... (live nodes size: [2])
   [junit4]   2> 255478 INFO  (zkCallback-1881-thread-3-processing-n:127.0.0.1:41765_solr) [n:127.0.0.1:41765_solr    ] o.a.s.c.c.ZkStateReader A cluster state change: [WatchedEvent state:SyncConnected type:NodeDataChanged path:/collections/testcollection/state.json] for collection [testcollection] has occurred - updating... (live nodes size: [2])
   [junit4]   2> 255652 INFO  (zkCallback-1880-thread-1-processing-n:127.0.0.1:36027_solr) [n:127.0.0.1:36027_solr    ] o.a.s.c.c.ZkStateReader A cluster state change: [WatchedEvent state:SyncConnected type:NodeDataChanged path:/collections/testcollection/state.json] for collection [testcollection] has occurred - updating... (live nodes size: [2])
   [junit4]   2> 255652 INFO  (zkCallback-1881-thread-3-processing-n:127.0.0.1:41765_solr) [n:127.0.0.1:41765_solr    ] o.a.s.c.c.ZkStateReader A cluster state change: [WatchedEvent state:SyncConnected type:NodeDataChanged path:/collections/testcollection/state.json] for collection [testcollection] has occurred - updating... (live nodes size: [2])
   [junit4]   2> 255942 INFO  (qtp32178861-4450) [n:127.0.0.1:36027_solr    ] o.a.s.h.a.CollectionsHandler Invoked Collection Action :requeststatus with params requestid=b874e66b-2385-4620-985d-af8d529fdc66&action=REQUESTSTATUS&wt=javabin&version=2 and sendToOCPQueue=true
   [junit4]   2> 255942 INFO  (qtp32178861-4450) [n:127.0.0.1:36027_solr    ] o.a.s.s.HttpSolrCall [admin] webapp=null path=/admin/collections params={requestid=b874e66b-2385-4620-985d-af8d529fdc66&action=REQUESTSTATUS&wt=javabin&version=2} status=0 QTime=0
   [junit4]   2> 256457 INFO  (qtp19342888-4458) [n:127.0.0.1:41765_solr    ] o.a.s.h.a.CoreAdminOperation Checking request status for : b874e66b-2385-4620-985d-af8d529fdc663109148354557835
   [junit4]   2> 256457 INFO  (qtp19342888-4458) [n:127.0.0.1:41765_solr    ] o.a.s.s.HttpSolrCall [admin] webapp=null path=/admin/cores params={qt=/admin/cores&requestid=b874e66b-2385-4620-985d-af8d529fdc663109148354557835&action=REQUESTSTATUS&wt=javabin&version=2} status=0 QTime=0
   [junit4]   2> 256463 INFO  (qtp32178861-4455) [n:127.0.0.1:36027_solr    ] o.a.s.h.a.CoreAdminOperation Checking request status for : b874e66b-2385-4620-985d-af8d529fdc663109148355321940
   [junit4]   2> 256463 INFO  (qtp32178861-4455) [n:127.0.0.1:36027_solr    ] o.a.s.s.HttpSolrCall [admin] webapp=null path=/admin/cores params={qt=/admin/cores&requestid=b874e66b-2385-4620-985d-af8d529fdc663109148355321940&action=REQUESTSTATUS&wt=javabin&version=2} status=0 QTime=0
   [junit4]   2> 256465 INFO  (OverseerThreadFactory-920-thread-1-processing-n:127.0.0.1:41765_solr) [n:127.0.0.1:41765_solr    ] o.a.s.c.OverseerTaskQueue Response ZK path: /overseer/collection-queue-work/qnr-0000000000 doesn't exist.  Requestor may have disconnected from ZooKeeper
   [junit4]   2> 256936 INFO  (OverseerCollectionConfigSetProcessor-98775223407411206-127.0.0.1:41765_solr-n_0000000000) [n:127.0.0.1:41765_solr    ] o.a.s.c.OverseerTaskQueue Response ZK path: /overseer/collection-queue-work/qnr-0000000000 doesn't exist.  Requestor may have disconnected from ZooKeeper
   [junit4]   2> 256943 INFO  (qtp32178861-4446) [n:127.0.0.1:36027_solr    ] o.a.s.h.a.CollectionsHandler Invoked Collection Action :requeststatus with params requestid=b874e66b-2385-4620-985d-af8d529fdc66&action=REQUESTSTATUS&wt=javabin&version=2 and sendToOCPQueue=true
   [junit4]   2> 256944 INFO  (qtp32178861-4446) [n:127.0.0.1:36027_solr    ] o.a.s.s.HttpSolrCall [admin] webapp=null path=/admin/collections params={requestid=b874e66b-2385-4620-985d-af8d529fdc66&action=REQUESTSTATUS&wt=javabin&version=2} status=0 QTime=1
   [junit4]   2> 256945 INFO  (qtp32178861-4459) [n:127.0.0.1:36027_solr    ] o.a.s.h.a.CollectionsHandler Invoked Collection Action :deletestatus with params requestid=b874e66b-2385-4620-985d-af8d529fdc66&action=DELETESTATUS&wt=javabin&version=2 and sendToOCPQueue=true
   [junit4]   2> 256947 INFO  (qtp32178861-4459) [n:127.0.0.1:36027_solr    ] o.a.s.s.HttpSolrCall [admin] webapp=null path=/admin/collections params={requestid=b874e66b-2385-4620-985d-af8d529fdc66&action=DELETESTATUS&wt=javabin&version=2} status=0 QTime=2
   [junit4]   2> 256948 INFO  (TEST-TestAuthenticationFramework.testBasics-seed#[A077203D4C55F456]) [    ] o.a.s.c.AbstractDistribZkTestBase Wait for recoveries to finish - collection: testcollection failOnTimeout:true timeout (sec):330
   [junit4]   1> -
   [junit4]   1> replica:core_node2 rstate:active live:true
   [junit4]   1> replica:core_node5 rstate:active live:true
   [junit4]   1> replica:core_node7 rstate:active live:true
   [junit4]   1> replica:core_node8 rstate:active live:true
   [junit4]   1> no one is recoverying
   [junit4]   2> 256948 INFO  (TEST-TestAuthenticationFramework.testBasics-seed#[A077203D4C55F456]) [    ] o.a.s.c.AbstractDistribZkTestBase Recoveries finished - collection: testcollection
   [junit4]   2> 256956 INFO  (qtp19342888-4458) [n:127.0.0.1:41765_solr c:testcollection s:shard2 r:core_node7 x:testcollection_shard2_replica_n4] o.a.s.c.S.Request [testcollection_shard2_replica_n4]  webapp=/solr path=/select params={df=text&distrib=false&_stateVer_=testcollection:7&fl=id&fl=score&shards.purpose=4&start=0&fsv=true&shard.url=https://127.0.0.1:41765/solr/testcollection_shard2_replica_n4/|https://127.0.0.1:36027/solr/testcollection_shard2_replica_n6/&rows=10&version=2&q=*:*&NOW=1507190302945&isShard=true&wt=javabin} hits=0 status=0 QTime=0
   [junit4]   2> 256960 INFO  (qtp32178861-4457) [n:127.0.0.1:36027_solr c:testcollection s:shard1 r:core_node5 x:testcollection_shard1_replica_n3] o.a.s.c.S.Request [testcollection_shard1_replica_n3]  webapp=/solr path=/select params={df=text&distrib=false&_stateVer_=testcollection:7&fl=id&fl=score&shards.purpose=4&start=0&fsv=true&shard.url=https://127.0.0.1:36027/solr/testcollection_shard1_replica_n3/|https://127.0.0.1:41765/solr/testcollection_shard1_replica_n1/&rows=10&version=2&q=*:*&NOW=1507190302945&isShard=true&wt=javabin} hits=0 status=0 QTime=0
   [junit4]   2> 256961 INFO  (qtp19342888-4447) [n:127.0.0.1:41765_solr c:testcollection s:shard2 r:core_node7 x:testcollection_shard2_replica_n4] o.a.s.c.S.Request [testcollection_shard2_replica_n4]  webapp=/solr path=/select params={q=*:*&_stateVer_=testcollection:7&wt=javabin&version=2} hits=0 status=0 QTime=7
   [junit4]   2> 256993 INFO  (qtp19342888-4454) [n:127.0.0.1:41765_solr c:testcollection s:shard1 r:core_node2 x:testcollection_shard1_replica_n1] o.a.s.u.p.LogUpdateProcessorFactory [testcollection_shard1_replica_n1]  webapp=/solr path=/update params={update.distrib=FROMLEADER&distrib.from=https://127.0.0.1:36027/solr/testcollection_shard1_replica_n3/&wt=javabin&version=2}{add=[1 (1580403579119730688)]} 0 17
   [junit4]   2> 256993 INFO  (qtp32178861-4450) [n:127.0.0.1:36027_solr c:testcollection s:shard1 r:core_node5 x:testcollection_shard1_replica_n3] o.a.s.u.p.LogUpdateProcessorFactory [testcollection_shard1_replica_n3]  webapp=/solr path=/update params={_stateVer_=testcollection:7&wt=javabin&version=2}{add=[1 (1580403579119730688)]} 0 23
   [junit4]   2> 256994 INFO  (qtp19342888-4462) [n:127.0.0.1:41765_solr c:testcollection s:shard1 r:core_node2 x:testcollection_shard1_replica_n1] o.a.s.u.DirectUpdateHandler2 start commit{_version_=1580403579143847936,optimize=false,openSearcher=true,waitSearcher=true,expungeDeletes=false,softCommit=false,prepareCommit=false}
   [junit4]   2> 256994 INFO  (qtp19342888-4462) [n:127.0.0.1:41765_solr c:testcollection s:shard1 r:core_node2 x:testcollection_shard1_replica_n1] o.a.s.u.SolrIndexWriter Calling setCommitData with IW:org.apache.solr.update.SolrIndexWriter@10cb5ce commitCommandVersion:1580403579143847936
   [junit4]   2> 257018 INFO  (qtp19342888-4449) [n:127.0.0.1:41765_solr c:testcollection s:shard2 r:core_node7 x:testcollection_shard2_replica_n4] o.a.s.u.DirectUpdateHandler2 start commit{_version_=1580403579169013760,optimize=false,openSearcher=true,waitSearcher=true,expungeDeletes=false,softCommit=false,prepareCommit=false}
   [junit4]   2> 257019 INFO  (qtp19342888-4449) [n:127.0.0.1:41765_solr c:testcollection s:shard2 r:core_node7 x:testcollection_shard2_replica_n4] o.a.s.u.DirectUpdateHandler2 No uncommitted changes. Skipping IW.commit.
   [junit4]   2> 257020 INFO  (qtp19342888-4449) [n:127.0.0.1:41765_solr c:testcollection s:shard2 r:core_node7 x:testcollection_shard2_replica_n4] o.a.s.u.DirectUpdateHandler2 end_commit_flush
   [junit4]   2> 257020 INFO  (qtp19342888-4449) [n:127.0.0.1:41765_solr c:testcollection s:shard2 r:core_node7 x:testcollection_shard2_replica_n4] o.a.s.u.p.LogUpdateProcessorFactory [testcollection_shard2_replica_n4]  webapp=/solr path=/update params={update.distrib=FROMLEADER&waitSearcher=true&openSearcher=true&commit=true&softCommit=false&distrib.from=https://127.0.0.1:36027/solr/testcollection_shard1_replica_n3/&commit_end_point=true&wt=javabin&version=2&expungeDeletes=false}{commit=} 0 1
   [junit4]   2> 257021 INFO  (qtp19342888-4462) [n:127.0.0.1:41765_solr c:testcollection s:shard1 r:core_node2 x:testcollection_shard1_replica_n1] o.a.s.s.SolrIndexSearcher Opening [Searcher@449e76[testcollection_shard1_replica_n1] main]
   [junit4]   2> 257021 INFO  (qtp19342888-4462) [n:127.0.0.1:41765_solr c:testcollection s:shard1 r:core_node2 x:testcollection_shard1_replica_n1] o.a.s.u.DirectUpdateHandler2 end_commit_flush
   [junit4]   2> 257035 INFO  (qtp32178861-4457) [n:127.0.0.1:36027_solr c:testcollection s:shard1 r:core_node5 x:testcollection_shard1_replica_n3] o.a.s.u.DirectUpdateHandler2 start commit{_version_=1580403579186839552,optimize=false,openSearcher=true,waitSearcher=true,expungeDeletes=false,softCommit=false,prepareCommit=false}
   [junit4]   2> 257035 INFO  (qtp32178861-4457) [n:127.0.0.1:36027_solr c:testcollection s:shard1 r:core_node5 x:testcollection_shard1_replica_n3] o.a.s.u.SolrIndexWriter Calling setCommitData with IW:org.apache.solr.update.SolrIndexWriter@17bc5cc commitCommandVersion:1580403579186839552
   [junit4]   2> 257038 INFO  (qtp32178861-4451) [n:127.0.0.1:36027_solr c:testcollection s:shard2 r:core_node8 x:testcollection_shard2_replica_n6] o.a.s.u.DirectUpdateHandler2 start commit{_version_=1580403579189985280,optimize=false,openSearcher=true,waitSearcher=true,expungeDeletes=false,softCommit=false,prepareCommit=false}
   [junit4]   2> 257048 INFO  (searcherExecutor-935-thread-1-processing-n:127.0.0.1:41765_solr x:testcollection_shard1_replica_n1 s:shard1 c:testcollection r:core_node2) [n:127.0.0.1:41765_solr c:testcollection s:shard1 r:core_node2 x:testcollection_shard1_replica_n1] o.a.s.c.SolrCore [testcollection_shard1_replica_n1] Registered new searcher Searcher@449e76[testcollection_shard1_replica_n1] main{ExitableDirectoryReader(UninvertingDirectoryReader(Uninverting(_0(8.0.0):C1)))}
   [junit4]   2> 257048 INFO  (qtp19342888-4462) [n:127.0.0.1:41765_solr c:testcollection s:shard1 r:core_node2 x:testcollection_shard1_replica_n1] o.a.s.u.p.LogUpdateProcessorFactory [testcollection_shard1_replica_n1]  webapp=/solr path=/update params={update.distrib=FROMLEADER&waitSearcher=true&openSearcher=true&commit=true&softCommit=false&distrib.from=https://127.0.0.1:36027/solr/testcollection_shard1_replica_n3/&commit_end_point=true&wt=javabin&version=2&expungeDeletes=false}{commit=} 0 53
   [junit4]   2> 257052 INFO  (qtp32178861-4451) [n:127.0.0.1:36027_solr c:testcollection s:shard2 r:core_node8 x:testcollection_shard2_replica_n6] o.a.s.u.DirectUpdateHandler2 No uncommitted changes. Skipping IW.commit.
   [junit4]   2> 257056 INFO  (qtp32178861-4457) [n:127.0.0.1:36027_solr c:testcollection s:shard1 r:core_node5 x:testcollection_shard1_replica_n3] o.a.s.s.SolrIndexSearcher Opening [Searcher@17de34c[testcollection_shard1_replica_n3] main]
   [junit4]   2> 257057 INFO  (qtp32178861-4457) [n:127.0.0.1:36027_solr c:testcollection s:shard1 r:core_node5 x:testcollection_shard1_replica_n3] o.a.s.u.DirectUpdateHandler2 end_commit_flush
   [junit4]   2> 257057 INFO  (qtp32178861-4451) [n:127.0.0.1:36027_solr c:testcollection s:shard2 r:core_node8 x:testcollection_shard2_replica_n6] o.a.s.u.DirectUpdateHandler2 end_commit_flush
   [junit4]   2> 257057 INFO  (qtp32178861-4451) [n:127.0.0.1:36027_solr c:testcollection s:shard2 r:core_node8 x:testcollection_shard2_replica_n6] o.a.s.u.p.LogUpdateProcessorFactory [testcollection_shard2_replica_n6]  webapp=/solr path=/update params={update.distrib=FROMLEADER&waitSearcher=true&openSearcher=true&commit=true&softCommit=false&distrib.from=https://127.0.0.1:36027/solr/testcollection_shard1_replica_n3/&commit_end_point=true&wt=javabin&version=2&expungeDeletes=false}{commit=} 0 18
   [junit4]   2> 257058 INFO  (searcherExecutor-925-thread-1-processing-n:127.0.0.1:36027_solr x:testcollection_shard1_replica_n3 s:shard1 c:testcollection r:core_node5) [n:127.0.0.1:36027_solr c:testcollection s:shard1 r:core_node5 x:testcollection_shard1_replica_n3] o.a.s.c.SolrCore [testcollection_shard1_replica_n3] Registered new searcher Searcher@17de34c[testcollection_shard1_replica_n3] main{ExitableDirectoryReader(UninvertingDirectoryReader(Uninverting(_0(8.0.0):C1)))}
   [junit4]   2> 257058 INFO  (qtp32178861-4457) [n:127.0.0.1:36027_solr c:testcollection s:shard1 r:core_node5 x:testcollection_shard1_replica_n3] o.a.s.u.p.LogUpdateProcessorFactory [testcollection_shard1_replica_n3]  webapp=/solr path=/update params={update.distrib=FROMLEADER&waitSearcher=true&openSearcher=true&commit=true&softCommit=false&distrib.from=https://127.0.0.1:36027/solr/testcollection_shard1_replica_n3/&commit_end_point=true&wt=javabin&version=2&expungeDeletes=false}{commit=} 0 23
   [junit4]   2> 257058 INFO  (qtp32178861-4446) [n:127.0.0.1:36027_solr c:testcollection s:shard1 r:core_node5 x:testcollection_shard1_replica_n3] o.a.s.u.p.LogUpdateProcessorFactory [testcollection_shard1_replica_n3]  webapp=/solr path=/update params={_stateVer_=testcollection:7&commit=true&wt=javabin&version=2}{commit=} 0 65
   [junit4]   2> 257060 INFO  (qtp32178861-4455) [n:127.0.0.1:36027_solr c:testcollection s:shard1 r:core_node5 x:testcollection_shard1_replica_n3] o.a.s.c.S.Request [testcollection_shard1_replica_n3]  webapp=/solr path=/select params={df=text&distrib=false&_stateVer_=testcollection:7&fl=id&fl=score&shards.purpose=4&start=0&fsv=true&shard.url=https://127.0.0.1:36027/solr/testcollection_shard1_replica_n3/|https://127.0.0.1:41765/solr/testcollection_shard1_replica_n1/&rows=10&version=2&q=*:*&NOW=1507190303051&isShard=true&wt=javabin} hits=1 status=0 QTime=0
   [junit4]   2> 257061 INFO  (qtp19342888-4454) [n:127.0.0.1:41765_solr c:testcollection s:shard2 r:core_node7 x:testcollection_shard2_replica_n4] o.a.s.c.S.Request [testcollection_shard2_replica_n4]  webapp=/solr path=/select params={df=text&distrib=false&_stateVer_=testcollection:7&fl=id&fl=score&shards.purpose=4&start=0&fsv=true&shard.url=https://127.0.0.1:41765/solr/testcollection_shard2_replica_n4/|https://127.0.0.1:36027/solr/testcollection_shard2_replica_n6/&rows=10&version=2&q=*:*&NOW=1507190303051&isShard=true&wt=javabin} hits=0 status=0 QTime=0
   [junit4]   2> 257062 INFO  (qtp32178861-4455) [n:127.0.0.1:36027_solr c:testcollection s:shard1 r:core_node5 x:testcollection_shard1_replica_n3] o.a.s.c.S.Request [testcollection_shard1_replica_n3]  webapp=/solr path=/select params={q=*:*&df=text&distrib=false&_stateVer_=testcollection:7&shards.purpose=64&NOW=1507190303051&ids=1&isShard=true&shard.url=https://127.0.0.1:36027/solr/testcollection_shard1_replica_n3/|https://127.0.0.1:41765/solr/testcollection_shard1_replica_n1/&wt=javabin&version=2} status=0 QTime=0
   [junit4]   2> 257063 INFO  (qtp19342888-4452) [n:127.0.0.1:41765_solr c:testcollection s:shard1 r:core_node2 x:testcollection_shard1_replica_n1] o.a.s.c.S.Request [testcollection_shard1_replica_n1]  webapp=/solr path=/select params={q=*:*&_stateVer_=testcollection:7&wt=javabin&version=2} hits=1 status=0 QTime=3
   [junit4]   2> 257065 INFO  (qtp32178861-4459) [n:127.0.0.1:36027_solr    ] o.a.s.h.a.CollectionsHandler Invoked Collection Action :delete with params name=testcollection&action=DELETE&wt=javabin&version=2 and sendToOCPQueue=true
   [junit4]   2> 257070 INFO  (OverseerThreadFactory-920-thread-2-processing-n:127.0.0.1:41765_solr) [n:127.0.0.1:41765_solr    ] o.a.s.c.OverseerCollectionMessageHandler Executing Collection Cmd : action=UNLOAD&deleteInstanceDir=true&deleteDataDir=true
   [junit4]   2> 257072 INFO  (qtp19342888-4449) [n:127.0.0.1:41765_solr    ] o.a.s.m.SolrMetricManager Closing metric reporters for registry=solr.core.testcollection.shard2.replica_n4, tag=null
   [junit4]   2> 257072 INFO  (qtp19342888-4449) [n:127.0.0.1:41765_solr    ] o.a.s.m.r.SolrJmxReporter Closing reporter [org.apache.solr.metrics.reporters.SolrJmxReporter@9ad98b: rootName = solr_41765, domain = solr.core.testcollection.shard2.replica_n4, service url = null, agent id = null] for registry solr.core.testcollection.shard2.replica_n4 / com.codahale.metrics.MetricRegistry@4f5e41
   [junit4]   2> 257073 INFO  (qtp32178861-4448) [n:127.0.0.1:36027_solr    ] o.a.s.m.SolrMetricManager Closing metric reporters for registry=solr.core.testcollection.shard2.replica_n6, tag=null
   [junit4]   2> 257074 INFO  (qtp32178861-4448) [n:127.0.0.1:36027_solr    ] o.a.s.m.r.SolrJmxReporter Closing reporter [org.apache.solr.metrics.reporters.SolrJmxReporter@1f4ef96: rootName = solr_36027, domain = solr.core.testcollection.shard2.replica_n6, service url = null, agent id = null] for registry solr.core.testcollection.shard2.replica_n6 / com.codahale.metrics.MetricRegistry@142bbbd
   [junit4]   2> 257087 INFO  (qtp32178861-4448) [n:127.0.0.1:36027_solr    ] o.a.s.c.SolrCore [testcollecti

[...truncated too long message...]

lint] 6. WARNING in /home/jenkins/workspace/Lucene-Solr-master-Linux/solr/core/src/java/org/apache/solr/handler/ReplicationHandler.java (at line 1285)
 [ecj-lint] 	DirectoryReader reader = s==null ? null : s.get().getIndexReader();
 [ecj-lint] 	                ^^^^^^
 [ecj-lint] Resource leak: 'reader' is never closed
 [ecj-lint] ----------
 [ecj-lint] ----------
 [ecj-lint] 7. WARNING in /home/jenkins/workspace/Lucene-Solr-master-Linux/solr/core/src/java/org/apache/solr/handler/sql/SolrTable.java (at line 517)
 [ecj-lint] 	ParallelStream parallelStream = new ParallelStream(zk, collection, tupleStream, numWorkers, comp);
 [ecj-lint] 	               ^^^^^^^^^^^^^^
 [ecj-lint] Resource leak: 'parallelStream' is never closed
 [ecj-lint] ----------
 [ecj-lint] 8. WARNING in /home/jenkins/workspace/Lucene-Solr-master-Linux/solr/core/src/java/org/apache/solr/handler/sql/SolrTable.java (at line 743)
 [ecj-lint] 	ParallelStream parallelStream = new ParallelStream(zkHost, collection, tupleStream, numWorkers, comp);
 [ecj-lint] 	               ^^^^^^^^^^^^^^
 [ecj-lint] Resource leak: 'parallelStream' is never closed
 [ecj-lint] ----------
 [ecj-lint] ----------
 [ecj-lint] 9. WARNING in /home/jenkins/workspace/Lucene-Solr-master-Linux/solr/core/src/java/org/apache/solr/highlight/DefaultSolrHighlighter.java (at line 578)
 [ecj-lint] 	tvWindowStream = new OffsetWindowTokenFilter(tvStream);
 [ecj-lint] 	^^^^^^^^^^^^^^^^^^^^^^^^^^^^^^^^^^^^^^^^^^^^^^^^^^^^^^
 [ecj-lint] Resource leak: 'tvWindowStream' is never closed
 [ecj-lint] ----------
 [ecj-lint] ----------
 [ecj-lint] 10. WARNING in /home/jenkins/workspace/Lucene-Solr-master-Linux/solr/core/src/java/org/apache/solr/request/SimpleFacets.java (at line 925)
 [ecj-lint] 	fastForRandomSet = new HashDocSet(sset.getDocs(), 0, sset.size());
 [ecj-lint] 	^^^^^^^^^^^^^^^^^^^^^^^^^^^^^^^^^^^^^^^^^^^^^^^^^^^^^^^^^^^^^^^^^
 [ecj-lint] Resource leak: 'fastForRandomSet' is never closed
 [ecj-lint] ----------
 [ecj-lint] ----------
 [ecj-lint] 11. WARNING in /home/jenkins/workspace/Lucene-Solr-master-Linux/solr/core/src/java/org/apache/solr/response/SmileResponseWriter.java (at line 33)
 [ecj-lint] 	new SmileWriter(out, request, response).writeResponse();
 [ecj-lint] 	^^^^^^^^^^^^^^^^^^^^^^^^^^^^^^^^^^^^^^^
 [ecj-lint] Resource leak: '<unassigned Closeable value>' is never closed
 [ecj-lint] ----------
 [ecj-lint] ----------
 [ecj-lint] 12. WARNING in /home/jenkins/workspace/Lucene-Solr-master-Linux/solr/core/src/java/org/apache/solr/schema/OpenExchangeRatesOrgProvider.java (at line 146)
 [ecj-lint] 	ratesJsonStream = resourceLoader.openResource(ratesFileLocation);
 [ecj-lint] 	^^^^^^^^^^^^^^^^^^^^^^^^^^^^^^^^^^^^^^^^^^^^^^^^^^^^^^^^^^^^^^^^
 [ecj-lint] Resource leak: 'ratesJsonStream' is not closed at this location
 [ecj-lint] ----------
 [ecj-lint] ----------
 [ecj-lint] 13. WARNING in /home/jenkins/workspace/Lucene-Solr-master-Linux/solr/core/src/java/org/apache/solr/search/CollapsingQParserPlugin.java (at line 1315)
 [ecj-lint] 	UninvertingReader uninvertingReader = new UninvertingReader(new ReaderWrapper(searcher.getSlowAtomicReader(), collapseField), mapping);
 [ecj-lint] 	                  ^^^^^^^^^^^^^^^^^
 [ecj-lint] Resource leak: 'uninvertingReader' is never closed
 [ecj-lint] ----------
 [ecj-lint] ----------
 [ecj-lint] 14. WARNING in /home/jenkins/workspace/Lucene-Solr-master-Linux/solr/core/src/java/org/apache/solr/search/DocSlice.java (at line 145)
 [ecj-lint] 	HashDocSet h = new HashDocSet(docs,offset,len);
 [ecj-lint] 	           ^
 [ecj-lint] Resource leak: 'h' is never closed
 [ecj-lint] ----------
 [ecj-lint] 15. WARNING in /home/jenkins/workspace/Lucene-Solr-master-Linux/solr/core/src/java/org/apache/solr/search/DocSlice.java (at line 154)
 [ecj-lint] 	HashDocSet h = new HashDocSet(docs,offset,len);
 [ecj-lint] 	           ^
 [ecj-lint] Resource leak: 'h' is never closed
 [ecj-lint] ----------
 [ecj-lint] 16. WARNING in /home/jenkins/workspace/Lucene-Solr-master-Linux/solr/core/src/java/org/apache/solr/search/DocSlice.java (at line 163)
 [ecj-lint] 	HashDocSet h = new HashDocSet(docs,offset,len);
 [ecj-lint] 	           ^
 [ecj-lint] Resource leak: 'h' is never closed
 [ecj-lint] ----------
 [ecj-lint] ----------
 [ecj-lint] 17. WARNING in /home/jenkins/workspace/Lucene-Solr-master-Linux/solr/core/src/java/org/apache/solr/search/function/OrdFieldSource.java (at line 79)
 [ecj-lint] 	SolrIndexSearcher is = (SolrIndexSearcher) o;
 [ecj-lint] 	                  ^^
 [ecj-lint] Resource leak: 'is' is never closed
 [ecj-lint] ----------
 [ecj-lint] ----------
 [ecj-lint] 18. WARNING in /home/jenkins/workspace/Lucene-Solr-master-Linux/solr/core/src/java/org/apache/solr/search/function/ReverseOrdFieldSource.java (at line 79)
 [ecj-lint] 	SolrIndexSearcher is = (SolrIndexSearcher) o;
 [ecj-lint] 	                  ^^
 [ecj-lint] Resource leak: 'is' is never closed
 [ecj-lint] ----------
 [ecj-lint] ----------
 [ecj-lint] 19. WARNING in /home/jenkins/workspace/Lucene-Solr-master-Linux/solr/core/src/java/org/apache/solr/servlet/SolrDispatchFilter.java (at line 291)
 [ecj-lint] 	throw new SolrException(ErrorCode.SERVER_ERROR, "Error occurred while loading solr.xml from zookeeper", e);
 [ecj-lint] 	^^^^^^^^^^^^^^^^^^^^^^^^^^^^^^^^^^^^^^^^^^^^^^^^^^^^^^^^^^^^^^^^^^^^^^^^^^^^^^^^^^^^^^^^^^^^^^^^^^^^^^^^^^^
 [ecj-lint] Resource leak: 'loader' is not closed at this location
 [ecj-lint] ----------
 [ecj-lint] ----------
 [ecj-lint] 20. WARNING in /home/jenkins/workspace/Lucene-Solr-master-Linux/solr/core/src/java/org/apache/solr/update/CdcrTransactionLog.java (at line 98)
 [ecj-lint] 	ChannelFastInputStream is = new ChannelFastInputStream(channel, pos);
 [ecj-lint] 	                       ^^
 [ecj-lint] Resource leak: 'is' is never closed
 [ecj-lint] ----------
 [ecj-lint] ----------
 [ecj-lint] 21. WARNING in /home/jenkins/workspace/Lucene-Solr-master-Linux/solr/core/src/java/org/apache/solr/update/HdfsTransactionLog.java (at line 191)
 [ecj-lint] 	LogCodec codec = new LogCodec(resolver);
 [ecj-lint] 	         ^^^^^
 [ecj-lint] Resource leak: 'codec' is never closed
 [ecj-lint] ----------
 [ecj-lint] 22. WARNING in /home/jenkins/workspace/Lucene-Solr-master-Linux/solr/core/src/java/org/apache/solr/update/HdfsTransactionLog.java (at line 261)
 [ecj-lint] 	LogCodec codec = new LogCodec(resolver);
 [ecj-lint] 	         ^^^^^
 [ecj-lint] Resource leak: 'codec' is never closed
 [ecj-lint] ----------
 [ecj-lint] ----------
 [ecj-lint] 23. WARNING in /home/jenkins/workspace/Lucene-Solr-master-Linux/solr/core/src/java/org/apache/solr/update/TransactionLog.java (at line 228)
 [ecj-lint] 	ChannelFastInputStream is = new ChannelFastInputStream(channel, pos);
 [ecj-lint] 	                       ^^
 [ecj-lint] Resource leak: 'is' is never closed
 [ecj-lint] ----------
 [ecj-lint] 24. WARNING in /home/jenkins/workspace/Lucene-Solr-master-Linux/solr/core/src/java/org/apache/solr/update/TransactionLog.java (at line 228)
 [ecj-lint] 	ChannelFastInputStream is = new ChannelFastInputStream(channel, pos);
 [ecj-lint] 	                       ^^
 [ecj-lint] Resource leak: 'is' is never closed
 [ecj-lint] ----------
 [ecj-lint] 25. WARNING in /home/jenkins/workspace/Lucene-Solr-master-Linux/solr/core/src/java/org/apache/solr/update/TransactionLog.java (at line 260)
 [ecj-lint] 	LogCodec codec = new LogCodec(resolver);
 [ecj-lint] 	         ^^^^^
 [ecj-lint] Resource leak: 'codec' is never closed
 [ecj-lint] ----------
 [ecj-lint] 26. WARNING in /home/jenkins/workspace/Lucene-Solr-master-Linux/solr/core/src/java/org/apache/solr/update/TransactionLog.java (at line 275)
 [ecj-lint] 	LogCodec codec = new LogCodec(resolver);
 [ecj-lint] 	         ^^^^^
 [ecj-lint] Resource leak: 'codec' is never closed
 [ecj-lint] ----------
 [ecj-lint] 27. WARNING in /home/jenkins/workspace/Lucene-Solr-master-Linux/solr/core/src/java/org/apache/solr/update/TransactionLog.java (at line 529)
 [ecj-lint] 	LogCodec codec = new LogCodec(resolver);
 [ecj-lint] 	         ^^^^^
 [ecj-lint] Resource leak: 'codec' is never closed
 [ecj-lint] ----------
 [ecj-lint] ----------
 [ecj-lint] 28. WARNING in /home/jenkins/workspace/Lucene-Solr-master-Linux/solr/core/src/java/org/apache/solr/util/SimplePostTool.java (at line 655)
 [ecj-lint] 	BAOS bos =  new BAOS();
 [ecj-lint] 	     ^^^
 [ecj-lint] Resource leak: 'bos' is never closed
 [ecj-lint] ----------
 [ecj-lint] 29. WARNING in /home/jenkins/workspace/Lucene-Solr-master-Linux/solr/core/src/java/org/apache/solr/util/SimplePostTool.java (at line 655)
 [ecj-lint] 	BAOS bos =  new BAOS();
 [ecj-lint] 	     ^^^
 [ecj-lint] Resource leak: 'bos' is never closed
 [ecj-lint] ----------
 [ecj-lint] ----------
 [ecj-lint] 30. WARNING in /home/jenkins/workspace/Lucene-Solr-master-Linux/solr/core/src/java/org/apache/solr/util/SolrLogLayout.java (at line 149)
 [ecj-lint] 	SolrQueryRequest req = requestInfo == null ? null : requestInfo.getReq();
 [ecj-lint] 	                 ^^^
 [ecj-lint] Resource leak: 'req' is never closed
 [ecj-lint] ----------
 [ecj-lint] 30 problems (1 error, 29 warnings)

BUILD FAILED
/home/jenkins/workspace/Lucene-Solr-master-Linux/build.xml:826: The following error occurred while executing this line:
/home/jenkins/workspace/Lucene-Solr-master-Linux/build.xml:101: The following error occurred while executing this line:
/home/jenkins/workspace/Lucene-Solr-master-Linux/solr/build.xml:684: The following error occurred while executing this line:
/home/jenkins/workspace/Lucene-Solr-master-Linux/lucene/common-build.xml:2081: The following error occurred while executing this line:
/home/jenkins/workspace/Lucene-Solr-master-Linux/lucene/common-build.xml:2120: Compile failed; see the compiler error output for details.

Total time: 83 minutes 24 seconds
Build step 'Invoke Ant' marked build as failure
Archiving artifacts
[WARNINGS] Skipping publisher since build result is FAILURE
Recording test results
Email was triggered for: Failure - Any
Sending email for trigger: Failure - Any

Mime
View raw message