lucene-dev mailing list archives

Site index · List index
Message view « Date » · « Thread »
Top « Date » · « Thread »
From Policeman Jenkins Server <jenk...@thetaphi.de>
Subject [JENKINS] Lucene-Solr-7.x-Solaris (64bit/jdk1.8.0) - Build # 252 - Unstable!
Date Thu, 19 Oct 2017 19:09:05 GMT
Build: https://jenkins.thetaphi.de/job/Lucene-Solr-7.x-Solaris/252/
Java: 64bit/jdk1.8.0 -XX:+UseCompressedOops -XX:+UseConcMarkSweepGC

2 tests failed.
FAILED:  junit.framework.TestSuite.org.apache.solr.cloud.TestSolrCloudWithSecureImpersonation

Error Message:
4 threads leaked from SUITE scope at org.apache.solr.cloud.TestSolrCloudWithSecureImpersonation:     1) Thread[id=18145, name=jetty-launcher-2248-thread-2-SendThread(127.0.0.1:45834), state=TIMED_WAITING, group=TGRP-TestSolrCloudWithSecureImpersonation]         at java.lang.Thread.sleep(Native Method)         at org.apache.zookeeper.client.StaticHostProvider.next(StaticHostProvider.java:101)         at org.apache.zookeeper.ClientCnxn$SendThread.startConnect(ClientCnxn.java:997)         at org.apache.zookeeper.ClientCnxn$SendThread.run(ClientCnxn.java:1060)    2) Thread[id=18143, name=jetty-launcher-2248-thread-1-SendThread(127.0.0.1:45834), state=TIMED_WAITING, group=TGRP-TestSolrCloudWithSecureImpersonation]         at java.lang.Thread.sleep(Native Method)         at org.apache.zookeeper.client.StaticHostProvider.next(StaticHostProvider.java:101)         at org.apache.zookeeper.ClientCnxn$SendThread.startConnect(ClientCnxn.java:997)         at org.apache.zookeeper.ClientCnxn$SendThread.run(ClientCnxn.java:1060)    3) Thread[id=18146, name=jetty-launcher-2248-thread-2-EventThread, state=WAITING, group=TGRP-TestSolrCloudWithSecureImpersonation]         at sun.misc.Unsafe.park(Native Method)         at java.util.concurrent.locks.LockSupport.park(LockSupport.java:175)         at java.util.concurrent.locks.AbstractQueuedSynchronizer$ConditionObject.await(AbstractQueuedSynchronizer.java:2039)         at java.util.concurrent.LinkedBlockingQueue.take(LinkedBlockingQueue.java:442)         at org.apache.zookeeper.ClientCnxn$EventThread.run(ClientCnxn.java:501)    4) Thread[id=18144, name=jetty-launcher-2248-thread-1-EventThread, state=WAITING, group=TGRP-TestSolrCloudWithSecureImpersonation]         at sun.misc.Unsafe.park(Native Method)         at java.util.concurrent.locks.LockSupport.park(LockSupport.java:175)         at java.util.concurrent.locks.AbstractQueuedSynchronizer$ConditionObject.await(AbstractQueuedSynchronizer.java:2039)         at java.util.concurrent.LinkedBlockingQueue.take(LinkedBlockingQueue.java:442)         at org.apache.zookeeper.ClientCnxn$EventThread.run(ClientCnxn.java:501)

Stack Trace:
com.carrotsearch.randomizedtesting.ThreadLeakError: 4 threads leaked from SUITE scope at org.apache.solr.cloud.TestSolrCloudWithSecureImpersonation: 
   1) Thread[id=18145, name=jetty-launcher-2248-thread-2-SendThread(127.0.0.1:45834), state=TIMED_WAITING, group=TGRP-TestSolrCloudWithSecureImpersonation]
        at java.lang.Thread.sleep(Native Method)
        at org.apache.zookeeper.client.StaticHostProvider.next(StaticHostProvider.java:101)
        at org.apache.zookeeper.ClientCnxn$SendThread.startConnect(ClientCnxn.java:997)
        at org.apache.zookeeper.ClientCnxn$SendThread.run(ClientCnxn.java:1060)
   2) Thread[id=18143, name=jetty-launcher-2248-thread-1-SendThread(127.0.0.1:45834), state=TIMED_WAITING, group=TGRP-TestSolrCloudWithSecureImpersonation]
        at java.lang.Thread.sleep(Native Method)
        at org.apache.zookeeper.client.StaticHostProvider.next(StaticHostProvider.java:101)
        at org.apache.zookeeper.ClientCnxn$SendThread.startConnect(ClientCnxn.java:997)
        at org.apache.zookeeper.ClientCnxn$SendThread.run(ClientCnxn.java:1060)
   3) Thread[id=18146, name=jetty-launcher-2248-thread-2-EventThread, state=WAITING, group=TGRP-TestSolrCloudWithSecureImpersonation]
        at sun.misc.Unsafe.park(Native Method)
        at java.util.concurrent.locks.LockSupport.park(LockSupport.java:175)
        at java.util.concurrent.locks.AbstractQueuedSynchronizer$ConditionObject.await(AbstractQueuedSynchronizer.java:2039)
        at java.util.concurrent.LinkedBlockingQueue.take(LinkedBlockingQueue.java:442)
        at org.apache.zookeeper.ClientCnxn$EventThread.run(ClientCnxn.java:501)
   4) Thread[id=18144, name=jetty-launcher-2248-thread-1-EventThread, state=WAITING, group=TGRP-TestSolrCloudWithSecureImpersonation]
        at sun.misc.Unsafe.park(Native Method)
        at java.util.concurrent.locks.LockSupport.park(LockSupport.java:175)
        at java.util.concurrent.locks.AbstractQueuedSynchronizer$ConditionObject.await(AbstractQueuedSynchronizer.java:2039)
        at java.util.concurrent.LinkedBlockingQueue.take(LinkedBlockingQueue.java:442)
        at org.apache.zookeeper.ClientCnxn$EventThread.run(ClientCnxn.java:501)
	at __randomizedtesting.SeedInfo.seed([B976A0C1B3CE24CB]:0)


FAILED:  junit.framework.TestSuite.org.apache.solr.cloud.TestSolrCloudWithSecureImpersonation

Error Message:
There are still zombie threads that couldn't be terminated:    1) Thread[id=18145, name=jetty-launcher-2248-thread-2-SendThread(127.0.0.1:45834), state=TIMED_WAITING, group=TGRP-TestSolrCloudWithSecureImpersonation]         at java.lang.Thread.sleep(Native Method)         at org.apache.zookeeper.client.StaticHostProvider.next(StaticHostProvider.java:101)         at org.apache.zookeeper.ClientCnxn$SendThread.startConnect(ClientCnxn.java:997)         at org.apache.zookeeper.ClientCnxn$SendThread.run(ClientCnxn.java:1060)    2) Thread[id=18143, name=jetty-launcher-2248-thread-1-SendThread(127.0.0.1:45834), state=TIMED_WAITING, group=TGRP-TestSolrCloudWithSecureImpersonation]         at java.lang.Thread.sleep(Native Method)         at org.apache.zookeeper.client.StaticHostProvider.next(StaticHostProvider.java:101)         at org.apache.zookeeper.ClientCnxn$SendThread.startConnect(ClientCnxn.java:997)         at org.apache.zookeeper.ClientCnxn$SendThread.run(ClientCnxn.java:1060)

Stack Trace:
com.carrotsearch.randomizedtesting.ThreadLeakError: There are still zombie threads that couldn't be terminated:
   1) Thread[id=18145, name=jetty-launcher-2248-thread-2-SendThread(127.0.0.1:45834), state=TIMED_WAITING, group=TGRP-TestSolrCloudWithSecureImpersonation]
        at java.lang.Thread.sleep(Native Method)
        at org.apache.zookeeper.client.StaticHostProvider.next(StaticHostProvider.java:101)
        at org.apache.zookeeper.ClientCnxn$SendThread.startConnect(ClientCnxn.java:997)
        at org.apache.zookeeper.ClientCnxn$SendThread.run(ClientCnxn.java:1060)
   2) Thread[id=18143, name=jetty-launcher-2248-thread-1-SendThread(127.0.0.1:45834), state=TIMED_WAITING, group=TGRP-TestSolrCloudWithSecureImpersonation]
        at java.lang.Thread.sleep(Native Method)
        at org.apache.zookeeper.client.StaticHostProvider.next(StaticHostProvider.java:101)
        at org.apache.zookeeper.ClientCnxn$SendThread.startConnect(ClientCnxn.java:997)
        at org.apache.zookeeper.ClientCnxn$SendThread.run(ClientCnxn.java:1060)
	at __randomizedtesting.SeedInfo.seed([B976A0C1B3CE24CB]:0)




Build Log:
[...truncated 12484 lines...]
   [junit4] Suite: org.apache.solr.cloud.TestSolrCloudWithSecureImpersonation
   [junit4]   2> 1877801 INFO  (SUITE-TestSolrCloudWithSecureImpersonation-seed#[B976A0C1B3CE24CB]-worker) [    ] o.a.s.SolrTestCaseJ4 SecureRandom sanity checks: test.solr.allowed.securerandom=null & java.security.egd=file:/dev/./urandom
   [junit4]   2> Creating dataDir: /export/home/jenkins/workspace/Lucene-Solr-7.x-Solaris/solr/build/solr-core/test/J1/temp/solr.cloud.TestSolrCloudWithSecureImpersonation_B976A0C1B3CE24CB-001/init-core-data-001
   [junit4]   2> 1877802 WARN  (SUITE-TestSolrCloudWithSecureImpersonation-seed#[B976A0C1B3CE24CB]-worker) [    ] o.a.s.SolrTestCaseJ4 startTrackingSearchers: numOpens=2 numCloses=2
   [junit4]   2> 1877802 INFO  (SUITE-TestSolrCloudWithSecureImpersonation-seed#[B976A0C1B3CE24CB]-worker) [    ] o.a.s.SolrTestCaseJ4 Using PointFields (NUMERIC_POINTS_SYSPROP=true) w/NUMERIC_DOCVALUES_SYSPROP=false
   [junit4]   2> 1877803 INFO  (SUITE-TestSolrCloudWithSecureImpersonation-seed#[B976A0C1B3CE24CB]-worker) [    ] o.a.s.SolrTestCaseJ4 Randomized ssl (true) and clientAuth (false) via: @org.apache.solr.util.RandomizeSSL(reason=, value=NaN, ssl=NaN, clientAuth=NaN)
   [junit4]   2> 1877841 INFO  (SUITE-TestSolrCloudWithSecureImpersonation-seed#[B976A0C1B3CE24CB]-worker) [    ] o.a.s.c.MiniSolrCloudCluster Starting cluster of 2 servers in /export/home/jenkins/workspace/Lucene-Solr-7.x-Solaris/solr/build/solr-core/test/J1/temp/solr.cloud.TestSolrCloudWithSecureImpersonation_B976A0C1B3CE24CB-001/tempDir-001
   [junit4]   2> 1877841 INFO  (SUITE-TestSolrCloudWithSecureImpersonation-seed#[B976A0C1B3CE24CB]-worker) [    ] o.a.s.c.ZkTestServer STARTING ZK TEST SERVER
   [junit4]   2> 1877841 INFO  (Thread-5746) [    ] o.a.s.c.ZkTestServer client port:0.0.0.0/0.0.0.0:0
   [junit4]   2> 1877841 INFO  (Thread-5746) [    ] o.a.s.c.ZkTestServer Starting server
   [junit4]   2> 1877844 ERROR (Thread-5746) [    ] o.a.z.s.ZooKeeperServer ZKShutdownHandler is not registered, so ZooKeeper server won't take any action on ERROR or SHUTDOWN server state changes
   [junit4]   2> 1877942 INFO  (SUITE-TestSolrCloudWithSecureImpersonation-seed#[B976A0C1B3CE24CB]-worker) [    ] o.a.s.c.ZkTestServer start zk server on port:45834
   [junit4]   2> 1877956 INFO  (jetty-launcher-2248-thread-1) [    ] o.e.j.s.Server jetty-9.3.20.v20170531
   [junit4]   2> 1877956 INFO  (jetty-launcher-2248-thread-2) [    ] o.e.j.s.Server jetty-9.3.20.v20170531
   [junit4]   2> 1877958 INFO  (jetty-launcher-2248-thread-2) [    ] o.e.j.s.h.ContextHandler Started o.e.j.s.ServletContextHandler@18c6950d{/solr,null,AVAILABLE}
   [junit4]   2> 1877958 INFO  (jetty-launcher-2248-thread-1) [    ] o.e.j.s.h.ContextHandler Started o.e.j.s.ServletContextHandler@54f18dac{/solr,null,AVAILABLE}
   [junit4]   2> 1877958 INFO  (jetty-launcher-2248-thread-2) [    ] o.e.j.s.AbstractConnector Started ServerConnector@557a4641{SSL,[ssl, http/1.1]}{127.0.0.1:41912}
   [junit4]   2> 1877958 INFO  (jetty-launcher-2248-thread-1) [    ] o.e.j.s.AbstractConnector Started ServerConnector@34d1beee{SSL,[ssl, http/1.1]}{127.0.0.1:47063}
   [junit4]   2> 1877958 INFO  (jetty-launcher-2248-thread-2) [    ] o.e.j.s.Server Started @1880819ms
   [junit4]   2> 1877959 INFO  (jetty-launcher-2248-thread-1) [    ] o.e.j.s.Server Started @1880819ms
   [junit4]   2> 1877959 INFO  (jetty-launcher-2248-thread-2) [    ] o.a.s.c.s.e.JettySolrRunner Jetty properties: {hostContext=/solr, hostPort=41912}
   [junit4]   2> 1877959 ERROR (jetty-launcher-2248-thread-2) [    ] o.a.s.u.StartupLoggingUtils Missing Java Option solr.log.dir. Logging may be missing or incomplete.
   [junit4]   2> 1877959 INFO  (jetty-launcher-2248-thread-2) [    ] o.a.s.s.SolrDispatchFilter  ___      _       Welcome to Apache Solr? version 7.2.0
   [junit4]   2> 1877959 INFO  (jetty-launcher-2248-thread-2) [    ] o.a.s.s.SolrDispatchFilter / __| ___| |_ _   Starting in cloud mode on port null
   [junit4]   2> 1877959 INFO  (jetty-launcher-2248-thread-2) [    ] o.a.s.s.SolrDispatchFilter \__ \/ _ \ | '_|  Install dir: null, Default config dir: null
   [junit4]   2> 1877959 INFO  (jetty-launcher-2248-thread-2) [    ] o.a.s.s.SolrDispatchFilter |___/\___/_|_|    Start time: 2017-10-19T18:49:51.208Z
   [junit4]   2> 1877959 INFO  (jetty-launcher-2248-thread-1) [    ] o.a.s.c.s.e.JettySolrRunner Jetty properties: {hostContext=/solr, hostPort=47063}
   [junit4]   2> 1877959 ERROR (jetty-launcher-2248-thread-1) [    ] o.a.s.u.StartupLoggingUtils Missing Java Option solr.log.dir. Logging may be missing or incomplete.
   [junit4]   2> 1877959 INFO  (jetty-launcher-2248-thread-1) [    ] o.a.s.s.SolrDispatchFilter  ___      _       Welcome to Apache Solr? version 7.2.0
   [junit4]   2> 1877960 INFO  (jetty-launcher-2248-thread-1) [    ] o.a.s.s.SolrDispatchFilter / __| ___| |_ _   Starting in cloud mode on port null
   [junit4]   2> 1877960 INFO  (jetty-launcher-2248-thread-1) [    ] o.a.s.s.SolrDispatchFilter \__ \/ _ \ | '_|  Install dir: null, Default config dir: null
   [junit4]   2> 1877960 INFO  (jetty-launcher-2248-thread-1) [    ] o.a.s.s.SolrDispatchFilter |___/\___/_|_|    Start time: 2017-10-19T18:49:51.209Z
   [junit4]   2> 1877965 INFO  (jetty-launcher-2248-thread-1) [    ] o.a.s.s.SolrDispatchFilter solr.xml found in ZooKeeper. Loading...
   [junit4]   2> 1877965 INFO  (jetty-launcher-2248-thread-2) [    ] o.a.s.s.SolrDispatchFilter solr.xml found in ZooKeeper. Loading...
   [junit4]   2> 1877979 INFO  (jetty-launcher-2248-thread-1) [    ] o.a.s.c.ZkContainer Zookeeper client=127.0.0.1:45834/solr
   [junit4]   2> 1877979 INFO  (jetty-launcher-2248-thread-2) [    ] o.a.s.c.ZkContainer Zookeeper client=127.0.0.1:45834/solr
   [junit4]   2> 1878096 INFO  (jetty-launcher-2248-thread-2) [n:127.0.0.1:41912_solr    ] o.a.s.c.Overseer Overseer (id=null) closing
   [junit4]   2> 1878097 INFO  (jetty-launcher-2248-thread-2) [n:127.0.0.1:41912_solr    ] o.a.s.c.OverseerElectionContext I am going to be the leader 127.0.0.1:41912_solr
   [junit4]   2> 1878098 INFO  (jetty-launcher-2248-thread-2) [n:127.0.0.1:41912_solr    ] o.a.s.c.Overseer Overseer (id=98857057720139781-127.0.0.1:41912_solr-n_0000000000) starting
   [junit4]   2> 1878107 INFO  (jetty-launcher-2248-thread-2) [n:127.0.0.1:41912_solr    ] o.a.s.c.ZkController Register node as live in ZooKeeper:/live_nodes/127.0.0.1:41912_solr
   [junit4]   2> 1878120 INFO  (OverseerStateUpdate-98857057720139781-127.0.0.1:41912_solr-n_0000000000) [n:127.0.0.1:41912_solr    ] o.a.s.c.c.ZkStateReader Updated live nodes from ZooKeeper... (0) -> (1)
   [junit4]   2> 1878125 INFO  (jetty-launcher-2248-thread-1) [n:127.0.0.1:47063_solr    ] o.a.s.c.c.ZkStateReader Updated live nodes from ZooKeeper... (0) -> (1)
   [junit4]   2> 1878129 INFO  (jetty-launcher-2248-thread-1) [n:127.0.0.1:47063_solr    ] o.a.s.c.Overseer Overseer (id=null) closing
   [junit4]   2> 1878131 INFO  (jetty-launcher-2248-thread-1) [n:127.0.0.1:47063_solr    ] o.a.s.c.ZkController Register node as live in ZooKeeper:/live_nodes/127.0.0.1:47063_solr
   [junit4]   2> 1878135 INFO  (zkCallback-2260-thread-1-processing-n:127.0.0.1:47063_solr) [n:127.0.0.1:47063_solr    ] o.a.s.c.c.ZkStateReader Updated live nodes from ZooKeeper... (1) -> (2)
   [junit4]   2> 1878144 INFO  (zkCallback-2259-thread-1-processing-n:127.0.0.1:41912_solr) [n:127.0.0.1:41912_solr    ] o.a.s.c.c.ZkStateReader Updated live nodes from ZooKeeper... (1) -> (2)
   [junit4]   2> 1878182 INFO  (jetty-launcher-2248-thread-2) [n:127.0.0.1:41912_solr    ] o.a.s.c.CoreContainer Initializing authentication plugin: org.apache.solr.security.HttpParamDelegationTokenPlugin
   [junit4]   2> 1878182 WARN  (jetty-launcher-2248-thread-2) [n:127.0.0.1:41912_solr    ] o.a.s.c.s.i.Krb5HttpClientBuilder org.apache.solr.client.solrj.impl.Krb5HttpClientBuilder is configured without specifying system property 'java.security.auth.login.config'
   [junit4]   2> 1878183 INFO  (jetty-launcher-2248-thread-2) [n:127.0.0.1:41912_solr    ] o.a.s.s.KerberosPlugin Params: {solr.kerberos.impersonator.user.noGroups.hosts=*, solr.kerberos.impersonator.user.bogusGroup.groups=__some_bogus_group, token.valid=30, cookie.domain=127.0.0.1, solr.kerberos.impersonator.user.anyHostAnyUser.groups=*, solr.kerberos.impersonator.user.bogusGroup.hosts=*, solr.kerberos.impersonator.user.anyHostAnyUser.hosts=*, token.validity=36000, solr.kerberos.impersonator.user.noHosts.groups=*, type=kerberos, solr.kerberos.impersonator.user.localHostAnyGroup.groups=*, delegation-token.token-kind=solr-dt, solr.kerberos.impersonator.user.wrongHost.hosts=1.1.1.1.1.1, cookie.path=/, zk-dt-secret-manager.znodeWorkingPath=solr/security/zkdtsm, solr.kerberos.impersonator.user.localHostAnyGroup.hosts=serv1-vm3,localhost,127.0.0.1, signer.secret.provider.zookeeper.path=/token, solr.kerberos.impersonator.user.anyHostUsersGroup.groups=staff, zk-dt-secret-manager.enable=true, solr.kerberos.impersonator.user.wrongHost.groups=*, kerberos.name.rules=DEFAULT, signer.secret.provider=zookeeper, solr.kerberos.impersonator.user.anyHostUsersGroup.hosts=*}
   [junit4]   2> 1878184 INFO  (jetty-launcher-2248-thread-2) [n:127.0.0.1:41912_solr    ] o.a.c.f.i.CuratorFrameworkImpl Starting
   [junit4]   2> 1878224 INFO  (jetty-launcher-2248-thread-2-EventThread) [n:127.0.0.1:41912_solr    ] o.a.c.f.s.ConnectionStateManager State change: CONNECTED
   [junit4]   2> 1878237 WARN  (jetty-launcher-2248-thread-2) [n:127.0.0.1:41912_solr    ] o.a.s.c.s.i.Krb5HttpClientBuilder org.apache.solr.client.solrj.impl.Krb5HttpClientBuilder is configured without specifying system property 'java.security.auth.login.config'
   [junit4]   2> 1878255 INFO  (jetty-launcher-2248-thread-1) [n:127.0.0.1:47063_solr    ] o.a.s.c.CoreContainer Initializing authentication plugin: org.apache.solr.security.HttpParamDelegationTokenPlugin
   [junit4]   2> 1878255 WARN  (jetty-launcher-2248-thread-1) [n:127.0.0.1:47063_solr    ] o.a.s.c.s.i.Krb5HttpClientBuilder org.apache.solr.client.solrj.impl.Krb5HttpClientBuilder is configured without specifying system property 'java.security.auth.login.config'
   [junit4]   2> 1878255 INFO  (jetty-launcher-2248-thread-1) [n:127.0.0.1:47063_solr    ] o.a.s.s.KerberosPlugin Params: {solr.kerberos.impersonator.user.noGroups.hosts=*, solr.kerberos.impersonator.user.bogusGroup.groups=__some_bogus_group, token.valid=30, cookie.domain=127.0.0.1, solr.kerberos.impersonator.user.anyHostAnyUser.groups=*, solr.kerberos.impersonator.user.bogusGroup.hosts=*, solr.kerberos.impersonator.user.anyHostAnyUser.hosts=*, token.validity=36000, solr.kerberos.impersonator.user.noHosts.groups=*, type=kerberos, solr.kerberos.impersonator.user.localHostAnyGroup.groups=*, delegation-token.token-kind=solr-dt, solr.kerberos.impersonator.user.wrongHost.hosts=1.1.1.1.1.1, cookie.path=/, zk-dt-secret-manager.znodeWorkingPath=solr/security/zkdtsm, solr.kerberos.impersonator.user.localHostAnyGroup.hosts=serv1-vm3,localhost,127.0.0.1, signer.secret.provider.zookeeper.path=/token, solr.kerberos.impersonator.user.anyHostUsersGroup.groups=staff, zk-dt-secret-manager.enable=true, solr.kerberos.impersonator.user.wrongHost.groups=*, kerberos.name.rules=DEFAULT, signer.secret.provider=zookeeper, solr.kerberos.impersonator.user.anyHostUsersGroup.hosts=*}
   [junit4]   2> 1878258 INFO  (jetty-launcher-2248-thread-1) [n:127.0.0.1:47063_solr    ] o.a.c.f.i.CuratorFrameworkImpl Starting
   [junit4]   2> 1878263 INFO  (jetty-launcher-2248-thread-1-EventThread) [n:127.0.0.1:47063_solr    ] o.a.c.f.s.ConnectionStateManager State change: CONNECTED
   [junit4]   2> 1878274 WARN  (jetty-launcher-2248-thread-1) [n:127.0.0.1:47063_solr    ] o.a.s.c.s.i.Krb5HttpClientBuilder org.apache.solr.client.solrj.impl.Krb5HttpClientBuilder is configured without specifying system property 'java.security.auth.login.config'
   [junit4]   2> 1878294 INFO  (jetty-launcher-2248-thread-2) [n:127.0.0.1:41912_solr    ] o.a.s.m.r.SolrJmxReporter JMX monitoring for 'solr_41912.solr.node' (registry 'solr.node') enabled at server: com.sun.jmx.mbeanserver.JmxMBeanServer@423c516b
   [junit4]   2> 1878306 INFO  (jetty-launcher-2248-thread-2) [n:127.0.0.1:41912_solr    ] o.a.s.m.r.SolrJmxReporter JMX monitoring for 'solr_41912.solr.jvm' (registry 'solr.jvm') enabled at server: com.sun.jmx.mbeanserver.JmxMBeanServer@423c516b
   [junit4]   2> 1878306 INFO  (jetty-launcher-2248-thread-2) [n:127.0.0.1:41912_solr    ] o.a.s.m.r.SolrJmxReporter JMX monitoring for 'solr_41912.solr.jetty' (registry 'solr.jetty') enabled at server: com.sun.jmx.mbeanserver.JmxMBeanServer@423c516b
   [junit4]   2> 1878307 INFO  (jetty-launcher-2248-thread-2) [n:127.0.0.1:41912_solr    ] o.a.s.c.CorePropertiesLocator Found 0 core definitions underneath /export/home/jenkins/workspace/Lucene-Solr-7.x-Solaris/solr/build/solr-core/test/J1/temp/solr.cloud.TestSolrCloudWithSecureImpersonation_B976A0C1B3CE24CB-001/tempDir-001/node2/.
   [junit4]   2> 1878320 INFO  (jetty-launcher-2248-thread-1) [n:127.0.0.1:47063_solr    ] o.a.s.m.r.SolrJmxReporter JMX monitoring for 'solr_47063.solr.node' (registry 'solr.node') enabled at server: com.sun.jmx.mbeanserver.JmxMBeanServer@423c516b
   [junit4]   2> 1878325 INFO  (jetty-launcher-2248-thread-1) [n:127.0.0.1:47063_solr    ] o.a.s.m.r.SolrJmxReporter JMX monitoring for 'solr_47063.solr.jvm' (registry 'solr.jvm') enabled at server: com.sun.jmx.mbeanserver.JmxMBeanServer@423c516b
   [junit4]   2> 1878325 INFO  (jetty-launcher-2248-thread-1) [n:127.0.0.1:47063_solr    ] o.a.s.m.r.SolrJmxReporter JMX monitoring for 'solr_47063.solr.jetty' (registry 'solr.jetty') enabled at server: com.sun.jmx.mbeanserver.JmxMBeanServer@423c516b
   [junit4]   2> 1878326 INFO  (jetty-launcher-2248-thread-1) [n:127.0.0.1:47063_solr    ] o.a.s.c.CorePropertiesLocator Found 0 core definitions underneath /export/home/jenkins/workspace/Lucene-Solr-7.x-Solaris/solr/build/solr-core/test/J1/temp/solr.cloud.TestSolrCloudWithSecureImpersonation_B976A0C1B3CE24CB-001/tempDir-001/node1/.
   [junit4]   2> 1878350 WARN  (NIOServerCxn.Factory:0.0.0.0/0.0.0.0:0) [    ] o.a.z.s.NIOServerCnxn caught end of stream exception
   [junit4]   2> EndOfStreamException: Unable to read additional data from client sessionid 0x15f35f860f30009, likely client has closed socket
   [junit4]   2> 	at org.apache.zookeeper.server.NIOServerCnxn.doIO(NIOServerCnxn.java:239)
   [junit4]   2> 	at org.apache.zookeeper.server.NIOServerCnxnFactory.run(NIOServerCnxnFactory.java:203)
   [junit4]   2> 	at java.lang.Thread.run(Thread.java:748)
   [junit4]   2> 1878495 INFO  (TEST-TestSolrCloudWithSecureImpersonation.testProxyValidateGroup-seed#[B976A0C1B3CE24CB]) [    ] o.a.s.SolrTestCaseJ4 ###Starting testProxyValidateGroup
   [junit4]   2> 1878550 INFO  (qtp23972949-18029) [n:127.0.0.1:41912_solr    ] o.a.s.h.a.CollectionsHandler Invoked Collection Action :list with params doAs=jenkins&action=LIST&wt=javabin&version=2 and sendToOCPQueue=true
   [junit4]   2> 1878551 INFO  (qtp23972949-18029) [n:127.0.0.1:41912_solr    ] o.a.s.s.HttpSolrCall [admin] webapp=null path=/admin/collections params={doAs=jenkins&action=LIST&wt=javabin&version=2} status=0 QTime=0
   [junit4]   2> 1878551 WARN  (TEST-TestSolrCloudWithSecureImpersonation.testProxyValidateGroup-seed#[B976A0C1B3CE24CB]) [    ] o.a.h.c.p.ResponseProcessCookies Invalid cookie header: "Set-Cookie: hadoop.auth="u=anyHostUsersGroup&p=anyHostUsersGroup&t=test&e=1508474991767&s=QBVJ1TXqp4z6aPl0oD3scWgF/vA="; Path=/; Domain=127.0.0.1; Expires= , 20-   -2017 04:49:51 GMT; Secure; HttpOnly". Invalid 'expires' attribute: , 20- -2017 04:49:51 GMT
   [junit4]   2> 1878551 INFO  (TEST-TestSolrCloudWithSecureImpersonation.testProxyValidateGroup-seed#[B976A0C1B3CE24CB]) [    ] o.a.s.SolrTestCaseJ4 ###Ending testProxyValidateGroup
   [junit4]   2> 1878711 INFO  (TEST-TestSolrCloudWithSecureImpersonation.testProxyInvalidProxyUser-seed#[B976A0C1B3CE24CB]) [    ] o.a.s.SolrTestCaseJ4 ###Starting testProxyInvalidProxyUser
   [junit4]   2> 1878722 WARN  (TEST-TestSolrCloudWithSecureImpersonation.testProxyInvalidProxyUser-seed#[B976A0C1B3CE24CB]) [    ] o.a.h.c.p.ResponseProcessCookies Invalid cookie header: "Set-Cookie: hadoop.auth="u=bar&p=bar&t=test&e=1508474991963&s=3in46MEeJHiEMmp6tX18a0F+zBU="; Path=/; Domain=127.0.0.1; Expires= , 20-   -2017 04:49:51 GMT; Secure; HttpOnly". Invalid 'expires' attribute: , 20- -2017 04:49:51 GMT
   [junit4]   2> 1878723 INFO  (TEST-TestSolrCloudWithSecureImpersonation.testProxyInvalidProxyUser-seed#[B976A0C1B3CE24CB]) [    ] o.a.s.SolrTestCaseJ4 ###Ending testProxyInvalidProxyUser
   [junit4]   2> 1878869 INFO  (TEST-TestSolrCloudWithSecureImpersonation.testProxyValidateHost-seed#[B976A0C1B3CE24CB]) [    ] o.a.s.SolrTestCaseJ4 ###Starting testProxyValidateHost
   [junit4]   2> 1878870 INFO  (qtp23972949-18031) [n:127.0.0.1:41912_solr    ] o.a.s.h.a.CollectionsHandler Invoked Collection Action :list with params doAs=bar&action=LIST&wt=javabin&version=2 and sendToOCPQueue=true
   [junit4]   2> 1878870 INFO  (qtp23972949-18031) [n:127.0.0.1:41912_solr    ] o.a.s.s.HttpSolrCall [admin] webapp=null path=/admin/collections params={doAs=bar&action=LIST&wt=javabin&version=2} status=0 QTime=0
   [junit4]   2> 1878870 WARN  (TEST-TestSolrCloudWithSecureImpersonation.testProxyValidateHost-seed#[B976A0C1B3CE24CB]) [    ] o.a.h.c.p.ResponseProcessCookies Invalid cookie header: "Set-Cookie: hadoop.auth="u=localHostAnyGroup&p=localHostAnyGroup&t=test&e=1508474992118&s=rbmArZx2eFfsAXf7MOE1/KTLSY0="; Path=/; Domain=127.0.0.1; Expires= , 20-   -2017 04:49:52 GMT; Secure; HttpOnly". Invalid 'expires' attribute: , 20- -2017 04:49:52 GMT
   [junit4]   2> 1878870 INFO  (TEST-TestSolrCloudWithSecureImpersonation.testProxyValidateHost-seed#[B976A0C1B3CE24CB]) [    ] o.a.s.SolrTestCaseJ4 ###Ending testProxyValidateHost
   [junit4]   2> 1879081 INFO  (TEST-TestSolrCloudWithSecureImpersonation.testForwarding-seed#[B976A0C1B3CE24CB]) [    ] o.a.s.SolrTestCaseJ4 ###Starting testForwarding
   [junit4]   2> 1879523 INFO  (TEST-TestSolrCloudWithSecureImpersonation.testForwarding-seed#[B976A0C1B3CE24CB]) [    ] o.a.s.c.c.ZkStateReader Updated live nodes from ZooKeeper... (0) -> (2)
   [junit4]   2> 1879524 INFO  (TEST-TestSolrCloudWithSecureImpersonation.testForwarding-seed#[B976A0C1B3CE24CB]) [    ] o.a.s.c.s.i.ZkClientClusterStateProvider Cluster at 127.0.0.1:45834/solr ready
   [junit4]   2> 1879548 INFO  (qtp754445424-18036) [n:127.0.0.1:47063_solr    ] o.a.s.h.a.CollectionsHandler Invoked Collection Action :create with params pullReplicas=0&replicationFactor=1&collection.configName=conf1&maxShardsPerNode=1&name=forwardingCollection&nrtReplicas=1&action=CREATE&numShards=1&tlogReplicas=0&wt=javabin&version=2 and sendToOCPQueue=true
   [junit4]   2> 1879555 INFO  (OverseerThreadFactory-6136-thread-1-processing-n:127.0.0.1:41912_solr) [n:127.0.0.1:41912_solr    ] o.a.s.c.CreateCollectionCmd Create collection forwardingCollection
   [junit4]   2> 1879664 INFO  (OverseerStateUpdate-98857057720139781-127.0.0.1:41912_solr-n_0000000000) [n:127.0.0.1:41912_solr    ] o.a.s.c.o.SliceMutator createReplica() {
   [junit4]   2>   "operation":"ADDREPLICA",
   [junit4]   2>   "collection":"forwardingCollection",
   [junit4]   2>   "shard":"shard1",
   [junit4]   2>   "core":"forwardingCollection_shard1_replica_n1",
   [junit4]   2>   "state":"down",
   [junit4]   2>   "base_url":"https://127.0.0.1:41912/solr",
   [junit4]   2>   "type":"NRT",
   [junit4]   2>   "waitForFinalState":"false"} 
   [junit4]   2> 1879873 INFO  (qtp23972949-18028) [n:127.0.0.1:41912_solr    ] o.a.s.h.a.CoreAdminOperation core create command qt=/admin/cores&coreNodeName=core_node2&collection.configName=conf1&newCollection=true&name=forwardingCollection_shard1_replica_n1&action=CREATE&numShards=1&collection=forwardingCollection&shard=shard1&wt=javabin&version=2&replicaType=NRT
   [junit4]   2> 1879874 INFO  (qtp23972949-18028) [n:127.0.0.1:41912_solr    ] o.a.s.c.TransientSolrCoreCacheDefault Allocating transient cache for 2147483647 transient cores
   [junit4]   2> 1879978 INFO  (zkCallback-2259-thread-1-processing-n:127.0.0.1:41912_solr) [n:127.0.0.1:41912_solr    ] o.a.s.c.c.ZkStateReader A cluster state change: [WatchedEvent state:SyncConnected type:NodeDataChanged path:/collections/forwardingCollection/state.json] for collection [forwardingCollection] has occurred - updating... (live nodes size: [2])
   [junit4]   2> 1879978 INFO  (zkCallback-2259-thread-2-processing-n:127.0.0.1:41912_solr) [n:127.0.0.1:41912_solr    ] o.a.s.c.c.ZkStateReader A cluster state change: [WatchedEvent state:SyncConnected type:NodeDataChanged path:/collections/forwardingCollection/state.json] for collection [forwardingCollection] has occurred - updating... (live nodes size: [2])
   [junit4]   2> 1880927 INFO  (qtp23972949-18028) [n:127.0.0.1:41912_solr c:forwardingCollection s:shard1 r:core_node2 x:forwardingCollection_shard1_replica_n1] o.a.s.c.SolrConfig Using Lucene MatchVersion: 7.2.0
   [junit4]   2> 1880954 INFO  (qtp23972949-18028) [n:127.0.0.1:41912_solr c:forwardingCollection s:shard1 r:core_node2 x:forwardingCollection_shard1_replica_n1] o.a.s.s.IndexSchema [forwardingCollection_shard1_replica_n1] Schema name=test
   [junit4]   2> 1881049 INFO  (qtp23972949-18028) [n:127.0.0.1:41912_solr c:forwardingCollection s:shard1 r:core_node2 x:forwardingCollection_shard1_replica_n1] o.a.s.s.IndexSchema Loaded schema test/1.0 with uniqueid field id
   [junit4]   2> 1881073 INFO  (qtp23972949-18028) [n:127.0.0.1:41912_solr c:forwardingCollection s:shard1 r:core_node2 x:forwardingCollection_shard1_replica_n1] o.a.s.c.CoreContainer Creating SolrCore 'forwardingCollection_shard1_replica_n1' using configuration from collection forwardingCollection, trusted=true
   [junit4]   2> 1881074 INFO  (qtp23972949-18028) [n:127.0.0.1:41912_solr c:forwardingCollection s:shard1 r:core_node2 x:forwardingCollection_shard1_replica_n1] o.a.s.m.r.SolrJmxReporter JMX monitoring for 'solr_41912.solr.core.forwardingCollection.shard1.replica_n1' (registry 'solr.core.forwardingCollection.shard1.replica_n1') enabled at server: com.sun.jmx.mbeanserver.JmxMBeanServer@423c516b
   [junit4]   2> 1881074 INFO  (qtp23972949-18028) [n:127.0.0.1:41912_solr c:forwardingCollection s:shard1 r:core_node2 x:forwardingCollection_shard1_replica_n1] o.a.s.c.SolrCore solr.RecoveryStrategy.Builder
   [junit4]   2> 1881074 INFO  (qtp23972949-18028) [n:127.0.0.1:41912_solr c:forwardingCollection s:shard1 r:core_node2 x:forwardingCollection_shard1_replica_n1] o.a.s.c.SolrCore [[forwardingCollection_shard1_replica_n1] ] Opening new SolrCore at [/export/home/jenkins/workspace/Lucene-Solr-7.x-Solaris/solr/build/solr-core/test/J1/temp/solr.cloud.TestSolrCloudWithSecureImpersonation_B976A0C1B3CE24CB-001/tempDir-001/node2/forwardingCollection_shard1_replica_n1], dataDir=[/export/home/jenkins/workspace/Lucene-Solr-7.x-Solaris/solr/build/solr-core/test/J1/temp/solr.cloud.TestSolrCloudWithSecureImpersonation_B976A0C1B3CE24CB-001/tempDir-001/node2/./forwardingCollection_shard1_replica_n1/data/]
   [junit4]   2> 1881075 INFO  (qtp23972949-18028) [n:127.0.0.1:41912_solr c:forwardingCollection s:shard1 r:core_node2 x:forwardingCollection_shard1_replica_n1] o.a.s.u.RandomMergePolicy RandomMergePolicy wrapping class org.apache.lucene.index.LogDocMergePolicy: [LogDocMergePolicy: minMergeSize=1000, mergeFactor=14, maxMergeSize=9223372036854775807, maxMergeSizeForForcedMerge=9223372036854775807, calibrateSizeByDeletes=false, maxMergeDocs=2147483647, maxCFSSegmentSizeMB=8.796093022207999E12, noCFSRatio=0.0]
   [junit4]   2> 1881124 INFO  (qtp23972949-18028) [n:127.0.0.1:41912_solr c:forwardingCollection s:shard1 r:core_node2 x:forwardingCollection_shard1_replica_n1] o.a.s.u.UpdateHandler Using UpdateLog implementation: org.apache.solr.update.UpdateLog
   [junit4]   2> 1881124 INFO  (qtp23972949-18028) [n:127.0.0.1:41912_solr c:forwardingCollection s:shard1 r:core_node2 x:forwardingCollection_shard1_replica_n1] o.a.s.u.UpdateLog Initializing UpdateLog: dataDir= defaultSyncLevel=FLUSH numRecordsToKeep=100 maxNumLogsToKeep=10 numVersionBuckets=65536
   [junit4]   2> 1881125 INFO  (qtp23972949-18028) [n:127.0.0.1:41912_solr c:forwardingCollection s:shard1 r:core_node2 x:forwardingCollection_shard1_replica_n1] o.a.s.u.CommitTracker Hard AutoCommit: disabled
   [junit4]   2> 1881125 INFO  (qtp23972949-18028) [n:127.0.0.1:41912_solr c:forwardingCollection s:shard1 r:core_node2 x:forwardingCollection_shard1_replica_n1] o.a.s.u.CommitTracker Soft AutoCommit: disabled
   [junit4]   2> 1881125 INFO  (qtp23972949-18028) [n:127.0.0.1:41912_solr c:forwardingCollection s:shard1 r:core_node2 x:forwardingCollection_shard1_replica_n1] o.a.s.u.RandomMergePolicy RandomMergePolicy wrapping class org.apache.lucene.index.LogByteSizeMergePolicy: [LogByteSizeMergePolicy: minMergeSize=1677721, mergeFactor=15, maxMergeSize=2147483648, maxMergeSizeForForcedMerge=9223372036854775807, calibrateSizeByDeletes=true, maxMergeDocs=2147483647, maxCFSSegmentSizeMB=8.796093022207999E12, noCFSRatio=0.0]
   [junit4]   2> 1881126 INFO  (qtp23972949-18028) [n:127.0.0.1:41912_solr c:forwardingCollection s:shard1 r:core_node2 x:forwardingCollection_shard1_replica_n1] o.a.s.s.SolrIndexSearcher Opening [Searcher@6b56a838[forwardingCollection_shard1_replica_n1] main]
   [junit4]   2> 1881127 INFO  (qtp23972949-18028) [n:127.0.0.1:41912_solr c:forwardingCollection s:shard1 r:core_node2 x:forwardingCollection_shard1_replica_n1] o.a.s.h.c.SpellCheckComponent Initializing spell checkers
   [junit4]   2> 1881140 INFO  (qtp23972949-18028) [n:127.0.0.1:41912_solr c:forwardingCollection s:shard1 r:core_node2 x:forwardingCollection_shard1_replica_n1] o.a.s.s.DirectSolrSpellChecker init: {name=direct,classname=DirectSolrSpellChecker,field=lowerfilt,minQueryLength=3}
   [junit4]   2> 1881152 INFO  (qtp23972949-18028) [n:127.0.0.1:41912_solr c:forwardingCollection s:shard1 r:core_node2 x:forwardingCollection_shard1_replica_n1] o.a.s.h.ReplicationHandler Commits will be reserved for 10000ms.
   [junit4]   2> 1881152 INFO  (qtp23972949-18028) [n:127.0.0.1:41912_solr c:forwardingCollection s:shard1 r:core_node2 x:forwardingCollection_shard1_replica_n1] o.a.s.u.UpdateLog Could not find max version in index or recent updates, using new clock 1581712926993022976
   [junit4]   2> 1881152 INFO  (searcherExecutor-6141-thread-1-processing-n:127.0.0.1:41912_solr x:forwardingCollection_shard1_replica_n1 s:shard1 c:forwardingCollection r:core_node2) [n:127.0.0.1:41912_solr c:forwardingCollection s:shard1 r:core_node2 x:forwardingCollection_shard1_replica_n1] o.a.s.h.c.SpellCheckComponent Loading spell index for spellchecker: default
   [junit4]   2> 1881152 INFO  (searcherExecutor-6141-thread-1-processing-n:127.0.0.1:41912_solr x:forwardingCollection_shard1_replica_n1 s:shard1 c:forwardingCollection r:core_node2) [n:127.0.0.1:41912_solr c:forwardingCollection s:shard1 r:core_node2 x:forwardingCollection_shard1_replica_n1] o.a.s.h.c.SpellCheckComponent Loading spell index for spellchecker: direct
   [junit4]   2> 1881152 INFO  (searcherExecutor-6141-thread-1-processing-n:127.0.0.1:41912_solr x:forwardingCollection_shard1_replica_n1 s:shard1 c:forwardingCollection r:core_node2) [n:127.0.0.1:41912_solr c:forwardingCollection s:shard1 r:core_node2 x:forwardingCollection_shard1_replica_n1] o.a.s.h.c.SpellCheckComponent Loading spell index for spellchecker: wordbreak
   [junit4]   2> 1881152 INFO  (searcherExecutor-6141-thread-1-processing-n:127.0.0.1:41912_solr x:forwardingCollection_shard1_replica_n1 s:shard1 c:forwardingCollection r:core_node2) [n:127.0.0.1:41912_solr c:forwardingCollection s:shard1 r:core_node2 x:forwardingCollection_shard1_replica_n1] o.a.s.h.c.SpellCheckComponent Loading spell index for spellchecker: multipleFields
   [junit4]   2> 1881153 INFO  (searcherExecutor-6141-thread-1-processing-n:127.0.0.1:41912_solr x:forwardingCollection_shard1_replica_n1 s:shard1 c:forwardingCollection r:core_node2) [n:127.0.0.1:41912_solr c:forwardingCollection s:shard1 r:core_node2 x:forwardingCollection_shard1_replica_n1] o.a.s.h.c.SpellCheckComponent Loading spell index for spellchecker: jarowinkler
   [junit4]   2> 1881153 INFO  (searcherExecutor-6141-thread-1-processing-n:127.0.0.1:41912_solr x:forwardingCollection_shard1_replica_n1 s:shard1 c:forwardingCollection r:core_node2) [n:127.0.0.1:41912_solr c:forwardingCollection s:shard1 r:core_node2 x:forwardingCollection_shard1_replica_n1] o.a.s.h.c.SpellCheckComponent Loading spell index for spellchecker: external
   [junit4]   2> 1881154 INFO  (searcherExecutor-6141-thread-1-processing-n:127.0.0.1:41912_solr x:forwardingCollection_shard1_replica_n1 s:shard1 c:forwardingCollection r:core_node2) [n:127.0.0.1:41912_solr c:forwardingCollection s:shard1 r:core_node2 x:forwardingCollection_shard1_replica_n1] o.a.s.h.c.SpellCheckComponent Loading spell index for spellchecker: freq
   [junit4]   2> 1881154 INFO  (searcherExecutor-6141-thread-1-processing-n:127.0.0.1:41912_solr x:forwardingCollection_shard1_replica_n1 s:shard1 c:forwardingCollection r:core_node2) [n:127.0.0.1:41912_solr c:forwardingCollection s:shard1 r:core_node2 x:forwardingCollection_shard1_replica_n1] o.a.s.h.c.SpellCheckComponent Loading spell index for spellchecker: fqcn
   [junit4]   2> 1881155 INFO  (searcherExecutor-6141-thread-1-processing-n:127.0.0.1:41912_solr x:forwardingCollection_shard1_replica_n1 s:shard1 c:forwardingCollection r:core_node2) [n:127.0.0.1:41912_solr c:forwardingCollection s:shard1 r:core_node2 x:forwardingCollection_shard1_replica_n1] o.a.s.h.c.SpellCheckComponent Loading spell index for spellchecker: perDict
   [junit4]   2> 1881156 INFO  (searcherExecutor-6141-thread-1-processing-n:127.0.0.1:41912_solr x:forwardingCollection_shard1_replica_n1 s:shard1 c:forwardingCollection r:core_node2) [n:127.0.0.1:41912_solr c:forwardingCollection s:shard1 r:core_node2 x:forwardingCollection_shard1_replica_n1] o.a.s.c.SolrCore [forwardingCollection_shard1_replica_n1] Registered new searcher Searcher@6b56a838[forwardingCollection_shard1_replica_n1] main{ExitableDirectoryReader(UninvertingDirectoryReader())}
   [junit4]   2> 1881158 INFO  (qtp23972949-18028) [n:127.0.0.1:41912_solr c:forwardingCollection s:shard1 r:core_node2 x:forwardingCollection_shard1_replica_n1] o.a.s.c.ShardLeaderElectionContext Enough replicas found to continue.
   [junit4]   2> 1881159 INFO  (qtp23972949-18028) [n:127.0.0.1:41912_solr c:forwardingCollection s:shard1 r:core_node2 x:forwardingCollection_shard1_replica_n1] o.a.s.c.ShardLeaderElectionContext I may be the new leader - try and sync
   [junit4]   2> 1881159 INFO  (qtp23972949-18028) [n:127.0.0.1:41912_solr c:forwardingCollection s:shard1 r:core_node2 x:forwardingCollection_shard1_replica_n1] o.a.s.c.SyncStrategy Sync replicas to https://127.0.0.1:41912/solr/forwardingCollection_shard1_replica_n1/
   [junit4]   2> 1881159 INFO  (qtp23972949-18028) [n:127.0.0.1:41912_solr c:forwardingCollection s:shard1 r:core_node2 x:forwardingCollection_shard1_replica_n1] o.a.s.c.SyncStrategy Sync Success - now sync replicas to me
   [junit4]   2> 1881159 INFO  (qtp23972949-18028) [n:127.0.0.1:41912_solr c:forwardingCollection s:shard1 r:core_node2 x:forwardingCollection_shard1_replica_n1] o.a.s.c.SyncStrategy https://127.0.0.1:41912/solr/forwardingCollection_shard1_replica_n1/ has no replicas
   [junit4]   2> 1881159 INFO  (qtp23972949-18028) [n:127.0.0.1:41912_solr c:forwardingCollection s:shard1 r:core_node2 x:forwardingCollection_shard1_replica_n1] o.a.s.c.ShardLeaderElectionContext Found all replicas participating in election, clear LIR
   [junit4]   2> 1881163 INFO  (qtp23972949-18028) [n:127.0.0.1:41912_solr c:forwardingCollection s:shard1 r:core_node2 x:forwardingCollection_shard1_replica_n1] o.a.s.c.ShardLeaderElectionContext I am the new leader: https://127.0.0.1:41912/solr/forwardingCollection_shard1_replica_n1/ shard1
   [junit4]   2> 1881266 INFO  (zkCallback-2259-thread-2-processing-n:127.0.0.1:41912_solr) [n:127.0.0.1:41912_solr    ] o.a.s.c.c.ZkStateReader A cluster state change: [WatchedEvent state:SyncConnected type:NodeDataChanged path:/collections/forwardingCollection/state.json] for collection [forwardingCollection] has occurred - updating... (live nodes size: [2])
   [junit4]   2> 1881266 INFO  (zkCallback-2259-thread-1-processing-n:127.0.0.1:41912_solr) [n:127.0.0.1:41912_solr    ] o.a.s.c.c.ZkStateReader A cluster state change: [WatchedEvent state:SyncConnected type:NodeDataChanged path:/collections/forwardingCollection/state.json] for collection [forwardingCollection] has occurred - updating... (live nodes size: [2])
   [junit4]   2> 1881314 INFO  (qtp23972949-18028) [n:127.0.0.1:41912_solr c:forwardingCollection s:shard1 r:core_node2 x:forwardingCollection_shard1_replica_n1] o.a.s.c.ZkController I am the leader, no recovery necessary
   [junit4]   2> 1881317 INFO  (qtp23972949-18028) [n:127.0.0.1:41912_solr c:forwardingCollection s:shard1 r:core_node2 x:forwardingCollection_shard1_replica_n1] o.a.s.s.HttpSolrCall [admin] webapp=null path=/admin/cores params={qt=/admin/cores&coreNodeName=core_node2&collection.configName=conf1&newCollection=true&name=forwardingCollection_shard1_replica_n1&action=CREATE&numShards=1&collection=forwardingCollection&shard=shard1&wt=javabin&version=2&replicaType=NRT} status=0 QTime=1444
   [junit4]   2> 1881318 WARN  (httpShardExecutor-6130-thread-1-processing-n:127.0.0.1:41912_solr [https:////127.0.0.1:41912//solr] https:////127.0.0.1:41912//solr) [n:127.0.0.1:41912_solr    ] o.a.h.c.p.ResponseProcessCookies Invalid cookie header: "Set-Cookie: hadoop.auth="u=$&p=$&t=test&e=1508474993122&s=vMPJoRGbCc4f3ZufySpSZVXo3rY="; Path=/; Domain=127.0.0.1; Expires= , 20-   -2017 04:49:53 GMT; Secure; HttpOnly". Invalid 'expires' attribute: , 20- -2017 04:49:53 GMT
   [junit4]   2> 1881330 INFO  (qtp754445424-18036) [n:127.0.0.1:47063_solr    ] o.a.s.h.a.CollectionsHandler Wait for new collection to be active for at most 30 seconds. Check all shard replicas
   [junit4]   2> 1881420 INFO  (zkCallback-2259-thread-3-processing-n:127.0.0.1:41912_solr) [n:127.0.0.1:41912_solr    ] o.a.s.c.c.ZkStateReader A cluster state change: [WatchedEvent state:SyncConnected type:NodeDataChanged path:/collections/forwardingCollection/state.json] for collection [forwardingCollection] has occurred - updating... (live nodes size: [2])
   [junit4]   2> 1881420 INFO  (zkCallback-2259-thread-1-processing-n:127.0.0.1:41912_solr) [n:127.0.0.1:41912_solr    ] o.a.s.c.c.ZkStateReader A cluster state change: [WatchedEvent state:SyncConnected type:NodeDataChanged path:/collections/forwardingCollection/state.json] for collection [forwardingCollection] has occurred - updating... (live nodes size: [2])
   [junit4]   2> 1881562 INFO  (OverseerCollectionConfigSetProcessor-98857057720139781-127.0.0.1:41912_solr-n_0000000000) [n:127.0.0.1:41912_solr    ] o.a.s.c.OverseerTaskQueue Response ZK path: /overseer/collection-queue-work/qnr-0000000000 doesn't exist.  Requestor may have disconnected from ZooKeeper
   [junit4]   2> 1882332 INFO  (qtp754445424-18036) [n:127.0.0.1:47063_solr    ] o.a.s.s.HttpSolrCall [admin] webapp=null path=/admin/collections params={pullReplicas=0&replicationFactor=1&collection.configName=conf1&maxShardsPerNode=1&name=forwardingCollection&nrtReplicas=1&action=CREATE&numShards=1&tlogReplicas=0&wt=javabin&version=2} status=0 QTime=2784
   [junit4]   2> 1882333 WARN  (TEST-TestSolrCloudWithSecureImpersonation.testForwarding-seed#[B976A0C1B3CE24CB]) [    ] o.a.h.c.p.ResponseProcessCookies Invalid cookie header: "Set-Cookie: hadoop.auth="u=user&p=user&t=test&e=1508474992797&s=qxQpOli6dvJPY6TnPGgfAlDIgBo="; Path=/; Domain=127.0.0.1; Expires= , 20-   -2017 04:49:52 GMT; Secure; HttpOnly". Invalid 'expires' attribute: , 20- -2017 04:49:52 GMT
   [junit4]   2> 1882333 INFO  (TEST-TestSolrCloudWithSecureImpersonation.testForwarding-seed#[B976A0C1B3CE24CB]) [    ] o.a.s.c.AbstractDistribZkTestBase Wait for recoveries to finish - collection: forwardingCollection failOnTimeout:true timeout (sec):100
   [junit4]   2> 1882334 INFO  (TEST-TestSolrCloudWithSecureImpersonation.testForwarding-seed#[B976A0C1B3CE24CB]) [    ] o.a.s.c.AbstractDistribZkTestBase Recoveries finished - collection: forwardingCollection
   [junit4]   2> 1882337 INFO  (qtp23972949-18031) [n:127.0.0.1:41912_solr c:forwardingCollection s:shard1 r:core_node2 x:forwardingCollection_shard1_replica_n1] o.a.s.c.S.Request [forwardingCollection_shard1_replica_n1]  webapp=/solr path=/select params={q=*:*&wt=javabin&version=2} hits=0 status=0 QTime=0
   [junit4]   2> 1882338 WARN  (TEST-TestSolrCloudWithSecureImpersonation.testForwarding-seed#[B976A0C1B3CE24CB]) [    ] o.a.h.c.p.ResponseProcessCookies Invalid cookie header: "Set-Cookie: hadoop.auth="u=user&p=user&t=test&e=1508474995586&s=bj9AYemvfNif44EdrigNsmABQNI="; Path=/; Domain=127.0.0.1; Expires= , 20-   -2017 04:49:55 GMT; Secure; HttpOnly". Invalid 'expires' attribute: , 20- -2017 04:49:55 GMT
   [junit4]   2> 1882348 INFO  (qtp754445424-18035) [n:127.0.0.1:47063_solr    ] o.a.s.c.TransientSolrCoreCacheDefault Allocating transient cache for 2147483647 transient cores
   [junit4]   2> 1882352 INFO  (qtp23972949-18029) [n:127.0.0.1:41912_solr c:forwardingCollection s:shard1 r:core_node2 x:forwardingCollection_shard1_replica_n1] o.a.s.c.S.Request [forwardingCollection_shard1_replica_n1]  webapp=/solr path=/select params={q=*:*&wt=javabin&version=2} hits=0 status=0 QTime=0
   [junit4]   2> 1882352 WARN  (qtp754445424-18035) [n:127.0.0.1:47063_solr    ] o.a.h.c.p.ResponseProcessCookies Invalid cookie header: "Set-Cookie: hadoop.auth="u=$&p=$&t=test&e=1508474995600&s=mc/oDZMIgk/THhTaTBHjyXFJVog="; Path=/; Domain=127.0.0.1; Expires= , 20-   -2017 04:49:55 GMT; Secure; HttpOnly". Invalid 'expires' attribute: , 20- -2017 04:49:55 GMT
   [junit4]   2> 1882353 WARN  (TEST-TestSolrCloudWithSecureImpersonation.testForwarding-seed#[B976A0C1B3CE24CB]) [    ] o.a.h.c.p.ResponseProcessCookies Invalid cookie header: "Set-Cookie: hadoop.auth="u=user&p=user&t=test&e=1508474995595&s=31IYiK+fnxq6IGqKZMJ6EqJyEDY="; Path=/; Domain=127.0.0.1; Expires= , 20-   -2017 04:49:55 GMT; Secure; HttpOnly". Invalid 'expires' attribute: , 20- -2017 04:49:55 GMT
   [junit4]   2> 1882353 WARN  (TEST-TestSolrCloudWithSecureImpersonation.testForwarding-seed#[B976A0C1B3CE24CB]) [    ] o.a.h.c.p.ResponseProcessCookies Invalid cookie header: "Set-Cookie: hadoop.auth="u=$&p=$&t=test&e=1508474995600&s=mc/oDZMIgk/THhTaTBHjyXFJVog="; Path=/; Domain=127.0.0.1; Expires= , 20-   -2017 04:49:55 GMT; Secure; HttpOnly". Invalid 'expires' attribute: , 20- -2017 04:49:55 GMT
   [junit4]   2> 1882353 INFO  (TEST-TestSolrCloudWithSecureImpersonation.testForwarding-seed#[B976A0C1B3CE24CB]) [    ] o.a.s.SolrTestCaseJ4 ###Ending testForwarding
   [junit4]   2> 1882536 INFO  (TEST-TestSolrCloudWithSecureImpersonation.testProxyInvalidGroup-seed#[B976A0C1B3CE24CB]) [    ] o.a.s.SolrTestCaseJ4 ###Starting testProxyInvalidGroup
   [junit4]   2> 1882575 WARN  (qtp23972949-18030) [    ] o.a.h.s.ShellBasedUnixGroupsMapping got exception trying to get groups for user bar: id: invalid user name: "bar"
   [junit4]   2> id: invalid user name: "bar"
   [junit4]   2> 
   [junit4]   2> 1882576 WARN  (TEST-TestSolrCloudWithSecureImpersonation.testProxyInvalidGroup-seed#[B976A0C1B3CE24CB]) [    ] o.a.h.c.p.ResponseProcessCookies Invalid cookie header: "Set-Cookie: hadoop.auth="u=bogusGroup&p=bogusGroup&t=test&e=1508474995790&s=8HFv/KhlR5qOSR+k2SZ8zPQCo3U="; Path=/; Domain=127.0.0.1; Expires= , 20-   -2017 04:49:55 GMT; Secure; HttpOnly". Invalid 'expires' attribute: , 20- -2017 04:49:55 GMT
   [junit4]   2> 1882576 INFO  (TEST-TestSolrCloudWithSecureImpersonation.testProxyInvalidGroup-seed#[B976A0C1B3CE24CB]) [    ] o.a.s.SolrTestCaseJ4 ###Ending testProxyInvalidGroup
   [junit4]   2> 1882747 INFO  (TEST-TestSolrCloudWithSecureImpersonation.testProxyNoConfigGroups-seed#[B976A0C1B3CE24CB]) [    ] o.a.s.SolrTestCaseJ4 ###Starting testProxyNoConfigGroups
   [junit4]   2> 1882768 WARN  (TEST-TestSolrCloudWithSecureImpersonation.testProxyNoConfigGroups-seed#[B976A0C1B3CE24CB]) [    ] o.a.h.c.p.ResponseProcessCookies Invalid cookie header: "Set-Cookie: hadoop.auth="u=noGroups&p=noGroups&t=test&e=1508474995997&s=gpnNflAC1hCsFVvbmMasUFj6WiA="; Path=/; Domain=127.0.0.1; Expires= , 20-   -2017 04:49:55 GMT; Secure; HttpOnly". Invalid 'expires' attribute: , 20- -2017 04:49:55 GMT
   [junit4]   2> 1882768 INFO  (TEST-TestSolrCloudWithSecureImpersonation.testProxyNoConfigGroups-seed#[B976A0C1B3CE24CB]) [    ] o.a.s.SolrTestCaseJ4 ###Ending testProxyNoConfigGroups
   [junit4]   2> 1882946 INFO  (TEST-TestSolrCloudWithSecureImpersonation.testProxyUnknownRemote-seed#[B976A0C1B3CE24CB]) [    ] o.a.s.SolrTestCaseJ4 ###Starting testProxyUnknownRemote
   [junit4]   2> 1892974 WARN  (TEST-TestSolrCloudWithSecureImpersonation.testForwarding-seed#[B976A0C1B3CE24CB]-SendThread(127.0.0.1:45834)) [    ] o.a.z.ClientCnxn Client session timed out, have not heard from server in 10641ms for sessionid 0x15f35f860f3000b
   [junit4]   2> 1892978 WARN  (jetty-launcher-2248-thread-1-SendThread(127.0.0.1:45834)) [n:127.0.0.1:47063_solr    ] o.a.z.ClientCnxn Client session timed out, have not heard from server in 14661ms for sessionid 0x15f35f860f30008
   [junit4]   2> 1892978 WARN  (jetty-launcher-2248-thread-2-SendThread(127.0.0.1:45834)) [n:127.0.0.1:41912_solr    ] o.a.z.ClientCnxn Client session timed out, have not heard from server in 14665ms for sessionid 0x15f35f860f30007
   [junit4]   2> 1892979 WARN  (NIOServerCxn.Factory:0.0.0.0/0.0.0.0:0) [    ] o.a.z.s.NIOServerCnxn caught end of stream exception
   [junit4]   2> EndOfStreamException: Unable to read additional data from client sessionid 0x15f35f860f30008, likely client has closed socket
   [junit4]   2> 	at org.apache.zookeeper.server.NIOServerCnxn.doIO(NIOServerCnxn.java:239)
   [junit4]   2> 	at org.apache.zookeeper.server.NIOServerCnxnFactory.run(NIOServerCnxnFactory.java:203)
   [junit4]   2> 	at java.lang.Thread.run(Thread.java:748)
   [junit4]   2> 1892980 WARN  (NIOServerCxn.Factory:0.0.0.0/0.0.0.0:0) [    ] o.a.z.s.NIOServerCnxn caught end of stream exception
   [junit4]   2> EndOfStreamException: Unable to read additional data from client sessionid 0x15f35f860f30007, likely client has closed socket
   [junit4]   2> 	at org.apache.zookeeper.server.NIOServerCnxn.doIO(NIOServerCnxn.java:239)
   [junit4]   2> 	at org.apache.zookeeper.server.NIOServerCnxnFactory.run(NIOServerCnxnFactory.java:203)
   [junit4]   2> 	at java.lang.Thread.run(Thread.java:748)
   [junit4]   2> 1892981 WARN  (TEST-TestSolrCloudWithSecureImpersonation.testProxyUnknownRemote-seed#[B976A0C1B3CE24CB]) [    ] o.a.h.c.p.ResponseProcessCookies Invalid cookie header: "Set-Cookie: hadoop.auth="u=localHostAnyGroup&p=localHostAnyGroup&t=test&e=1508474996196&s=NAhGjr8oCxH7BH8+VvTSlXLOkT4="; Path=/; Domain=127.0.0.1; Expires= , 20-   -2017 04:49:56 GMT; Secure; HttpOnly". Invalid 'expires' attribute: , 20- -2017 04:49:56 GMT
   [junit4]   2> 1892982 INFO  (TEST-TestSolrCloudWithSecureImpersonation.testProxyUnknownRemote-seed#[B976A0C1B3CE24CB]) [    ] o.a.s.SolrTestCaseJ4 ###Ending testProxyUnknownRemote
   [junit4]   2> 1893080 INFO  (jetty-launcher-2248-thread-2-EventThread) [n:127.0.0.1:41912_solr    ] o.a.c.f.s.ConnectionStateManager State change: SUSPENDED
   [junit4]   2> 1893080 WARN  (zkCallback-2268-thread-3) [    ] o.a.s.c.c.ConnectionManager Watcher org.apache.solr.common.cloud.ConnectionManager@2c27522a name: ZooKeeperConnection Watcher:127.0.0.1:45834/solr got event WatchedEvent state:Disconnected type:None path:null path: null type: None
   [junit4]   2> 1893081 WARN  (zkCallback-2268-thread-3) [    ] o.a.s.c.c.ConnectionManager zkClient has disconnected
   [junit4]   2> 1893085 INFO  (jetty-launcher-2248-thread-1-EventThread) [n:127.0.0.1:47063_solr    ] o.a.c.f.s.ConnectionStateManager State change: SUSPENDED
   [junit4]   2> 1893187 INFO  (TEST-TestSolrCloudWithSecureImpersonation.testProxyNoConfigHosts-seed#[B976A0C1B3CE24CB]) [    ] o.a.s.SolrTestCaseJ4 ###Starting testProxyNoConfigHosts
   [junit4]   2> 1893190 WARN  (TEST-TestSolrCloudWithSecureImpersonation.testProxyNoConfigHosts-seed#[B976A0C1B3CE24CB]) [    ] o.a.h.c.p.ResponseProcessCookies Invalid cookie header: "Set-Cookie: hadoop.auth="u=noHosts&p=noHosts&t=test&e=1508475006437&s=cpa0Isj2UPzjyEcaNQoX+WqcXCk="; Path=/; Domain=127.0.0.1; Expires= , 20-   -2017 04:50:06 GMT; Secure; HttpOnly". Invalid 'expires' attribute: , 20- -2017 04:50:06 GMT
   [junit4]   2> 1893191 INFO  (TEST-TestSolrCloudWithSecureImpersonation.testProxyNoConfigHosts-seed#[B976A0C1B3CE24CB]) [    ] o.a.s.SolrTestCaseJ4 ###Ending testProxyNoConfigHosts
   [junit4]   2> 1893381 INFO  (TEST-TestSolrCloudWithSecureImpersonation.testProxyWrongHost-seed#[B976A0C1B3CE24CB]) [    ] o.a.s.SolrTestCaseJ4 ###Starting testProxyWrongHost
   [junit4]   2> 1908408 WARN  (jetty-launcher-2248-thread-1-SendThread(127.0.0.1:45834)) [n:127.0.0.1:47063_solr    ] o.a.z.ClientCnxn Client session timed out, have not heard from server in 15427ms for sessionid 0x15f35f860f30006
   [junit4]   2> 1908408 WARN  (jetty-launcher-2248-thread-2-SendThread(127.0.0.1:45834)) [n:127.0.0.1:41912_solr    ] o.a.z.ClientCnxn Client session timed out, have not heard from server in 15427ms for sessionid 0x15f35f860f30005
   [junit4]   2> 1908409 WARN  (NIOServerCxn.Factory:0.0.0.0/0.0.0.0:0) [    ] o.a.z.s.NIOServerCnxn caught end of stream exception
   [junit4]   2> EndOfStreamException: Unable to read additional data from client sessionid 0x15f35f860f30006, likely client has closed socket
   [junit4]   2> 	at org.apache.zookeeper.server.NIOServerCnxn.doIO(NIOServerCnxn.java:239)
   [junit4]   2> 	at org.apache.zookeeper.server.NIOServerCnxnFactory.run(NIOServerCnxnFactory.java:203)
   [junit4]   2> 	at java.lang.Thread.run(Thread.java:748)
   [junit4]   2> 1908410 WARN  (NIOServerCxn.Factory:0.0.0.0/0.0.0.0:0) [    ] o.a.z.s.NIOServerCnxn Exception causing close of session 0x15f35f860f30005 due to java.io.IOException: Connection reset by peer
   [junit4]   2> 1908410 WARN  (TEST-TestSolrCloudWithSecureImpersonation.testProxyWrongHost-seed#[B976A0C1B3CE24CB]) [    ] o.a.h.c.p.ResponseProcessCookies Invalid cookie header: "Set-Cookie: hadoop.auth="u=wrongHost&p=wrongHost&t=test&e=1508475006631&s=J+IQLZKKfvfptvvAXaGuR9HK+6Y="; Path=/; Domain=127.0.0.1; Expires= , 20-   -2017 04:50:06 GMT; Secure; HttpOnly". Invalid 'expires' attribute: , 20- -2017 04:50:06 GMT
   [junit4]   2> 1908411 INFO  (TEST-TestSolrCloudWithSecureImpersonation.testProxyWrongHost-seed#[B976A0C1B3CE24CB]) [    ] o.a.s.SolrTestCaseJ4 ###Ending testProxyWrongHost
   [junit4]   2> 1908412 WARN  (jetty-launcher-2248-thread-2-SendThread(127.0.0.1:45834)) [n:127.0.0.1:41912_solr    ] o.a.z.ClientCnxn Unable to reconnect to ZooKeeper service, session 0x15f35f860f30007 has expired
   [junit4]   2> 1908412 WARN  (TEST-TestSolrCloudWithSecureImpersonation.testForwarding-seed#[B976A0C1B3CE24CB]-SendThread(127.0.0.1:45834)) [    ] o.a.z.ClientCnxn Unable to reconnect to ZooKeeper service, session 0x15f35f860f3000b has expired
   [junit4]   2> 1908422 WARN  (jetty-launcher-2248-thread-1-SendThread(127.0.0.1:45834)) [n:127.0.0.1:47063_solr    ] o.a.z.ClientCnxn Unable to reconnect to ZooKeeper service, session 0x15f35f860f30008 has expired
   [junit4]   2> 1908426 WARN  (zkCallback-2268-thread-2) [    ] o.a.s.c.c.ConnectionManager Watcher org.apache.solr.common.cloud.ConnectionManager@2c27522a name: ZooKeeperConnection Watcher:127.0.0.1:45834/solr got event WatchedEvent state:Expired type:None path:null path: null type: None
   [junit4]   2> 1908431 WARN  (zkCallback-2268-thread-2) [    ] o.a.s.c.c.ConnectionManager Our previous ZooKeeper session was expired. Attempting to reconnect to recover relationship with ZooKeeper...
   [junit4]   2> 1908431 WARN  (zkCallback-2268-thread-2) [    ] o.a.s.c.c.DefaultConnectionStrategy Connection expired - starting a new one...
   [junit4]   2> 1908482 INFO  (zkCallback-2268-thread-2) [    ] o.a.s.c.c.ConnectionManager Connection with ZooKeeper reestablished.
   [junit4]   2> 1908517 WARN  (zkCallback-2260-thread-2-processing-n:127.0.0.1:47063_solr) [n:127.0.0.1:47063_solr    ] o.a.s.c.c.ConnectionManager Watcher org.apache.solr.common.cloud.ConnectionManager@39a1fc3e name: ZooKeeperConnection Watcher:127.0.0.1:45834/solr got event WatchedEvent state:Disconnected type:None path:null path: null type: None
   [junit4]   2> 1908517 WARN  (zkCallback-2260-thread-2-processing-n:127.0.0.1:47063_solr) [n:127.0.0.1:47063_solr    ] o.a.s.c.c.ConnectionManager zkClient has disconnected
   [junit4]   2> 1908541 WARN  (zkCallback-2259-thread-7-processing-n:127.0.0.1:41912_solr) [n:127.0.0.1:41912_solr    ] o.a.s.c.c.ConnectionManager Watcher org.apache.solr.common.cloud.ConnectionManager@10c03cd3 name: ZooKeeperConnection Watcher:127.0.0.1:45834/solr got event WatchedEvent state:Disconnected type:None path:null path: null type: None
   [junit4]   2> 1908567 WARN  (zkCallback-2259-thread-7-processing-n:127.0.0.1:41912_solr) [n:127.0.0.1:41912_solr    ] o.a.s.c.c.ConnectionManager zkClient has disconnected
   [junit4]   2> 1908627 INFO  (TEST-TestSolrCloudWithSecureImpersonation.testProxyNullProxyUser-seed#[B976A0C1B3CE24CB]) [    ] o.a.s.SolrTestCaseJ4 ###Starting testProxyNullProxyUser
   [junit4]   2> 1908627 INFO  (qtp23972949-18028) [n:127.0.0.1:41912_solr c:forwardingCollection s:shard1 r:core_node2 x:forwardingCollection_shard1_replica_n1] o.a.s.s.SolrDispatchFilter Error authenticating
   [junit4]   2> java.lang.IllegalArgumentException: userName is NULL, empty or contains a '&'
   [junit4]   2> 	at org.apache.hadoop.security.authentication.util.AuthToken.checkForIllegalArgument(AuthToken.java:87)
   [junit4]   2> 	at org.apache.hadoop.security.authentication.util.AuthToken.<init>(AuthToken.java:70)
   [junit4]   2> 	at org.apache.hadoop.security.authentication.server.AuthenticationToken.<init>(AuthenticationToken.java:58)
   [junit4]   2> 	at org.apache.solr.security.HttpParamDelegationTokenPlugin$HttpParamDelegationTokenAuthenticationHandler$HttpParamAuthenticationHandler.authenticate(HttpParamDelegationTokenPlugin.java:213)
   [junit4]   2> 	at org.apache.hadoop.security.token.delegation.web.DelegationTokenAuthenticationHandler.authenticate(DelegationTokenAuthenticationHandler.java:348)
   [junit4]   2> 	at org.apache.solr.security.RequestContinuesRecorderAuthenticationHandler.authenticate(RequestContinuesRecorderAuthenticationHandler.java:69)
   [junit4]   2> 	at org.apache.hadoop.security.authentication.server.AuthenticationFilter.doFilter(AuthenticationFilter.java:518)
   [junit4]   2> 	at org.apache.solr.security.DelegationTokenKerberosFilter.doFilter(DelegationTokenKerberosFilter.java:134)
   [junit4]   2> 	at org.apache.solr.security.HttpParamDelegationTokenPlugin$HttpParamToRequestFilter.doFilter(HttpParamDelegationTokenPlugin.java:245)
   [junit4]   2> 	at org.apache.solr.security.KerberosPlugin.doAuthenticate(KerberosPlugin.java:243)
   [junit4]   2> 	at org.apache.solr.servlet.SolrDispatchFilter.authenticateRequest(SolrDispatchFilter.java:451)
   [junit4]   2> 	at org.apache.solr.servlet.SolrDispatchFilter.doFilter(SolrDispatchFilter.java:347)
   [junit4]   2> 	at org.apache.solr.servlet.SolrDispatchFilter.doFilter(SolrDispatchFilter.java:326)
   [junit4]   2> 	at org.eclipse.jetty.servlet.ServletHandler$CachedChain.doFilter(ServletHandler.java:1759)
   [junit4]   2> 	at org.apache.solr.client.solrj.embedded.JettySolrRunner$DebugFilter.doFilter(JettySolrRunner.java:139)
   [junit4]   2> 	at org.eclipse.jetty.servlet.ServletHandler$CachedChain.doFilter(ServletHandler.java:1759)
   [junit4]   2> 	at org.eclipse.jetty.servlet.ServletHandler.doHandle(ServletHandler.java:582)
   [junit4]   2> 	at org.eclipse.jetty.server.session.SessionHandler.doHandle(SessionHandler.java:224)
   [junit4]   2> 	at org.eclipse.jetty.server.handler.ContextHandler.doHandle(ContextHandler.java:1180)
   [junit4]   2> 	at org.eclipse.jetty.servlet.ServletHandler.doScope(ServletHandler.java:512)
   [junit4]   2> 	at org.eclipse.jetty.server.session.SessionHandler.doScope(SessionHandler.java:185)
   [junit4]   2> 	at org.eclipse.jetty.server.handler.ContextHandler.doScope(ContextHandler.java:1112)
   [junit4]   2> 	at org.eclipse.jetty.server.handler.ScopedHandler.handle(ScopedHandler.java:141)
   [junit4]   2> 	at org.eclipse.jetty.server.handler.gzip.GzipHandler.handle(GzipHandler.java:493)
   [junit4]   2> 	at org.eclipse.jetty.server.handler.HandlerWrapper.handle(HandlerWrapper.java:134)
   [junit4]   2> 	at org.eclipse.jetty.server.Server.handle(Server.java:534)
   [junit4]   2> 	at org.eclipse.jetty.server.HttpChannel.handle(HttpChannel.java:320)
   [junit4]   2> 	at org.eclipse.jetty.server.HttpConnection.onFillable(HttpConnection.java:251)
   [junit4]   2> 	at org.eclipse.jetty.io.AbstractConnection$ReadCallback.succeeded(AbstractConnection.java:283)
   [junit4]   2> 	at org.eclipse.jetty.io.FillInterest.fillable(FillInterest.java:108)
   [junit4]   2> 	at org.eclipse.jetty.io.ssl.SslConnection.onFillable(SslConnection.java:251)
   [junit4]   2> 	at org.eclipse.jetty.io.AbstractConnection$ReadCallback.succeeded(AbstractConnection.java:283)
   [junit4]   2> 	at org.eclipse.jetty.io.FillInterest.fillable(FillInterest.java:108)
   [junit4]   2> 	at org.eclipse.jetty.io.SelectChannelEndPoint$2.run(SelectChannelEndPoint.java:93)
   [junit4]   2> 	at org.eclipse.jetty.util.thread.strategy.ExecuteProduceConsume.executeProduceConsume(ExecuteProduceConsume.java:303)
   [junit4]   2> 	at org.eclipse.jetty.util.thread.strategy.ExecuteProduceConsume.produceConsume(ExecuteProduceConsume.java:148)
   [junit4]   2> 	at org.eclipse.jetty.util.thread.strategy.ExecuteProduceConsume.run(ExecuteProduceConsume.java:136)
   [junit4]   2> 	at org.eclipse.jetty.util.thread.QueuedThreadPool.runJob(QueuedThreadPool.java:671)
   [junit4]   2> 	at org.eclipse.jetty.util.thread.QueuedThreadPool$2.run(QueuedThreadPool.java:589)
   [junit4]   2> 	at java.lang.Thread.run(Thread.java:748)
   [junit4]   2> 1908628 WARN  (qtp23972949-18028) [n:127.0.0.1:41912_solr c:forwardingCollection s:shard1 r:core_node2 x:forwardingCollection_shard1_replica_n1] o.e.j.s.ServletHandler /solr/admin/collections
   [junit4]   2> org.apache.solr.common.SolrException: Error during request authentication, 
   [junit4]   2> 	at org.apache.solr.servlet.SolrDispatchFilter.authenticateRequest(SolrDispatchFilter.java:457)
   [junit4]   2> 	at org.apache.solr.servlet.SolrDispatchFilter.doFilter(SolrDispatchFilter.java:347)
   [junit4]   2> 	at org.apache.solr.servlet.SolrDispatchFilter.doFilter(SolrDispatchFilter.java:326)
   [junit4]   2> 	at org.eclipse.jetty.servlet.ServletHandler$CachedChain.doFilter(ServletHandler.java:1759)
   [junit4]   2> 	at org.apache.solr.client.solrj.embedded.JettySolrRunner$DebugFilter.doFilter(JettySolrRunner.java:139)
   [junit4]   2> 	at org.eclipse.jetty.servlet.ServletHandler$CachedChain.doFilter(ServletHandler.java:1759)
   [junit4]   2> 	at org.eclipse.jetty.servlet.ServletHandler.doHandle(ServletHandler.java:582)
   [junit4]   2> 	at org.eclipse.jetty.server.session.SessionHandler.doHandle(SessionHandler.java:224)
   [junit4]   2> 	at org.eclipse.jetty.server.handler.ContextHandler.doHandle(ContextHandler.java:1180)
   [junit4]   2> 	at org.eclipse.jetty.servlet.ServletHandler.doScope(ServletHandler.java:512)
   [junit4]   2> 	at org.eclipse.jetty.server.session.SessionHandler.doScope(SessionHandler.java:185)
   [junit4]   2> 	at org.eclipse.jetty.server.handler.ContextHandler.doScope(ContextHandler.java:1112)
   [junit4]   2> 	at org.eclipse.jetty.server.handler.ScopedHandler.handle(ScopedHandler.java:141)
   [junit4]   2> 	at org.eclipse.jetty.server.handler.gzip.GzipHandler.handle(GzipHandler.java:493)
   [junit4]   2> 	at org.eclipse.jetty.server.handler.HandlerWrapper.handle(HandlerWrapper.java:134)
   [junit4]   2> 	at org.eclipse.jetty.server.Server.handle(Server.java:534)
   [junit4]   2> 	at org.eclipse.jetty.server.HttpChannel.handle(HttpChannel.java:320)
   [junit4]   2> 	at org.eclipse.jetty.server.HttpConnection.onFillable(HttpConnection.java:251)
   [junit4]   2> 	at org.eclipse.jetty.io.AbstractConnection$ReadCallback.succeeded(AbstractConnection.java:283)
   [junit4]   2> 	at org.eclipse.jetty.io.FillInterest.fillable(FillInterest.java:108)
   [junit4]   2> 	at org.eclipse.jetty.io.ssl.SslConnection.onFillable(SslConnection.java:251)
   [junit4]   2> 	at org.eclipse.jetty.io.AbstractConnection$ReadCallback.succeeded(AbstractConnection.java:283)
   [junit4]   2> 	at org.eclipse.jetty.io.FillInterest.fillable(FillInterest.java:108)
   [junit4]   2> 	at org.eclipse.jetty.io.SelectChannelEndPoint$2.run(SelectChannelEndPoint.java:93)
   [junit4]   2> 	at org.eclipse.jetty.util.thread.strategy.ExecuteProduceConsume.executeProduceConsume(ExecuteProduceConsume.java:303)
   [junit4]   2> 	at org.eclipse.jetty.util.thread.strategy.ExecuteProduceConsume.produceConsume(ExecuteProduceConsume.java:148)
   [junit4]   2> 	at org.eclipse.jetty.util.thread.strategy.ExecuteProduceConsume.run(ExecuteProduceConsume.java:136)
   [junit4]   2> 	at org.eclipse.jetty.util.thread.QueuedThreadPool.runJob(QueuedThreadPool.java:671)
   [junit4]   2> 	at org.eclipse.jetty.util.thread.QueuedThreadPool$2.run(QueuedThreadPool.java:589)
   [junit4]   2> 	at java.lang.Thread.run(Thread.java:748)
   [junit4]   2> Caused by: java.lang.IllegalArgumentException: userName is NULL, empty or contains a '&'
   [junit4]   2> 	at org.apache.hadoop.security.authentication.util.AuthToken.checkForIllegalArgument(AuthToken.java:87)
   [junit4]   2> 	at org.apache.hadoop.security.authentication.util.AuthToken.<init>(AuthToken.java:70)
   [junit4]   2> 	at org.apache.hadoop.security.authentication.server.AuthenticationToken.<init>(AuthenticationToken.java:58)
   [junit4]   2> 	at org.apache.solr.security.HttpParamDelegationTokenPlugin$HttpParamDelegationTokenAuthenticationHandler$HttpParamAuthenticationHandler.authenticate(HttpParamDelegationTokenPlugin.java:213)
   [junit4]   2> 	at org.apache.hadoop.security.token.delegation.web.DelegationTokenAuthenticationHandler.authenticate(DelegationTokenAuthenticationHandler.java:348)
   [junit4]   2> 	at org.apache.solr.security.RequestContinuesRecorderAuthenticationHandler.authenticate(RequestContinuesRecorderAuthenticationHandler.java:69)
   [junit4]   2> 	at org.apache.hadoop.security.authentication.server.AuthenticationFilter.doFilter(AuthenticationFilter.java:518)
   [junit4]   2> 	at org.apache.solr.security.DelegationTokenKerberosFilter.doFilter(DelegationTokenKerberosFilter.java:134)
   [junit4]   2> 	at org.apache.solr.security.HttpParamDelegationTokenPlugin$HttpParamToRequestFilter.doFilter(HttpParamDelegationTokenPlugin.java:245)
   [junit4]   2> 	at org.apache.solr.security.KerberosPlugin.doAuthenticate(KerberosPlugin.java:243)
   [junit4]   2> 	at org.apache.solr.servlet.SolrDispatchFilter.authenticateRequest(SolrDispatchFilter.java:451)
   [junit4]   2> 	... 29 more
   [junit4]   2> 1908628 INFO  (zkCallback-2268-thread-2) [    ] o.a.s.c.c.DefaultConnectionStrategy Reconnected to ZooKeeper
   [junit4]   2> 1908629 INFO  (zkCallback-2268-thread-2) [    ] o.a.s.c.c.ConnectionManager Connected:true
   [junit4]   2> 1908629 INFO  (TEST-TestSolrCloudWithSecureImpersonation.testProxyNullProxyUser-seed#[B976A0C1B3CE24CB]) [    ] o.a.s.SolrTestCaseJ4 ###Ending testProxyNullProxyUser
   [junit4]   2> 1908840 INFO  (TEST-TestSolrCloudWithSecureImpersonation.testProxyValidateAnyHostAnyUser-seed#[B976A0C1B3CE24CB]) [    ] o.a.s.SolrTestCaseJ4 ###Starting testProxyValidateAnyHostAnyUser
   [junit4]   2> 1908842 INFO  (qtp23972949-18032) [n:127.0.0.1:41912_solr    ] o.a.s.h.a.CollectionsHandler Invoked Collection Action :list with params doAs=bar&action=LIST&wt=javabin&version=2 and sendToOCPQueue=true
   [junit4]   2> 1908843 INFO  (qtp23972949-18032) [n:127.0.0.1:41912_solr    ] o.a.s.s.HttpSolrCall [admin] webapp=null path=/admin/collections params={doAs=bar&action=LIST&wt=javabin&version=2} status=0 QTime=0
   [junit4]   2> 1908843 WARN  (TEST-TestSolrCloudWithSecureImpersonation.testProxyValidateAnyHostAnyUser-seed#[B976A0C1B3CE24CB]) [    ] o.a.h.c.p.ResponseProcessCookies Invalid cookie header: "Set-Cookie: hadoop.auth="u=anyHostAnyUser&p=anyHostAnyUser&t=test&e=1508475022091&s=TYJvfZfWC6Pq6ag5KRPMsYYa/PM="; Path=/; Domain=127.0.0.1; Expires= , 20-   -2017 04:50:22 GMT; Secure; HttpOnly". Invalid 'expires' attribute: , 20- -2017 04:50:22 GMT
   [junit4]   2> 1908843 INFO  (TEST-TestSolrCloudWithSecureImpersonation.testProxyValidateAnyHostAnyUser-seed#[B976A0C1B3CE24CB]) [    ] o.a.s.SolrTestCaseJ4 ###Ending testProxyValidateAnyHostAnyUser
   [junit4]   2> 1909053 INFO  (TEST-TestSolrCloudWithSecureImpersonation.testProxyInvalidRemote-seed#[B976A0C1B3CE24CB]) [    ] o.a.s.SolrTestCaseJ4 ###Starting testProxyInvalidRemote
   [junit4]   2> 1909059 WARN  (TEST-TestSolrCloudWithSecureImpersonation.testProxyInvalidRemote-seed#[B976A0C1B3CE24CB]) [    ] o.a.h.c.p.ResponseProcessCookies Invalid cookie header: "Set-Cookie: hadoop.auth="u=localHostAnyGroup&p=localHostAnyGroup&t=test&e=1508475022303&s=f7kWlWUv8FFnnnuHQy/FBAOxp4M="; Path=/; Domain=127.0.0.1; Expires= , 20-   -2017 04:50:22 GMT; Secure; HttpOnly". Invalid 'expires' attribute: , 20- -2017 04:50:22 GMT
   [junit4]   2> 1909060 INFO  (TEST-TestSolrCloudWithSecureImpersonation.testProxyInvalidRemote-seed#[B976A0C1B3CE24CB]) [    ] o.a.s.SolrTestCaseJ4 ###Ending testProxyInvalidRemote
   [junit4]   2> 1909063 INFO  (jetty-closer-2249-thread-2) [    ] o.e.j.s.AbstractConnector Stopped ServerConnector@34d1beee{SSL,[ssl, http/1.1]}{127.0.0.1:0}
   [junit4]   2> 1909063 INFO  (jetty-closer-2249-thread-1) [    ] o.e.j.s.AbstractConnector Stopped ServerConnector@557a4641{SSL,[ssl, http/1.1]}{127.0.0.1:0}
   [junit4]   2> 1909066 INFO  (jetty-closer-2249-thread-2) [    ] o.a.s.c.CoreContainer Shutting down CoreContainer instance=1203469904
   [junit4]   2> 1909066 INFO  (jetty-closer-2249-thread-1) [    ] o.a.s.c.CoreContainer Shutting down CoreContainer instance=470422863
   [junit4]   2> 1909066 INFO  (jetty-closer-2249-thread-2) [    ] o.a.s.m.SolrMetricManager Closing metric reporters for registry=solr.node, tag=null
   [junit4]   2> 1909066 INFO  (jetty-closer-2249-thread-2) [    ] o.a.s.m.r.SolrJmxReporter Closing reporter [org.apache.solr.metrics.reporters.SolrJmxReporter@6376db2f: rootName = solr_47063, domain = solr.node, service url = null, agent id = null] for registry solr.node / com.codahale.metrics.MetricRegistry@2ad30cd8
   [junit4]   2> 1909067 INFO  (jetty-closer-2249-thread-1) [    ] o.a.s.m.SolrMetricManager Closing metric reporters for registry=solr.node, tag=null
   [junit4]   2> 1909067 INFO  (jetty-closer-2249-thread-1) [    ] o.a.s.m.r.SolrJmxReporter Closing reporter [org.apache.solr.metrics.reporters.SolrJmxReporter@2ca4e1d9: rootName = solr_41912, domain = solr.node, service url = null, agent id = null] for registry solr.node / com.codahale.metrics.MetricRegistry@1b32caab
   [junit4]   2> 1909071 INFO  (jetty-closer-2249-thread-2) [    ] o.a.s.m.SolrMetricManager Closing metric reporters for registry=solr.jvm, tag=null
   [junit4]   2> 1909071 INFO  (jetty-closer-2249-thread-2) [    ] o.a.s.m.r.SolrJmxReporter Closing reporter [org.apache.solr.metrics.reporters.SolrJmxReporter@6d705985: rootName = solr_47063, domain = solr.jvm, service url = null, agent id = null] for registry solr.jvm / com.codahale.metrics.MetricRegistry@3cb24882
   [junit4]   2> 1909073 INFO  (jetty-closer-2249-thread-1) [    ] o.a.s.m.SolrMetricManager Closing metric reporters for registry=solr.jvm, tag=null
   [junit4]   2> 1909073 INFO  (jetty-closer-2249-thread-1) [    ] o.a.s.m.r.SolrJmxReporter Closing reporter [org.apache.solr.metrics.reporters.SolrJmxReporter@3eaa793d: rootName = solr_41912, domain = solr.jvm, service url = null, agent id = null] for registry solr.jvm / com.codahale.metrics.MetricRegistry@3cb24882
   [junit4]   2> 1909079 INFO  (jetty-closer-2249-thread-2) [    ] o.a.s.m.SolrMetricManager Closing metric reporters for registry=solr.jetty, tag=null
   [junit4]   2> 1909079 INFO  (jetty-closer-2249-thread-2) [    ] o.a.s.m.r.SolrJmxReporter Closing reporter [org.apache.solr.metrics.reporters.SolrJmxReporter@628d54ec: rootName = solr_47063, domain = solr.jetty, service url = null, agent id = null] for registry solr.jetty / com.codahale.metrics.MetricRegistry@388ddbcc
   [junit4]   2> 1909079 INFO  (jetty-closer-2249-thread-1) [    ] o.a.s.m.SolrMetricManager Closing metric reporters for registry=solr.jetty, tag=null
   [junit4]   2> 1909079 INFO  (jetty-closer-2249-thread-1) [    ] o.a.s.m.r.SolrJmxReporter Closing reporter [org.apache.solr.metrics.reporters.SolrJmxReporter@b50da0b: rootName = solr_41912, domain = solr.jetty, service url = null, agent id = null] for registry solr.jetty / com.codahale.metrics.MetricRegistry@388ddbcc
   [junit4]   2> 1909989 INFO  (jetty-closer-2249-thread-1) [    ] o.a.s.c.ZkController Remove node as live in ZooKeeper:/live_nodes/127.0.0.1:41912_solr
   [junit4]   2> 1909991 INFO  (jetty-closer-2249-thread-1) [    ] o.a.s.m.SolrMetricManager Closing metric reporters for registry=solr.cluster, tag=null
   [junit4]   2> 1909996 INFO  (zkCallback-2259-thread-6-processing-n:127.0.0.1:41912_solr) [n:127.0.0.1:41912_solr    ] o.a.s.c.c.ZkStateReader Updated live nodes from ZooKeeper... (2) -> (1)
   [junit4]   2> 1909996 INFO  (coreCloseExecutor-6146-thread-1) [n:127.0.0.1:41912_solr c:forwardingCollection s:shard1 r:core_node2 x:forwardingCollection_shard1_replica_n1] o.a.s.c.SolrCore [forwardingCollection_shard1_replica_n1]  CLOSING SolrCore org.apache.solr.core.SolrCore@5e132e5a
   [junit4]   2> 1909996 INFO  (coreCloseExecutor-6146-thread-1) [n:127.0.0.1:41912_solr c:forwardingCollection s:shard1 r:core_node2 x:forwardingCollection_shard1_replica_n1] o.a.s.m.SolrMetricManager Closing metric reporters for registry=solr.core.forwardingCollection.shard1.replica_n1, tag=1578315354
   [junit4]   2> 1909996 INFO  (coreCloseExecutor-6146-thread-1) [n:127.0.0.1:41912_solr c:forwardingCollection s:shard1 r:core_node2 x:forwardingCollection_shard1_replica_n1] o.a.s.m.r.SolrJmxReporter Closing reporter [org.apache.solr.metrics.reporters.SolrJmxReporter@7a0cc820: rootName = solr_41912, domain = solr.core.forwardingCollection.shard1.replica_n1, service url = null, agent id = null] for registry solr.core.forwardingCollection.shard1.replica_n1 / com.codahale.metrics.MetricRegistry@55013d7e
   [junit4]   2> 1909997 INFO  (zkCallback-2259-thread-5-processing-n:127.0.0.1:41912_solr) [n:127.0.0.1:41912_solr    ] o.a.s.c.c.ZkStateReader A cluster state change: [WatchedEvent state:SyncConnected type:NodeDataChanged path:/collections/forwardingCollection/state.json] for collection [forwardingCollection] has occurred - updating... (live nodes size: [1])
   [junit4]   2> 1909997 INFO  (zkCallback-2259-thread-9-processing-n:127.0.0.1:41912_solr) [n:127.0.0.1:41912_solr    ] o.a.s.c.c.ZkStateReader A cluster state change: [WatchedEvent state:SyncConnected type:NodeDataChanged path:/collections/forwardingCollection/state.json] for collection [forwardingCollection] has occurred - updating... (live nodes size: [1])
   [junit4]   2> 1910031 INFO  (coreCloseExecutor-6146-thread-1) [n:127.0.0.1:41912_solr c:forwardingCollection s:shard1 r:core_node2 x:forwardingCollection_shard1_replica_n1] o.a.s.m.SolrMetricManager Closing metric reporters for registry=solr.collection.forwardingCollection.shard1.leader, tag=1578315354
   [junit4]   2> 1910033 INFO  (jetty-closer-2249-thread-1) [    ] o.a.s.c.Overseer Overseer (id=98857057720139781-127.0.0.1:41912_solr-n_0000000000) closing
   [junit4]   2> 1910033 INFO  (OverseerStateUpdate-98857057720139781-127.0.0.1:41912_solr-n_0000000000) [n:127.0.0.1:41912_solr    ] o.a.s.c.Overseer Overseer Loop exiting : 127.0.0.1:41912_solr
   [junit4]   2> 1910033 WARN  (OverseerAutoScalingTriggerThread-98857057720139781-127.0.0.1:41912_solr-n_0000000000) [n:127.0.0.1:41912_solr    ] o.a.s.c.a.OverseerTriggerThread OverseerTriggerThread woken up but we are closed, exiting.
   [junit4]   2> 1910042 ERROR (Thread[Thread-5763,5,TGRP-TestSolrCloudWithSecureImpersonation]) [n:127.0.0.1:41912_solr    ] o.a.h.s.t.d.AbstractDelegationTokenSecretManager ExpiredTokenRemover received java.lang.InterruptedException: sleep interrupted
   [junit4]   2> 1910052 INFO  (jetty-closer-2249-thread-1) [    ] o.e.j.s.h.ContextHandler Stopped o.e.j.s.ServletContextHandler@18c6950d{/solr,null,UNAVAILABLE}
   [junit4]   2> 1910266 INFO  (zkCallback-2260-thread-3-processing-n:127.0.0.1:47063_solr) [n:127.0.0.1:47063_solr    ] o.a.s.c.c.ZkStateReader Updated live nodes from ZooKeeper... (2) -> (1)
   [junit4]   2> 1910266 INFO  (zkCallback-2260-thread-1-processing-n:127.0.0.1:47063_solr) [n:127.0.0.1:47063_solr    ] o.a.s.c.OverseerElectionContext I am going to be the leader 127.0.0.1:47063_solr
   [junit4]   2> 1910268 INFO  (jetty-closer-2249-thread-2) [    ] o.a.s.c.ZkController Remove node as live in ZooKeeper:/live_nodes/127.0.0.1:47063_solr
   [junit4]   2> 1910274 INFO  (jetty-closer-2249-thread-2) [    ] o.a.s.m.SolrMetricManager Closing metric reporters for registry=solr.cluster, tag=null
   [junit4]   2> 1911779 WARN  (zkCallback-2260-thread-3-processing-n:127.0.0.1:47063_solr) [n:127.0.0.1:47063_solr    ] o.a.s.c.c.ZkStateReader ZooKeeper watch triggered, but Solr cannot talk to ZK: [KeeperErrorCode = Session expired for /live_nodes]
   [junit4]   2> 1911780 ERROR (Thread[Thread-5765,5,TGRP-TestSolrCloudWithSecureImpersonation]) [n:127.0.0.1:47063_solr    ] o.a.h.s.t.d.AbstractDelegationTokenSecretManager ExpiredTokenRemover received java.lang.InterruptedException: sleep interrupted
   [junit4]   2> 1911792 INFO  (jetty-closer-2249-thread-2) [    ] o.e.j.s.h.ContextHandler Stopped o.e.j.s.ServletContextHandler@54f18dac{/solr,null,UNAVAILABLE}
   [junit4]   2> 1911796 ERROR (SUITE-TestSolrCloudWithSecureImpersonation-seed#[B976A0C1B3CE24CB]-worker) [    ] o.a.z.s.ZooKeeperServer ZKShutdownHandler is not registered, so ZooKeeper server won't take any action on ERROR or SHUTDOWN server state changes
   [junit4]   2> 1911797 INFO  (SUITE-TestSolrCloudWithSecureImpersonation-seed#[B976A0C1B3CE24CB]-worker) [    ] o.a.s.c.ZkTestServer connecting to 127.0.0.1:45834 45834
   [junit4]   2> 1916882 INFO  (Thread-5746) [    ] o.a.s.c.ZkTestServer connecting to 127.0.0.1:45834 45834
   [junit4]   2> 1916899 WARN  (Thread-5746) [    ] o.a.s.c.ZkTestServer Watch limit violations: 
   [junit4]   2> Maximum concurrent create/delete watches above limit:
   [junit4]   2> 
   [junit4]   2> 	4	/solr/aliases.json
   [junit4]   2> 	2	/solr/security.json
   [junit4]   2> 
   [junit4]   2> Maximum concurrent data watches above limit:
   [junit4]   2> 
   [junit4]   2> 	6	/solr/collections/forwardingCollection/state.json
   [junit4]   2> 	4	/solr/clusterstate.json
   [junit4]   2> 	4	/solr/clusterprops.json
   [junit4]   2> 	2	/solr/security/zkdtsm/ZKDTSMRoot/ZKDTSMKeyIdRoot
   [junit4]   2> 	2	/solr/security/zkdtsm/ZKDTSMRoot/ZKDTSMMasterKeyRoot/DK_1
   [junit4]   2> 	2	/solr/security/zkdtsm/ZKDTSMRoot/ZKDTSMMasterKeyRoot/DK_3
   [junit4]   2> 	2	/solr/security/zkdtsm/ZKDTSMRoot/ZKDTSMMasterKeyRoot/DK_2
   [junit4]   2> 	2	/solr/security/zkdtsm/ZKDTSMRoot/ZKDTSMMasterKeyRoot/DK_4
   [junit4]   2> 	2	/solr/security/zkdtsm/ZKDTSMRoot/ZKDTSMSeqNumRoot
   [junit4]   2> 
   [junit4]   2> Maximum concurrent children watches above limit:
   [junit4]   2> 
   [junit4]   2> 	4	/solr/live_nodes
   [junit4]   2> 	4	/solr/collections
   [junit4]   2> 	2	/solr/security/zkdtsm/ZKDTSMRoot/ZKDTSMMasterKeyRoot
   [junit4]   2> 	2	/solr/security/zkdtsm/ZKDTSMRoot/ZKDTSMTokensRoot
   [junit4]   2> 
   [junit4]   2> 1916962 INFO  (SUITE-TestSolrCloudWithSecureImpersonation-seed#[B976A0C1B3CE24CB]-worker) [    ] o.a.s.SolrTestCaseJ4 ------------------------------------------------------- Done waiting for tracked resources to be released
   [junit4]   2> Oct 19, 2017 6:50:30 PM com.carrotsearch.randomizedtesting.ThreadLeakControl checkThreadLeaks
   [junit4]   2> WARNING: Will linger awaiting termination of 2 leaked thread(s).
   [junit4]   2> 1923241 ERROR (jetty-launcher-2248-thread-1-EventThread) [n:127.0.0.1:47063_solr    ] o.a.c.f.i.CuratorFrameworkImpl Watcher exception
   [junit4]   2> java.lang.IllegalStateException: Client is not started
   [junit4]   2> 	at com.google.common.base.Preconditions.checkState(Preconditions.java:149)
   [junit4]   2> 	at org.apache.curator.CuratorZookeeperClient.getZooKeeper(CuratorZookeeperClient.java:113)
   [junit4]   2> 	at org.apache.curator.framework.imps.CuratorFrameworkImpl.getZooKeeper(CuratorFrameworkImpl.java:477)
   [junit4]   2> 	at org.apache.curator.framework.imps.NamespaceFacade.getZooKeeper(NamespaceFacade.java:112)
   [junit4]   2> 	at org.apache.curator.framework.imps.GetDataBuilderImpl$4.call(GetDataBuilderImpl.java:302)
   [junit4]   2> 	at org.apache.curator.framework.imps.GetDataBuilderImpl$4.call(GetDataBuilderImpl.java:291)
   [junit4]   2> 	at org.apache.curator.RetryLoop.callWithRetry(RetryLoop.java:107)
   [junit4]   2> 	at org.apache.curator.framework.imps.GetDataBuilderImpl.pathInForeground(GetDataBuilderImpl.java:288)
   [junit4]   2> 	at org.apache.curator.framework.imps.GetDataBuilderImpl.forPath(GetDataBuilderImpl.java:279)
   [junit4]   2> 	at org.apache.curator.framework.imps.GetDataBuilderImpl.forPath(GetDataBuilderImpl.java:41)
   [junit4]   2> 	at org.apache.curator.framework.recipes.shared.SharedValue.readValue(SharedValue.java:244)
   [junit4]   2> 	at org.apache.curator.framework.recipes.shared.SharedValue.access$100(SharedValue.java:44)
   [junit4]   2> 	at org.apache.curator.framework.recipes.shared.SharedValue$1.process(SharedValue.java:61)
   [junit4]   2> 	at org.apache.curator.framework.imps.NamespaceWatcher.process(NamespaceWatcher.java:67)
   [junit4]   2> 	at org.apache.zookeeper.ClientCnxn$EventThread.processEvent(ClientCnxn.java:530)
   [junit4]   2> 	at org.apache.zookeeper.ClientCnxn$EventThread.run(ClientCnxn.java:505)
   [junit4]   2> 1923243 WARN  (jetty-launcher-2248-thread-1-EventThread) [n:127.0.0.1:47063_solr    ] o.a.c.ConnectionState Session expired event received
   [junit4]   2> 1923245 WARN  (jetty-launcher-2248-thread-1-SendThread(127.0.0.1:45834)) [n:127.0.0.1:47063_solr    ] o.a.z.ClientCnxn Session 0x0 for server null, unexpected error, closing socket connection and attempting reconnect
   [junit4]   2> java.net.ConnectException: Connection refused
   [junit4]   2> 	at sun.nio.ch.SocketChannelImpl.checkConnect(Native Method)
   [junit4]   2> 	at sun.nio.ch.SocketChannelImpl.finishConnect(SocketChannelImpl.java:717)
   [junit4]   2> 	at org.apache.zookeeper.ClientCnxnSocketNIO.doTransport(ClientCnxnSocketNIO.java:361)
   [junit4]   2> 	at org.apache.zookeeper.ClientCnxn$SendThread.run(ClientCnxn.java:1141)
   [junit4]   2> 1923257 ERROR (jetty-launcher-2248-thread-2-EventThread) [n:127.0.0.1:41912_solr    ] o.a.c.f.i.CuratorFrameworkImpl Watcher exception
   [junit4]   2> java.lang.IllegalStateException: Client is not started
   [junit4]   2> 	at com.google.common.base.Preconditions.checkState(Preconditions.java:149)
   [junit4]   2> 	at org.apache.curator.CuratorZookeeperClient.getZooKeeper(CuratorZookeeperClient.java:113)
   [junit4]   2> 	at org.apache.curator.framework.imps.CuratorFrameworkImpl.getZooKeeper(CuratorFrameworkImpl.java:477)
   [junit4]   2> 	at org.apache.curator.framework.imps.NamespaceFacade.getZooKeeper(NamespaceFacade.java:112)
   [junit4]   2> 	at org.apache.curator.framework.imps.GetDataBuilderImpl$4.call(GetDataBuilderImpl.java:302)
   [junit4]   2> 	at org.apache.curator.framework.imps.GetDataBuilderImpl$4.call(GetDataBuilderImpl.java:291)
   [junit4]   2> 	at org.apache.curator.RetryLoop.callWithRetry(RetryLoop.java:107)
   [junit4]   2> 	at org.apache.curator.framework.imps.GetDataBuilderImpl.pathInForeground(GetDataBuilderImpl.java:288)
   [junit4]   2> 	at org.apache.curator.framework.imps.GetDataBuilderImpl.forPath(GetDataBuilderImpl.java:279)
   [junit4]   2> 	at org.apache.curator.framework.imps.GetDataBuilderImpl.forPath(GetDataBuilderImpl.java:41)
   [junit4]   2> 	at org.apache.curator.framework.recipes.shared.SharedValue.readValue(SharedValue.java:244)
   [junit4]   2> 	at org.apache.curator.framework.recipes.shared.SharedValue.access$100(SharedValue.java:44)
   [junit4]   2> 	at org.apache.curator.framework.recipes.shared.SharedValue$1.process(SharedValue.java:61)
   [junit4]   2> 	at org.apache.curator.framework.imps.NamespaceWatcher.process(NamespaceWatcher.java:67)
   [junit4]   2> 	at org.apache.zookeeper.ClientCnxn$EventThread.processEvent(ClientCnxn.java:530)
   [junit4]   2> 	at org.apache.zookeeper.ClientCnxn$EventThread.run(ClientCnxn.java:505)
   [junit4]   2> 1923258 WARN  (jetty-launcher-2248-thread-2-EventThread) [n:127.0.0.1:41912_solr    ] o.a.c.ConnectionState Session expired event received
   [junit4]   2> 1923259 WARN  (jetty-launcher-2248-thread-2-SendThread(127.0.0.1:45834)) [n:127.0.0.1:41912_solr    ] o.a.z.ClientCnxn Session 0x0 for server null, unexpected error, closing socket connection and attempting reconnect
   [junit4]   2> java.net.ConnectException: Connection refused
   [junit4]   2> 	at sun.nio.ch.SocketChannelImpl.checkConnect(Native Method)
   [junit4]   2> 	at sun.nio.ch.SocketChannelImpl.finishConnect(SocketChannelImpl.java:717)
   [junit4]   2> 	at org.apache.zookeeper.ClientCnxnSocketNIO.doTransport(ClientCnxnSocketNIO.java:361)
   [junit4]   2> 	at org.apache.zookeeper.ClientCnxn$SendThread.run(ClientCnxn.java:1141)
   [junit4]   2> 1924348 WARN  (jetty-launcher-2248-thread-1-SendThread(127.0.0.1:45834)) [n:127.0.0.1:47063_solr    ] o.a.z.ClientCnxn Session 0x0 for server null, unexpected error, closing socket connection and attempting reconnect
   [junit4]   2> java.net.ConnectException: Connection refused
   [junit4]   2> 	at sun.nio.ch.SocketChannelImpl.checkConnect(Native Method)
   [junit4]   2> 	at sun.nio.ch.SocketChannelImpl.finishConnect(SocketChannelImpl.java:717)
   [junit4]   2> 	at org.apache.zookeeper.ClientCnxnSocketNIO.doTransport(ClientCnxnSocketNIO.java:361)
   [junit4]   2> 	at org.apache.zookeeper.ClientCnxn$SendThread.run(ClientCnxn.java:1141)
   [junit4]   2> 1924361 WARN  (jetty-launcher-2248-thread-2-SendThread(127.0.0.1:45834)) [n:127.0.0.1:41912_solr    ] o.a.z.ClientCnxn Session 0x0 for server null, unexpected error, closing socket connection and attempting reconnect
   [junit4]   2> java.net.ConnectException: Connection refused
   [junit4]   2> 	at sun.nio.ch.SocketChannelImpl.checkConnect(Native Method)
   [junit4]   2> 	at sun.nio.ch.SocketChannelImpl.finishConnect(SocketChannelImpl.java:717)
   [junit4]   2> 	at org.apache.zookeeper.ClientCnxnSocketNIO.doTransport(ClientCnxnSocketNIO.java:361)
   [junit4]   2> 	at org.apache.zookeeper.ClientCnxn$SendThread.run(ClientCnxn.java:1141)
   [junit4]   2> 1925450 WARN  (jetty-launcher-2248-thread-1-SendThread(127.0.0.1:45834)) [n:127.0.0.1:47063_solr    ] o.a.z.ClientCnxn Session 0x0 for server null, unexpected error, closing socket connection and attempting reconnect
   [junit4]   2> java.net.ConnectException: Connection refused
   [junit4]   2> 	at sun.nio.ch.SocketChannelImpl.checkConnect(Native Method)
   [junit4]   2> 	at sun.nio.ch.SocketChannelImpl.finishConnect(SocketChannelImpl.java:717)
   [junit4]   2> 	at org.apache.zookeeper.ClientCnxnSocketNIO.doTransport(ClientCnxnSocketNIO.java:361)
   [junit4]   2> 	at org.apache.zookeeper.ClientCnxn$SendThread.run(ClientCnxn.java:1141)
   [junit4]   2> 1925464 WARN  (jetty-launcher-2248-thread-2-SendThread(127.0.0.1:45834)) [n:127.0.0.1:41912_solr    ] o.a.z.ClientCnxn Session 0x0 for server null, unexpected error, closing socket connection and attempting reconnect
   [junit4]   2> java.net.ConnectException: Connection refused
   [junit4]   2> 	at sun.nio.ch.SocketChannelImpl.checkConnect(Native Method)
   [junit4]   2> 	at sun.nio.ch.SocketChannelImpl.finishConnect(SocketChannelImpl.java:717)
   [junit4]   2> 	at org.apache.zookeeper.ClientCnxnSocketNIO.doTransport(ClientCnxnSocketNIO.java:361)
   [junit4]   2> 	at org.apache.zookeeper.ClientCnxn$SendThread.run(ClientCnxn.java:1141)
   [junit4]   2> 1926552 WARN  (jetty-launcher-2248-thread-1-SendThread(127.0.0.1:45834)) [n:127.0.0.1:47063_solr    ] o.a.z.ClientCnxn Session 0x0 for server null, unexpected error, closing socket connection and attempting reconnect
   [junit4]   2> java.net.ConnectException: Connection refused
   [junit4]   2> 	at sun.nio.ch.SocketChannelImpl.checkConnect(Native Method)
   [junit4]   2> 	at sun.nio.ch.SocketChannelImpl.finishConnect(SocketChannelImpl.java:717)
   [junit4]   2> 	at org.apache.zookeeper.ClientCnxnSocketNIO.doTransport(ClientCnxnSocketNIO.java:361)
   [junit4]   2> 	at org.apache.zookeeper.ClientCnxn$SendThread.run(ClientCnxn.java:1141)
   [junit4]   2> 1926568 WARN  (jetty-launcher-2248-thread-2-SendThread(127.0.0.1:45834)) [n:127.0.0.1:41912_solr    ] o.a.z.ClientCnxn Session 0x0 for server null, unexpected error, closing socket connection and attempting reconnect
   [junit4]   2> java.net.ConnectException: Connection refused
   [junit4]   2> 	at sun.nio.ch.SocketChannelImpl.checkConnect(Native Method)
   [junit4]   2> 	at sun.nio.ch.SocketChannelImpl.finishConnect(SocketChannelImpl.java:717)
   [junit4]   2> 	at org.apache.zookeeper.ClientCnxnSocketNIO.doTransport(ClientCnxnSocketNIO.java:361)
   [junit4]   2> 	at org.apache.zookeeper.ClientCnxn$SendThread.run(ClientCnxn.java:1141)
   [junit4]   2> 1927658 WARN  (jetty-launcher-2248-thread-1-SendThread(127.0.0.1:45834)) [n:127.0.0.1:47063_solr    ] o.a.z.ClientCnxn Session 0x0 for server null, unexpected error, closing socket connection and attempting reconnect
   [junit4]   2> java.net.ConnectException: Connection refused
   [junit4]   2> 	at sun.nio.ch.SocketChannelImpl.checkConnect(Native Method)
   [junit4]   2> 	at sun.nio.ch.SocketChannelImpl.finishConnect(SocketChannelImpl.java:717)
   [junit4]   2> 	at org.apache.zookeeper.ClientCnxnSocketNIO.doTransport(ClientCnxnSocketNIO.java:361)
   [junit4]   2> 	at org.apache.zookeeper.ClientCnxn$SendThread.run(ClientCnxn.java:1141)
   [junit4]   2> 1927669 WARN  (jetty-launcher-2248-thread-2-SendThread(127.0.0.1:45834)) [n:127.0.0.1:41912_solr    ] o.a.z.ClientCnxn Session 0x0 for server null, unexpected error, closing socket connection and attempting reconnect
   [junit4]   2> java.net.ConnectException: Connection refused
   [junit4]   2> 	at sun.nio.ch.SocketChannelImpl.checkConnect(Native Method)
   [junit4]   2> 	at sun.nio.ch.SocketChannelImpl.finishConnect(SocketChannelImpl.java:717)
   [jun

[...truncated too long message...]

361)
   [junit4]   2> 	at org.apache.zookeeper.ClientCnxn$SendThread.run(ClientCnxn.java:1141)
   [junit4]   2> Oct 19, 2017 6:50:53 PM com.carrotsearch.randomizedtesting.ThreadLeakControl tryToInterruptAll
   [junit4]   2> SEVERE: There are still zombie threads that couldn't be terminated:
   [junit4]   2>    1) Thread[id=18145, name=jetty-launcher-2248-thread-2-SendThread(127.0.0.1:45834), state=TIMED_WAITING, group=TGRP-TestSolrCloudWithSecureImpersonation]
   [junit4]   2>         at java.lang.Thread.sleep(Native Method)
   [junit4]   2>         at org.apache.zookeeper.client.StaticHostProvider.next(StaticHostProvider.java:101)
   [junit4]   2>         at org.apache.zookeeper.ClientCnxn$SendThread.startConnect(ClientCnxn.java:997)
   [junit4]   2>         at org.apache.zookeeper.ClientCnxn$SendThread.run(ClientCnxn.java:1060)
   [junit4]   2>    2) Thread[id=18143, name=jetty-launcher-2248-thread-1-SendThread(127.0.0.1:45834), state=TIMED_WAITING, group=TGRP-TestSolrCloudWithSecureImpersonation]
   [junit4]   2>         at java.lang.Thread.sleep(Native Method)
   [junit4]   2>         at org.apache.zookeeper.client.StaticHostProvider.next(StaticHostProvider.java:101)
   [junit4]   2>         at org.apache.zookeeper.ClientCnxn$SendThread.startConnect(ClientCnxn.java:997)
   [junit4]   2>         at org.apache.zookeeper.ClientCnxn$SendThread.run(ClientCnxn.java:1060)
   [junit4]   2> NOTE: test params are: codec=Asserting(Lucene70): {}, docValues:{}, maxPointsInLeafNode=1655, maxMBSortInHeap=7.225179400543757, sim=RandomSimilarity(queryNorm=false): {}, locale=ar-QA, timezone=Asia/Yerevan
   [junit4]   2> NOTE: SunOS 5.11 amd64/Oracle Corporation 1.8.0_141 (64-bit)/cpus=3,threads=3,free=157906536,total=360669184
   [junit4]   2> NOTE: All tests run in this JVM: [SpellingQueryConverterTest, TestSmileRequest, TestDistribIDF, ShardRoutingCustomTest, SpellPossibilityIteratorTest, HdfsUnloadDistributedZkTest, TestCoreContainer, DirectoryFactoryTest, PKIAuthenticationIntegrationTest, TestComponentsName, TestSha256AuthenticationProvider, TestTrie, SaslZkACLProviderTest, TestHashPartitioner, TestHdfsCloudBackupRestore, DocumentBuilderTest, TestFieldCache, BasicFunctionalityTest, BooleanFieldTest, TestRandomRequestDistribution, BasicZkTest, TestCloudSchemaless, TestJettySolrRunner, AnalysisAfterCoreReloadTest, TestSerializedLuceneMatchVersion, TestSolrDeletionPolicy1, TestSearcherReuse, TestSolrQueryParser, OverseerModifyCollectionTest, BlockJoinFacetRandomTest, TestXmlQParserPlugin, DeleteReplicaTest, TestReplicationHandlerBackup, CloudExitableDirectoryReaderTest, JSONWriterTest, RollingRestartTest, SolrIndexSplitterTest, TestImpersonationWithHadoopAuth, TestCSVLoader, AutoscalingHistoryHandlerTest, SegmentsInfoRequestHandlerTest, MetricsConfigTest, ConfigureRecoveryStrategyTest, TestStressLucene, BufferStoreTest, TestLeaderElectionZkExpiry, TestPerFieldSimilarity, SearchRateTriggerTest, FileBasedSpellCheckerTest, DebugComponentTest, DistributedFacetExistsSmallTest, TestSolrQueryResponse, TestMergePolicyConfig, TestPushWriter, TestPostingsSolrHighlighter, SolrGraphiteReporterTest, DistributedMLTComponentTest, QueryElevationComponentTest, TestFreeTextSuggestions, TestNumericRangeQuery64, TestLuceneMatchVersion, DocumentAnalysisRequestHandlerTest, AddBlockUpdateTest, HLLSerializationTest, BasicDistributedZk2Test, MoveReplicaTest, TestTrackingShardHandlerFactory, DistributedDebugComponentTest, SearchHandlerTest, TestAddFieldRealTimeGet, StressHdfsTest, TestOrdValues, TestManagedSynonymGraphFilterFactory, TestDistributedGrouping, ChaosMonkeyNothingIsSafeWithPullReplicasTest, LoggingHandlerTest, ShufflingReplicaListTransformerTest, AutoAddReplicasPlanActionTest, FileUtilsTest, TestManagedSchemaAPI, ConnectionManagerTest, TestIndexSearcher, SearchHandlerTest, AnalyticsQueryTest, DOMUtilTest, HdfsThreadLeakTest, TestTlogReplica, HdfsDirectoryFactoryTest, TestDistributedStatsComponentCardinality, TestLRUCache, TestFieldTypeCollectionResource, AssignTest, ResponseHeaderTest, TestConfigSetsAPI, TestLegacyField, TestLegacyNumericRangeQueryBuilder, TestHalfAndHalfDocValues, FullSolrCloudDistribCmdsTest, TestConfigSets, BJQParserTest, ZkNodePropsTest, ClassificationUpdateProcessorFactoryTest, ComputePlanActionTest, TestPointFields, LeaderInitiatedRecoveryOnCommitTest, TermsComponentTest, VersionInfoTest, SharedFSAutoReplicaFailoverTest, TestDynamicFieldCollectionResource, TestFaceting, TestSegmentSorting, TestMissingGroups, TestTolerantUpdateProcessorRandomCloud, LukeRequestHandlerTest, TestSolrCloudWithDelegationTokens, TestSearchPerf, TestRestoreCore, TestSimpleTrackingShardHandler, AliasIntegrationTest, HighlighterMaxOffsetTest, CloudMLTQParserTest, ZkSolrClientTest, RemoteQueryErrorTest, DistributedQueueTest, CoreAdminHandlerTest, TestCloudSearcherWarming, SparseHLLTest, TestFieldCollectionResource, TestStressReorder, TestLMJelinekMercerSimilarityFactory, BigEndianAscendingWordSerializerTest, NodeMutatorTest, TestRequestStatusCollectionAPI, TestMiniSolrCloudClusterSSL, TestMultiValuedNumericRangeQuery, CollectionsAPIDistributedZkTest, TestTrieFacet, TestSchemaNameResource, HdfsChaosMonkeyNothingIsSafeTest, TestSystemIdResolver, SubstringBytesRefFilterTest, TestDistributedMissingSort, SolrCloudReportersTest, CustomCollectionTest, TestSolrJ, ImplicitSnitchTest, TestCharFilters, TestQueryUtils, UpdateRequestProcessorFactoryTest, TestClassicSimilarityFactory, TestGraphMLResponseWriter, TestManagedStopFilterFactory, TestPKIAuthenticationPlugin, TestSubQueryTransformer, TestSolrCloudWithSecureImpersonation]
   [junit4]   2> NOTE: reproduce with: ant test  -Dtestcase=TestSolrCloudWithSecureImpersonation -Dtests.seed=B976A0C1B3CE24CB -Dtests.slow=true -Dtests.locale=ar-QA -Dtests.timezone=Asia/Yerevan -Dtests.asserts=true -Dtests.file.encoding=US-ASCII
   [junit4] ERROR   0.00s J1 | TestSolrCloudWithSecureImpersonation (suite) <<<
   [junit4]    > Throwable #1: com.carrotsearch.randomizedtesting.ThreadLeakError: 4 threads leaked from SUITE scope at org.apache.solr.cloud.TestSolrCloudWithSecureImpersonation: 
   [junit4]    >    1) Thread[id=18145, name=jetty-launcher-2248-thread-2-SendThread(127.0.0.1:45834), state=TIMED_WAITING, group=TGRP-TestSolrCloudWithSecureImpersonation]
   [junit4]    >         at java.lang.Thread.sleep(Native Method)
   [junit4]    >         at org.apache.zookeeper.client.StaticHostProvider.next(StaticHostProvider.java:101)
   [junit4]    >         at org.apache.zookeeper.ClientCnxn$SendThread.startConnect(ClientCnxn.java:997)
   [junit4]    >         at org.apache.zookeeper.ClientCnxn$SendThread.run(ClientCnxn.java:1060)
   [junit4]    >    2) Thread[id=18143, name=jetty-launcher-2248-thread-1-SendThread(127.0.0.1:45834), state=TIMED_WAITING, group=TGRP-TestSolrCloudWithSecureImpersonation]
   [junit4]    >         at java.lang.Thread.sleep(Native Method)
   [junit4]    >         at org.apache.zookeeper.client.StaticHostProvider.next(StaticHostProvider.java:101)
   [junit4]    >         at org.apache.zookeeper.ClientCnxn$SendThread.startConnect(ClientCnxn.java:997)
   [junit4]    >         at org.apache.zookeeper.ClientCnxn$SendThread.run(ClientCnxn.java:1060)
   [junit4]    >    3) Thread[id=18146, name=jetty-launcher-2248-thread-2-EventThread, state=WAITING, group=TGRP-TestSolrCloudWithSecureImpersonation]
   [junit4]    >         at sun.misc.Unsafe.park(Native Method)
   [junit4]    >         at java.util.concurrent.locks.LockSupport.park(LockSupport.java:175)
   [junit4]    >         at java.util.concurrent.locks.AbstractQueuedSynchronizer$ConditionObject.await(AbstractQueuedSynchronizer.java:2039)
   [junit4]    >         at java.util.concurrent.LinkedBlockingQueue.take(LinkedBlockingQueue.java:442)
   [junit4]    >         at org.apache.zookeeper.ClientCnxn$EventThread.run(ClientCnxn.java:501)
   [junit4]    >    4) Thread[id=18144, name=jetty-launcher-2248-thread-1-EventThread, state=WAITING, group=TGRP-TestSolrCloudWithSecureImpersonation]
   [junit4]    >         at sun.misc.Unsafe.park(Native Method)
   [junit4]    >         at java.util.concurrent.locks.LockSupport.park(LockSupport.java:175)
   [junit4]    >         at java.util.concurrent.locks.AbstractQueuedSynchronizer$ConditionObject.await(AbstractQueuedSynchronizer.java:2039)
   [junit4]    >         at java.util.concurrent.LinkedBlockingQueue.take(LinkedBlockingQueue.java:442)
   [junit4]    >         at org.apache.zookeeper.ClientCnxn$EventThread.run(ClientCnxn.java:501)
   [junit4]    > 	at __randomizedtesting.SeedInfo.seed([B976A0C1B3CE24CB]:0)Throwable #2: com.carrotsearch.randomizedtesting.ThreadLeakError: There are still zombie threads that couldn't be terminated:
   [junit4]    >    1) Thread[id=18145, name=jetty-launcher-2248-thread-2-SendThread(127.0.0.1:45834), state=TIMED_WAITING, group=TGRP-TestSolrCloudWithSecureImpersonation]
   [junit4]    >         at java.lang.Thread.sleep(Native Method)
   [junit4]    >         at org.apache.zookeeper.client.StaticHostProvider.next(StaticHostProvider.java:101)
   [junit4]    >         at org.apache.zookeeper.ClientCnxn$SendThread.startConnect(ClientCnxn.java:997)
   [junit4]    >         at org.apache.zookeeper.ClientCnxn$SendThread.run(ClientCnxn.java:1060)
   [junit4]    >    2) Thread[id=18143, name=jetty-launcher-2248-thread-1-SendThread(127.0.0.1:45834), state=TIMED_WAITING, group=TGRP-TestSolrCloudWithSecureImpersonation]
   [junit4]    >         at java.lang.Thread.sleep(Native Method)
   [junit4]    >         at org.apache.zookeeper.client.StaticHostProvider.next(StaticHostProvider.java:101)
   [junit4]    >         at org.apache.zookeeper.ClientCnxn$SendThread.startConnect(ClientCnxn.java:997)
   [junit4]    >         at org.apache.zookeeper.ClientCnxn$SendThread.run(ClientCnxn.java:1060)
   [junit4]    > 	at __randomizedtesting.SeedInfo.seed([B976A0C1B3CE24CB]:0)
   [junit4] Completed [323/744 (1!)] on J1 in 62.58s, 12 tests, 2 errors <<< FAILURES!

[...truncated 48609 lines...]

Mime
View raw message