lucene-dev mailing list archives

Site index · List index
Message view « Date » · « Thread »
Top « Date » · « Thread »
From Policeman Jenkins Server <jenk...@thetaphi.de>
Subject [JENKINS] Lucene-Solr-7.x-Solaris (64bit/jdk1.8.0) - Build # 254 - Still Unstable!
Date Fri, 20 Oct 2017 18:50:54 GMT
Build: https://jenkins.thetaphi.de/job/Lucene-Solr-7.x-Solaris/254/
Java: 64bit/jdk1.8.0 -XX:+UseCompressedOops -XX:+UseSerialGC

2 tests failed.
FAILED:  org.apache.solr.cloud.autoscaling.ExecutePlanActionTest.testIntegration

Error Message:
Timed out waiting for replicas of collection to be 2 again null Live Nodes: [127.0.0.1:61145_solr] Last available state: DocCollection(testIntegration//collections/testIntegration/state.json/7)={   "pullReplicas":"0",   "replicationFactor":"2",   "shards":{"shard1":{       "range":"80000000-7fffffff",       "state":"active",       "replicas":{         "core_node3":{           "core":"testIntegration_shard1_replica_n1",           "base_url":"http://127.0.0.1:47014/solr",           "node_name":"127.0.0.1:47014_solr",           "state":"down",           "type":"NRT"},         "core_node4":{           "core":"testIntegration_shard1_replica_n2",           "base_url":"http://127.0.0.1:61145/solr",           "node_name":"127.0.0.1:61145_solr",           "state":"active",           "type":"NRT",           "leader":"true"}}}},   "router":{"name":"compositeId"},   "maxShardsPerNode":"1",   "autoAddReplicas":"false",   "nrtReplicas":"2",   "tlogReplicas":"0"}

Stack Trace:
java.lang.AssertionError: Timed out waiting for replicas of collection to be 2 again
null
Live Nodes: [127.0.0.1:61145_solr]
Last available state: DocCollection(testIntegration//collections/testIntegration/state.json/7)={
  "pullReplicas":"0",
  "replicationFactor":"2",
  "shards":{"shard1":{
      "range":"80000000-7fffffff",
      "state":"active",
      "replicas":{
        "core_node3":{
          "core":"testIntegration_shard1_replica_n1",
          "base_url":"http://127.0.0.1:47014/solr",
          "node_name":"127.0.0.1:47014_solr",
          "state":"down",
          "type":"NRT"},
        "core_node4":{
          "core":"testIntegration_shard1_replica_n2",
          "base_url":"http://127.0.0.1:61145/solr",
          "node_name":"127.0.0.1:61145_solr",
          "state":"active",
          "type":"NRT",
          "leader":"true"}}}},
  "router":{"name":"compositeId"},
  "maxShardsPerNode":"1",
  "autoAddReplicas":"false",
  "nrtReplicas":"2",
  "tlogReplicas":"0"}
	at __randomizedtesting.SeedInfo.seed([7E47DCBFD04BDBC6:CE26D293F5747AE3]:0)
	at org.junit.Assert.fail(Assert.java:93)
	at org.apache.solr.cloud.SolrCloudTestCase.waitForState(SolrCloudTestCase.java:269)
	at org.apache.solr.cloud.autoscaling.ExecutePlanActionTest.testIntegration(ExecutePlanActionTest.java:209)
	at sun.reflect.NativeMethodAccessorImpl.invoke0(Native Method)
	at sun.reflect.NativeMethodAccessorImpl.invoke(NativeMethodAccessorImpl.java:62)
	at sun.reflect.DelegatingMethodAccessorImpl.invoke(DelegatingMethodAccessorImpl.java:43)
	at java.lang.reflect.Method.invoke(Method.java:498)
	at com.carrotsearch.randomizedtesting.RandomizedRunner.invoke(RandomizedRunner.java:1737)
	at com.carrotsearch.randomizedtesting.RandomizedRunner$8.evaluate(RandomizedRunner.java:934)
	at com.carrotsearch.randomizedtesting.RandomizedRunner$9.evaluate(RandomizedRunner.java:970)
	at com.carrotsearch.randomizedtesting.RandomizedRunner$10.evaluate(RandomizedRunner.java:984)
	at com.carrotsearch.randomizedtesting.rules.SystemPropertiesRestoreRule$1.evaluate(SystemPropertiesRestoreRule.java:57)
	at org.apache.lucene.util.TestRuleSetupTeardownChained$1.evaluate(TestRuleSetupTeardownChained.java:49)
	at org.apache.lucene.util.AbstractBeforeAfterRule$1.evaluate(AbstractBeforeAfterRule.java:45)
	at org.apache.lucene.util.TestRuleThreadAndTestName$1.evaluate(TestRuleThreadAndTestName.java:48)
	at org.apache.lucene.util.TestRuleIgnoreAfterMaxFailures$1.evaluate(TestRuleIgnoreAfterMaxFailures.java:64)
	at org.apache.lucene.util.TestRuleMarkFailure$1.evaluate(TestRuleMarkFailure.java:47)
	at com.carrotsearch.randomizedtesting.rules.StatementAdapter.evaluate(StatementAdapter.java:36)
	at com.carrotsearch.randomizedtesting.ThreadLeakControl$StatementRunner.run(ThreadLeakControl.java:368)
	at com.carrotsearch.randomizedtesting.ThreadLeakControl.forkTimeoutingTask(ThreadLeakControl.java:817)
	at com.carrotsearch.randomizedtesting.ThreadLeakControl$3.evaluate(ThreadLeakControl.java:468)
	at com.carrotsearch.randomizedtesting.RandomizedRunner.runSingleTest(RandomizedRunner.java:943)
	at com.carrotsearch.randomizedtesting.RandomizedRunner$5.evaluate(RandomizedRunner.java:829)
	at com.carrotsearch.randomizedtesting.RandomizedRunner$6.evaluate(RandomizedRunner.java:879)
	at com.carrotsearch.randomizedtesting.RandomizedRunner$7.evaluate(RandomizedRunner.java:890)
	at com.carrotsearch.randomizedtesting.rules.StatementAdapter.evaluate(StatementAdapter.java:36)
	at com.carrotsearch.randomizedtesting.rules.SystemPropertiesRestoreRule$1.evaluate(SystemPropertiesRestoreRule.java:57)
	at org.apache.lucene.util.AbstractBeforeAfterRule$1.evaluate(AbstractBeforeAfterRule.java:45)
	at com.carrotsearch.randomizedtesting.rules.StatementAdapter.evaluate(StatementAdapter.java:36)
	at org.apache.lucene.util.TestRuleStoreClassName$1.evaluate(TestRuleStoreClassName.java:41)
	at com.carrotsearch.randomizedtesting.rules.NoShadowingOrOverridesOnMethodsRule$1.evaluate(NoShadowingOrOverridesOnMethodsRule.java:40)
	at com.carrotsearch.randomizedtesting.rules.NoShadowingOrOverridesOnMethodsRule$1.evaluate(NoShadowingOrOverridesOnMethodsRule.java:40)
	at com.carrotsearch.randomizedtesting.rules.StatementAdapter.evaluate(StatementAdapter.java:36)
	at com.carrotsearch.randomizedtesting.rules.StatementAdapter.evaluate(StatementAdapter.java:36)
	at com.carrotsearch.randomizedtesting.rules.StatementAdapter.evaluate(StatementAdapter.java:36)
	at org.apache.lucene.util.TestRuleAssertionsRequired$1.evaluate(TestRuleAssertionsRequired.java:53)
	at org.apache.lucene.util.TestRuleMarkFailure$1.evaluate(TestRuleMarkFailure.java:47)
	at org.apache.lucene.util.TestRuleIgnoreAfterMaxFailures$1.evaluate(TestRuleIgnoreAfterMaxFailures.java:64)
	at org.apache.lucene.util.TestRuleIgnoreTestSuites$1.evaluate(TestRuleIgnoreTestSuites.java:54)
	at com.carrotsearch.randomizedtesting.rules.StatementAdapter.evaluate(StatementAdapter.java:36)
	at com.carrotsearch.randomizedtesting.ThreadLeakControl$StatementRunner.run(ThreadLeakControl.java:368)
	at java.lang.Thread.run(Thread.java:748)


FAILED:  org.apache.solr.client.solrj.io.stream.StreamExpressionTest.testParallelCommitStream

Error Message:
expected:<5> but was:<3>

Stack Trace:
java.lang.AssertionError: expected:<5> but was:<3>
	at __randomizedtesting.SeedInfo.seed([F9A1A517F32841AC:D94BC7176F69ACE0]:0)
	at org.junit.Assert.fail(Assert.java:93)
	at org.junit.Assert.failNotEquals(Assert.java:647)
	at org.junit.Assert.assertEquals(Assert.java:128)
	at org.junit.Assert.assertEquals(Assert.java:472)
	at org.junit.Assert.assertEquals(Assert.java:456)
	at org.apache.solr.client.solrj.io.stream.StreamExpressionTest.testParallelCommitStream(StreamExpressionTest.java:4594)
	at sun.reflect.NativeMethodAccessorImpl.invoke0(Native Method)
	at sun.reflect.NativeMethodAccessorImpl.invoke(NativeMethodAccessorImpl.java:62)
	at sun.reflect.DelegatingMethodAccessorImpl.invoke(DelegatingMethodAccessorImpl.java:43)
	at java.lang.reflect.Method.invoke(Method.java:498)
	at com.carrotsearch.randomizedtesting.RandomizedRunner.invoke(RandomizedRunner.java:1737)
	at com.carrotsearch.randomizedtesting.RandomizedRunner$8.evaluate(RandomizedRunner.java:934)
	at com.carrotsearch.randomizedtesting.RandomizedRunner$9.evaluate(RandomizedRunner.java:970)
	at com.carrotsearch.randomizedtesting.RandomizedRunner$10.evaluate(RandomizedRunner.java:984)
	at com.carrotsearch.randomizedtesting.rules.SystemPropertiesRestoreRule$1.evaluate(SystemPropertiesRestoreRule.java:57)
	at org.apache.lucene.util.TestRuleSetupTeardownChained$1.evaluate(TestRuleSetupTeardownChained.java:49)
	at org.apache.lucene.util.AbstractBeforeAfterRule$1.evaluate(AbstractBeforeAfterRule.java:45)
	at org.apache.lucene.util.TestRuleThreadAndTestName$1.evaluate(TestRuleThreadAndTestName.java:48)
	at org.apache.lucene.util.TestRuleIgnoreAfterMaxFailures$1.evaluate(TestRuleIgnoreAfterMaxFailures.java:64)
	at org.apache.lucene.util.TestRuleMarkFailure$1.evaluate(TestRuleMarkFailure.java:47)
	at com.carrotsearch.randomizedtesting.rules.StatementAdapter.evaluate(StatementAdapter.java:36)
	at com.carrotsearch.randomizedtesting.ThreadLeakControl$StatementRunner.run(ThreadLeakControl.java:368)
	at com.carrotsearch.randomizedtesting.ThreadLeakControl.forkTimeoutingTask(ThreadLeakControl.java:817)
	at com.carrotsearch.randomizedtesting.ThreadLeakControl$3.evaluate(ThreadLeakControl.java:468)
	at com.carrotsearch.randomizedtesting.RandomizedRunner.runSingleTest(RandomizedRunner.java:943)
	at com.carrotsearch.randomizedtesting.RandomizedRunner$5.evaluate(RandomizedRunner.java:829)
	at com.carrotsearch.randomizedtesting.RandomizedRunner$6.evaluate(RandomizedRunner.java:879)
	at com.carrotsearch.randomizedtesting.RandomizedRunner$7.evaluate(RandomizedRunner.java:890)
	at com.carrotsearch.randomizedtesting.rules.StatementAdapter.evaluate(StatementAdapter.java:36)
	at com.carrotsearch.randomizedtesting.rules.SystemPropertiesRestoreRule$1.evaluate(SystemPropertiesRestoreRule.java:57)
	at org.apache.lucene.util.AbstractBeforeAfterRule$1.evaluate(AbstractBeforeAfterRule.java:45)
	at com.carrotsearch.randomizedtesting.rules.StatementAdapter.evaluate(StatementAdapter.java:36)
	at org.apache.lucene.util.TestRuleStoreClassName$1.evaluate(TestRuleStoreClassName.java:41)
	at com.carrotsearch.randomizedtesting.rules.NoShadowingOrOverridesOnMethodsRule$1.evaluate(NoShadowingOrOverridesOnMethodsRule.java:40)
	at com.carrotsearch.randomizedtesting.rules.NoShadowingOrOverridesOnMethodsRule$1.evaluate(NoShadowingOrOverridesOnMethodsRule.java:40)
	at com.carrotsearch.randomizedtesting.rules.StatementAdapter.evaluate(StatementAdapter.java:36)
	at com.carrotsearch.randomizedtesting.rules.StatementAdapter.evaluate(StatementAdapter.java:36)
	at com.carrotsearch.randomizedtesting.rules.StatementAdapter.evaluate(StatementAdapter.java:36)
	at org.apache.lucene.util.TestRuleAssertionsRequired$1.evaluate(TestRuleAssertionsRequired.java:53)
	at org.apache.lucene.util.TestRuleMarkFailure$1.evaluate(TestRuleMarkFailure.java:47)
	at org.apache.lucene.util.TestRuleIgnoreAfterMaxFailures$1.evaluate(TestRuleIgnoreAfterMaxFailures.java:64)
	at org.apache.lucene.util.TestRuleIgnoreTestSuites$1.evaluate(TestRuleIgnoreTestSuites.java:54)
	at com.carrotsearch.randomizedtesting.rules.StatementAdapter.evaluate(StatementAdapter.java:36)
	at com.carrotsearch.randomizedtesting.ThreadLeakControl$StatementRunner.run(ThreadLeakControl.java:368)
	at java.lang.Thread.run(Thread.java:748)




Build Log:
[...truncated 12465 lines...]
   [junit4] Suite: org.apache.solr.cloud.autoscaling.ExecutePlanActionTest
   [junit4]   2> Creating dataDir: /export/home/jenkins/workspace/Lucene-Solr-7.x-Solaris/solr/build/solr-core/test/J0/temp/solr.cloud.autoscaling.ExecutePlanActionTest_7E47DCBFD04BDBC6-001/init-core-data-001
   [junit4]   2> 1762876 WARN  (SUITE-ExecutePlanActionTest-seed#[7E47DCBFD04BDBC6]-worker) [    ] o.a.s.SolrTestCaseJ4 startTrackingSearchers: numOpens=74 numCloses=74
   [junit4]   2> 1762876 INFO  (SUITE-ExecutePlanActionTest-seed#[7E47DCBFD04BDBC6]-worker) [    ] o.a.s.SolrTestCaseJ4 Using PointFields (NUMERIC_POINTS_SYSPROP=true) w/NUMERIC_DOCVALUES_SYSPROP=true
   [junit4]   2> 1762878 INFO  (SUITE-ExecutePlanActionTest-seed#[7E47DCBFD04BDBC6]-worker) [    ] o.a.s.SolrTestCaseJ4 Randomized ssl (false) and clientAuth (false) via: @org.apache.solr.util.RandomizeSSL(reason=, value=NaN, ssl=NaN, clientAuth=NaN)
   [junit4]   2> 1762878 INFO  (SUITE-ExecutePlanActionTest-seed#[7E47DCBFD04BDBC6]-worker) [    ] o.a.s.SolrTestCaseJ4 SecureRandom sanity checks: test.solr.allowed.securerandom=null & java.security.egd=file:/dev/./urandom
   [junit4]   2> 1762878 INFO  (SUITE-ExecutePlanActionTest-seed#[7E47DCBFD04BDBC6]-worker) [    ] o.a.s.c.MiniSolrCloudCluster Starting cluster of 2 servers in /export/home/jenkins/workspace/Lucene-Solr-7.x-Solaris/solr/build/solr-core/test/J0/temp/solr.cloud.autoscaling.ExecutePlanActionTest_7E47DCBFD04BDBC6-001/tempDir-001
   [junit4]   2> 1762878 INFO  (SUITE-ExecutePlanActionTest-seed#[7E47DCBFD04BDBC6]-worker) [    ] o.a.s.c.ZkTestServer STARTING ZK TEST SERVER
   [junit4]   2> 1762878 INFO  (Thread-5923) [    ] o.a.s.c.ZkTestServer client port:0.0.0.0/0.0.0.0:0
   [junit4]   2> 1762878 INFO  (Thread-5923) [    ] o.a.s.c.ZkTestServer Starting server
   [junit4]   2> 1762881 ERROR (Thread-5923) [    ] o.a.z.s.ZooKeeperServer ZKShutdownHandler is not registered, so ZooKeeper server won't take any action on ERROR or SHUTDOWN server state changes
   [junit4]   2> 1762978 INFO  (SUITE-ExecutePlanActionTest-seed#[7E47DCBFD04BDBC6]-worker) [    ] o.a.s.c.ZkTestServer start zk server on port:57140
   [junit4]   2> 1763011 INFO  (jetty-launcher-2261-thread-2) [    ] o.e.j.s.Server jetty-9.3.20.v20170531
   [junit4]   2> 1763012 INFO  (jetty-launcher-2261-thread-2) [    ] o.e.j.s.h.ContextHandler Started o.e.j.s.ServletContextHandler@36164596{/solr,null,AVAILABLE}
   [junit4]   2> 1763013 INFO  (jetty-launcher-2261-thread-1) [    ] o.e.j.s.Server jetty-9.3.20.v20170531
   [junit4]   2> 1763014 INFO  (jetty-launcher-2261-thread-1) [    ] o.e.j.s.h.ContextHandler Started o.e.j.s.ServletContextHandler@5ba6cf7d{/solr,null,AVAILABLE}
   [junit4]   2> 1763014 INFO  (jetty-launcher-2261-thread-1) [    ] o.e.j.s.AbstractConnector Started ServerConnector@1fafb4c8{HTTP/1.1,[http/1.1]}{127.0.0.1:47014}
   [junit4]   2> 1763014 INFO  (jetty-launcher-2261-thread-1) [    ] o.e.j.s.Server Started @1765666ms
   [junit4]   2> 1763014 INFO  (jetty-launcher-2261-thread-1) [    ] o.a.s.c.s.e.JettySolrRunner Jetty properties: {hostContext=/solr, hostPort=47014}
   [junit4]   2> 1763014 ERROR (jetty-launcher-2261-thread-1) [    ] o.a.s.u.StartupLoggingUtils Missing Java Option solr.log.dir. Logging may be missing or incomplete.
   [junit4]   2> 1763014 INFO  (jetty-launcher-2261-thread-1) [    ] o.a.s.s.SolrDispatchFilter  ___      _       Welcome to Apache Solr™ version 7.2.0
   [junit4]   2> 1763014 INFO  (jetty-launcher-2261-thread-1) [    ] o.a.s.s.SolrDispatchFilter / __| ___| |_ _   Starting in cloud mode on port null
   [junit4]   2> 1763014 INFO  (jetty-launcher-2261-thread-1) [    ] o.a.s.s.SolrDispatchFilter \__ \/ _ \ | '_|  Install dir: null, Default config dir: null
   [junit4]   2> 1763014 INFO  (jetty-launcher-2261-thread-1) [    ] o.a.s.s.SolrDispatchFilter |___/\___/_|_|    Start time: 2017-10-20T17:48:16.799Z
   [junit4]   2> 1763022 INFO  (jetty-launcher-2261-thread-2) [    ] o.e.j.s.AbstractConnector Started ServerConnector@514cc758{HTTP/1.1,[http/1.1]}{127.0.0.1:61145}
   [junit4]   2> 1763022 INFO  (jetty-launcher-2261-thread-2) [    ] o.e.j.s.Server Started @1765674ms
   [junit4]   2> 1763022 INFO  (jetty-launcher-2261-thread-2) [    ] o.a.s.c.s.e.JettySolrRunner Jetty properties: {hostContext=/solr, hostPort=61145}
   [junit4]   2> 1763022 ERROR (jetty-launcher-2261-thread-2) [    ] o.a.s.u.StartupLoggingUtils Missing Java Option solr.log.dir. Logging may be missing or incomplete.
   [junit4]   2> 1763022 INFO  (jetty-launcher-2261-thread-2) [    ] o.a.s.s.SolrDispatchFilter  ___      _       Welcome to Apache Solr™ version 7.2.0
   [junit4]   2> 1763022 INFO  (jetty-launcher-2261-thread-2) [    ] o.a.s.s.SolrDispatchFilter / __| ___| |_ _   Starting in cloud mode on port null
   [junit4]   2> 1763022 INFO  (jetty-launcher-2261-thread-2) [    ] o.a.s.s.SolrDispatchFilter \__ \/ _ \ | '_|  Install dir: null, Default config dir: null
   [junit4]   2> 1763022 INFO  (jetty-launcher-2261-thread-2) [    ] o.a.s.s.SolrDispatchFilter |___/\___/_|_|    Start time: 2017-10-20T17:48:16.807Z
   [junit4]   2> 1763030 INFO  (jetty-launcher-2261-thread-2) [    ] o.a.s.s.SolrDispatchFilter solr.xml found in ZooKeeper. Loading...
   [junit4]   2> 1763042 INFO  (jetty-launcher-2261-thread-1) [    ] o.a.s.s.SolrDispatchFilter solr.xml found in ZooKeeper. Loading...
   [junit4]   2> 1763044 INFO  (jetty-launcher-2261-thread-2) [    ] o.a.s.c.ZkContainer Zookeeper client=127.0.0.1:57140/solr
   [junit4]   2> 1763051 INFO  (jetty-launcher-2261-thread-1) [    ] o.a.s.c.ZkContainer Zookeeper client=127.0.0.1:57140/solr
   [junit4]   2> 1763512 INFO  (jetty-launcher-2261-thread-2) [n:127.0.0.1:61145_solr    ] o.a.s.c.Overseer Overseer (id=null) closing
   [junit4]   2> 1763513 INFO  (jetty-launcher-2261-thread-2) [n:127.0.0.1:61145_solr    ] o.a.s.c.OverseerElectionContext I am going to be the leader 127.0.0.1:61145_solr
   [junit4]   2> 1763514 INFO  (jetty-launcher-2261-thread-2) [n:127.0.0.1:61145_solr    ] o.a.s.c.Overseer Overseer (id=98862477912637445-127.0.0.1:61145_solr-n_0000000000) starting
   [junit4]   2> 1763583 INFO  (jetty-launcher-2261-thread-2) [n:127.0.0.1:61145_solr    ] o.a.s.c.ZkController Register node as live in ZooKeeper:/live_nodes/127.0.0.1:61145_solr
   [junit4]   2> 1763584 DEBUG (OverseerAutoScalingTriggerThread-98862477912637445-127.0.0.1:61145_solr-n_0000000000) [n:127.0.0.1:61145_solr    ] o.a.s.c.a.OverseerTriggerThread Adding .autoAddReplicas trigger
   [junit4]   2> 1763591 DEBUG (OverseerAutoScalingTriggerThread-98862477912637445-127.0.0.1:61145_solr-n_0000000000) [n:127.0.0.1:61145_solr    ] o.a.s.c.a.OverseerTriggerThread Refreshing /autoscaling.json with znode version 1
   [junit4]   2> 1763592 INFO  (OverseerStateUpdate-98862477912637445-127.0.0.1:61145_solr-n_0000000000) [n:127.0.0.1:61145_solr    ] o.a.s.c.c.ZkStateReader Updated live nodes from ZooKeeper... (0) -> (1)
   [junit4]   2> 1763593 DEBUG (OverseerAutoScalingTriggerThread-98862477912637445-127.0.0.1:61145_solr-n_0000000000) [n:127.0.0.1:61145_solr    ] o.a.s.c.a.NodeLostTrigger Initial livenodes: [127.0.0.1:61145_solr]
   [junit4]   2> 1763593 DEBUG (OverseerAutoScalingTriggerThread-98862477912637445-127.0.0.1:61145_solr-n_0000000000) [n:127.0.0.1:61145_solr    ] o.a.s.c.a.OverseerTriggerThread Current znodeVersion 1, lastZnodeVersion -1
   [junit4]   2> 1763593 DEBUG (OverseerAutoScalingTriggerThread-98862477912637445-127.0.0.1:61145_solr-n_0000000000) [n:127.0.0.1:61145_solr    ] o.a.s.c.a.OverseerTriggerThread Processed trigger updates upto znodeVersion 1
   [junit4]   2> 1763604 DEBUG (OverseerAutoScalingTriggerThread-98862477912637445-127.0.0.1:61145_solr-n_0000000000) [n:127.0.0.1:61145_solr    ] o.a.s.c.a.OverseerTriggerThread -- clean old nodeAdded markers
   [junit4]   2> 1763605 DEBUG (OverseerAutoScalingTriggerThread-98862477912637445-127.0.0.1:61145_solr-n_0000000000) [n:127.0.0.1:61145_solr    ] o.a.s.c.a.OverseerTriggerThread Current znodeVersion 1, lastZnodeVersion 1
   [junit4]   2> 1763606 DEBUG (ScheduledTrigger-6161-thread-1) [n:127.0.0.1:61145_solr    ] o.a.s.c.a.NodeLostTrigger Running NodeLostTrigger: .auto_add_replicas with currently live nodes: [127.0.0.1:61145_solr]
   [junit4]   2> 1763682 INFO  (jetty-launcher-2261-thread-1) [n:127.0.0.1:47014_solr    ] o.a.s.c.c.ZkStateReader Updated live nodes from ZooKeeper... (0) -> (1)
   [junit4]   2> 1763716 INFO  (jetty-launcher-2261-thread-1) [n:127.0.0.1:47014_solr    ] o.a.s.c.Overseer Overseer (id=null) closing
   [junit4]   2> 1763723 INFO  (jetty-launcher-2261-thread-1) [n:127.0.0.1:47014_solr    ] o.a.s.c.ZkController Register node as live in ZooKeeper:/live_nodes/127.0.0.1:47014_solr
   [junit4]   2> 1763728 INFO  (zkCallback-2273-thread-1-processing-n:127.0.0.1:47014_solr) [n:127.0.0.1:47014_solr    ] o.a.s.c.c.ZkStateReader Updated live nodes from ZooKeeper... (1) -> (2)
   [junit4]   2> 1763728 INFO  (zkCallback-2272-thread-1-processing-n:127.0.0.1:61145_solr) [n:127.0.0.1:61145_solr    ] o.a.s.c.c.ZkStateReader Updated live nodes from ZooKeeper... (1) -> (2)
   [junit4]   2> 1763790 INFO  (jetty-launcher-2261-thread-2) [n:127.0.0.1:61145_solr    ] o.a.s.m.r.SolrJmxReporter JMX monitoring for 'solr_61145.solr.node' (registry 'solr.node') enabled at server: com.sun.jmx.mbeanserver.JmxMBeanServer@7f78faf8
   [junit4]   2> 1763803 INFO  (jetty-launcher-2261-thread-2) [n:127.0.0.1:61145_solr    ] o.a.s.m.r.SolrJmxReporter JMX monitoring for 'solr_61145.solr.jvm' (registry 'solr.jvm') enabled at server: com.sun.jmx.mbeanserver.JmxMBeanServer@7f78faf8
   [junit4]   2> 1763804 INFO  (jetty-launcher-2261-thread-2) [n:127.0.0.1:61145_solr    ] o.a.s.m.r.SolrJmxReporter JMX monitoring for 'solr_61145.solr.jetty' (registry 'solr.jetty') enabled at server: com.sun.jmx.mbeanserver.JmxMBeanServer@7f78faf8
   [junit4]   2> 1763805 INFO  (jetty-launcher-2261-thread-2) [n:127.0.0.1:61145_solr    ] o.a.s.c.CorePropertiesLocator Found 0 core definitions underneath /export/home/jenkins/workspace/Lucene-Solr-7.x-Solaris/solr/build/solr-core/test/J0/temp/solr.cloud.autoscaling.ExecutePlanActionTest_7E47DCBFD04BDBC6-001/tempDir-001/node1/.
   [junit4]   2> 1763838 INFO  (jetty-launcher-2261-thread-1) [n:127.0.0.1:47014_solr    ] o.a.s.m.r.SolrJmxReporter JMX monitoring for 'solr_47014.solr.node' (registry 'solr.node') enabled at server: com.sun.jmx.mbeanserver.JmxMBeanServer@7f78faf8
   [junit4]   2> 1763847 INFO  (jetty-launcher-2261-thread-1) [n:127.0.0.1:47014_solr    ] o.a.s.m.r.SolrJmxReporter JMX monitoring for 'solr_47014.solr.jvm' (registry 'solr.jvm') enabled at server: com.sun.jmx.mbeanserver.JmxMBeanServer@7f78faf8
   [junit4]   2> 1763847 INFO  (jetty-launcher-2261-thread-1) [n:127.0.0.1:47014_solr    ] o.a.s.m.r.SolrJmxReporter JMX monitoring for 'solr_47014.solr.jetty' (registry 'solr.jetty') enabled at server: com.sun.jmx.mbeanserver.JmxMBeanServer@7f78faf8
   [junit4]   2> 1763848 INFO  (jetty-launcher-2261-thread-1) [n:127.0.0.1:47014_solr    ] o.a.s.c.CorePropertiesLocator Found 0 core definitions underneath /export/home/jenkins/workspace/Lucene-Solr-7.x-Solaris/solr/build/solr-core/test/J0/temp/solr.cloud.autoscaling.ExecutePlanActionTest_7E47DCBFD04BDBC6-001/tempDir-001/node2/.
   [junit4]   2> 1763882 INFO  (SUITE-ExecutePlanActionTest-seed#[7E47DCBFD04BDBC6]-worker) [    ] o.a.s.c.c.ZkStateReader Updated live nodes from ZooKeeper... (0) -> (2)
   [junit4]   2> 1763884 INFO  (SUITE-ExecutePlanActionTest-seed#[7E47DCBFD04BDBC6]-worker) [    ] o.a.s.c.s.i.ZkClientClusterStateProvider Cluster at 127.0.0.1:57140/solr ready
   [junit4]   2> 1763966 INFO  (TEST-ExecutePlanActionTest.testExecute-seed#[7E47DCBFD04BDBC6]) [    ] o.a.s.SolrTestCaseJ4 ###Starting testExecute
   [junit4]   2> 1763972 DEBUG (zkCallback-2272-thread-1-processing-n:127.0.0.1:61145_solr) [n:127.0.0.1:61145_solr    ] o.a.s.c.a.OverseerTriggerThread Refreshing /autoscaling.json with znode version 2
   [junit4]   2> 1763972 DEBUG (OverseerAutoScalingTriggerThread-98862477912637445-127.0.0.1:61145_solr-n_0000000000) [n:127.0.0.1:61145_solr    ] o.a.s.c.a.OverseerTriggerThread Processed trigger updates upto znodeVersion 2
   [junit4]   2> 1763975 DEBUG (OverseerAutoScalingTriggerThread-98862477912637445-127.0.0.1:61145_solr-n_0000000000) [n:127.0.0.1:61145_solr    ] o.a.s.c.a.OverseerTriggerThread -- clean old nodeLost markers
   [junit4]   2> 1763975 DEBUG (OverseerAutoScalingTriggerThread-98862477912637445-127.0.0.1:61145_solr-n_0000000000) [n:127.0.0.1:61145_solr    ] o.a.s.c.a.OverseerTriggerThread -- clean old nodeAdded markers
   [junit4]   2> 1763976 DEBUG (OverseerAutoScalingTriggerThread-98862477912637445-127.0.0.1:61145_solr-n_0000000000) [n:127.0.0.1:61145_solr    ] o.a.s.c.a.OverseerTriggerThread Current znodeVersion 2, lastZnodeVersion 2
   [junit4]   2> 1763981 INFO  (qtp539002003-16780) [n:127.0.0.1:47014_solr    ] o.a.s.h.a.CollectionsHandler Invoked Collection Action :create with params replicationFactor=2&collection.configName=conf&maxShardsPerNode=1&name=testExecute&nrtReplicas=2&action=CREATE&numShards=1&wt=javabin&version=2 and sendToOCPQueue=true
   [junit4]   2> 1763984 INFO  (OverseerThreadFactory-6163-thread-1-processing-n:127.0.0.1:61145_solr) [n:127.0.0.1:61145_solr    ] o.a.s.c.CreateCollectionCmd Create collection testExecute
   [junit4]   2> 1764096 INFO  (OverseerStateUpdate-98862477912637445-127.0.0.1:61145_solr-n_0000000000) [n:127.0.0.1:61145_solr    ] o.a.s.c.o.SliceMutator createReplica() {
   [junit4]   2>   "operation":"ADDREPLICA",
   [junit4]   2>   "collection":"testExecute",
   [junit4]   2>   "shard":"shard1",
   [junit4]   2>   "core":"testExecute_shard1_replica_n1",
   [junit4]   2>   "state":"down",
   [junit4]   2>   "base_url":"http://127.0.0.1:47014/solr",
   [junit4]   2>   "type":"NRT",
   [junit4]   2>   "waitForFinalState":"false"} 
   [junit4]   2> 1764100 INFO  (OverseerStateUpdate-98862477912637445-127.0.0.1:61145_solr-n_0000000000) [n:127.0.0.1:61145_solr    ] o.a.s.c.o.SliceMutator createReplica() {
   [junit4]   2>   "operation":"ADDREPLICA",
   [junit4]   2>   "collection":"testExecute",
   [junit4]   2>   "shard":"shard1",
   [junit4]   2>   "core":"testExecute_shard1_replica_n2",
   [junit4]   2>   "state":"down",
   [junit4]   2>   "base_url":"http://127.0.0.1:61145/solr",
   [junit4]   2>   "type":"NRT",
   [junit4]   2>   "waitForFinalState":"false"} 
   [junit4]   2> 1764310 INFO  (qtp539002003-16784) [n:127.0.0.1:47014_solr    ] o.a.s.h.a.CoreAdminOperation core create command qt=/admin/cores&coreNodeName=core_node3&collection.configName=conf&newCollection=true&name=testExecute_shard1_replica_n1&action=CREATE&numShards=1&collection=testExecute&shard=shard1&wt=javabin&version=2&replicaType=NRT
   [junit4]   2> 1764311 INFO  (qtp539002003-16784) [n:127.0.0.1:47014_solr    ] o.a.s.c.TransientSolrCoreCacheDefault Allocating transient cache for 2147483647 transient cores
   [junit4]   2> 1764312 INFO  (qtp1976382143-16767) [n:127.0.0.1:61145_solr    ] o.a.s.h.a.CoreAdminOperation core create command qt=/admin/cores&coreNodeName=core_node4&collection.configName=conf&newCollection=true&name=testExecute_shard1_replica_n2&action=CREATE&numShards=1&collection=testExecute&shard=shard1&wt=javabin&version=2&replicaType=NRT
   [junit4]   2> 1764312 INFO  (qtp1976382143-16767) [n:127.0.0.1:61145_solr    ] o.a.s.c.TransientSolrCoreCacheDefault Allocating transient cache for 2147483647 transient cores
   [junit4]   2> 1764425 INFO  (zkCallback-2272-thread-1-processing-n:127.0.0.1:61145_solr) [n:127.0.0.1:61145_solr    ] o.a.s.c.c.ZkStateReader A cluster state change: [WatchedEvent state:SyncConnected type:NodeDataChanged path:/collections/testExecute/state.json] for collection [testExecute] has occurred - updating... (live nodes size: [2])
   [junit4]   2> 1764425 INFO  (zkCallback-2272-thread-2-processing-n:127.0.0.1:61145_solr) [n:127.0.0.1:61145_solr    ] o.a.s.c.c.ZkStateReader A cluster state change: [WatchedEvent state:SyncConnected type:NodeDataChanged path:/collections/testExecute/state.json] for collection [testExecute] has occurred - updating... (live nodes size: [2])
   [junit4]   2> 1764425 INFO  (zkCallback-2273-thread-1-processing-n:127.0.0.1:47014_solr) [n:127.0.0.1:47014_solr    ] o.a.s.c.c.ZkStateReader A cluster state change: [WatchedEvent state:SyncConnected type:NodeDataChanged path:/collections/testExecute/state.json] for collection [testExecute] has occurred - updating... (live nodes size: [2])
   [junit4]   2> 1764425 INFO  (zkCallback-2273-thread-2-processing-n:127.0.0.1:47014_solr) [n:127.0.0.1:47014_solr    ] o.a.s.c.c.ZkStateReader A cluster state change: [WatchedEvent state:SyncConnected type:NodeDataChanged path:/collections/testExecute/state.json] for collection [testExecute] has occurred - updating... (live nodes size: [2])
   [junit4]   2> 1765359 INFO  (qtp539002003-16784) [n:127.0.0.1:47014_solr c:testExecute s:shard1 r:core_node3 x:testExecute_shard1_replica_n1] o.a.s.c.SolrConfig Using Lucene MatchVersion: 7.2.0
   [junit4]   2> 1765366 INFO  (qtp1976382143-16767) [n:127.0.0.1:61145_solr c:testExecute s:shard1 r:core_node4 x:testExecute_shard1_replica_n2] o.a.s.c.SolrConfig Using Lucene MatchVersion: 7.2.0
   [junit4]   2> 1765376 INFO  (qtp1976382143-16767) [n:127.0.0.1:61145_solr c:testExecute s:shard1 r:core_node4 x:testExecute_shard1_replica_n2] o.a.s.s.IndexSchema [testExecute_shard1_replica_n2] Schema name=minimal
   [junit4]   2> 1765376 INFO  (qtp539002003-16784) [n:127.0.0.1:47014_solr c:testExecute s:shard1 r:core_node3 x:testExecute_shard1_replica_n1] o.a.s.s.IndexSchema [testExecute_shard1_replica_n1] Schema name=minimal
   [junit4]   2> 1765378 INFO  (qtp1976382143-16767) [n:127.0.0.1:61145_solr c:testExecute s:shard1 r:core_node4 x:testExecute_shard1_replica_n2] o.a.s.s.IndexSchema Loaded schema minimal/1.1 with uniqueid field id
   [junit4]   2> 1765379 INFO  (qtp1976382143-16767) [n:127.0.0.1:61145_solr c:testExecute s:shard1 r:core_node4 x:testExecute_shard1_replica_n2] o.a.s.c.CoreContainer Creating SolrCore 'testExecute_shard1_replica_n2' using configuration from collection testExecute, trusted=true
   [junit4]   2> 1765379 INFO  (qtp1976382143-16767) [n:127.0.0.1:61145_solr c:testExecute s:shard1 r:core_node4 x:testExecute_shard1_replica_n2] o.a.s.m.r.SolrJmxReporter JMX monitoring for 'solr_61145.solr.core.testExecute.shard1.replica_n2' (registry 'solr.core.testExecute.shard1.replica_n2') enabled at server: com.sun.jmx.mbeanserver.JmxMBeanServer@7f78faf8
   [junit4]   2> 1765379 INFO  (qtp1976382143-16767) [n:127.0.0.1:61145_solr c:testExecute s:shard1 r:core_node4 x:testExecute_shard1_replica_n2] o.a.s.c.SolrCore solr.RecoveryStrategy.Builder
   [junit4]   2> 1765379 INFO  (qtp1976382143-16767) [n:127.0.0.1:61145_solr c:testExecute s:shard1 r:core_node4 x:testExecute_shard1_replica_n2] o.a.s.c.SolrCore [[testExecute_shard1_replica_n2] ] Opening new SolrCore at [/export/home/jenkins/workspace/Lucene-Solr-7.x-Solaris/solr/build/solr-core/test/J0/temp/solr.cloud.autoscaling.ExecutePlanActionTest_7E47DCBFD04BDBC6-001/tempDir-001/node1/testExecute_shard1_replica_n2], dataDir=[/export/home/jenkins/workspace/Lucene-Solr-7.x-Solaris/solr/build/solr-core/test/J0/temp/solr.cloud.autoscaling.ExecutePlanActionTest_7E47DCBFD04BDBC6-001/tempDir-001/node1/./testExecute_shard1_replica_n2/data/]
   [junit4]   2> 1765381 INFO  (qtp539002003-16784) [n:127.0.0.1:47014_solr c:testExecute s:shard1 r:core_node3 x:testExecute_shard1_replica_n1] o.a.s.s.IndexSchema Loaded schema minimal/1.1 with uniqueid field id
   [junit4]   2> 1765381 INFO  (qtp539002003-16784) [n:127.0.0.1:47014_solr c:testExecute s:shard1 r:core_node3 x:testExecute_shard1_replica_n1] o.a.s.c.CoreContainer Creating SolrCore 'testExecute_shard1_replica_n1' using configuration from collection testExecute, trusted=true
   [junit4]   2> 1765382 INFO  (qtp539002003-16784) [n:127.0.0.1:47014_solr c:testExecute s:shard1 r:core_node3 x:testExecute_shard1_replica_n1] o.a.s.m.r.SolrJmxReporter JMX monitoring for 'solr_47014.solr.core.testExecute.shard1.replica_n1' (registry 'solr.core.testExecute.shard1.replica_n1') enabled at server: com.sun.jmx.mbeanserver.JmxMBeanServer@7f78faf8
   [junit4]   2> 1765382 INFO  (qtp539002003-16784) [n:127.0.0.1:47014_solr c:testExecute s:shard1 r:core_node3 x:testExecute_shard1_replica_n1] o.a.s.c.SolrCore solr.RecoveryStrategy.Builder
   [junit4]   2> 1765382 INFO  (qtp539002003-16784) [n:127.0.0.1:47014_solr c:testExecute s:shard1 r:core_node3 x:testExecute_shard1_replica_n1] o.a.s.c.SolrCore [[testExecute_shard1_replica_n1] ] Opening new SolrCore at [/export/home/jenkins/workspace/Lucene-Solr-7.x-Solaris/solr/build/solr-core/test/J0/temp/solr.cloud.autoscaling.ExecutePlanActionTest_7E47DCBFD04BDBC6-001/tempDir-001/node2/testExecute_shard1_replica_n1], dataDir=[/export/home/jenkins/workspace/Lucene-Solr-7.x-Solaris/solr/build/solr-core/test/J0/temp/solr.cloud.autoscaling.ExecutePlanActionTest_7E47DCBFD04BDBC6-001/tempDir-001/node2/./testExecute_shard1_replica_n1/data/]
   [junit4]   2> 1765453 INFO  (qtp1976382143-16767) [n:127.0.0.1:61145_solr c:testExecute s:shard1 r:core_node4 x:testExecute_shard1_replica_n2] o.a.s.u.UpdateHandler Using UpdateLog implementation: org.apache.solr.update.UpdateLog
   [junit4]   2> 1765453 INFO  (qtp1976382143-16767) [n:127.0.0.1:61145_solr c:testExecute s:shard1 r:core_node4 x:testExecute_shard1_replica_n2] o.a.s.u.UpdateLog Initializing UpdateLog: dataDir=null defaultSyncLevel=FLUSH numRecordsToKeep=100 maxNumLogsToKeep=10 numVersionBuckets=65536
   [junit4]   2> 1765455 INFO  (qtp1976382143-16767) [n:127.0.0.1:61145_solr c:testExecute s:shard1 r:core_node4 x:testExecute_shard1_replica_n2] o.a.s.u.CommitTracker Hard AutoCommit: disabled
   [junit4]   2> 1765455 INFO  (qtp1976382143-16767) [n:127.0.0.1:61145_solr c:testExecute s:shard1 r:core_node4 x:testExecute_shard1_replica_n2] o.a.s.u.CommitTracker Soft AutoCommit: disabled
   [junit4]   2> 1765456 INFO  (qtp1976382143-16767) [n:127.0.0.1:61145_solr c:testExecute s:shard1 r:core_node4 x:testExecute_shard1_replica_n2] o.a.s.s.SolrIndexSearcher Opening [Searcher@760b7d3b[testExecute_shard1_replica_n2] main]
   [junit4]   2> 1765458 INFO  (qtp1976382143-16767) [n:127.0.0.1:61145_solr c:testExecute s:shard1 r:core_node4 x:testExecute_shard1_replica_n2] o.a.s.r.ManagedResourceStorage Configured ZooKeeperStorageIO with znodeBase: /configs/conf
   [junit4]   2> 1765459 INFO  (qtp1976382143-16767) [n:127.0.0.1:61145_solr c:testExecute s:shard1 r:core_node4 x:testExecute_shard1_replica_n2] o.a.s.r.ManagedResourceStorage Loaded null at path _rest_managed.json using ZooKeeperStorageIO:path=/configs/conf
   [junit4]   2> 1765460 INFO  (qtp1976382143-16767) [n:127.0.0.1:61145_solr c:testExecute s:shard1 r:core_node4 x:testExecute_shard1_replica_n2] o.a.s.h.ReplicationHandler Commits will be reserved for 10000ms.
   [junit4]   2> 1765460 INFO  (qtp1976382143-16767) [n:127.0.0.1:61145_solr c:testExecute s:shard1 r:core_node4 x:testExecute_shard1_replica_n2] o.a.s.u.UpdateLog Could not find max version in index or recent updates, using new clock 1581799649307525120
   [junit4]   2> 1765465 INFO  (searcherExecutor-6168-thread-1-processing-n:127.0.0.1:61145_solr x:testExecute_shard1_replica_n2 s:shard1 c:testExecute r:core_node4) [n:127.0.0.1:61145_solr c:testExecute s:shard1 r:core_node4 x:testExecute_shard1_replica_n2] o.a.s.c.SolrCore [testExecute_shard1_replica_n2] Registered new searcher Searcher@760b7d3b[testExecute_shard1_replica_n2] main{ExitableDirectoryReader(UninvertingDirectoryReader())}
   [junit4]   2> 1765468 INFO  (qtp1976382143-16767) [n:127.0.0.1:61145_solr c:testExecute s:shard1 r:core_node4 x:testExecute_shard1_replica_n2] o.a.s.c.ShardLeaderElectionContext Waiting until we see more replicas up for shard shard1: total=2 found=1 timeoutin=9999ms
   [junit4]   2> 1765474 INFO  (qtp539002003-16784) [n:127.0.0.1:47014_solr c:testExecute s:shard1 r:core_node3 x:testExecute_shard1_replica_n1] o.a.s.u.UpdateHandler Using UpdateLog implementation: org.apache.solr.update.UpdateLog
   [junit4]   2> 1765475 INFO  (qtp539002003-16784) [n:127.0.0.1:47014_solr c:testExecute s:shard1 r:core_node3 x:testExecute_shard1_replica_n1] o.a.s.u.UpdateLog Initializing UpdateLog: dataDir=null defaultSyncLevel=FLUSH numRecordsToKeep=100 maxNumLogsToKeep=10 numVersionBuckets=65536
   [junit4]   2> 1765476 INFO  (qtp539002003-16784) [n:127.0.0.1:47014_solr c:testExecute s:shard1 r:core_node3 x:testExecute_shard1_replica_n1] o.a.s.u.CommitTracker Hard AutoCommit: disabled
   [junit4]   2> 1765476 INFO  (qtp539002003-16784) [n:127.0.0.1:47014_solr c:testExecute s:shard1 r:core_node3 x:testExecute_shard1_replica_n1] o.a.s.u.CommitTracker Soft AutoCommit: disabled
   [junit4]   2> 1765478 INFO  (qtp539002003-16784) [n:127.0.0.1:47014_solr c:testExecute s:shard1 r:core_node3 x:testExecute_shard1_replica_n1] o.a.s.s.SolrIndexSearcher Opening [Searcher@383b9cd7[testExecute_shard1_replica_n1] main]
   [junit4]   2> 1765496 INFO  (qtp539002003-16784) [n:127.0.0.1:47014_solr c:testExecute s:shard1 r:core_node3 x:testExecute_shard1_replica_n1] o.a.s.r.ManagedResourceStorage Configured ZooKeeperStorageIO with znodeBase: /configs/conf
   [junit4]   2> 1765497 INFO  (qtp539002003-16784) [n:127.0.0.1:47014_solr c:testExecute s:shard1 r:core_node3 x:testExecute_shard1_replica_n1] o.a.s.r.ManagedResourceStorage Loaded null at path _rest_managed.json using ZooKeeperStorageIO:path=/configs/conf
   [junit4]   2> 1765497 INFO  (qtp539002003-16784) [n:127.0.0.1:47014_solr c:testExecute s:shard1 r:core_node3 x:testExecute_shard1_replica_n1] o.a.s.h.ReplicationHandler Commits will be reserved for 10000ms.
   [junit4]   2> 1765498 INFO  (qtp539002003-16784) [n:127.0.0.1:47014_solr c:testExecute s:shard1 r:core_node3 x:testExecute_shard1_replica_n1] o.a.s.u.UpdateLog Could not find max version in index or recent updates, using new clock 1581799649347371008
   [junit4]   2> 1765499 INFO  (searcherExecutor-6169-thread-1-processing-n:127.0.0.1:47014_solr x:testExecute_shard1_replica_n1 s:shard1 c:testExecute r:core_node3) [n:127.0.0.1:47014_solr c:testExecute s:shard1 r:core_node3 x:testExecute_shard1_replica_n1] o.a.s.c.SolrCore [testExecute_shard1_replica_n1] Registered new searcher Searcher@383b9cd7[testExecute_shard1_replica_n1] main{ExitableDirectoryReader(UninvertingDirectoryReader())}
   [junit4]   2> 1765578 INFO  (zkCallback-2273-thread-2-processing-n:127.0.0.1:47014_solr) [n:127.0.0.1:47014_solr    ] o.a.s.c.c.ZkStateReader A cluster state change: [WatchedEvent state:SyncConnected type:NodeDataChanged path:/collections/testExecute/state.json] for collection [testExecute] has occurred - updating... (live nodes size: [2])
   [junit4]   2> 1765578 INFO  (zkCallback-2272-thread-2-processing-n:127.0.0.1:61145_solr) [n:127.0.0.1:61145_solr    ] o.a.s.c.c.ZkStateReader A cluster state change: [WatchedEvent state:SyncConnected type:NodeDataChanged path:/collections/testExecute/state.json] for collection [testExecute] has occurred - updating... (live nodes size: [2])
   [junit4]   2> 1765578 INFO  (zkCallback-2273-thread-1-processing-n:127.0.0.1:47014_solr) [n:127.0.0.1:47014_solr    ] o.a.s.c.c.ZkStateReader A cluster state change: [WatchedEvent state:SyncConnected type:NodeDataChanged path:/collections/testExecute/state.json] for collection [testExecute] has occurred - updating... (live nodes size: [2])
   [junit4]   2> 1765580 INFO  (zkCallback-2272-thread-1-processing-n:127.0.0.1:61145_solr) [n:127.0.0.1:61145_solr    ] o.a.s.c.c.ZkStateReader A cluster state change: [WatchedEvent state:SyncConnected type:NodeDataChanged path:/collections/testExecute/state.json] for collection [testExecute] has occurred - updating... (live nodes size: [2])
   [junit4]   2> 1765971 INFO  (qtp1976382143-16767) [n:127.0.0.1:61145_solr c:testExecute s:shard1 r:core_node4 x:testExecute_shard1_replica_n2] o.a.s.c.ShardLeaderElectionContext Enough replicas found to continue.
   [junit4]   2> 1765971 INFO  (qtp1976382143-16767) [n:127.0.0.1:61145_solr c:testExecute s:shard1 r:core_node4 x:testExecute_shard1_replica_n2] o.a.s.c.ShardLeaderElectionContext I may be the new leader - try and sync
   [junit4]   2> 1765971 INFO  (qtp1976382143-16767) [n:127.0.0.1:61145_solr c:testExecute s:shard1 r:core_node4 x:testExecute_shard1_replica_n2] o.a.s.c.SyncStrategy Sync replicas to http://127.0.0.1:61145/solr/testExecute_shard1_replica_n2/
   [junit4]   2> 1765971 INFO  (qtp1976382143-16767) [n:127.0.0.1:61145_solr c:testExecute s:shard1 r:core_node4 x:testExecute_shard1_replica_n2] o.a.s.u.PeerSync PeerSync: core=testExecute_shard1_replica_n2 url=http://127.0.0.1:61145/solr START replicas=[http://127.0.0.1:47014/solr/testExecute_shard1_replica_n1/] nUpdates=100
   [junit4]   2> 1765974 INFO  (qtp539002003-16779) [n:127.0.0.1:47014_solr c:testExecute s:shard1 r:core_node3 x:testExecute_shard1_replica_n1] o.a.s.c.S.Request [testExecute_shard1_replica_n1]  webapp=/solr path=/get params={distrib=false&qt=/get&fingerprint=false&getVersions=100&wt=javabin&version=2} status=0 QTime=1
   [junit4]   2> 1766272 INFO  (qtp1976382143-16767) [n:127.0.0.1:61145_solr c:testExecute s:shard1 r:core_node4 x:testExecute_shard1_replica_n2] o.a.s.u.PeerSync PeerSync: core=testExecute_shard1_replica_n2 url=http://127.0.0.1:61145/solr DONE.  We have no versions.  sync failed.
   [junit4]   2> 1766272 INFO  (qtp1976382143-16767) [n:127.0.0.1:61145_solr c:testExecute s:shard1 r:core_node4 x:testExecute_shard1_replica_n2] o.a.s.c.SyncStrategy Leader's attempt to sync with shard failed, moving to the next candidate
   [junit4]   2> 1766272 INFO  (qtp1976382143-16767) [n:127.0.0.1:61145_solr c:testExecute s:shard1 r:core_node4 x:testExecute_shard1_replica_n2] o.a.s.c.ShardLeaderElectionContext We failed sync, but we have no versions - we can't sync in that case - we were active before, so become leader anyway
   [junit4]   2> 1766272 INFO  (qtp1976382143-16767) [n:127.0.0.1:61145_solr c:testExecute s:shard1 r:core_node4 x:testExecute_shard1_replica_n2] o.a.s.c.ShardLeaderElectionContext Found all replicas participating in election, clear LIR
   [junit4]   2> 1766303 INFO  (qtp1976382143-16767) [n:127.0.0.1:61145_solr c:testExecute s:shard1 r:core_node4 x:testExecute_shard1_replica_n2] o.a.s.c.ShardLeaderElectionContext I am the new leader: http://127.0.0.1:61145/solr/testExecute_shard1_replica_n2/ shard1
   [junit4]   2> 1766407 INFO  (zkCallback-2273-thread-2-processing-n:127.0.0.1:47014_solr) [n:127.0.0.1:47014_solr    ] o.a.s.c.c.ZkStateReader A cluster state change: [WatchedEvent state:SyncConnected type:NodeDataChanged path:/collections/testExecute/state.json] for collection [testExecute] has occurred - updating... (live nodes size: [2])
   [junit4]   2> 1766407 INFO  (zkCallback-2272-thread-1-processing-n:127.0.0.1:61145_solr) [n:127.0.0.1:61145_solr    ] o.a.s.c.c.ZkStateReader A cluster state change: [WatchedEvent state:SyncConnected type:NodeDataChanged path:/collections/testExecute/state.json] for collection [testExecute] has occurred - updating... (live nodes size: [2])
   [junit4]   2> 1766407 INFO  (zkCallback-2273-thread-1-processing-n:127.0.0.1:47014_solr) [n:127.0.0.1:47014_solr    ] o.a.s.c.c.ZkStateReader A cluster state change: [WatchedEvent state:SyncConnected type:NodeDataChanged path:/collections/testExecute/state.json] for collection [testExecute] has occurred - updating... (live nodes size: [2])
   [junit4]   2> 1766407 INFO  (zkCallback-2272-thread-3-processing-n:127.0.0.1:61145_solr) [n:127.0.0.1:61145_solr    ] o.a.s.c.c.ZkStateReader A cluster state change: [WatchedEvent state:SyncConnected type:NodeDataChanged path:/collections/testExecute/state.json] for collection [testExecute] has occurred - updating... (live nodes size: [2])
   [junit4]   2> 1766455 INFO  (qtp1976382143-16767) [n:127.0.0.1:61145_solr c:testExecute s:shard1 r:core_node4 x:testExecute_shard1_replica_n2] o.a.s.c.ZkController I am the leader, no recovery necessary
   [junit4]   2> 1766458 INFO  (qtp1976382143-16767) [n:127.0.0.1:61145_solr c:testExecute s:shard1 r:core_node4 x:testExecute_shard1_replica_n2] o.a.s.s.HttpSolrCall [admin] webapp=null path=/admin/cores params={qt=/admin/cores&coreNodeName=core_node4&collection.configName=conf&newCollection=true&name=testExecute_shard1_replica_n2&action=CREATE&numShards=1&collection=testExecute&shard=shard1&wt=javabin&version=2&replicaType=NRT} status=0 QTime=2146
   [junit4]   2> 1766509 INFO  (qtp539002003-16784) [n:127.0.0.1:47014_solr c:testExecute s:shard1 r:core_node3 x:testExecute_shard1_replica_n1] o.a.s.s.HttpSolrCall [admin] webapp=null path=/admin/cores params={qt=/admin/cores&coreNodeName=core_node3&collection.configName=conf&newCollection=true&name=testExecute_shard1_replica_n1&action=CREATE&numShards=1&collection=testExecute&shard=shard1&wt=javabin&version=2&replicaType=NRT} status=0 QTime=2200
   [junit4]   2> 1766515 INFO  (qtp539002003-16780) [n:127.0.0.1:47014_solr    ] o.a.s.h.a.CollectionsHandler Wait for new collection to be active for at most 30 seconds. Check all shard replicas
   [junit4]   2> 1766611 INFO  (zkCallback-2272-thread-1-processing-n:127.0.0.1:61145_solr) [n:127.0.0.1:61145_solr    ] o.a.s.c.c.ZkStateReader A cluster state change: [WatchedEvent state:SyncConnected type:NodeDataChanged path:/collections/testExecute/state.json] for collection [testExecute] has occurred - updating... (live nodes size: [2])
   [junit4]   2> 1766611 INFO  (zkCallback-2272-thread-2-processing-n:127.0.0.1:61145_solr) [n:127.0.0.1:61145_solr    ] o.a.s.c.c.ZkStateReader A cluster state change: [WatchedEvent state:SyncConnected type:NodeDataChanged path:/collections/testExecute/state.json] for collection [testExecute] has occurred - updating... (live nodes size: [2])
   [junit4]   2> 1766611 INFO  (zkCallback-2273-thread-2-processing-n:127.0.0.1:47014_solr) [n:127.0.0.1:47014_solr    ] o.a.s.c.c.ZkStateReader A cluster state change: [WatchedEvent state:SyncConnected type:NodeDataChanged path:/collections/testExecute/state.json] for collection [testExecute] has occurred - updating... (live nodes size: [2])
   [junit4]   2> 1766611 INFO  (zkCallback-2273-thread-1-processing-n:127.0.0.1:47014_solr) [n:127.0.0.1:47014_solr    ] o.a.s.c.c.ZkStateReader A cluster state change: [WatchedEvent state:SyncConnected type:NodeDataChanged path:/collections/testExecute/state.json] for collection [testExecute] has occurred - updating... (live nodes size: [2])
   [junit4]   2> 1767516 INFO  (qtp539002003-16780) [n:127.0.0.1:47014_solr    ] o.a.s.s.HttpSolrCall [admin] webapp=null path=/admin/collections params={replicationFactor=2&collection.configName=conf&maxShardsPerNode=1&name=testExecute&nrtReplicas=2&action=CREATE&numShards=1&wt=javabin&version=2} status=0 QTime=3535
   [junit4]   2> 1767533 DEBUG (TEST-ExecutePlanActionTest.testExecute-seed#[7E47DCBFD04BDBC6]) [    ] o.a.s.c.a.ExecutePlanAction -- processing event: {
   [junit4]   2>   "id":"14ef587eae5f24c0Tczkvl8fgdoi5m9ztrgpvw3fig",
   [junit4]   2>   "source":"mock_trigger_name",
   [junit4]   2>   "eventTime":1508521701307000000,
   [junit4]   2>   "eventType":"NODELOST",
   [junit4]   2>   "properties":{
   [junit4]   2>     "eventTimes":[1508521701307000000],
   [junit4]   2>     "nodeNames":["127.0.0.1:61145_solr"]}} with context properties: {operations=[org.apache.solr.client.solrj.request.CollectionAdminRequest$MoveReplica@7be00c7d, org.apache.solr.cloud.autoscaling.ExecutePlanActionTest$1@225d440f]}
   [junit4]   2> 1767533 INFO  (TEST-ExecutePlanActionTest.testExecute-seed#[7E47DCBFD04BDBC6]) [    ] o.a.s.c.a.ExecutePlanAction Executing operation: action=MOVEREPLICA&collection=testExecute&targetNode=127.0.0.1:47014_solr&replica=core_node4
   [junit4]   2> 1767545 DEBUG (TEST-ExecutePlanActionTest.testExecute-seed#[7E47DCBFD04BDBC6]) [    ] o.a.s.c.a.ExecutePlanAction Saved requestId: mock_trigger_name/14ef587eae5f24c0Tczkvl8fgdoi5m9ztrgpvw3fig/0 in znode: /autoscaling/triggerState/mock_trigger_name/execute_plan/op-0000000000
   [junit4]   2> 1767546 INFO  (qtp539002003-16773) [n:127.0.0.1:47014_solr    ] o.a.s.h.a.CollectionsHandler Invoked Collection Action :movereplica with params async=mock_trigger_name/14ef587eae5f24c0Tczkvl8fgdoi5m9ztrgpvw3fig/0&replica=core_node4&action=MOVEREPLICA&collection=testExecute&targetNode=127.0.0.1:47014_solr&wt=javabin&version=2 and sendToOCPQueue=true
   [junit4]   2> 1767551 INFO  (qtp539002003-16773) [n:127.0.0.1:47014_solr    ] o.a.s.s.HttpSolrCall [admin] webapp=null path=/admin/collections params={async=mock_trigger_name/14ef587eae5f24c0Tczkvl8fgdoi5m9ztrgpvw3fig/0&replica=core_node4&action=MOVEREPLICA&collection=testExecute&targetNode=127.0.0.1:47014_solr&wt=javabin&version=2} status=0 QTime=4
   [junit4]   2> 1767552 INFO  (qtp539002003-16785) [n:127.0.0.1:47014_solr    ] o.a.s.h.a.CollectionsHandler Invoked Collection Action :requeststatus with params requestid=mock_trigger_name/14ef587eae5f24c0Tczkvl8fgdoi5m9ztrgpvw3fig/0&action=REQUESTSTATUS&wt=javabin&version=2 and sendToOCPQueue=true
   [junit4]   2> 1767556 INFO  (qtp539002003-16785) [n:127.0.0.1:47014_solr    ] o.a.s.s.HttpSolrCall [admin] webapp=null path=/admin/collections params={requestid=mock_trigger_name/14ef587eae5f24c0Tczkvl8fgdoi5m9ztrgpvw3fig/0&action=REQUESTSTATUS&wt=javabin&version=2} status=0 QTime=4
   [junit4]   2> 1767560 INFO  (OverseerCollectionConfigSetProcessor-98862477912637445-127.0.0.1:61145_solr-n_0000000000) [n:127.0.0.1:61145_solr    ] o.a.s.c.OverseerTaskQueue Response ZK path: /overseer/collection-queue-work/qnr-0000000000 doesn't exist.  Requestor may have disconnected from ZooKeeper
   [junit4]   2> 1767561 INFO  (OverseerThreadFactory-6163-thread-2-processing-n:127.0.0.1:61145_solr) [n:127.0.0.1:61145_solr    ] o.a.s.c.MoveReplicaCmd Replica will be moved core_node4:{"core":"testExecute_shard1_replica_n2","base_url":"http://127.0.0.1:61145/solr","node_name":"127.0.0.1:61145_solr","state":"active","type":"NRT","leader":"true"}
   [junit4]   2> 1767564 INFO  (OverseerThreadFactory-6163-thread-2-processing-n:127.0.0.1:61145_solr) [n:127.0.0.1:61145_solr    ] o.a.s.c.AddReplicaCmd Node Identified 127.0.0.1:47014_solr for creating new replica
   [junit4]   2> 1767571 INFO  (OverseerStateUpdate-98862477912637445-127.0.0.1:61145_solr-n_0000000000) [n:127.0.0.1:61145_solr    ] o.a.s.c.o.SliceMutator createReplica() {
   [junit4]   2>   "operation":"addreplica",
   [junit4]   2>   "collection":"testExecute",
   [junit4]   2>   "shard":"shard1",
   [junit4]   2>   "core":"testExecute_shard1_replica_n5",
   [junit4]   2>   "state":"down",
   [junit4]   2>   "base_url":"http://127.0.0.1:47014/solr",
   [junit4]   2>   "node_name":"127.0.0.1:47014_solr",
   [junit4]   2>   "type":"NRT"} 
   [junit4]   2> 1767675 INFO  (zkCallback-2273-thread-2-processing-n:127.0.0.1:47014_solr) [n:127.0.0.1:47014_solr    ] o.a.s.c.c.ZkStateReader A cluster state change: [WatchedEvent state:SyncConnected type:NodeDataChanged path:/collections/testExecute/state.json] for collection [testExecute] has occurred - updating... (live nodes size: [2])
   [junit4]   2> 1767675 INFO  (zkCallback-2272-thread-2-processing-n:127.0.0.1:61145_solr) [n:127.0.0.1:61145_solr    ] o.a.s.c.c.ZkStateReader A cluster state change: [WatchedEvent state:SyncConnected type:NodeDataChanged path:/collections/testExecute/state.json] for collection [testExecute] has occurred - updating... (live nodes size: [2])
   [junit4]   2> 1767675 INFO  (zkCallback-2273-thread-1-processing-n:127.0.0.1:47014_solr) [n:127.0.0.1:47014_solr    ] o.a.s.c.c.ZkStateReader A cluster state change: [WatchedEvent state:SyncConnected type:NodeDataChanged path:/collections/testExecute/state.json] for collection [testExecute] has occurred - updating... (live nodes size: [2])
   [junit4]   2> 1767675 INFO  (zkCallback-2272-thread-1-processing-n:127.0.0.1:61145_solr) [n:127.0.0.1:61145_solr    ] o.a.s.c.c.ZkStateReader A cluster state change: [WatchedEvent state:SyncConnected type:NodeDataChanged path:/collections/testExecute/state.json] for collection [testExecute] has occurred - updating... (live nodes size: [2])
   [junit4]   2> 1767771 INFO  (qtp539002003-16774) [n:127.0.0.1:47014_solr    ] o.a.s.s.HttpSolrCall [admin] webapp=null path=/admin/cores params={async=mock_trigger_name/14ef587eae5f24c0Tczkvl8fgdoi5m9ztrgpvw3fig/02699658024654521&qt=/admin/cores&coreNodeName=core_node6&collection.configName=conf&name=testExecute_shard1_replica_n5&action=CREATE&collection=testExecute&shard=shard1&wt=javabin&version=2&replicaType=NRT} status=0 QTime=0
   [junit4]   2> 1767771 INFO  (parallelCoreAdminExecutor-6166-thread-1-processing-n:127.0.0.1:47014_solr mock_trigger_name//14ef587eae5f24c0Tczkvl8fgdoi5m9ztrgpvw3fig//02699658024654521 CREATE) [n:127.0.0.1:47014_solr    ] o.a.s.h.a.CoreAdminOperation core create command async=mock_trigger_name/14ef587eae5f24c0Tczkvl8fgdoi5m9ztrgpvw3fig/02699658024654521&qt=/admin/cores&coreNodeName=core_node6&collection.configName=conf&name=testExecute_shard1_replica_n5&action=CREATE&collection=testExecute&shard=shard1&wt=javabin&version=2&replicaType=NRT
   [junit4]   2> 1767772 INFO  (qtp539002003-16774) [n:127.0.0.1:47014_solr    ] o.a.s.h.a.CoreAdminOperation Checking request status for : mock_trigger_name/14ef587eae5f24c0Tczkvl8fgdoi5m9ztrgpvw3fig/02699658024654521
   [junit4]   2> 1767772 INFO  (qtp539002003-16774) [n:127.0.0.1:47014_solr    ] o.a.s.s.HttpSolrCall [admin] webapp=null path=/admin/cores params={qt=/admin/cores&requestid=mock_trigger_name/14ef587eae5f24c0Tczkvl8fgdoi5m9ztrgpvw3fig/02699658024654521&action=REQUESTSTATUS&wt=javabin&version=2} status=0 QTime=0
   [junit4]   2> 1767792 INFO  (parallelCoreAdminExecutor-6166-thread-1-processing-n:127.0.0.1:47014_solr mock_trigger_name//14ef587eae5f24c0Tczkvl8fgdoi5m9ztrgpvw3fig//02699658024654521 CREATE) [n:127.0.0.1:47014_solr c:testExecute s:shard1 r:core_node6 x:testExecute_shard1_replica_n5] o.a.s.c.SolrConfig Using Lucene MatchVersion: 7.2.0
   [junit4]   2> 1767836 INFO  (parallelCoreAdminExecutor-6166-thread-1-processing-n:127.0.0.1:47014_solr mock_trigger_name//14ef587eae5f24c0Tczkvl8fgdoi5m9ztrgpvw3fig//02699658024654521 CREATE) [n:127.0.0.1:47014_solr c:testExecute s:shard1 r:core_node6 x:testExecute_shard1_replica_n5] o.a.s.s.IndexSchema [testExecute_shard1_replica_n5] Schema name=minimal
   [junit4]   2> 1767840 INFO  (parallelCoreAdminExecutor-6166-thread-1-processing-n:127.0.0.1:47014_solr mock_trigger_name//14ef587eae5f24c0Tczkvl8fgdoi5m9ztrgpvw3fig//02699658024654521 CREATE) [n:127.0.0.1:47014_solr c:testExecute s:shard1 r:core_node6 x:testExecute_shard1_replica_n5] o.a.s.s.IndexSchema Loaded schema minimal/1.1 with uniqueid field id
   [junit4]   2> 1767840 INFO  (parallelCoreAdminExecutor-6166-thread-1-processing-n:127.0.0.1:47014_solr mock_trigger_name//14ef587eae5f24c0Tczkvl8fgdoi5m9ztrgpvw3fig//02699658024654521 CREATE) [n:127.0.0.1:47014_solr c:testExecute s:shard1 r:core_node6 x:testExecute_shard1_replica_n5] o.a.s.c.CoreContainer Creating SolrCore 'testExecute_shard1_replica_n5' using configuration from collection testExecute, trusted=true
   [junit4]   2> 1767840 INFO  (parallelCoreAdminExecutor-6166-thread-1-processing-n:127.0.0.1:47014_solr mock_trigger_name//14ef587eae5f24c0Tczkvl8fgdoi5m9ztrgpvw3fig//02699658024654521 CREATE) [n:127.0.0.1:47014_solr c:testExecute s:shard1 r:core_node6 x:testExecute_shard1_replica_n5] o.a.s.m.r.SolrJmxReporter JMX monitoring for 'solr_47014.solr.core.testExecute.shard1.replica_n5' (registry 'solr.core.testExecute.shard1.replica_n5') enabled at server: com.sun.jmx.mbeanserver.JmxMBeanServer@7f78faf8
   [junit4]   2> 1767840 INFO  (parallelCoreAdminExecutor-6166-thread-1-processing-n:127.0.0.1:47014_solr mock_trigger_name//14ef587eae5f24c0Tczkvl8fgdoi5m9ztrgpvw3fig//02699658024654521 CREATE) [n:127.0.0.1:47014_solr c:testExecute s:shard1 r:core_node6 x:testExecute_shard1_replica_n5] o.a.s.c.SolrCore solr.RecoveryStrategy.Builder
   [junit4]   2> 1767840 INFO  (parallelCoreAdminExecutor-6166-thread-1-processing-n:127.0.0.1:47014_solr mock_trigger_name//14ef587eae5f24c0Tczkvl8fgdoi5m9ztrgpvw3fig//02699658024654521 CREATE) [n:127.0.0.1:47014_solr c:testExecute s:shard1 r:core_node6 x:testExecute_shard1_replica_n5] o.a.s.c.SolrCore [[testExecute_shard1_replica_n5] ] Opening new SolrCore at [/export/home/jenkins/workspace/Lucene-Solr-7.x-Solaris/solr/build/solr-core/test/J0/temp/solr.cloud.autoscaling.ExecutePlanActionTest_7E47DCBFD04BDBC6-001/tempDir-001/node2/testExecute_shard1_replica_n5], dataDir=[/export/home/jenkins/workspace/Lucene-Solr-7.x-Solaris/solr/build/solr-core/test/J0/temp/solr.cloud.autoscaling.ExecutePlanActionTest_7E47DCBFD04BDBC6-001/tempDir-001/node2/./testExecute_shard1_replica_n5/data/]
   [junit4]   2> 1767877 INFO  (zkCallback-2273-thread-2-processing-n:127.0.0.1:47014_solr) [n:127.0.0.1:47014_solr    ] o.a.s.c.c.ZkStateReader A cluster state change: [WatchedEvent state:SyncConnected type:NodeDataChanged path:/collections/testExecute/state.json] for collection [testExecute] has occurred - updating... (live nodes size: [2])
   [junit4]   2> 1767877 INFO  (zkCallback-2273-thread-1-processing-n:127.0.0.1:47014_solr) [n:127.0.0.1:47014_solr    ] o.a.s.c.c.ZkStateReader A cluster state change: [WatchedEvent state:SyncConnected type:NodeDataChanged path:/collections/testExecute/state.json] for collection [testExecute] has occurred - updating... (live nodes size: [2])
   [junit4]   2> 1767877 INFO  (zkCallback-2272-thread-1-processing-n:127.0.0.1:61145_solr) [n:127.0.0.1:61145_solr    ] o.a.s.c.c.ZkStateReader A cluster state change: [WatchedEvent state:SyncConnected type:NodeDataChanged path:/collections/testExecute/state.json] for collection [testExecute] has occurred - updating... (live nodes size: [2])
   [junit4]   2> 1767877 INFO  (zkCallback-2272-thread-2-processing-n:127.0.0.1:61145_solr) [n:127.0.0.1:61145_solr    ] o.a.s.c.c.ZkStateReader A cluster state change: [WatchedEvent state:SyncConnected type:NodeDataChanged path:/collections/testExecute/state.json] for collection [testExecute] has occurred - updating... (live nodes size: [2])
   [junit4]   2> 1767913 INFO  (parallelCoreAdminExecutor-6166-thread-1-processing-n:127.0.0.1:47014_solr mock_trigger_name//14ef587eae5f24c0Tczkvl8fgdoi5m9ztrgpvw3fig//02699658024654521 CREATE) [n:127.0.0.1:47014_solr c:testExecute s:shard1 r:core_node6 x:testExecute_shard1_replica_n5] o.a.s.u.UpdateHandler Using UpdateLog implementation: org.apache.solr.update.UpdateLog
   [junit4]   2> 1767913 INFO  (parallelCoreAdminExecutor-6166-thread-1-processing-n:127.0.0.1:47014_solr mock_trigger_name//14ef587eae5f24c0Tczkvl8fgdoi5m9ztrgpvw3fig//02699658024654521 CREATE) [n:127.0.0.1:47014_solr c:testExecute s:shard1 r:core_node6 x:testExecute_shard1_replica_n5] o.a.s.u.UpdateLog Initializing UpdateLog: dataDir=null defaultSyncLevel=FLUSH numRecordsToKeep=100 maxNumLogsToKeep=10 numVersionBuckets=65536
   [junit4]   2> 1767914 INFO  (parallelCoreAdminExecutor-6166-thread-1-processing-n:127.0.0.1:47014_solr mock_trigger_name//14ef587eae5f24c0Tczkvl8fgdoi5m9ztrgpvw3fig//02699658024654521 CREATE) [n:127.0.0.1:47014_solr c:testExecute s:shard1 r:core_node6 x:testExecute_shard1_replica_n5] o.a.s.u.CommitTracker Hard AutoCommit: disabled
   [junit4]   2> 1767915 INFO  (parallelCoreAdminExecutor-6166-thread-1-processing-n:127.0.0.1:47014_solr mock_trigger_name//14ef587eae5f24c0Tczkvl8fgdoi5m9ztrgpvw3fig//02699658024654521 CREATE) [n:127.0.0.1:47014_solr c:testExecute s:shard1 r:core_node6 x:testExecute_shard1_replica_n5] o.a.s.u.CommitTracker Soft AutoCommit: disabled
   [junit4]   2> 1767916 INFO  (parallelCoreAdminExecutor-6166-thread-1-processing-n:127.0.0.1:47014_solr mock_trigger_name//14ef587eae5f24c0Tczkvl8fgdoi5m9ztrgpvw3fig//02699658024654521 CREATE) [n:127.0.0.1:47014_solr c:testExecute s:shard1 r:core_node6 x:testExecute_shard1_replica_n5] o.a.s.s.SolrIndexSearcher Opening [Searcher@61db57f4[testExecute_shard1_replica_n5] main]
   [junit4]   2> 1767918 INFO  (parallelCoreAdminExecutor-6166-thread-1-processing-n:127.0.0.1:47014_solr mock_trigger_name//14ef587eae5f24c0Tczkvl8fgdoi5m9ztrgpvw3fig//02699658024654521 CREATE) [n:127.0.0.1:47014_solr c:testExecute s:shard1 r:core_node6 x:testExecute_shard1_replica_n5] o.a.s.r.ManagedResourceStorage Configured ZooKeeperStorageIO with znodeBase: /configs/conf
   [junit4]   2> 1767920 INFO  (parallelCoreAdminExecutor-6166-thread-1-processing-n:127.0.0.1:47014_solr mock_trigger_name//14ef587eae5f24c0Tczkvl8fgdoi5m9ztrgpvw3fig//02699658024654521 CREATE) [n:127.0.0.1:47014_solr c:testExecute s:shard1 r:core_node6 x:testExecute_shard1_replica_n5] o.a.s.r.ManagedResourceStorage Loaded null at path _rest_managed.json using ZooKeeperStorageIO:path=/configs/conf
   [junit4]   2> 1767920 INFO  (parallelCoreAdminExecutor-6166-thread-1-processing-n:127.0.0.1:47014_solr mock_trigger_name//14ef587eae5f24c0Tczkvl8fgdoi5m9ztrgpvw3fig//02699658024654521 CREATE) [n:127.0.0.1:47014_solr c:testExecute s:shard1 r:core_node6 x:testExecute_shard1_replica_n5] o.a.s.h.ReplicationHandler Commits will be reserved for 10000ms.
   [junit4]   2> 1767920 INFO  (parallelCoreAdminExecutor-6166-thread-1-processing-n:127.0.0.1:47014_solr mock_trigger_name//14ef587eae5f24c0Tczkvl8fgdoi5m9ztrgpvw3fig//02699658024654521 CREATE) [n:127.0.0.1:47014_solr c:testExecute s:shard1 r:core_node6 x:testExecute_shard1_replica_n5] o.a.s.u.UpdateLog Could not find max version in index or recent updates, using new clock 1581799651887022080
   [junit4]   2> 1767923 INFO  (searcherExecutor-6178-thread-1-processing-x:testExecute_shard1_replica_n5 r:core_node6 mock_trigger_name//14ef587eae5f24c0Tczkvl8fgdoi5m9ztrgpvw3fig//02699658024654521 CREATE n:127.0.0.1:47014_solr s:shard1 c:testExecute) [n:127.0.0.1:47014_solr c:testExecute s:shard1 r:core_node6 x:testExecute_shard1_replica_n5] o.a.s.c.SolrCore [testExecute_shard1_replica_n5] Registered new searcher Searcher@61db57f4[testExecute_shard1_replica_n5] main{ExitableDirectoryReader(UninvertingDirectoryReader())}
   [junit4]   2> 1767924 INFO  (parallelCoreAdminExecutor-6166-thread-1-processing-n:127.0.0.1:47014_solr mock_trigger_name//14ef587eae5f24c0Tczkvl8fgdoi5m9ztrgpvw3fig//02699658024654521 CREATE) [n:127.0.0.1:47014_solr c:testExecute s:shard1 r:core_node6 x:testExecute_shard1_replica_n5] o.a.s.c.ZkController Core needs to recover:testExecute_shard1_replica_n5
   [junit4]   2> 1767925 INFO  (updateExecutor-2269-thread-1-processing-x:testExecute_shard1_replica_n5 r:core_node6 mock_trigger_name//14ef587eae5f24c0Tczkvl8fgdoi5m9ztrgpvw3fig//02699658024654521 CREATE n:127.0.0.1:47014_solr s:shard1 c:testExecute) [n:127.0.0.1:47014_solr c:testExecute s:shard1 r:core_node6 x:testExecute_shard1_replica_n5] o.a.s.u.DefaultSolrCoreState Running recovery
   [junit4]   2> 1767926 INFO  (recoveryExecutor-2270-thread-1-processing-x:testExecute_shard1_replica_n5 r:core_node6 mock_trigger_name//14ef587eae5f24c0Tczkvl8fgdoi5m9ztrgpvw3fig//02699658024654521 CREATE n:127.0.0.1:47014_solr s:shard1 c:testExecute) [n:127.0.0.1:47014_solr c:testExecute s:shard1 r:core_node6 x:testExecute_shard1_replica_n5] o.a.s.c.RecoveryStrategy Starting recovery process. recoveringAfterStartup=true
   [junit4]   2> 1767929 INFO  (recoveryExecutor-2270-thread-1-processing-x:testExecute_shard1_replica_n5 r:core_node6 mock_trigger_name//14ef587eae5f24c0Tczkvl8fgdoi5m9ztrgpvw3fig//02699658024654521 CREATE n:127.0.0.1:47014_solr s:shard1 c:testExecute) [n:127.0.0.1:47014_solr c:testExecute s:shard1 r:core_node6 x:testExecute_shard1_replica_n5] o.a.s.c.RecoveryStrategy ###### startupVersions=[[]]
   [junit4]   2> 1767929 INFO  (recoveryExecutor-2270-thread-1-processing-x:testExecute_shard1_replica_n5 r:core_node6 mock_trigger_name//14ef587eae5f24c0Tczkvl8fgdoi5m9ztrgpvw3fig//02699658024654521 CREATE n:127.0.0.1:47014_solr s:shard1 c:testExecute) [n:127.0.0.1:47014_solr c:testExecute s:shard1 r:core_node6 x:testExecute_shard1_replica_n5] o.a.s.c.RecoveryStrategy Begin buffering updates. core=[testExecute_shard1_replica_n5]
   [junit4]   2> 1767929 INFO  (recoveryExecutor-2270-thread-1-processing-x:testExecute_shard1_replica_n5 r:core_node6 mock_trigger_name//14ef587eae5f24c0Tczkvl8fgdoi5m9ztrgpvw3fig//02699658024654521 CREATE n:127.0.0.1:47014_solr s:shard1 c:testExecute) [n:127.0.0.1:47014_solr c:testExecute s:shard1 r:core_node6 x:testExecute_shard1_replica_n5] o.a.s.u.UpdateLog Starting to buffer updates. FSUpdateLog{state=ACTIVE, tlog=null}
   [junit4]   2> 1767930 INFO  (recoveryExecutor-2270-thread-1-processing-x:testExecute_shard1_replica_n5 r:core_node6 mock_trigger_name//14ef587eae5f24c0Tczkvl8fgdoi5m9ztrgpvw3fig//02699658024654521 CREATE n:127.0.0.1:47014_solr s:shard1 c:testExecute) [n:127.0.0.1:47014_solr c:testExecute s:shard1 r:core_node6 x:testExecute_shard1_replica_n5] o.a.s.c.RecoveryStrategy Publishing state of core [testExecute_shard1_replica_n5] as recovering, leader is [http://127.0.0.1:61145/solr/testExecute_shard1_replica_n2/] and I am [http://127.0.0.1:47014/solr/testExecute_shard1_replica_n5/]
   [junit4]   2> 1767934 INFO  (recoveryExecutor-2270-thread-1-processing-x:testExecute_shard1_replica_n5 r:core_node6 mock_trigger_name//14ef587eae5f24c0Tczkvl8fgdoi5m9ztrgpvw3fig//02699658024654521 CREATE n:127.0.0.1:47014_solr s:shard1 c:testExecute) [n:127.0.0.1:47014_solr c:testExecute s:shard1 r:core_node6 x:testExecute_shard1_replica_n5] o.a.s.c.RecoveryStrategy Sending prep recovery command to [http://127.0.0.1:61145/solr]; [WaitForState: action=PREPRECOVERY&core=testExecute_shard1_replica_n2&nodeName=127.0.0.1:47014_solr&coreNodeName=core_node6&state=recovering&checkLive=true&onlyIfLeader=true&onlyIfLeaderActive=true]
   [junit4]   2> 1767936 INFO  (qtp1976382143-16769) [n:127.0.0.1:61145_solr    ] o.a.s.h.a.PrepRecoveryOp Going to wait for coreNodeName: core_node6, state: recovering, checkLive: true, onlyIfLeader: true, onlyIfLeaderActive: true, maxTime: 183 s
   [junit4]   2> 1767937 INFO  (qtp1976382143-16769) [n:127.0.0.1:61145_solr    ] o.a.s.h.a.PrepRecoveryOp In WaitForState(recovering): collection=testExecute, shard=shard1, thisCore=testExecute_shard1_replica_n2, leaderDoesNotNeedRecovery=false, isLeader? true, live=true, checkLive=true, currentState=down, localState=active, nodeName=127.0.0.1:47014_solr, coreNodeName=core_node6, onlyIfActiveCheckResult=false, nodeProps: core_node6:{"core":"testExecute_shard1_replica_n5","base_url":"http://127.0.0.1:47014/solr","node_name":"127.0.0.1:47014_solr","state":"down","type":"NRT"}
   [junit4]   2> 1768036 INFO  (zkCallback-2272-thread-2-processing-n:127.0.0.1:61145_solr) [n:127.0.0.1:61145_solr    ] o.a.s.c.c.ZkStateReader A cluster state change: [WatchedEvent state:SyncConnected type:NodeDataChanged path:/collections/testExecute/state.json] for collection [testExecute] has occurred - updating... (live nodes size: [2])
   [junit4]   2> 1768036 INFO  (zkCallback-2272-thread-1-processing-n:127.0.0.1:61145_solr) [n:127.0.0.1:61145_solr    ] o.a.s.c.c.ZkStateReader A cluster state change: [WatchedEvent state:SyncConnected type:NodeDataChanged path:/collections/testExecute/state.json] for collection [testExecute] has occurred - updating... (live nodes size: [2])
   [junit4]   2> 1768036 INFO  (zkCallback-2273-thread-1-processing-n:127.0.0.1:47014_solr) [n:127.0.0.1:47014_solr    ] o.a.s.c.c.ZkStateReader A cluster state change: [WatchedEvent state:SyncConnected type:NodeDataChanged path:/collections/testExecute/state.json] for collection [testExecute] has occurred - updating... (live nodes size: [2])
   [junit4]   2> 1768036 INFO  (zkCallback-2273-thread-2-processing-n:127.0.0.1:47014_solr) [n:127.0.0.1:47014_solr    ] o.a.s.c.c.ZkStateReader A cluster state change: [WatchedEvent state:SyncConnected type:NodeDataChanged path:/collections/testExecute/state.json] for collection [testExecute] has occurred - updating... (live nodes size: [2])
   [junit4]   2> 1768774 INFO  (qtp539002003-16774) [n:127.0.0.1:47014_solr    ] o.a.s.h.a.CoreAdminOperation Checking request status for : mock_trigger_name/14ef587eae5f24c0Tczkvl8fgdoi5m9ztrgpvw3fig/02699658024654521
   [junit4]   2> 1768774 INFO  (qtp539002003-16774) [n:127.0.0.1:47014_solr    ] o.a.s.s.HttpSolrCall [admin] webapp=null path=/admin/cores params={qt=/admin/cores&requestid=mock_trigger_name/14ef587eae5f24c0Tczkvl8fgdoi5m9ztrgpvw3fig/02699658024654521&action=REQUESTSTATUS&wt=javabin&version=2} status=0 QTime=0
   [junit4]   2> 1768774 INFO  (qtp1976382143-16770) [n:127.0.0.1:61145_solr    ] o.a.s.s.HttpSolrCall [admin] webapp=null path=/admin/cores params={deleteInstanceDir=true&core=testExecute_shard1_replica_n2&async=mock_trigger_name/14ef587eae5f24c0Tczkvl8fgdoi5m9ztrgpvw3fig/02699659029202897&qt=/admin/cores&deleteDataDir=true&action=UNLOAD&wt=javabin&version=2&deleteIndex=true} status=0 QTime=0
   [junit4]   2> 1768779 INFO  (parallelCoreAdminExecutor-6164-thread-1-processing-n:127.0.0.1:61145_solr mock_trigger_name//14ef587eae5f24c0Tczkvl8fgdoi5m9ztrgpvw3fig//02699659029202897 UNLOAD) [n:127.0.0.1:61145_solr    ] o.a.s.m.SolrMetricManager Closing metric reporters for registry=solr.core.testExecute.shard1.replica_n2, tag=null
   [junit4]   2> 1768779 INFO  (parallelCoreAdminExecutor-6164-thread-1-processing-n:127.0.0.1:61145_solr mock_trigger_name//14ef587eae5f24c0Tczkvl8fgdoi5m9ztrgpvw3fig//02699659029202897 UNLOAD) [n:127.0.0.1:61145_solr    ] o.a.s.m.r.SolrJmxReporter Closing reporter [org.apache.solr.metrics.reporters.SolrJmxReporter@33f93c49: rootName = solr_61145, domain = solr.core.testExecute.shard1.replica_n2, service url = null, agent id = null] for registry solr.core.testExecute.shard1.replica_n2 / com.codahale.metrics.MetricRegistry@243c74fb
   [junit4]   2> 1768779 INFO  (qtp1976382143-16770) [n:127.0.0.1:61145_solr    ] o.a.s.h.a.CoreAdminOperation Checking request status for : mock_trigger_name/14ef587eae5f24c0Tczkvl8fgdoi5m9ztrgpvw3fig/02699659029202897
   [junit4]   2> 1768779 INFO  (qtp1976382143-16770) [n:127.0.0.1:61145_solr    ] o.a.s.s.HttpSolrCall [admin] webapp=null path=/admin/cores params={qt=/admin/cores&requestid=mock_trigger_name/14ef587eae5f24c0Tczkvl8fgdoi5m9ztrgpvw3fig/02699659029202897&action=REQUESTSTATUS&wt=javabin&version=2} status=0 QTime=0
   [junit4]   2> 1768799 INFO  (parallelCoreAdminExecutor-6164-thread-1-processing-n:127.0.0.1:61145_solr mock_trigger_name//14ef587eae5f24c0Tczkvl8fgdoi5m9ztrgpvw3fig//02699659029202897 UNLOAD) [n:127.0.0.1:61145_solr    ] o.a.s.c.SolrCore [testExecute_shard1_replica_n2]  CLOSING SolrCore org.apache.solr.core.SolrCore@7b9ac601
   [junit4]   2> 1768799 INFO  (parallelCoreAdminExecutor-6164-thread-1-processing-n:127.0.0.1:61145_solr mock_trigger_name//14ef587eae5f24c0Tczkvl8fgdoi5m9ztrgpvw3fig//02699659029202897 UNLOAD) [n:127.0.0.1:61145_solr    ] o.a.s.m.SolrMetricManager Closing metric reporters for registry=solr.core.testExecute.shard1.replica_n2, tag=2073740801
   [junit4]   2> 1768799 INFO  (parallelCoreAdminExecutor-6164-thread-1-processing-n:127.0.0.1:61145_solr mock_trigger_name//14ef587eae5f24c0Tczkvl8fgdoi5m9ztrgpvw3fig//02699659029202897 UNLOAD) [n:127.0.0.1:61145_solr    ] o.a.s.m.SolrMetricManager Closing metric reporters for registry=solr.collection.testExecute.shard1.leader, tag=2073740801
   [junit4]   2> 1768806 INFO  (zkCallback-2273-thread-2-processing-n:127.0.0.1:47014_solr) [n:127.0.0.1:47014_solr c:testExecute s:shard1 r:core_node3 x:testExecute_shard1_replica_n1] o.a.s.c.ShardLeaderElectionContext I may be the new leader - try and sync
   [junit4]   2> 1768912 INFO  (zkCallback-2273-thread-1-processing-n:127.0.0.1:47014_solr) [n:127.0.0.1:47014_solr    ] o.a.s.c.c.ZkStateReader A cluster state change: [WatchedEvent state:SyncConnected type:NodeDataChanged path:/collections/testExecute/state.json] for collection [testExecute] has occurred - updating... (live nodes size: [2])
   [junit4]   2> 1768912 INFO  (zkCallback-2273-thread-3-processing-n:127.0.0.1:47014_solr) [n:127.0.0.1:47014_solr    ] o.a.s.c.c.ZkStateReader A cluster state change: [WatchedEvent state:SyncConnected type:NodeDataChanged path:/collections/testExecute/state.json] for collection [testExecute] has occurred - updating... (live nodes size: [2])
   [junit4]   2> 1769785 INFO  (qtp1976382143-16770) [n:127.0.0.1:61145_solr    ] o.a.s.h.a.CoreAdminOperation Checking request status for : mock_trigger_name/14ef587eae5f24c0Tczkvl8fgdoi5m9ztrgpvw3fig/02699659029202897
   [junit4]   2> 1769786 INFO  (qtp1976382143-16770) [n:127.0.0.1:61145_solr    ] o.a.s.s.HttpSolrCall [admin] webapp=null path=/admin/cores params={qt=/admin/cores&requestid=mock_trigger_name/14ef587eae5f24c0Tczkvl8fgdoi5m9ztrgpvw3fig/02699659029202897&action=REQUESTSTATUS&wt=javabin&version=2} status=0 QTime=0
   [junit4]   2> 1769899 INFO  (OverseerThreadFactory-6163-thread-2-processing-n:127.0.0.1:61145_solr) [n:127.0.0.1:61145_solr    ] o.a.s.c.OverseerTaskQueue Response ZK path: /overseer/collection-queue-work/qnr-0000000002 doesn't exist.  Requestor may have disconnected from ZooKeeper
   [junit4]   2> 1771306 INFO  (zkCallback-2273-thread-2-processing-n:127.0.0.1:47014_solr) [n:127.0.0.1:47014_solr c:testExecute s:shard1 r:core_node3 x:testExecute_shard1_replica_n1] o.a.s.c.SyncStrategy Sync replicas to http://127.0.0.1:47014/solr/testExecute_shard1_replica_n1/
   [junit4]   2> 1771307 INFO  (zkCallback-2273-thread-2-processing-n:127.0.0.1:47014_solr) [n:127.0.0.1:47014_solr c:testExecute s:shard1 r:core_node3 x:testExecute_shard1_replica_n1] o.a.s.u.PeerSync PeerSync: core=testExecute_shard1_replica_n1 url=http://127.0.0.1:47014/solr START replicas=[http://127.0.0.1:47014/solr/testExecute_shard1_replica_n5/] nUpdates=100
   [junit4]   2> 1771308 INFO  (qtp539002003-16784) [n:127.0.0.1:47014_solr c:testExecute s:shard1 r:core_node6 x:testExecute_shard1_replica_n5] o.a.s.c.S.Request [testExecute_shard1_replica_n5]  webapp=/solr path=/get params={distrib=false&qt=/get&fingerprint=false&getVersions=100&wt=javabin&version=2} status=0 QTime=0
   [junit4]   2> 1771565 INFO  (OverseerCollectionConfigSetProcessor-98862477912637445-127.0.0.1:61145_solr-n_0000000000) [n:127.0.0.1:61145_solr    ] o.a.s.c.OverseerTaskQueue Response ZK path: /overseer/collection-queue-work/qnr-0000000002 doesn't exist.  Requestor may have disconnected from ZooKeeper
   [junit4]   2> 1771608 INFO  (zkCallback-2273-thread-2-processing-n:127.0.0.1:47014_solr) [n:127.0.0.1:47014_solr c:testExecute s:shard1 r:core_node3 x:testExecute_shard1_replica_n1] o.a.s.u.PeerSync PeerSync: core=testExecute_shard1_replica_n1 url=http://127.0.0.1:47014/solr DONE.  We have no versions.  sync failed.
   [junit4]   2> 1771608 INFO  (zkCallback-2273-thread-2-processing-n:127.0.0.1:47014_solr) [n:127.0.0.1:47014_solr c:testExecute s:shard1 r:core_node3 x:testExecute_shard1_replica_n1] o.a.s.c.SyncStrategy Leader's attempt to sync with shard failed, moving to the next candidate
   [junit4]   2> 1771608 INFO  (zkCallback-2273-thread-2-processing-n:127.0.0.1:47014_solr) [n:127.0.0.1:47014_solr c:testExecute s:shard1 r:core_node3 x:testExecute_shard1_replica_n1] o.a.s.c.ShardLeaderElectionContext We failed sync, but we have no versions - we can't sync in that case - we were active before, so become leader anyway
   [junit4]   2> 1771612 INFO  (zkCallback-2273-thread-2-processing-n:127.0.0.1:47014_solr) [n:127.0.0.1:47014_solr c:testExecute s:shard1 r:core_node3 x:testExecute_shard1_replica_n1] o.a.s.c.ShardLeaderElectionContext I am the new leader: http://127.0.0.1:47014/solr/testExecute_shard1_replica_n1/ shard1
   [junit4]   2> 1771613 INFO  (zkCallback-2273-thread-1-processing-n:127.0.0.1:47014_solr) [n:127.0.0.1:47014_solr    ] o.a.s.c.c.ZkStateReader A cluster state change: [WatchedEvent state:SyncConnected type:NodeDataChanged path:/collections/testExecute/state.json] for collection [testExecute] has occurred - updating... (live nodes size: [2])
   [junit4]   2> 1771613 INFO  (zkCallback-2273-thread-2-processing-n:127.0.0.1:47014_solr) [n:127.0.0.1:47014_solr    ] o.a.s.c.c.ZkStateReader A cluster state change: [WatchedEvent state:SyncConnected type:NodeDataChanged path:/collections/testExecute/state.json] for collection [testExecute] has occurred - updating... (live nodes size: [2])
   [junit4]   2> 1772560 INFO  (qtp539002003-16780) [n:127.0.0.1:47014_solr    ] o.a.s.h.a.CollectionsHandler Invoked Collection Action :requeststatus with params requestid=mock_trigger_name/14ef587eae5f24c0Tczkvl8fgdoi5m9ztrgpvw3fig/0&action=REQUESTSTATUS&wt=javabin&version=2 and sendToOCPQueue=true
   [junit4]   2> 1772561 INFO  (qtp539002003-16780) [n:127.0.0.1:47014_solr    ] o.a.s.s.HttpSolrCall [admin] webapp=null path=/admin/collections params={requestid=mock_trigger_name/14ef587eae5f24c0Tczkvl8fgdoi5m9ztrgpvw3fig/0&action=REQUESTSTATUS&wt=javabin&version=2} status=0 QTime=1
   [junit4]   2> 1772562 INFO  (TEST-ExecutePlanActionTest.testExecute-seed#[7E47DCBFD04BDBC6]) [    ] o.a.s.c.a.ExecutePlanAction Task with requestId=mock_trigger_name/14ef587eae5f24c0Tczkvl8fgdoi5m9ztrgpvw3fig/0 finished with state=COMPLETED in 5s
   [junit4]   2> 1772562 INFO  (qtp539002003-16776) [n:127.0.0.1:47014_solr    ] o.a.s.h.a.CollectionsHandler Invoked Collection Action :deletestatus with params requestid=mock_trigger_name/14ef587eae5f24c0Tczkvl8fgdoi5m9ztrgpvw3fig/0&action=DELETESTATUS&wt=javabin&version=2 and sendToOCPQueue=true
   [junit4]   2> 1772563 INFO  (qtp539002003-16776) [n:127.0.0.1:47014_solr    ] o.a.s.s.HttpSolrCall [admin] webapp=null path=/admin/collections params={requestid=mock_trigger_name/14ef587eae5f24c0Tczkvl8fgdoi5m9ztrgpvw3fig/0&action=DELETESTATUS&wt=javabin&version=2} status=0 QTime=0
   [junit4]   2> 1772564 INFO  (TEST-ExecutePlanActionTest.testExecute-seed#[7E47DCBFD04BDBC6]) [    ] o.a.s.c.a.ExecutePlanAction Executing operation: action=OVERSEERSTATUS
   [junit4]   2> 1772567 DEBUG (TEST-ExecutePlanActionTest.testExecute-seed#[7E47DCBFD04BDBC6]) [    ] o.a.s.c.a.ExecutePlanAction Saved requestId: mock_trigger_name/14ef587eae5f24c0Tczkvl8fgdoi5m9ztrgpvw3fig/0 in znode: /autoscaling/triggerState/mock_trigger_name/execute_plan/op-0000000001
   [junit4]   2> 1772568 INFO  (qtp539002003-16773) [n:127.0.0.1:47014_solr    ] o.a.s.h.a.CollectionsHandler Invoked Collection Action :overseerstatus with params async=mock_trigger_name/14ef587eae5f24c0Tczkvl8fgdoi5m9ztrgpvw3fig/0&action=OVERSEERSTATUS&wt=javabin&version=2 and sendToOCPQueue=true
   [junit4]   2> 1772570 INFO  (qtp539002003-16773) [n:127.0.0.1:47014_solr    ] o.a.s.s.HttpSolrCall [admin] webapp=null path=/admin/collections params={async=mock_trigger_name/14ef587eae5f24c0Tczkvl8fgdoi5m9ztrgpvw3fig/0&action=OVERSEERSTATUS&wt=javabin&version=2} status=0 QTime=2
   [junit4]   2> 1772571 INFO  (qtp539002003-16785) [n:127.0.0.1:47014_solr    ] o.a.s.h.a.CollectionsHandler Invoked Collection Action :requeststatus with params requestid=mock_trigger_name/14ef587eae5f24c0Tczkvl8fgdoi5m9ztrgpvw3fig/0&action=REQUESTSTATUS&wt=javabin&version=2 and sendToOCPQueue=true
   [junit4]   2> 1772573 INFO  (qtp539002003-16785) [n:127.0.0.1:47014_solr    ] o.a.s.s.HttpSolrCall [admin] webapp=null path=/admin/collections params={requestid=mock_trigger_name/14ef587eae5f24c0Tczkvl8fgdoi5m9ztrgpvw3fig/0&action=REQUESTSTATUS&wt=javabin&version=2} status=0 QTime=1
   [junit4]   2> 1772582 INFO  (OverseerThreadFactory-6163-thread-3-processing-n:127.0.0.1:61145_solr) [n:127.0.0.1:61145_solr    ] o.a.s.c.OverseerTaskQueue Response ZK path: /overseer/collection-queue-work/qnr-0000000003 doesn't exist.  Requestor may have disconnected from ZooKeeper
   [junit4]   2> 1774577 INFO  (OverseerCollectionConfigSetProcessor-98862477912637445-127.0.0.1:61145_solr-n_0000000000) [n:127.0.0.1:61145_solr    ] o.a.s.c.OverseerTaskQueue Response ZK path: /overseer/collection-queue-work/qnr-0000000003 doesn't exist.  Requestor may have disconnected from ZooKeeper
   [junit4]   2> 1777576 INFO  (qtp539002003-16778) [n:127.0.0.1:47014_solr    ] o.a.s.h.a.CollectionsHandler Invoked Collection Action :requeststatus with params requestid=mock_trigger_name/14ef587eae5f24c0Tczkvl8fgdoi5m9ztrgpvw3fig/0&action=REQUESTSTATUS&wt=javabin&version=2 and sendToOCPQueue=true
   [junit4]   2> 1777578 INFO  (qtp539002003-16778) [n:127.0.0.1:47014_solr    ] o.a.s.s.HttpSolrCall [admin] webapp=null path=/admin/collections params={requestid=mock_trigger_name/14ef587eae5f24c0Tczkvl8fgdoi5m9ztrgpvw3fig/0&action=REQUESTSTATUS&wt=javabin&version=2} status=0 QTime=1
   [junit4]   2> 1777578 INFO  (TEST-ExecutePlanActionTest.testExecute-seed#[7E47DCBFD04BDBC6]) [    ] o.a.s.c.a.ExecutePlanAction Task with requestId=mock_trigger_name/14ef587eae5f24c0Tczkvl8fgdoi5m9ztrgpvw3fig/0 finished with state=COMPLETED in 5s
   [junit4]   2> 1777578 INFO  (qtp539002003-16786) [n:127.0.0.1:47014_solr    ] o.a.s.h.a.CollectionsHandler Invoked Collection Action :deletestatus with params requestid=mock_trigger_name/14ef587eae5f24c0Tczkvl8fgdoi5m9ztrgpvw3fig/0&action=DELETESTATUS&wt=javabin&version=2 and sendToOCPQueue=true
   [junit4]   2> 1777579 INFO  (qtp539002003-16786) [n:127.0.0.1:47014_solr    ] o.a.s.s.HttpSolrCall [admin] webapp=null path=/admin/collections params={requestid=mock_trigger_name/14ef587eae5f24c0Tczkvl8fgdoi5m9ztrgpvw3fig/0&action=DELETESTATUS&wt=javabin&version=2} status=0 QTime=0
   [junit4]   2> 1797979 ERROR (qtp1976382143-16769) [n:127.0.0.1:61145_solr    ] o.a.s.h.RequestHandlerBase org.apache.solr.common.SolrException: core not found:testExecute_shard1_replica_n2
   [junit4]   2> 	at org.apache.solr.handler.admin.PrepRecoveryOp.execute(PrepRecoveryOp.java:75)
   [junit4]   2> 	at org.apache.solr.handler.admin.CoreAdminOperation.execute(CoreAdminOperation.java:384)
   [junit4]   2> 	at org.apache.solr.handler.admin.CoreAdminHandler$CallInfo.call(CoreAdminHandler.java:389)
   [junit4]   2> 	at org.apache.solr.handler.admin.CoreAdminHandler.handleRequestBody(CoreAdminHandler.java:174)
   [junit4]   2> 	at org.apache.solr.handler.RequestHandlerBase.handleRequest(RequestHandlerBase.java:177)
   [junit4]   2> 	at org.apache.solr.servlet.HttpSolrCall.handleAdmin(HttpSolrCall.java:735)
   [junit4]   2> 	at org.apache.solr.servlet.HttpSolrCall.handleAdminRequest(HttpSolrCall.java:716)
   [junit4]   2> 	at org.apache.solr.servlet.HttpSolrCall.call(HttpSolrCall.java:497)
   [junit4]   2> 	at org.apache.solr.servlet.SolrDispatchFilter.doFilter(SolrDispatchFilter.java:382)
   [junit4]   2> 	at org.apache.solr.servlet.SolrDispatchFilter.doFilter(SolrDispatchFilter.java:326)
   [junit4]   2> 	at org.eclipse.jetty.servlet.ServletHandler$CachedChain.doFilter(ServletHandler.java:1759)
   [junit4]   2> 	at org.apache.solr.client.solrj.embedded.JettySolrRunner$DebugFilter.doFilter(JettySolrRunner.java:139)
   [junit4]   2> 	at org.eclipse.jetty.servlet.ServletHandler$CachedChain.doFilter(ServletHandler.java:1759)
   [junit4]   2> 	at org.eclipse.jetty.servlet.ServletHandler.doHandle(ServletHandler.java:582)
   [junit4]   2> 	at org.eclipse.jetty.server.session.SessionHandler.doHandle(SessionHandler.java:224)
   [junit4]   2> 	at org.eclipse.jetty.server.handler.ContextHandler.doHandle(ContextHandler.java:1180)
   [junit4]   2> 	at org.eclipse.jetty.servlet.ServletHandler.doScope(ServletHandler.java:512)
   [junit4]   2> 	at org.eclipse.jetty.server.session.SessionHandler.doScope(SessionHandler.java:185)
   [junit4]   2> 	at org.eclipse.jetty.server.handler.ContextHandler.doScope(ContextHandler.java:1112)
   [junit4]   2> 	at org.eclipse.jetty.server.handler.ScopedHandler.handle(ScopedHandler.java:141)
   [junit4]   2> 	at org.eclipse.jetty.server.handler.gzip.GzipHandler.handle(GzipHandler.java:493)
   [junit4]   2> 	at org.eclipse.jetty.server.handler.HandlerWrapper.handle(HandlerWrapper.java:134)
   [junit4]   2> 	at org.eclipse.jetty.server.Server.handle(Server.java:534)
   [junit4]   2> 	at org.eclipse.jetty.server.HttpChannel.handle(HttpChannel.java:320)
   [junit4]   2> 	at org.eclipse.jetty.server.HttpConnection.onFillable(HttpConnection.java:251)
   [junit4]   2> 	at org.eclipse.jetty.io.AbstractConnection$ReadCallback.succeeded(AbstractConnection.java:283)
   [junit4]   2> 	at org.eclipse.jetty.io.FillInterest.fillable(FillInterest.java:108)
   [junit4]   2> 	at org.eclipse.jetty.io.SelectChannelEndPoint$2.run(SelectChannelEndPoint.java:93)
   [junit4]   2> 	at org.eclipse.jetty.util.thread.strategy.ExecuteProduceConsume.executeProduceConsume(ExecuteProduceConsume.java:303)
   [junit4]   2> 	at org.eclipse.jetty.util.thread.strategy.ExecuteProduceConsume.produceConsume(ExecuteProduceConsume.java:148)
   [junit4]   2> 	at org.eclipse.jetty.util.thread.strategy.ExecuteProduceConsume.run(ExecuteProduceConsume.java:136)
   [junit4]   2> 	at org.eclipse.jetty.util.thread.QueuedThreadPool.runJob(QueuedThreadPool.java:671)
   [junit4]   2> 	at org.eclipse.jetty.util.thread.QueuedThreadPool$2.run(QueuedThreadPool.java:589)
   [junit4]   2> 	at java.lang.Thread.run(Thread.java:748)
   [junit4]   2> 
   [junit4]   2> 1797979 INFO  (qtp1976382143-16769) [n:127.0.0.1:61145_solr    ] o.a.s.s.HttpSolrCall [admin] webapp=null path=/admin/cores params={nodeName=127.0.0.1:47014_solr&onlyIfLeaderActive=true&core=testExecute_shard1_replica_n2&coreNodeName=core_node6&action=PREPRECOVERY&checkLive=true&state=recovering&onlyIfLeader=true&wt=javabin&version=2} status=400 QTime=30049
   [junit4]   2> 1797980 ERROR (recoveryExecutor-2270-thread-1-processing-x:testExecute_shard1_replica_n5 r:core_node6 mock_trigger_name//14ef587eae5f24c0Tczkvl8fgdoi5m9ztrgpvw3fig//02699658024654521 CREATE n:127.0.0.1:47014_solr s:shard1 c:testExecute) [n:127.0.0.1:47014_solr c:testExecute s:shard1 r:core_node6 x:testExecute_shard1_replica_n5] o.a.s.c.RecoveryStrategy Error while trying to recover. core=testExecute_shard1_replica_n5:java.util.concurrent.ExecutionException: org.apache.solr.client.solrj.impl.HttpSolrClient$RemoteSolrException: Error from server at http://127.0.0.1:61145/solr: core not found:testExecute_shard1_replica_n2
   [junit4]   2> 	at java.util.concurrent.FutureTask.report(FutureTask.java:122)
   [junit4]   2> 	at java.util.concurrent.FutureTask.get(FutureTask.java:192)
   [junit4]   2> 	at org.apache.solr.cloud.RecoveryStrategy.sendPrepRecoveryCmd(RecoveryStrategy.java:825)
   [junit4]   2> 	at org.apache.solr.cloud.RecoveryStrategy.doSyncOrReplicateRecovery(RecoveryStrategy.java:562)
   [junit4]   2> 	at org.apache.solr.cloud.RecoveryStrategy.doRecovery(RecoveryStrategy.java:302)
   [junit4]   2> 	at org.apache.solr.cloud.RecoveryStrategy.run(RecoveryStrategy.java:286)
   [junit4]   2> 	at com.codahale.metrics.InstrumentedExecutorService$InstrumentedRunnable.run(InstrumentedExecutorService.java:176)
   [junit4]   2> 	at java.util.concurrent.Executors$RunnableAdapter.call(Executors.java:511)
   [junit4]   2> 	at java.util.concurrent.FutureTask.run(FutureTask.java:266)
   [junit4]   2> 	at org.apache.solr.common.util.ExecutorUtil$MDCAwareThreadPoolExecutor.lambda$execute$0(ExecutorUtil.java:188)
   [junit4]   2> 	at java.util.concurrent.ThreadPoolExecutor.runWorker(ThreadPoolExecutor.java:1149)
   [junit4]   2> 	at java.util.concurrent.ThreadPoolExecutor$Worker.run(ThreadPoolExecutor.java:624)
   [junit4]   2> 	at java.lang.Thread.run(Thread.java:748)
   [junit4]   2> Caused by: org.apache.solr.client.solrj.impl.HttpSolrClient$RemoteSolrException: Error from server at http://127.0.0.1:61145/solr: core not found:testExecute_shard1_replica_n2
   [junit4]   2> 	at org.apache.solr.client.solrj.impl.HttpSolrClient.executeMethod(HttpSolrClient.java:626)
   [junit4]   2> 	at org.apache.solr.client.solrj.impl.HttpSolrClient.lambda$httpUriRequest$0(HttpSolrClient.java:297)
   [junit4]   2> 	... 5 more
   [junit4]   2> 
   [junit4]   2> 1797980 INFO  (recoveryExecutor-2270-thread-1-processing-x:testExecute_shard1_replica_n5 r:core_node6 mock_trigger_name//14ef587eae5f24c0Tczkvl8fgdoi5m9ztrgpvw3fig//02699658024654521 CREATE n:127.0.0.1:47014_solr s:shard1 c:testExecute) [n:127.0.0.1:47014_solr c:testExecute s:shard1 r:core_node6 x:testExecute_shard1_replica_n5] o.a.s.c.RecoveryStrategy Replay not started, or was not successful... still buffering updates.
   [junit4]   2> 1797980 ERROR (recoveryExecutor-2270-thread-1-processing-x:testExecute_shard1_replica_n5 r:core_node6 mock_trigger_name//14ef587eae5f24c0Tczkvl8fgdoi5m9ztrgpvw3fig//02699658024654521 CREATE n:127.0.0.1:47014_solr s:shard1 c:testExecute) [n:127.0.0.1:47014_solr c:testExecute s:shard1 r:core_node6 x:testExecute_shard1_replica_n5] o.a.s.c.RecoveryStrategy Recovery failed - trying again... (0)
   [junit4]   2> 1797980 INFO  (recoveryExecutor-2270-thread-1-processing-x:testExecute_shard1_replica_n5 r:core_node6 mock_trigger_name//14ef587eae5f24c0Tczkvl8fgdoi5m9ztrgpvw3fig//02699658024654521 CREATE n:127.0.0.1:47014_solr s:shard1 c:testExecute) [n:127.0.0.1:47014_solr c:testExecute s:shard1 r:core_node6 x:testExecute_shard1_replica_n5] o.a.s.c.RecoveryStrategy Wait [2.0] seconds before trying to recover again (attempt=1)
   [junit4]   2> 1807981 INFO  (recoveryExecutor-2270-thread-1-processing-x:testExecute_shard1_replica_n5 r:core_node6 mock_trigger_name//14ef587eae5f24c0Tczkvl8fgdoi5m9ztrgpvw3fig//02699658024654521 CREATE n:127.0.0.1:47014_solr s:shard1 c:testExecute) [n:127.0.0.1:47014_solr c:testExecute s:shard1 r:core_node6 x:testExecute_shard1_replica_n5] o.a.s.c.RecoveryStrategy Begin buffering updates. core=[testExecute_shard1_replica_n5]
   [junit4]   2> 1807981 INFO  (recoveryExecutor-2270-thread-1-processing-x:testExecute_shard1_replica_n5 r:core_node6 mock_trigger_name//14ef587eae5f24c0Tczkvl8fgdoi5m9ztrgpvw3fig//02699658024654521 CREATE n:127.0.0.1:47014_solr s:shard1 c:testExecute) [n:127.0.0.1:47014_solr c:testExecute s:shard1 r:core_node6 x:testExecute_shard1_replica_n5] o.a.s.u.UpdateLog Restarting buffering. previous=RecoveryInfo{adds=0 deletes=0 deleteByQuery=0 errors=0 positionOfStart=0}
   [junit4]   2> 1807981 INFO  (recoveryExecutor-2270-thread-1-processing-x:testExecute_shard1_replica_n5 r:core_node6 mock_trigger_name//14ef587eae5f24c0Tczkvl8fgdoi5m9ztrgpvw3fig//02699658024654521 CREATE n:127.0.0.1:47014_solr s:shard1 c:testExecute) [n:127.0.0.1:47014_solr c:testExecute s:shard1 r:core_node6 x:testExecute_shard1_replica_n5] o.a.s.u.UpdateLog Starting to buffer updates. FSUpdateLog{state=BUFFERING, tlog=null}
   [junit4]   2> 1807981 INFO  (recoveryExecutor-2270-thread-1-processing-x:testExecute_shard1_replica_n5 r:core_node6 mock_trigger_name//14ef587eae5f24c0Tczkvl8fgdoi5m9ztrgpvw3fig//02699658024654521 CREATE n:127.0.0.1:47014_solr s:shard1 c:testExecute) [n:127.0.0.1:47014_solr c:testExecute s:shard1 r:core_node6 x:testExecute_shard1_replica_n5] o.a.s.c.RecoveryStrategy Publishing state of core [testExecute_shard1_replica_n5] as recovering, leader is [http://127.0.0.1:47014/solr/testExecute_shard1_replica_n1/] and I am [http://127.0.0.1:47014/solr/testExecute_shard1_replica_n5/]
   [junit4]   2> 1807983 INFO  (recoveryExecutor-2270-thread-1-processing-x:testExecute_shard1_replica_n5 r:core_node6 mock_trigger_name//14ef587eae5f24c0Tczkvl8fgdoi5m9ztrgpv

[...truncated too long message...]

 r:core_node4 x:collection1_collection_shard2_replica_n2] o.a.s.m.r.SolrJmxReporter Closing reporter [org.apache.solr.metrics.reporters.SolrJmxReporter@33753f53: rootName = solr_61507, domain = solr.core.collection1_collection.shard2.replica_n2, service url = null, agent id = null] for registry solr.core.collection1_collection.shard2.replica_n2 / com.codahale.metrics.MetricRegistry@6d0f1c2f
   [junit4]   2> 113185 WARN  (NIOServerCxn.Factory:0.0.0.0/0.0.0.0:0) [    ] o.a.z.s.NIOServerCnxn caught end of stream exception
   [junit4]   2> EndOfStreamException: Unable to read additional data from client sessionid 0x15f3b0f17690056, likely client has closed socket
   [junit4]   2> 	at org.apache.zookeeper.server.NIOServerCnxn.doIO(NIOServerCnxn.java:239)
   [junit4]   2> 	at org.apache.zookeeper.server.NIOServerCnxnFactory.run(NIOServerCnxnFactory.java:203)
   [junit4]   2> 	at java.lang.Thread.run(Thread.java:748)
   [junit4]   2> 113190 INFO  (coreCloseExecutor-251-thread-1) [n:127.0.0.1:61507_solr c:collection1_collection s:shard2 r:core_node4 x:collection1_collection_shard2_replica_n2] o.a.s.m.SolrMetricManager Closing metric reporters for registry=solr.collection.collection1_collection.shard2.leader, tag=1526777118
   [junit4]   2> 113198 INFO  (jetty-closer-61-thread-2) [    ] o.a.s.c.Overseer Overseer (id=98862652828745738-127.0.0.1:61507_solr-n_0000000000) closing
   [junit4]   2> 113198 INFO  (OverseerStateUpdate-98862652828745738-127.0.0.1:61507_solr-n_0000000000) [n:127.0.0.1:61507_solr    ] o.a.s.c.Overseer Overseer Loop exiting : 127.0.0.1:61507_solr
   [junit4]   2> 113199 WARN  (OverseerAutoScalingTriggerThread-98862652828745738-127.0.0.1:61507_solr-n_0000000000) [n:127.0.0.1:61507_solr    ] o.a.s.c.a.OverseerTriggerThread OverseerTriggerThread woken up but we are closed, exiting.
   [junit4]   2> 113202 INFO  (jetty-closer-61-thread-3) [    ] o.e.j.s.h.ContextHandler Stopped o.e.j.s.ServletContextHandler@1808fce0{/solr,null,UNAVAILABLE}
   [junit4]   2> 113205 INFO  (jetty-closer-61-thread-2) [    ] o.e.j.s.h.ContextHandler Stopped o.e.j.s.ServletContextHandler@268acbaa{/solr,null,UNAVAILABLE}
   [junit4]   2> 114646 WARN  (zkCallback-82-thread-2-processing-n:127.0.0.1:47182_solr) [n:127.0.0.1:47182_solr    ] o.a.s.c.ZkController Unable to register nodeLost path for 127.0.0.1:47182_solr
   [junit4]   2> org.apache.zookeeper.KeeperException$SessionExpiredException: KeeperErrorCode = Session expired for /autoscaling/nodeLost/127.0.0.1:47182_solr
   [junit4]   2> 	at org.apache.zookeeper.KeeperException.create(KeeperException.java:127)
   [junit4]   2> 	at org.apache.zookeeper.KeeperException.create(KeeperException.java:51)
   [junit4]   2> 	at org.apache.zookeeper.ZooKeeper.create(ZooKeeper.java:783)
   [junit4]   2> 	at org.apache.solr.common.cloud.SolrZkClient$9.execute(SolrZkClient.java:392)
   [junit4]   2> 	at org.apache.solr.common.cloud.SolrZkClient$9.execute(SolrZkClient.java:389)
   [junit4]   2> 	at org.apache.solr.common.cloud.ZkCmdExecutor.retryOperation(ZkCmdExecutor.java:60)
   [junit4]   2> 	at org.apache.solr.common.cloud.SolrZkClient.create(SolrZkClient.java:389)
   [junit4]   2> 	at org.apache.solr.cloud.ZkController.lambda$registerLiveNodesListener$2(ZkController.java:879)
   [junit4]   2> 	at org.apache.solr.common.cloud.ZkStateReader.lambda$refreshLiveNodes$1(ZkStateReader.java:749)
   [junit4]   2> 	at java.util.concurrent.ConcurrentHashMap$KeySetView.forEach(ConcurrentHashMap.java:4649)
   [junit4]   2> 	at org.apache.solr.common.cloud.ZkStateReader.refreshLiveNodes(ZkStateReader.java:748)
   [junit4]   2> 	at org.apache.solr.common.cloud.ZkStateReader.access$1000(ZkStateReader.java:72)
   [junit4]   2> 	at org.apache.solr.common.cloud.ZkStateReader$LiveNodeWatcher.refreshAndWatch(ZkStateReader.java:1154)
   [junit4]   2> 	at org.apache.solr.common.cloud.ZkStateReader$LiveNodeWatcher.process(ZkStateReader.java:1149)
   [junit4]   2> 	at org.apache.solr.common.cloud.SolrZkClient$3.lambda$process$0(SolrZkClient.java:269)
   [junit4]   2> 	at java.util.concurrent.Executors$RunnableAdapter.call(Executors.java:511)
   [junit4]   2> 	at java.util.concurrent.FutureTask.run(FutureTask.java:266)
   [junit4]   2> 	at org.apache.solr.common.util.ExecutorUtil$MDCAwareThreadPoolExecutor.lambda$execute$0(ExecutorUtil.java:188)
   [junit4]   2> 	at java.util.concurrent.ThreadPoolExecutor.runWorker(ThreadPoolExecutor.java:1149)
   [junit4]   2> 	at java.util.concurrent.ThreadPoolExecutor$Worker.run(ThreadPoolExecutor.java:624)
   [junit4]   2> 	at java.lang.Thread.run(Thread.java:748)
   [junit4]   2> 114647 INFO  (jetty-closer-61-thread-4) [    ] o.e.j.s.h.ContextHandler Stopped o.e.j.s.ServletContextHandler@62a7b37b{/solr,null,UNAVAILABLE}
   [junit4]   2> 114649 ERROR (SUITE-StreamExpressionTest-seed#[F9A1A517F32841AC]-worker) [    ] o.a.z.s.ZooKeeperServer ZKShutdownHandler is not registered, so ZooKeeper server won't take any action on ERROR or SHUTDOWN server state changes
   [junit4]   2> 114650 INFO  (SUITE-StreamExpressionTest-seed#[F9A1A517F32841AC]-worker) [    ] o.a.s.c.ZkTestServer connecting to 127.0.0.1:46678 46678
   [junit4]   2> 121072 WARN  (NIOServerCxn.Factory:0.0.0.0/0.0.0.0:0) [    ] o.a.z.s.NIOServerCnxnFactory Ignoring unexpected runtime exception
   [junit4]   2> java.nio.channels.CancelledKeyException
   [junit4]   2> 	at sun.nio.ch.SelectionKeyImpl.ensureValid(SelectionKeyImpl.java:73)
   [junit4]   2> 	at sun.nio.ch.SelectionKeyImpl.readyOps(SelectionKeyImpl.java:87)
   [junit4]   2> 	at org.apache.zookeeper.server.NIOServerCnxnFactory.run(NIOServerCnxnFactory.java:182)
   [junit4]   2> 	at java.lang.Thread.run(Thread.java:748)
   [junit4]   2> 121076 INFO  (Thread-44) [    ] o.a.s.c.ZkTestServer connecting to 127.0.0.1:46678 46678
   [junit4]   2> 121080 WARN  (Thread-44) [    ] o.a.s.c.ZkTestServer Watch limit violations: 
   [junit4]   2> Maximum concurrent create/delete watches above limit:
   [junit4]   2> 
   [junit4]   2> 	80	/solr/aliases.json
   [junit4]   2> 	80	/solr/clusterprops.json
   [junit4]   2> 	14	/solr/configs/conf
   [junit4]   2> 	4	/solr/security.json
   [junit4]   2> 
   [junit4]   2> Maximum concurrent data watches above limit:
   [junit4]   2> 
   [junit4]   2> 	80	/solr/clusterstate.json
   [junit4]   2> 	20	/solr/collections/parallelDestinationCollection/state.json
   [junit4]   2> 	20	/solr/collections/destinationCollection/state.json
   [junit4]   2> 	18	/solr/collections/parallelDestinationCollection1/state.json
   [junit4]   2> 	10	/solr/collections/mainCorpus1/state.json
   [junit4]   2> 	10	/solr/collections/destination/state.json
   [junit4]   2> 	10	/solr/collections/destination1/state.json
   [junit4]   2> 	10	/solr/collections/collection1_collection/state.json
   [junit4]   2> 	10	/solr/collections/workQueue1/state.json
   [junit4]   2> 	10	/solr/collections/workQueue/state.json
   [junit4]   2> 	10	/solr/collections/mainCorpus/state.json
   [junit4]   2> 	2	/solr/overseer_elect/election/98862652828745738-127.0.0.1:61507_solr-n_0000000000
   [junit4]   2> 
   [junit4]   2> Maximum concurrent children watches above limit:
   [junit4]   2> 
   [junit4]   2> 	80	/solr/live_nodes
   [junit4]   2> 	80	/solr/collections
   [junit4]   2> 
   [junit4]   2> NOTE: leaving temporary files on disk at: /export/home/jenkins/workspace/Lucene-Solr-7.x-Solaris/solr/build/solr-solrj/test/J0/temp/solr.client.solrj.io.stream.StreamExpressionTest_F9A1A517F32841AC-001
   [junit4]   2> NOTE: test params are: codec=Asserting(Lucene70): {expr_s=BlockTreeOrds(blocksize=128), join2_s=PostingsFormat(name=LuceneFixedGap), multiDefault=PostingsFormat(name=LuceneFixedGap), subject=PostingsFormat(name=LuceneFixedGap), a1_s=PostingsFormat(name=LuceneFixedGap), a2_s=PostingsFormat(name=Direct), test_t=PostingsFormat(name=Direct), level1_s=BlockTreeOrds(blocksize=128), body_t=PostingsFormat(name=Direct), ident_s=PostingsFormat(name=LuceneFixedGap), s_multi=PostingsFormat(name=Direct), col_s=PostingsFormat(name=LuceneFixedGap), level2_s=PostingsFormat(name=Memory), a_ss=PostingsFormat(name=Memory), a_s=PostingsFormat(name=Direct), a_t=PostingsFormat(name=Memory), side_s=PostingsFormat(name=Direct), id=BlockTreeOrds(blocksize=128), text=PostingsFormat(name=Direct)}, docValues:{expr_s=DocValuesFormat(name=Lucene70), join2_s=DocValuesFormat(name=Memory), multiDefault=DocValuesFormat(name=Memory), price_f=DocValuesFormat(name=Memory), a1_s=DocValuesFormat(name=Memory), intDefault=DocValuesFormat(name=Direct), a_f=DocValuesFormat(name=Memory), join1_i=DocValuesFormat(name=Lucene70), a2_s=DocValuesFormat(name=Lucene70), a_i=DocValuesFormat(name=Lucene70), test_i=DocValuesFormat(name=Memory), join3_i=DocValuesFormat(name=Lucene70), field_i=DocValuesFormat(name=Memory), level1_s=DocValuesFormat(name=Lucene70), s_multi=DocValuesFormat(name=Lucene70), col_s=DocValuesFormat(name=Memory), level2_s=DocValuesFormat(name=Direct), a_ss=DocValuesFormat(name=Direct), a_s=DocValuesFormat(name=Lucene70), id=DocValuesFormat(name=Lucene70), timestamp=DocValuesFormat(name=Direct), i_multi=DocValuesFormat(name=Lucene70), b_ls=DocValuesFormat(name=Memory), test_dt=DocValuesFormat(name=Lucene70), ident_s=DocValuesFormat(name=Memory), order_i=DocValuesFormat(name=Memory), _version_=DocValuesFormat(name=Direct), side_s=DocValuesFormat(name=Lucene70), miles_i=DocValuesFormat(name=Memory)}, maxPointsInLeafNode=777, maxMBSortInHeap=5.573678308042875, sim=RandomSimilarity(queryNorm=true): {}, locale=he-IL, timezone=US/Indiana-Starke
   [junit4]   2> NOTE: SunOS 5.11 amd64/Oracle Corporation 1.8.0_141 (64-bit)/cpus=3,threads=1,free=62485624,total=183721984
   [junit4]   2> NOTE: All tests run in this JVM: [SolrZkClientTest, LBHttpSolrClientBuilderTest, TangentEvaluatorTest, TestV2Request, ArcTangentEvaluatorTest, JdbcDriverTest, SolrDocumentTest, StreamExpressionTest]
   [junit4] Completed [66/145 (1!)] on J0 in 98.22s, 121 tests, 1 failure, 9 skipped <<< FAILURES!

[...truncated 46573 lines...]

Mime
View raw message