Build: https://jenkins.thetaphi.de/job/Lucene-Solr-master-Windows/6973/ Java: 64bit/jdk-9 -XX:-UseCompressedOops -XX:+UseConcMarkSweepGC --illegal-access=deny 3 tests failed. FAILED: org.apache.lucene.replicator.IndexAndTaxonomyReplicationClientTest.testConsistencyOnExceptions Error Message: Captured an uncaught exception in thread: Thread[id=22, name=ReplicationThread-indexAndTaxo, state=RUNNABLE, group=TGRP-IndexAndTaxonomyReplicationClientTest] Stack Trace: com.carrotsearch.randomizedtesting.UncaughtExceptionError: Captured an uncaught exception in thread: Thread[id=22, name=ReplicationThread-indexAndTaxo, state=RUNNABLE, group=TGRP-IndexAndTaxonomyReplicationClientTest] at __randomizedtesting.SeedInfo.seed([F83F3B6DDC6A281F:77B1DCCDCE06DBE0]:0) Caused by: java.lang.AssertionError: handler failed too many times: -1 at __randomizedtesting.SeedInfo.seed([F83F3B6DDC6A281F]:0) at org.apache.lucene.replicator.IndexAndTaxonomyReplicationClientTest$4.handleUpdateException(IndexAndTaxonomyReplicationClientTest.java:422) at org.apache.lucene.replicator.ReplicationClient$ReplicationThread.run(ReplicationClient.java:77) FAILED: org.apache.solr.cloud.TestCollectionsAPIViaSolrCloudCluster.testCollectionCreateSearchDelete Error Message: Error from server at http://127.0.0.1:61267/solr/testcollection_shard1_replica_n2: Expected mime type application/octet-stream but got text/html. Error 404

HTTP ERROR: 404

Problem accessing /solr/testcollection_shard1_replica_n2/update. Reason:

    Can not find: /solr/testcollection_shard1_replica_n2/update


Powered by Jetty:// 9.3.20.v20170531
Stack Trace: org.apache.solr.client.solrj.impl.CloudSolrClient$RouteException: Error from server at http://127.0.0.1:61267/solr/testcollection_shard1_replica_n2: Expected mime type application/octet-stream but got text/html. Error 404

HTTP ERROR: 404

Problem accessing /solr/testcollection_shard1_replica_n2/update. Reason:

    Can not find: /solr/testcollection_shard1_replica_n2/update


Powered by Jetty:// 9.3.20.v20170531
at __randomizedtesting.SeedInfo.seed([216A22F099D20562:82908C551E3AEFC7]:0) at org.apache.solr.client.solrj.impl.CloudSolrClient.directUpdate(CloudSolrClient.java:541) at org.apache.solr.client.solrj.impl.CloudSolrClient.sendRequest(CloudSolrClient.java:998) at org.apache.solr.client.solrj.impl.CloudSolrClient.requestWithRetryOnStaleState(CloudSolrClient.java:867) at org.apache.solr.client.solrj.impl.CloudSolrClient.request(CloudSolrClient.java:800) at org.apache.solr.client.solrj.SolrRequest.process(SolrRequest.java:178) at org.apache.solr.client.solrj.request.UpdateRequest.commit(UpdateRequest.java:233) at org.apache.solr.cloud.TestCollectionsAPIViaSolrCloudCluster.testCollectionCreateSearchDelete(TestCollectionsAPIViaSolrCloudCluster.java:167) at java.base/jdk.internal.reflect.NativeMethodAccessorImpl.invoke0(Native Method) at java.base/jdk.internal.reflect.NativeMethodAccessorImpl.invoke(NativeMethodAccessorImpl.java:62) at java.base/jdk.internal.reflect.DelegatingMethodAccessorImpl.invoke(DelegatingMethodAccessorImpl.java:43) at java.base/java.lang.reflect.Method.invoke(Method.java:564) at com.carrotsearch.randomizedtesting.RandomizedRunner.invoke(RandomizedRunner.java:1737) at com.carrotsearch.randomizedtesting.RandomizedRunner$8.evaluate(RandomizedRunner.java:934) at com.carrotsearch.randomizedtesting.RandomizedRunner$9.evaluate(RandomizedRunner.java:970) at com.carrotsearch.randomizedtesting.RandomizedRunner$10.evaluate(RandomizedRunner.java:984) at com.carrotsearch.randomizedtesting.rules.SystemPropertiesRestoreRule$1.evaluate(SystemPropertiesRestoreRule.java:57) at org.apache.lucene.util.TestRuleSetupTeardownChained$1.evaluate(TestRuleSetupTeardownChained.java:49) at org.apache.lucene.util.AbstractBeforeAfterRule$1.evaluate(AbstractBeforeAfterRule.java:45) at org.apache.lucene.util.TestRuleThreadAndTestName$1.evaluate(TestRuleThreadAndTestName.java:48) at org.apache.lucene.util.TestRuleIgnoreAfterMaxFailures$1.evaluate(TestRuleIgnoreAfterMaxFailures.java:64) at org.apache.lucene.util.TestRuleMarkFailure$1.evaluate(TestRuleMarkFailure.java:47) at com.carrotsearch.randomizedtesting.rules.StatementAdapter.evaluate(StatementAdapter.java:36) at com.carrotsearch.randomizedtesting.ThreadLeakControl$StatementRunner.run(ThreadLeakControl.java:368) at com.carrotsearch.randomizedtesting.ThreadLeakControl.forkTimeoutingTask(ThreadLeakControl.java:817) at com.carrotsearch.randomizedtesting.ThreadLeakControl$3.evaluate(ThreadLeakControl.java:468) at com.carrotsearch.randomizedtesting.RandomizedRunner.runSingleTest(RandomizedRunner.java:943) at com.carrotsearch.randomizedtesting.RandomizedRunner$5.evaluate(RandomizedRunner.java:829) at com.carrotsearch.randomizedtesting.RandomizedRunner$6.evaluate(RandomizedRunner.java:879) at com.carrotsearch.randomizedtesting.RandomizedRunner$7.evaluate(RandomizedRunner.java:890) at com.carrotsearch.randomizedtesting.rules.StatementAdapter.evaluate(StatementAdapter.java:36) at com.carrotsearch.randomizedtesting.rules.SystemPropertiesRestoreRule$1.evaluate(SystemPropertiesRestoreRule.java:57) at org.apache.lucene.util.AbstractBeforeAfterRule$1.evaluate(AbstractBeforeAfterRule.java:45) at com.carrotsearch.randomizedtesting.rules.StatementAdapter.evaluate(StatementAdapter.java:36) at org.apache.lucene.util.TestRuleStoreClassName$1.evaluate(TestRuleStoreClassName.java:41) at com.carrotsearch.randomizedtesting.rules.NoShadowingOrOverridesOnMethodsRule$1.evaluate(NoShadowingOrOverridesOnMethodsRule.java:40) at com.carrotsearch.randomizedtesting.rules.NoShadowingOrOverridesOnMethodsRule$1.evaluate(NoShadowingOrOverridesOnMethodsRule.java:40) at com.carrotsearch.randomizedtesting.rules.StatementAdapter.evaluate(StatementAdapter.java:36) at com.carrotsearch.randomizedtesting.rules.StatementAdapter.evaluate(StatementAdapter.java:36) at org.apache.lucene.util.TestRuleAssertionsRequired$1.evaluate(TestRuleAssertionsRequired.java:53) at org.apache.lucene.util.TestRuleMarkFailure$1.evaluate(TestRuleMarkFailure.java:47) at org.apache.lucene.util.TestRuleIgnoreAfterMaxFailures$1.evaluate(TestRuleIgnoreAfterMaxFailures.java:64) at org.apache.lucene.util.TestRuleIgnoreTestSuites$1.evaluate(TestRuleIgnoreTestSuites.java:54) at com.carrotsearch.randomizedtesting.rules.StatementAdapter.evaluate(StatementAdapter.java:36) at com.carrotsearch.randomizedtesting.ThreadLeakControl$StatementRunner.run(ThreadLeakControl.java:368) at java.base/java.lang.Thread.run(Thread.java:844) Caused by: org.apache.solr.client.solrj.impl.HttpSolrClient$RemoteSolrException: Error from server at http://127.0.0.1:61267/solr/testcollection_shard1_replica_n2: Expected mime type application/octet-stream but got text/html. Error 404

HTTP ERROR: 404

Problem accessing /solr/testcollection_shard1_replica_n2/update. Reason:

    Can not find: /solr/testcollection_shard1_replica_n2/update


Powered by Jetty:// 9.3.20.v20170531
at org.apache.solr.client.solrj.impl.HttpSolrClient.executeMethod(HttpSolrClient.java:590) at org.apache.solr.client.solrj.impl.HttpSolrClient.request(HttpSolrClient.java:253) at org.apache.solr.client.solrj.impl.HttpSolrClient.request(HttpSolrClient.java:242) at org.apache.solr.client.solrj.impl.LBHttpSolrClient.doRequest(LBHttpSolrClient.java:483) at org.apache.solr.client.solrj.impl.LBHttpSolrClient.request(LBHttpSolrClient.java:413) at org.apache.solr.client.solrj.impl.CloudSolrClient.lambda$directUpdate$0(CloudSolrClient.java:518) at java.base/java.util.concurrent.FutureTask.run(FutureTask.java:264) at org.apache.solr.common.util.ExecutorUtil$MDCAwareThreadPoolExecutor.lambda$execute$0(ExecutorUtil.java:188) at java.base/java.util.concurrent.ThreadPoolExecutor.runWorker(ThreadPoolExecutor.java:1167) at java.base/java.util.concurrent.ThreadPoolExecutor$Worker.run(ThreadPoolExecutor.java:641) ... 1 more FAILED: org.apache.solr.cloud.autoscaling.ExecutePlanActionTest.testIntegration Error Message: Timed out waiting for replicas of collection to be 2 again null Live Nodes: [127.0.0.1:53683_solr] Last available state: DocCollection(testIntegration//collections/testIntegration/state.json/7)={ "pullReplicas":"0", "replicationFactor":"2", "shards":{"shard1":{ "range":"80000000-7fffffff", "state":"active", "replicas":{ "core_node3":{ "core":"testIntegration_shard1_replica_n1", "base_url":"https://127.0.0.1:53688/solr", "node_name":"127.0.0.1:53688_solr", "state":"down", "type":"NRT"}, "core_node4":{ "core":"testIntegration_shard1_replica_n2", "base_url":"https://127.0.0.1:53683/solr", "node_name":"127.0.0.1:53683_solr", "state":"active", "type":"NRT", "leader":"true"}}}}, "router":{"name":"compositeId"}, "maxShardsPerNode":"1", "autoAddReplicas":"false", "nrtReplicas":"2", "tlogReplicas":"0"} Stack Trace: java.lang.AssertionError: Timed out waiting for replicas of collection to be 2 again null Live Nodes: [127.0.0.1:53683_solr] Last available state: DocCollection(testIntegration//collections/testIntegration/state.json/7)={ "pullReplicas":"0", "replicationFactor":"2", "shards":{"shard1":{ "range":"80000000-7fffffff", "state":"active", "replicas":{ "core_node3":{ "core":"testIntegration_shard1_replica_n1", "base_url":"https://127.0.0.1:53688/solr", "node_name":"127.0.0.1:53688_solr", "state":"down", "type":"NRT"}, "core_node4":{ "core":"testIntegration_shard1_replica_n2", "base_url":"https://127.0.0.1:53683/solr", "node_name":"127.0.0.1:53683_solr", "state":"active", "type":"NRT", "leader":"true"}}}}, "router":{"name":"compositeId"}, "maxShardsPerNode":"1", "autoAddReplicas":"false", "nrtReplicas":"2", "tlogReplicas":"0"} at __randomizedtesting.SeedInfo.seed([216A22F099D20562:910B2CDCBCEDA447]:0) at org.junit.Assert.fail(Assert.java:93) at org.apache.solr.cloud.SolrCloudTestCase.waitForState(SolrCloudTestCase.java:269) at org.apache.solr.cloud.autoscaling.ExecutePlanActionTest.testIntegration(ExecutePlanActionTest.java:209) at java.base/jdk.internal.reflect.NativeMethodAccessorImpl.invoke0(Native Method) at java.base/jdk.internal.reflect.NativeMethodAccessorImpl.invoke(NativeMethodAccessorImpl.java:62) at java.base/jdk.internal.reflect.DelegatingMethodAccessorImpl.invoke(DelegatingMethodAccessorImpl.java:43) at java.base/java.lang.reflect.Method.invoke(Method.java:564) at com.carrotsearch.randomizedtesting.RandomizedRunner.invoke(RandomizedRunner.java:1737) at com.carrotsearch.randomizedtesting.RandomizedRunner$8.evaluate(RandomizedRunner.java:934) at com.carrotsearch.randomizedtesting.RandomizedRunner$9.evaluate(RandomizedRunner.java:970) at com.carrotsearch.randomizedtesting.RandomizedRunner$10.evaluate(RandomizedRunner.java:984) at com.carrotsearch.randomizedtesting.rules.SystemPropertiesRestoreRule$1.evaluate(SystemPropertiesRestoreRule.java:57) at org.apache.lucene.util.TestRuleSetupTeardownChained$1.evaluate(TestRuleSetupTeardownChained.java:49) at org.apache.lucene.util.AbstractBeforeAfterRule$1.evaluate(AbstractBeforeAfterRule.java:45) at org.apache.lucene.util.TestRuleThreadAndTestName$1.evaluate(TestRuleThreadAndTestName.java:48) at org.apache.lucene.util.TestRuleIgnoreAfterMaxFailures$1.evaluate(TestRuleIgnoreAfterMaxFailures.java:64) at org.apache.lucene.util.TestRuleMarkFailure$1.evaluate(TestRuleMarkFailure.java:47) at com.carrotsearch.randomizedtesting.rules.StatementAdapter.evaluate(StatementAdapter.java:36) at com.carrotsearch.randomizedtesting.ThreadLeakControl$StatementRunner.run(ThreadLeakControl.java:368) at com.carrotsearch.randomizedtesting.ThreadLeakControl.forkTimeoutingTask(ThreadLeakControl.java:817) at com.carrotsearch.randomizedtesting.ThreadLeakControl$3.evaluate(ThreadLeakControl.java:468) at com.carrotsearch.randomizedtesting.RandomizedRunner.runSingleTest(RandomizedRunner.java:943) at com.carrotsearch.randomizedtesting.RandomizedRunner$5.evaluate(RandomizedRunner.java:829) at com.carrotsearch.randomizedtesting.RandomizedRunner$6.evaluate(RandomizedRunner.java:879) at com.carrotsearch.randomizedtesting.RandomizedRunner$7.evaluate(RandomizedRunner.java:890) at com.carrotsearch.randomizedtesting.rules.StatementAdapter.evaluate(StatementAdapter.java:36) at com.carrotsearch.randomizedtesting.rules.SystemPropertiesRestoreRule$1.evaluate(SystemPropertiesRestoreRule.java:57) at org.apache.lucene.util.AbstractBeforeAfterRule$1.evaluate(AbstractBeforeAfterRule.java:45) at com.carrotsearch.randomizedtesting.rules.StatementAdapter.evaluate(StatementAdapter.java:36) at org.apache.lucene.util.TestRuleStoreClassName$1.evaluate(TestRuleStoreClassName.java:41) at com.carrotsearch.randomizedtesting.rules.NoShadowingOrOverridesOnMethodsRule$1.evaluate(NoShadowingOrOverridesOnMethodsRule.java:40) at com.carrotsearch.randomizedtesting.rules.NoShadowingOrOverridesOnMethodsRule$1.evaluate(NoShadowingOrOverridesOnMethodsRule.java:40) at com.carrotsearch.randomizedtesting.rules.StatementAdapter.evaluate(StatementAdapter.java:36) at com.carrotsearch.randomizedtesting.rules.StatementAdapter.evaluate(StatementAdapter.java:36) at org.apache.lucene.util.TestRuleAssertionsRequired$1.evaluate(TestRuleAssertionsRequired.java:53) at org.apache.lucene.util.TestRuleMarkFailure$1.evaluate(TestRuleMarkFailure.java:47) at org.apache.lucene.util.TestRuleIgnoreAfterMaxFailures$1.evaluate(TestRuleIgnoreAfterMaxFailures.java:64) at org.apache.lucene.util.TestRuleIgnoreTestSuites$1.evaluate(TestRuleIgnoreTestSuites.java:54) at com.carrotsearch.randomizedtesting.rules.StatementAdapter.evaluate(StatementAdapter.java:36) at com.carrotsearch.randomizedtesting.ThreadLeakControl$StatementRunner.run(ThreadLeakControl.java:368) at java.base/java.lang.Thread.run(Thread.java:844) Build Log: [...truncated 1735 lines...] [junit4] JVM J1: stderr was not empty, see: C:\Users\jenkins\workspace\Lucene-Solr-master-Windows\lucene\build\core\test\temp\junit4-J1-20171022_231036_5284734341613349587943.syserr [junit4] >>> JVM J1 emitted unexpected output (verbatim) ---- [junit4] Java HotSpot(TM) 64-Bit Server VM warning: Option UseConcMarkSweepGC was deprecated in version 9.0 and will likely be removed in a future release. [junit4] <<< JVM J1: EOF ---- [...truncated 3 lines...] [junit4] JVM J0: stderr was not empty, see: C:\Users\jenkins\workspace\Lucene-Solr-master-Windows\lucene\build\core\test\temp\junit4-J0-20171022_231036_52816126972839557696017.syserr [junit4] >>> JVM J0 emitted unexpected output (verbatim) ---- [junit4] Java HotSpot(TM) 64-Bit Server VM warning: Option UseConcMarkSweepGC was deprecated in version 9.0 and will likely be removed in a future release. [junit4] <<< JVM J0: EOF ---- [...truncated 309 lines...] [junit4] JVM J1: stderr was not empty, see: C:\Users\jenkins\workspace\Lucene-Solr-master-Windows\lucene\build\test-framework\test\temp\junit4-J1-20171022_231602_664988439007176742401.syserr [junit4] >>> JVM J1 emitted unexpected output (verbatim) ---- [junit4] Java HotSpot(TM) 64-Bit Server VM warning: Option UseConcMarkSweepGC was deprecated in version 9.0 and will likely be removed in a future release. [junit4] <<< JVM J1: EOF ---- [...truncated 3 lines...] [junit4] JVM J0: stderr was not empty, see: C:\Users\jenkins\workspace\Lucene-Solr-master-Windows\lucene\build\test-framework\test\temp\junit4-J0-20171022_231602_6642628595798534822333.syserr [junit4] >>> JVM J0 emitted unexpected output (verbatim) ---- [junit4] Java HotSpot(TM) 64-Bit Server VM warning: Option UseConcMarkSweepGC was deprecated in version 9.0 and will likely be removed in a future release. [junit4] <<< JVM J0: EOF ---- [...truncated 1055 lines...] [junit4] JVM J1: stderr was not empty, see: C:\Users\jenkins\workspace\Lucene-Solr-master-Windows\lucene\build\analysis\common\test\temp\junit4-J1-20171022_231707_10310470616435667894358.syserr [junit4] >>> JVM J1 emitted unexpected output (verbatim) ---- [junit4] Java HotSpot(TM) 64-Bit Server VM warning: Option UseConcMarkSweepGC was deprecated in version 9.0 and will likely be removed in a future release. [junit4] <<< JVM J1: EOF ---- [...truncated 3 lines...] [junit4] JVM J0: stderr was not empty, see: C:\Users\jenkins\workspace\Lucene-Solr-master-Windows\lucene\build\analysis\common\test\temp\junit4-J0-20171022_231707_1039790915678000136176.syserr [junit4] >>> JVM J0 emitted unexpected output (verbatim) ---- [junit4] Java HotSpot(TM) 64-Bit Server VM warning: Option UseConcMarkSweepGC was deprecated in version 9.0 and will likely be removed in a future release. [junit4] <<< JVM J0: EOF ---- [...truncated 230 lines...] [junit4] JVM J0: stderr was not empty, see: C:\Users\jenkins\workspace\Lucene-Solr-master-Windows\lucene\build\analysis\icu\test\temp\junit4-J0-20171022_231853_8529583991892717368554.syserr [junit4] >>> JVM J0 emitted unexpected output (verbatim) ---- [junit4] Java HotSpot(TM) 64-Bit Server VM warning: Option UseConcMarkSweepGC was deprecated in version 9.0 and will likely be removed in a future release. [junit4] <<< JVM J0: EOF ---- [junit4] JVM J1: stderr was not empty, see: C:\Users\jenkins\workspace\Lucene-Solr-master-Windows\lucene\build\analysis\icu\test\temp\junit4-J1-20171022_231853_85216395090249788098894.syserr [junit4] >>> JVM J1 emitted unexpected output (verbatim) ---- [junit4] Java HotSpot(TM) 64-Bit Server VM warning: Option UseConcMarkSweepGC was deprecated in version 9.0 and will likely be removed in a future release. [junit4] <<< JVM J1: EOF ---- [...truncated 244 lines...] [junit4] JVM J0: stderr was not empty, see: C:\Users\jenkins\workspace\Lucene-Solr-master-Windows\lucene\build\analysis\kuromoji\test\temp\junit4-J0-20171022_231907_05917871063537729205529.syserr [junit4] >>> JVM J0 emitted unexpected output (verbatim) ---- [junit4] Java HotSpot(TM) 64-Bit Server VM warning: Option UseConcMarkSweepGC was deprecated in version 9.0 and will likely be removed in a future release. [junit4] <<< JVM J0: EOF ---- [...truncated 9 lines...] [junit4] JVM J1: stderr was not empty, see: C:\Users\jenkins\workspace\Lucene-Solr-master-Windows\lucene\build\analysis\kuromoji\test\temp\junit4-J1-20171022_231907_05915477919955841580157.syserr [junit4] >>> JVM J1 emitted unexpected output (verbatim) ---- [junit4] Java HotSpot(TM) 64-Bit Server VM warning: Option UseConcMarkSweepGC was deprecated in version 9.0 and will likely be removed in a future release. [junit4] <<< JVM J1: EOF ---- [...truncated 155 lines...] [junit4] JVM J0: stderr was not empty, see: C:\Users\jenkins\workspace\Lucene-Solr-master-Windows\lucene\build\analysis\morfologik\test\temp\junit4-J0-20171022_231942_6341979117988784002689.syserr [junit4] >>> JVM J0 emitted unexpected output (verbatim) ---- [junit4] Java HotSpot(TM) 64-Bit Server VM warning: Option UseConcMarkSweepGC was deprecated in version 9.0 and will likely be removed in a future release. [junit4] <<< JVM J0: EOF ---- [...truncated 3 lines...] [junit4] JVM J1: stderr was not empty, see: C:\Users\jenkins\workspace\Lucene-Solr-master-Windows\lucene\build\analysis\morfologik\test\temp\junit4-J1-20171022_231942_63414974151688126994288.syserr [junit4] >>> JVM J1 emitted unexpected output (verbatim) ---- [junit4] Java HotSpot(TM) 64-Bit Server VM warning: Option UseConcMarkSweepGC was deprecated in version 9.0 and will likely be removed in a future release. [junit4] <<< JVM J1: EOF ---- [...truncated 167 lines...] [junit4] JVM J0: stderr was not empty, see: C:\Users\jenkins\workspace\Lucene-Solr-master-Windows\lucene\build\analysis\phonetic\test\temp\junit4-J0-20171022_231948_02313769343074363448118.syserr [junit4] >>> JVM J0 emitted unexpected output (verbatim) ---- [junit4] Java HotSpot(TM) 64-Bit Server VM warning: Option UseConcMarkSweepGC was deprecated in version 9.0 and will likely be removed in a future release. [junit4] <<< JVM J0: EOF ---- [...truncated 3 lines...] [junit4] JVM J1: stderr was not empty, see: C:\Users\jenkins\workspace\Lucene-Solr-master-Windows\lucene\build\analysis\phonetic\test\temp\junit4-J1-20171022_231948_0236961379540579717386.syserr [junit4] >>> JVM J1 emitted unexpected output (verbatim) ---- [junit4] Java HotSpot(TM) 64-Bit Server VM warning: Option UseConcMarkSweepGC was deprecated in version 9.0 and will likely be removed in a future release. [junit4] <<< JVM J1: EOF ---- [...truncated 152 lines...] [junit4] JVM J0: stderr was not empty, see: C:\Users\jenkins\workspace\Lucene-Solr-master-Windows\lucene\build\analysis\smartcn\test\temp\junit4-J0-20171022_231958_79110720091516862669623.syserr [junit4] >>> JVM J0 emitted unexpected output (verbatim) ---- [junit4] Java HotSpot(TM) 64-Bit Server VM warning: Option UseConcMarkSweepGC was deprecated in version 9.0 and will likely be removed in a future release. [junit4] <<< JVM J0: EOF ---- [...truncated 3 lines...] [junit4] JVM J1: stderr was not empty, see: C:\Users\jenkins\workspace\Lucene-Solr-master-Windows\lucene\build\analysis\smartcn\test\temp\junit4-J1-20171022_231958_791720928404785533807.syserr [junit4] >>> JVM J1 emitted unexpected output (verbatim) ---- [junit4] Java HotSpot(TM) 64-Bit Server VM warning: Option UseConcMarkSweepGC was deprecated in version 9.0 and will likely be removed in a future release. [junit4] <<< JVM J1: EOF ---- [...truncated 157 lines...] [junit4] JVM J1: stderr was not empty, see: C:\Users\jenkins\workspace\Lucene-Solr-master-Windows\lucene\build\analysis\stempel\test\temp\junit4-J1-20171022_232007_34113511791602077406842.syserr [junit4] >>> JVM J1 emitted unexpected output (verbatim) ---- [junit4] Java HotSpot(TM) 64-Bit Server VM warning: Option UseConcMarkSweepGC was deprecated in version 9.0 and will likely be removed in a future release. [junit4] <<< JVM J1: EOF ---- [...truncated 3 lines...] [junit4] JVM J0: stderr was not empty, see: C:\Users\jenkins\workspace\Lucene-Solr-master-Windows\lucene\build\analysis\stempel\test\temp\junit4-J0-20171022_232007_34117884557885109416800.syserr [junit4] >>> JVM J0 emitted unexpected output (verbatim) ---- [junit4] Java HotSpot(TM) 64-Bit Server VM warning: Option UseConcMarkSweepGC was deprecated in version 9.0 and will likely be removed in a future release. [junit4] <<< JVM J0: EOF ---- [...truncated 168 lines...] [junit4] JVM J0: stderr was not empty, see: C:\Users\jenkins\workspace\Lucene-Solr-master-Windows\lucene\build\analysis\uima\test\temp\junit4-J0-20171022_232011_46114877929462853024393.syserr [junit4] >>> JVM J0 emitted unexpected output (verbatim) ---- [junit4] Java HotSpot(TM) 64-Bit Server VM warning: Option UseConcMarkSweepGC was deprecated in version 9.0 and will likely be removed in a future release. [junit4] <<< JVM J0: EOF ---- [...truncated 153 lines...] [junit4] JVM J1: stderr was not empty, see: C:\Users\jenkins\workspace\Lucene-Solr-master-Windows\lucene\build\backward-codecs\test\temp\junit4-J1-20171022_232029_9257043135277888918400.syserr [junit4] >>> JVM J1 emitted unexpected output (verbatim) ---- [junit4] Java HotSpot(TM) 64-Bit Server VM warning: Option UseConcMarkSweepGC was deprecated in version 9.0 and will likely be removed in a future release. [junit4] <<< JVM J1: EOF ---- [...truncated 19 lines...] [junit4] JVM J0: stderr was not empty, see: C:\Users\jenkins\workspace\Lucene-Solr-master-Windows\lucene\build\backward-codecs\test\temp\junit4-J0-20171022_232029_9252484230722153224676.syserr [junit4] >>> JVM J0 emitted unexpected output (verbatim) ---- [junit4] Java HotSpot(TM) 64-Bit Server VM warning: Option UseConcMarkSweepGC was deprecated in version 9.0 and will likely be removed in a future release. [junit4] <<< JVM J0: EOF ---- [...truncated 1269 lines...] [junit4] JVM J1: stderr was not empty, see: C:\Users\jenkins\workspace\Lucene-Solr-master-Windows\lucene\build\benchmark\test\temp\junit4-J1-20171022_232051_4373729566922613548285.syserr [junit4] >>> JVM J1 emitted unexpected output (verbatim) ---- [junit4] Java HotSpot(TM) 64-Bit Server VM warning: Option UseConcMarkSweepGC was deprecated in version 9.0 and will likely be removed in a future release. [junit4] <<< JVM J1: EOF ---- [junit4] JVM J0: stderr was not empty, see: C:\Users\jenkins\workspace\Lucene-Solr-master-Windows\lucene\build\benchmark\test\temp\junit4-J0-20171022_232051_4411987486947820568938.syserr [junit4] >>> JVM J0 emitted unexpected output (verbatim) ---- [junit4] Java HotSpot(TM) 64-Bit Server VM warning: Option UseConcMarkSweepGC was deprecated in version 9.0 and will likely be removed in a future release. [junit4] <<< JVM J0: EOF ---- [...truncated 235 lines...] [junit4] JVM J1: stderr was not empty, see: C:\Users\jenkins\workspace\Lucene-Solr-master-Windows\lucene\build\classification\test\temp\junit4-J1-20171022_232105_06913799609367659017741.syserr [junit4] >>> JVM J1 emitted unexpected output (verbatim) ---- [junit4] Java HotSpot(TM) 64-Bit Server VM warning: Option UseConcMarkSweepGC was deprecated in version 9.0 and will likely be removed in a future release. [junit4] <<< JVM J1: EOF ---- [junit4] JVM J0: stderr was not empty, see: C:\Users\jenkins\workspace\Lucene-Solr-master-Windows\lucene\build\classification\test\temp\junit4-J0-20171022_232105_0693866428208911639711.syserr [junit4] >>> JVM J0 emitted unexpected output (verbatim) ---- [junit4] Java HotSpot(TM) 64-Bit Server VM warning: Option UseConcMarkSweepGC was deprecated in version 9.0 and will likely be removed in a future release. [junit4] <<< JVM J0: EOF ---- [...truncated 256 lines...] [junit4] JVM J1: stderr was not empty, see: C:\Users\jenkins\workspace\Lucene-Solr-master-Windows\lucene\build\codecs\test\temp\junit4-J1-20171022_232119_7039816051730066284985.syserr [junit4] >>> JVM J1 emitted unexpected output (verbatim) ---- [junit4] Java HotSpot(TM) 64-Bit Server VM warning: Option UseConcMarkSweepGC was deprecated in version 9.0 and will likely be removed in a future release. [junit4] <<< JVM J1: EOF ---- [...truncated 7 lines...] [junit4] JVM J0: stderr was not empty, see: C:\Users\jenkins\workspace\Lucene-Solr-master-Windows\lucene\build\codecs\test\temp\junit4-J0-20171022_232119_7032409008558624161579.syserr [junit4] >>> JVM J0 emitted unexpected output (verbatim) ---- [junit4] Java HotSpot(TM) 64-Bit Server VM warning: Option UseConcMarkSweepGC was deprecated in version 9.0 and will likely be removed in a future release. [junit4] <<< JVM J0: EOF ---- [...truncated 241 lines...] [junit4] JVM J1: stderr was not empty, see: C:\Users\jenkins\workspace\Lucene-Solr-master-Windows\lucene\build\demo\test\temp\junit4-J1-20171022_232248_0661738351378045414626.syserr [junit4] >>> JVM J1 emitted unexpected output (verbatim) ---- [junit4] Java HotSpot(TM) 64-Bit Server VM warning: Option UseConcMarkSweepGC was deprecated in version 9.0 and will likely be removed in a future release. [junit4] <<< JVM J1: EOF ---- [junit4] JVM J0: stderr was not empty, see: C:\Users\jenkins\workspace\Lucene-Solr-master-Windows\lucene\build\demo\test\temp\junit4-J0-20171022_232248_06610763773910769504780.syserr [junit4] >>> JVM J0 emitted unexpected output (verbatim) ---- [junit4] Java HotSpot(TM) 64-Bit Server VM warning: Option UseConcMarkSweepGC was deprecated in version 9.0 and will likely be removed in a future release. [junit4] <<< JVM J0: EOF ---- [...truncated 168 lines...] [junit4] JVM J0: stderr was not empty, see: C:\Users\jenkins\workspace\Lucene-Solr-master-Windows\lucene\build\expressions\test\temp\junit4-J0-20171022_232252_00911596801378346084997.syserr [junit4] >>> JVM J0 emitted unexpected output (verbatim) ---- [junit4] Java HotSpot(TM) 64-Bit Server VM warning: Option UseConcMarkSweepGC was deprecated in version 9.0 and will likely be removed in a future release. [junit4] <<< JVM J0: EOF ---- [...truncated 6 lines...] [junit4] JVM J1: stderr was not empty, see: C:\Users\jenkins\workspace\Lucene-Solr-master-Windows\lucene\build\expressions\test\temp\junit4-J1-20171022_232252_00916156113905309310174.syserr [junit4] >>> JVM J1 emitted unexpected output (verbatim) ---- [junit4] Java HotSpot(TM) 64-Bit Server VM warning: Option UseConcMarkSweepGC was deprecated in version 9.0 and will likely be removed in a future release. [junit4] <<< JVM J1: EOF ---- [...truncated 227 lines...] [junit4] JVM J0: stderr was not empty, see: C:\Users\jenkins\workspace\Lucene-Solr-master-Windows\lucene\build\facet\test\temp\junit4-J0-20171022_232257_629504550115622383553.syserr [junit4] >>> JVM J0 emitted unexpected output (verbatim) ---- [junit4] Java HotSpot(TM) 64-Bit Server VM warning: Option UseConcMarkSweepGC was deprecated in version 9.0 and will likely be removed in a future release. [junit4] <<< JVM J0: EOF ---- [...truncated 3 lines...] [junit4] JVM J1: stderr was not empty, see: C:\Users\jenkins\workspace\Lucene-Solr-master-Windows\lucene\build\facet\test\temp\junit4-J1-20171022_232257_6299622053477465168401.syserr [junit4] >>> JVM J1 emitted unexpected output (verbatim) ---- [junit4] Java HotSpot(TM) 64-Bit Server VM warning: Option UseConcMarkSweepGC was deprecated in version 9.0 and will likely be removed in a future release. [junit4] <<< JVM J1: EOF ---- [...truncated 180 lines...] [junit4] JVM J0: stderr was not empty, see: C:\Users\jenkins\workspace\Lucene-Solr-master-Windows\lucene\build\grouping\test\temp\junit4-J0-20171022_232323_69514055382997805876238.syserr [junit4] >>> JVM J0 emitted unexpected output (verbatim) ---- [junit4] Java HotSpot(TM) 64-Bit Server VM warning: Option UseConcMarkSweepGC was deprecated in version 9.0 and will likely be removed in a future release. [junit4] <<< JVM J0: EOF ---- [...truncated 3 lines...] [junit4] JVM J1: stderr was not empty, see: C:\Users\jenkins\workspace\Lucene-Solr-master-Windows\lucene\build\grouping\test\temp\junit4-J1-20171022_232323_69515759039700971724864.syserr [junit4] >>> JVM J1 emitted unexpected output (verbatim) ---- [junit4] Java HotSpot(TM) 64-Bit Server VM warning: Option UseConcMarkSweepGC was deprecated in version 9.0 and will likely be removed in a future release. [junit4] <<< JVM J1: EOF ---- [...truncated 244 lines...] [junit4] JVM J0: stderr was not empty, see: C:\Users\jenkins\workspace\Lucene-Solr-master-Windows\lucene\build\highlighter\test\temp\junit4-J0-20171022_232332_1879975509659128129678.syserr [junit4] >>> JVM J0 emitted unexpected output (verbatim) ---- [junit4] Java HotSpot(TM) 64-Bit Server VM warning: Option UseConcMarkSweepGC was deprecated in version 9.0 and will likely be removed in a future release. [junit4] <<< JVM J0: EOF ---- [...truncated 3 lines...] [junit4] JVM J1: stderr was not empty, see: C:\Users\jenkins\workspace\Lucene-Solr-master-Windows\lucene\build\highlighter\test\temp\junit4-J1-20171022_232332_18711683398798555643505.syserr [junit4] >>> JVM J1 emitted unexpected output (verbatim) ---- [junit4] Java HotSpot(TM) 64-Bit Server VM warning: Option UseConcMarkSweepGC was deprecated in version 9.0 and will likely be removed in a future release. [junit4] <<< JVM J1: EOF ---- [...truncated 164 lines...] [junit4] JVM J1: stderr was not empty, see: C:\Users\jenkins\workspace\Lucene-Solr-master-Windows\lucene\build\join\test\temp\junit4-J1-20171022_232348_87111946284470919610143.syserr [junit4] >>> JVM J1 emitted unexpected output (verbatim) ---- [junit4] Java HotSpot(TM) 64-Bit Server VM warning: Option UseConcMarkSweepGC was deprecated in version 9.0 and will likely be removed in a future release. [junit4] <<< JVM J1: EOF ---- [...truncated 3 lines...] [junit4] JVM J0: stderr was not empty, see: C:\Users\jenkins\workspace\Lucene-Solr-master-Windows\lucene\build\join\test\temp\junit4-J0-20171022_232348_8716011521174028193264.syserr [junit4] >>> JVM J0 emitted unexpected output (verbatim) ---- [junit4] Java HotSpot(TM) 64-Bit Server VM warning: Option UseConcMarkSweepGC was deprecated in version 9.0 and will likely be removed in a future release. [junit4] <<< JVM J0: EOF ---- [...truncated 148 lines...] [junit4] JVM J0: stderr was not empty, see: C:\Users\jenkins\workspace\Lucene-Solr-master-Windows\lucene\build\memory\test\temp\junit4-J0-20171022_232400_80010523627088310414057.syserr [junit4] >>> JVM J0 emitted unexpected output (verbatim) ---- [junit4] Java HotSpot(TM) 64-Bit Server VM warning: Option UseConcMarkSweepGC was deprecated in version 9.0 and will likely be removed in a future release. [junit4] <<< JVM J0: EOF ---- [...truncated 3 lines...] [junit4] JVM J1: stderr was not empty, see: C:\Users\jenkins\workspace\Lucene-Solr-master-Windows\lucene\build\memory\test\temp\junit4-J1-20171022_232400_80013311048410854757372.syserr [junit4] >>> JVM J1 emitted unexpected output (verbatim) ---- [junit4] Java HotSpot(TM) 64-Bit Server VM warning: Option UseConcMarkSweepGC was deprecated in version 9.0 and will likely be removed in a future release. [junit4] <<< JVM J1: EOF ---- [...truncated 185 lines...] [junit4] JVM J1: stderr was not empty, see: C:\Users\jenkins\workspace\Lucene-Solr-master-Windows\lucene\build\misc\test\temp\junit4-J1-20171022_232407_4459663799826243284703.syserr [junit4] >>> JVM J1 emitted unexpected output (verbatim) ---- [junit4] Java HotSpot(TM) 64-Bit Server VM warning: Option UseConcMarkSweepGC was deprecated in version 9.0 and will likely be removed in a future release. [junit4] <<< JVM J1: EOF ---- [...truncated 3 lines...] [junit4] JVM J0: stderr was not empty, see: C:\Users\jenkins\workspace\Lucene-Solr-master-Windows\lucene\build\misc\test\temp\junit4-J0-20171022_232407_4459479752199280051253.syserr [junit4] >>> JVM J0 emitted unexpected output (verbatim) ---- [junit4] Java HotSpot(TM) 64-Bit Server VM warning: Option UseConcMarkSweepGC was deprecated in version 9.0 and will likely be removed in a future release. [junit4] <<< JVM J0: EOF ---- [...truncated 313 lines...] [junit4] JVM J1: stderr was not empty, see: C:\Users\jenkins\workspace\Lucene-Solr-master-Windows\lucene\build\queries\test\temp\junit4-J1-20171022_232429_18813769037611878865082.syserr [junit4] >>> JVM J1 emitted unexpected output (verbatim) ---- [junit4] Java HotSpot(TM) 64-Bit Server VM warning: Option UseConcMarkSweepGC was deprecated in version 9.0 and will likely be removed in a future release. [junit4] <<< JVM J1: EOF ---- [...truncated 3 lines...] [junit4] JVM J0: stderr was not empty, see: C:\Users\jenkins\workspace\Lucene-Solr-master-Windows\lucene\build\queries\test\temp\junit4-J0-20171022_232429_18816299620087861999399.syserr [junit4] >>> JVM J0 emitted unexpected output (verbatim) ---- [junit4] Java HotSpot(TM) 64-Bit Server VM warning: Option UseConcMarkSweepGC was deprecated in version 9.0 and will likely be removed in a future release. [junit4] <<< JVM J0: EOF ---- [...truncated 225 lines...] [junit4] JVM J1: stderr was not empty, see: C:\Users\jenkins\workspace\Lucene-Solr-master-Windows\lucene\build\queryparser\test\temp\junit4-J1-20171022_232437_9526717234561578683719.syserr [junit4] >>> JVM J1 emitted unexpected output (verbatim) ---- [junit4] Java HotSpot(TM) 64-Bit Server VM warning: Option UseConcMarkSweepGC was deprecated in version 9.0 and will likely be removed in a future release. [junit4] <<< JVM J1: EOF ---- [...truncated 3 lines...] [junit4] JVM J0: stderr was not empty, see: C:\Users\jenkins\workspace\Lucene-Solr-master-Windows\lucene\build\queryparser\test\temp\junit4-J0-20171022_232437_95212818992727361881884.syserr [junit4] >>> JVM J0 emitted unexpected output (verbatim) ---- [junit4] Java HotSpot(TM) 64-Bit Server VM warning: Option UseConcMarkSweepGC was deprecated in version 9.0 and will likely be removed in a future release. [junit4] <<< JVM J0: EOF ---- [...truncated 188 lines...] [junit4] Suite: org.apache.lucene.replicator.IndexAndTaxonomyReplicationClientTest [junit4] 2> golg 23, 2017 7:24:56 I?ITBEAIVET com.carrotsearch.randomizedtesting.RandomizedRunner$QueueUncaughtExceptionsHandler uncaughtException [junit4] 2> WARNING: Uncaught exception in thread: Thread[ReplicationThread-indexAndTaxo,5,TGRP-IndexAndTaxonomyReplicationClientTest] [junit4] 2> java.lang.AssertionError: handler failed too many times: -1 [junit4] 2> at __randomizedtesting.SeedInfo.seed([F83F3B6DDC6A281F]:0) [junit4] 2> at org.apache.lucene.replicator.IndexAndTaxonomyReplicationClientTest$4.handleUpdateException(IndexAndTaxonomyReplicationClientTest.java:422) [junit4] 2> at org.apache.lucene.replicator.ReplicationClient$ReplicationThread.run(ReplicationClient.java:77) [junit4] 2> [junit4] 2> NOTE: reproduce with: ant test -Dtestcase=IndexAndTaxonomyReplicationClientTest -Dtests.method=testConsistencyOnExceptions -Dtests.seed=F83F3B6DDC6A281F -Dtests.slow=true -Dtests.locale=se-SE -Dtests.timezone=Asia/Irkutsk -Dtests.asserts=true -Dtests.file.encoding=UTF-8 [junit4] ERROR 1.04s J1 | IndexAndTaxonomyReplicationClientTest.testConsistencyOnExceptions <<< [junit4] > Throwable #1: com.carrotsearch.randomizedtesting.UncaughtExceptionError: Captured an uncaught exception in thread: Thread[id=22, name=ReplicationThread-indexAndTaxo, state=RUNNABLE, group=TGRP-IndexAndTaxonomyReplicationClientTest] [junit4] > at __randomizedtesting.SeedInfo.seed([F83F3B6DDC6A281F:77B1DCCDCE06DBE0]:0) [junit4] > Caused by: java.lang.AssertionError: handler failed too many times: -1 [junit4] > at __randomizedtesting.SeedInfo.seed([F83F3B6DDC6A281F]:0) [junit4] > at org.apache.lucene.replicator.IndexAndTaxonomyReplicationClientTest$4.handleUpdateException(IndexAndTaxonomyReplicationClientTest.java:422) [junit4] > at org.apache.lucene.replicator.ReplicationClient$ReplicationThread.run(ReplicationClient.java:77) [junit4] 2> NOTE: test params are: codec=Asserting(Lucene70): {$full_path$=PostingsFormat(name=MockRandom), $facets=PostingsFormat(name=Asserting), $payloads$=PostingsFormat(name=Memory)}, docValues:{$facets=DocValuesFormat(name=Lucene70)}, maxPointsInLeafNode=893, maxMBSortInHeap=5.412506782394516, sim=RandomSimilarity(queryNorm=true): {}, locale=se-SE, timezone=Asia/Irkutsk [junit4] 2> NOTE: Windows 10 10.0 amd64/Oracle Corporation 9 (64-bit)/cpus=3,threads=1,free=59993912,total=97320960 [junit4] 2> NOTE: All tests run in this JVM: [SessionTokenTest, TestNRTReplication, IndexAndTaxonomyReplicationClientTest] [junit4] Completed [3/9 (1!)] on J1 in 2.16s, 5 tests, 1 error <<< FAILURES! [...truncated 12 lines...] [junit4] JVM J1: stderr was not empty, see: C:\Users\jenkins\workspace\Lucene-Solr-master-Windows\lucene\build\replicator\test\temp\junit4-J1-20171022_232447_7935522512649834036903.syserr [junit4] >>> JVM J1 emitted unexpected output (verbatim) ---- [junit4] Java HotSpot(TM) 64-Bit Server VM warning: Option UseConcMarkSweepGC was deprecated in version 9.0 and will likely be removed in a future release. [junit4] <<< JVM J1: EOF ---- [...truncated 9 lines...] [junit4] JVM J0: stderr was not empty, see: C:\Users\jenkins\workspace\Lucene-Solr-master-Windows\lucene\build\replicator\test\temp\junit4-J0-20171022_232447_79315651355551654550064.syserr [junit4] >>> JVM J0 emitted unexpected output (verbatim) ---- [junit4] Java HotSpot(TM) 64-Bit Server VM warning: Option UseConcMarkSweepGC was deprecated in version 9.0 and will likely be removed in a future release. [junit4] <<< JVM J0: EOF ---- [...truncated 222 lines...] [junit4] JVM J1: stderr was not empty, see: C:\Users\jenkins\workspace\Lucene-Solr-master-Windows\lucene\build\sandbox\test\temp\junit4-J1-20171022_232502_7946544913653252060859.syserr [junit4] >>> JVM J1 emitted unexpected output (verbatim) ---- [junit4] Java HotSpot(TM) 64-Bit Server VM warning: Option UseConcMarkSweepGC was deprecated in version 9.0 and will likely be removed in a future release. [junit4] <<< JVM J1: EOF ---- [...truncated 7 lines...] [junit4] JVM J0: stderr was not empty, see: C:\Users\jenkins\workspace\Lucene-Solr-master-Windows\lucene\build\sandbox\test\temp\junit4-J0-20171022_232502_7946348003063397202793.syserr [junit4] >>> JVM J0 emitted unexpected output (verbatim) ---- [junit4] Java HotSpot(TM) 64-Bit Server VM warning: Option UseConcMarkSweepGC was deprecated in version 9.0 and will likely be removed in a future release. [junit4] <<< JVM J0: EOF ---- [...truncated 416 lines...] [junit4] JVM J0: stderr was not empty, see: C:\Users\jenkins\workspace\Lucene-Solr-master-Windows\lucene\build\spatial-extras\test\temp\junit4-J0-20171022_232546_00914297973326096045265.syserr [junit4] >>> JVM J0 emitted unexpected output (verbatim) ---- [junit4] Java HotSpot(TM) 64-Bit Server VM warning: Option UseConcMarkSweepGC was deprecated in version 9.0 and will likely be removed in a future release. [junit4] <<< JVM J0: EOF ---- [...truncated 3 lines...] [junit4] JVM J1: stderr was not empty, see: C:\Users\jenkins\workspace\Lucene-Solr-master-Windows\lucene\build\spatial-extras\test\temp\junit4-J1-20171022_232546_009482189646333750920.syserr [junit4] >>> JVM J1 emitted unexpected output (verbatim) ---- [junit4] Java HotSpot(TM) 64-Bit Server VM warning: Option UseConcMarkSweepGC was deprecated in version 9.0 and will likely be removed in a future release. [junit4] <<< JVM J1: EOF ---- [...truncated 178 lines...] [junit4] JVM J0: stderr was not empty, see: C:\Users\jenkins\workspace\Lucene-Solr-master-Windows\lucene\build\spatial3d\test\temp\junit4-J0-20171022_232605_27016220113565510620618.syserr [junit4] >>> JVM J0 emitted unexpected output (verbatim) ---- [junit4] Java HotSpot(TM) 64-Bit Server VM warning: Option UseConcMarkSweepGC was deprecated in version 9.0 and will likely be removed in a future release. [junit4] <<< JVM J0: EOF ---- [...truncated 8 lines...] [junit4] JVM J1: stderr was not empty, see: C:\Users\jenkins\workspace\Lucene-Solr-master-Windows\lucene\build\spatial3d\test\temp\junit4-J1-20171022_232605_27013478269353689900568.syserr [junit4] >>> JVM J1 emitted unexpected output (verbatim) ---- [junit4] Java HotSpot(TM) 64-Bit Server VM warning: Option UseConcMarkSweepGC was deprecated in version 9.0 and will likely be removed in a future release. [junit4] <<< JVM J1: EOF ---- [...truncated 147 lines...] [junit4] JVM J0: stderr was not empty, see: C:\Users\jenkins\workspace\Lucene-Solr-master-Windows\lucene\build\spatial\test\temp\junit4-J0-20171022_232622_10614107964372961344992.syserr [junit4] >>> JVM J0 emitted unexpected output (verbatim) ---- [junit4] Java HotSpot(TM) 64-Bit Server VM warning: Option UseConcMarkSweepGC was deprecated in version 9.0 and will likely be removed in a future release. [junit4] <<< JVM J0: EOF ---- [...truncated 245 lines...] [junit4] JVM J0: stderr was not empty, see: C:\Users\jenkins\workspace\Lucene-Solr-master-Windows\lucene\build\suggest\test\temp\junit4-J0-20171022_232625_6465875596399535658178.syserr [junit4] >>> JVM J0 emitted unexpected output (verbatim) ---- [junit4] Java HotSpot(TM) 64-Bit Server VM warning: Option UseConcMarkSweepGC was deprecated in version 9.0 and will likely be removed in a future release. [junit4] <<< JVM J0: EOF ---- [...truncated 3 lines...] [junit4] JVM J1: stderr was not empty, see: C:\Users\jenkins\workspace\Lucene-Solr-master-Windows\lucene\build\suggest\test\temp\junit4-J1-20171022_232625_64611909165670686018993.syserr [junit4] >>> JVM J1 emitted unexpected output (verbatim) ---- [junit4] Java HotSpot(TM) 64-Bit Server VM warning: Option UseConcMarkSweepGC was deprecated in version 9.0 and will likely be removed in a future release. [junit4] <<< JVM J1: EOF ---- [...truncated 2160 lines...] [junit4] Suite: org.apache.solr.cloud.autoscaling.ExecutePlanActionTest [junit4] 2> Creating dataDir: C:\Users\jenkins\workspace\Lucene-Solr-master-Windows\solr\build\solr-core\test\J1\temp\solr.cloud.autoscaling.ExecutePlanActionTest_216A22F099D20562-001\init-core-data-001 [junit4] 2> 562624 WARN (SUITE-ExecutePlanActionTest-seed#[216A22F099D20562]-worker) [ ] o.a.s.SolrTestCaseJ4 startTrackingSearchers: numOpens=7 numCloses=7 [junit4] 2> 562624 INFO (SUITE-ExecutePlanActionTest-seed#[216A22F099D20562]-worker) [ ] o.a.s.SolrTestCaseJ4 Using PointFields (NUMERIC_POINTS_SYSPROP=true) w/NUMERIC_DOCVALUES_SYSPROP=true [junit4] 2> 562626 INFO (SUITE-ExecutePlanActionTest-seed#[216A22F099D20562]-worker) [ ] o.a.s.SolrTestCaseJ4 Randomized ssl (true) and clientAuth (false) via: @org.apache.solr.util.RandomizeSSL(reason="", value=0.0/0.0, ssl=0.0/0.0, clientAuth=0.0/0.0) [junit4] 2> 562627 INFO (SUITE-ExecutePlanActionTest-seed#[216A22F099D20562]-worker) [ ] o.a.s.SolrTestCaseJ4 SecureRandom sanity checks: test.solr.allowed.securerandom=null & java.security.egd=file:/dev/./urandom [junit4] 2> 562627 INFO (SUITE-ExecutePlanActionTest-seed#[216A22F099D20562]-worker) [ ] o.a.s.c.MiniSolrCloudCluster Starting cluster of 2 servers in C:\Users\jenkins\workspace\Lucene-Solr-master-Windows\solr\build\solr-core\test\J1\temp\solr.cloud.autoscaling.ExecutePlanActionTest_216A22F099D20562-001\tempDir-001 [junit4] 2> 562627 INFO (SUITE-ExecutePlanActionTest-seed#[216A22F099D20562]-worker) [ ] o.a.s.c.ZkTestServer STARTING ZK TEST SERVER [junit4] 2> 562637 INFO (Thread-1757) [ ] o.a.s.c.ZkTestServer client port:0.0.0.0/0.0.0.0:0 [junit4] 2> 562637 INFO (Thread-1757) [ ] o.a.s.c.ZkTestServer Starting server [junit4] 2> 562641 ERROR (Thread-1757) [ ] o.a.z.s.ZooKeeperServer ZKShutdownHandler is not registered, so ZooKeeper server won't take any action on ERROR or SHUTDOWN server state changes [junit4] 2> 562727 INFO (SUITE-ExecutePlanActionTest-seed#[216A22F099D20562]-worker) [ ] o.a.s.c.ZkTestServer start zk server on port:53679 [junit4] 2> 562734 WARN (NIOServerCxn.Factory:0.0.0.0/0.0.0.0:0) [ ] o.a.z.s.NIOServerCnxn caught end of stream exception [junit4] 2> EndOfStreamException: Unable to read additional data from client sessionid 0x15f46729deb0000, likely client has closed socket [junit4] 2> at org.apache.zookeeper.server.NIOServerCnxn.doIO(NIOServerCnxn.java:239) [junit4] 2> at org.apache.zookeeper.server.NIOServerCnxnFactory.run(NIOServerCnxnFactory.java:203) [junit4] 2> at java.base/java.lang.Thread.run(Thread.java:844) [junit4] 2> 562751 INFO (jetty-launcher-2597-thread-2) [ ] o.e.j.s.Server jetty-9.3.20.v20170531 [junit4] 2> 562753 INFO (jetty-launcher-2597-thread-1) [ ] o.e.j.s.Server jetty-9.3.20.v20170531 [junit4] 2> 562754 INFO (jetty-launcher-2597-thread-1) [ ] o.e.j.s.h.ContextHandler Started o.e.j.s.ServletContextHandler@6fcae453{/solr,null,AVAILABLE} [junit4] 2> 562757 INFO (jetty-launcher-2597-thread-1) [ ] o.e.j.s.AbstractConnector Started ServerConnector@187e1046{SSL,[ssl, http/1.1]}{127.0.0.1:53683} [junit4] 2> 562757 INFO (jetty-launcher-2597-thread-1) [ ] o.e.j.s.Server Started @572962ms [junit4] 2> 562757 INFO (jetty-launcher-2597-thread-1) [ ] o.a.s.c.s.e.JettySolrRunner Jetty properties: {hostContext=/solr, hostPort=53683} [junit4] 2> 562757 ERROR (jetty-launcher-2597-thread-1) [ ] o.a.s.u.StartupLoggingUtils Missing Java Option solr.log.dir. Logging may be missing or incomplete. [junit4] 2> 562757 INFO (jetty-launcher-2597-thread-1) [ ] o.a.s.s.SolrDispatchFilter ___ _ Welcome to Apache Solr? version 8.0.0 [junit4] 2> 562757 INFO (jetty-launcher-2597-thread-1) [ ] o.a.s.s.SolrDispatchFilter / __| ___| |_ _ Starting in cloud mode on port null [junit4] 2> 562757 INFO (jetty-launcher-2597-thread-1) [ ] o.a.s.s.SolrDispatchFilter \__ \/ _ \ | '_| Install dir: null, Default config dir: null [junit4] 2> 562757 INFO (jetty-launcher-2597-thread-1) [ ] o.a.s.s.SolrDispatchFilter |___/\___/_|_| Start time: 2017-10-22T23:37:17.663501500Z [junit4] 2> 562764 INFO (jetty-launcher-2597-thread-2) [ ] o.e.j.s.h.ContextHandler Started o.e.j.s.ServletContextHandler@2c85f33c{/solr,null,AVAILABLE} [junit4] 2> 562766 INFO (jetty-launcher-2597-thread-2) [ ] o.e.j.s.AbstractConnector Started ServerConnector@45c2dce1{SSL,[ssl, http/1.1]}{127.0.0.1:53688} [junit4] 2> 562766 INFO (jetty-launcher-2597-thread-2) [ ] o.e.j.s.Server Started @572972ms [junit4] 2> 562766 INFO (jetty-launcher-2597-thread-2) [ ] o.a.s.c.s.e.JettySolrRunner Jetty properties: {hostContext=/solr, hostPort=53688} [junit4] 2> 562766 ERROR (jetty-launcher-2597-thread-2) [ ] o.a.s.u.StartupLoggingUtils Missing Java Option solr.log.dir. Logging may be missing or incomplete. [junit4] 2> 562766 INFO (jetty-launcher-2597-thread-2) [ ] o.a.s.s.SolrDispatchFilter ___ _ Welcome to Apache Solr? version 8.0.0 [junit4] 2> 562766 INFO (jetty-launcher-2597-thread-2) [ ] o.a.s.s.SolrDispatchFilter / __| ___| |_ _ Starting in cloud mode on port null [junit4] 2> 562766 INFO (jetty-launcher-2597-thread-2) [ ] o.a.s.s.SolrDispatchFilter \__ \/ _ \ | '_| Install dir: null, Default config dir: null [junit4] 2> 562766 INFO (jetty-launcher-2597-thread-2) [ ] o.a.s.s.SolrDispatchFilter |___/\___/_|_| Start time: 2017-10-22T23:37:17.672645500Z [junit4] 2> 562784 INFO (jetty-launcher-2597-thread-1) [ ] o.a.s.s.SolrDispatchFilter solr.xml found in ZooKeeper. Loading... [junit4] 2> 562788 WARN (NIOServerCxn.Factory:0.0.0.0/0.0.0.0:0) [ ] o.a.z.s.NIOServerCnxn caught end of stream exception [junit4] 2> EndOfStreamException: Unable to read additional data from client sessionid 0x15f46729deb0001, likely client has closed socket [junit4] 2> at org.apache.zookeeper.server.NIOServerCnxn.doIO(NIOServerCnxn.java:239) [junit4] 2> at org.apache.zookeeper.server.NIOServerCnxnFactory.run(NIOServerCnxnFactory.java:203) [junit4] 2> at java.base/java.lang.Thread.run(Thread.java:844) [junit4] 2> 562789 INFO (jetty-launcher-2597-thread-2) [ ] o.a.s.s.SolrDispatchFilter solr.xml found in ZooKeeper. Loading... [junit4] 2> 562790 INFO (jetty-launcher-2597-thread-1) [ ] o.a.s.c.ZkContainer Zookeeper client=127.0.0.1:53679/solr [junit4] 2> 562799 INFO (jetty-launcher-2597-thread-2) [ ] o.a.s.c.ZkContainer Zookeeper client=127.0.0.1:53679/solr [junit4] 2> 562927 INFO (jetty-launcher-2597-thread-2) [ ] o.a.s.c.Overseer Overseer (id=null) closing [junit4] 2> 562927 INFO (jetty-launcher-2597-thread-1) [ ] o.a.s.c.Overseer Overseer (id=null) closing [junit4] 2> 562928 INFO (jetty-launcher-2597-thread-2) [ ] o.a.s.c.OverseerElectionContext I am going to be the leader 127.0.0.1:53688_solr [junit4] 2> 562928 INFO (jetty-launcher-2597-thread-1) [ ] o.a.s.c.ZkController Register node as live in ZooKeeper:/live_nodes/127.0.0.1:53683_solr [junit4] 2> 562929 INFO (jetty-launcher-2597-thread-2) [ ] o.a.s.c.Overseer Overseer (id=98875174915080198-127.0.0.1:53688_solr-n_0000000000) starting [junit4] 2> 562930 INFO (zkCallback-2608-thread-1) [ ] o.a.s.c.c.ZkStateReader Updated live nodes from ZooKeeper... (0) -> (1) [junit4] 2> 562930 INFO (zkCallback-2609-thread-1) [ ] o.a.s.c.c.ZkStateReader Updated live nodes from ZooKeeper... (0) -> (1) [junit4] 2> 562937 INFO (jetty-launcher-2597-thread-2) [ ] o.a.s.c.ZkController Register node as live in ZooKeeper:/live_nodes/127.0.0.1:53688_solr [junit4] 2> 562943 INFO (zkCallback-2608-thread-1) [ ] o.a.s.c.c.ZkStateReader Updated live nodes from ZooKeeper... (1) -> (2) [junit4] 2> 562943 INFO (zkCallback-2609-thread-1) [ ] o.a.s.c.c.ZkStateReader Updated live nodes from ZooKeeper... (1) -> (2) [junit4] 2> 562961 DEBUG (OverseerAutoScalingTriggerThread-98875174915080198-127.0.0.1:53688_solr-n_0000000000) [ ] o.a.s.c.a.OverseerTriggerThread Adding .autoAddReplicas trigger [junit4] 2> 562964 DEBUG (OverseerAutoScalingTriggerThread-98875174915080198-127.0.0.1:53688_solr-n_0000000000) [ ] o.a.s.c.a.OverseerTriggerThread Refreshing /autoscaling.json with znode version 1 [junit4] 2> 562965 DEBUG (OverseerAutoScalingTriggerThread-98875174915080198-127.0.0.1:53688_solr-n_0000000000) [ ] o.a.s.c.a.NodeLostTrigger Initial livenodes: [127.0.0.1:53683_solr, 127.0.0.1:53688_solr] [junit4] 2> 562966 DEBUG (OverseerAutoScalingTriggerThread-98875174915080198-127.0.0.1:53688_solr-n_0000000000) [ ] o.a.s.c.a.OverseerTriggerThread Current znodeVersion 1, lastZnodeVersion -1 [junit4] 2> 562966 DEBUG (OverseerAutoScalingTriggerThread-98875174915080198-127.0.0.1:53688_solr-n_0000000000) [ ] o.a.s.c.a.OverseerTriggerThread Processed trigger updates upto znodeVersion 1 [junit4] 2> 562971 DEBUG (OverseerAutoScalingTriggerThread-98875174915080198-127.0.0.1:53688_solr-n_0000000000) [ ] o.a.s.c.a.OverseerTriggerThread -- clean old nodeAdded markers [junit4] 2> 562971 DEBUG (OverseerAutoScalingTriggerThread-98875174915080198-127.0.0.1:53688_solr-n_0000000000) [ ] o.a.s.c.a.OverseerTriggerThread Current znodeVersion 1, lastZnodeVersion 1 [junit4] 2> 562978 DEBUG (ScheduledTrigger-3720-thread-1) [ ] o.a.s.c.a.NodeLostTrigger Running NodeLostTrigger: .auto_add_replicas with currently live nodes: [127.0.0.1:53683_solr, 127.0.0.1:53688_solr] [junit4] 2> 563009 INFO (jetty-launcher-2597-thread-1) [ ] o.a.s.m.r.SolrJmxReporter JMX monitoring for 'solr_53683.solr.node' (registry 'solr.node') enabled at server: com.sun.jmx.mbeanserver.JmxMBeanServer@3bc60d85 [junit4] 2> 563009 INFO (jetty-launcher-2597-thread-2) [ ] o.a.s.m.r.SolrJmxReporter JMX monitoring for 'solr_53688.solr.node' (registry 'solr.node') enabled at server: com.sun.jmx.mbeanserver.JmxMBeanServer@3bc60d85 [junit4] 2> 563019 INFO (jetty-launcher-2597-thread-2) [ ] o.a.s.m.r.SolrJmxReporter JMX monitoring for 'solr_53688.solr.jvm' (registry 'solr.jvm') enabled at server: com.sun.jmx.mbeanserver.JmxMBeanServer@3bc60d85 [junit4] 2> 563020 INFO (jetty-launcher-2597-thread-1) [ ] o.a.s.m.r.SolrJmxReporter JMX monitoring for 'solr_53683.solr.jvm' (registry 'solr.jvm') enabled at server: com.sun.jmx.mbeanserver.JmxMBeanServer@3bc60d85 [junit4] 2> 563020 INFO (jetty-launcher-2597-thread-2) [ ] o.a.s.m.r.SolrJmxReporter JMX monitoring for 'solr_53688.solr.jetty' (registry 'solr.jetty') enabled at server: com.sun.jmx.mbeanserver.JmxMBeanServer@3bc60d85 [junit4] 2> 563020 INFO (jetty-launcher-2597-thread-1) [ ] o.a.s.m.r.SolrJmxReporter JMX monitoring for 'solr_53683.solr.jetty' (registry 'solr.jetty') enabled at server: com.sun.jmx.mbeanserver.JmxMBeanServer@3bc60d85 [junit4] 2> 563021 INFO (jetty-launcher-2597-thread-2) [ ] o.a.s.c.CorePropertiesLocator Found 0 core definitions underneath C:\Users\jenkins\workspace\Lucene-Solr-master-Windows\solr\build\solr-core\test\J1\temp\solr.cloud.autoscaling.ExecutePlanActionTest_216A22F099D20562-001\tempDir-001\node2\. [junit4] 2> 563021 INFO (jetty-launcher-2597-thread-1) [ ] o.a.s.c.CorePropertiesLocator Found 0 core definitions underneath C:\Users\jenkins\workspace\Lucene-Solr-master-Windows\solr\build\solr-core\test\J1\temp\solr.cloud.autoscaling.ExecutePlanActionTest_216A22F099D20562-001\tempDir-001\node1\. [junit4] 2> 563064 WARN (NIOServerCxn.Factory:0.0.0.0/0.0.0.0:0) [ ] o.a.z.s.NIOServerCnxn caught end of stream exception [junit4] 2> EndOfStreamException: Unable to read additional data from client sessionid 0x15f46729deb0007, likely client has closed socket [junit4] 2> at org.apache.zookeeper.server.NIOServerCnxn.doIO(NIOServerCnxn.java:239) [junit4] 2> at org.apache.zookeeper.server.NIOServerCnxnFactory.run(NIOServerCnxnFactory.java:203) [junit4] 2> at java.base/java.lang.Thread.run(Thread.java:844) [junit4] 2> 563069 INFO (SUITE-ExecutePlanActionTest-seed#[216A22F099D20562]-worker) [ ] o.a.s.c.c.ZkStateReader Updated live nodes from ZooKeeper... (0) -> (2) [junit4] 2> 563070 INFO (SUITE-ExecutePlanActionTest-seed#[216A22F099D20562]-worker) [ ] o.a.s.c.s.i.ZkClientClusterStateProvider Cluster at 127.0.0.1:53679/solr ready [junit4] 2> 563084 INFO (TEST-ExecutePlanActionTest.testExecute-seed#[216A22F099D20562]) [ ] o.a.s.SolrTestCaseJ4 ###Starting testExecute [junit4] 2> 563084 DEBUG (zkCallback-2609-thread-1) [ ] o.a.s.c.a.OverseerTriggerThread Refreshing /autoscaling.json with znode version 2 [junit4] 2> 563084 DEBUG (OverseerAutoScalingTriggerThread-98875174915080198-127.0.0.1:53688_solr-n_0000000000) [ ] o.a.s.c.a.OverseerTriggerThread Processed trigger updates upto znodeVersion 2 [junit4] 2> 563090 DEBUG (OverseerAutoScalingTriggerThread-98875174915080198-127.0.0.1:53688_solr-n_0000000000) [ ] o.a.s.c.a.OverseerTriggerThread -- clean old nodeLost markers [junit4] 2> 563091 DEBUG (OverseerAutoScalingTriggerThread-98875174915080198-127.0.0.1:53688_solr-n_0000000000) [ ] o.a.s.c.a.OverseerTriggerThread -- clean old nodeAdded markers [junit4] 2> 563112 DEBUG (OverseerAutoScalingTriggerThread-98875174915080198-127.0.0.1:53688_solr-n_0000000000) [ ] o.a.s.c.a.OverseerTriggerThread Current znodeVersion 2, lastZnodeVersion 2 [junit4] 2> 563122 INFO (qtp2014545226-11034) [ ] o.a.s.h.a.CollectionsHandler Invoked Collection Action :create with params replicationFactor=2&collection.configName=conf&maxShardsPerNode=1&name=testExecute&nrtReplicas=2&action=CREATE&numShards=1&wt=javabin&version=2 and sendToOCPQueue=true [junit4] 2> 563128 INFO (OverseerThreadFactory-3722-thread-1) [ ] o.a.s.c.CreateCollectionCmd Create collection testExecute [junit4] 2> 563289 INFO (OverseerStateUpdate-98875174915080198-127.0.0.1:53688_solr-n_0000000000) [ ] o.a.s.c.o.SliceMutator createReplica() { [junit4] 2> "operation":"ADDREPLICA", [junit4] 2> "collection":"testExecute", [junit4] 2> "shard":"shard1", [junit4] 2> "core":"testExecute_shard1_replica_n1", [junit4] 2> "state":"down", [junit4] 2> "base_url":"https://127.0.0.1:53688/solr", [junit4] 2> "type":"NRT", [junit4] 2> "waitForFinalState":"false"} [junit4] 2> 563291 INFO (OverseerStateUpdate-98875174915080198-127.0.0.1:53688_solr-n_0000000000) [ ] o.a.s.c.o.SliceMutator createReplica() { [junit4] 2> "operation":"ADDREPLICA", [junit4] 2> "collection":"testExecute", [junit4] 2> "shard":"shard1", [junit4] 2> "core":"testExecute_shard1_replica_n2", [junit4] 2> "state":"down", [junit4] 2> "base_url":"https://127.0.0.1:53683/solr", [junit4] 2> "type":"NRT", [junit4] 2> "waitForFinalState":"false"} [junit4] 2> 563498 INFO (qtp2014545226-11036) [ ] o.a.s.h.a.CoreAdminOperation core create command qt=/admin/cores&coreNodeName=core_node3&collection.configName=conf&newCollection=true&name=testExecute_shard1_replica_n1&action=CREATE&numShards=1&collection=testExecute&shard=shard1&wt=javabin&version=2&replicaType=NRT [junit4] 2> 563498 INFO (qtp2014545226-11036) [ ] o.a.s.c.TransientSolrCoreCacheDefault Allocating transient cache for 2147483647 transient cores [junit4] 2> 563513 INFO (qtp440481688-11042) [ ] o.a.s.h.a.CoreAdminOperation core create command qt=/admin/cores&coreNodeName=core_node4&collection.configName=conf&newCollection=true&name=testExecute_shard1_replica_n2&action=CREATE&numShards=1&collection=testExecute&shard=shard1&wt=javabin&version=2&replicaType=NRT [junit4] 2> 563514 INFO (qtp440481688-11042) [ ] o.a.s.c.TransientSolrCoreCacheDefault Allocating transient cache for 2147483647 transient cores [junit4] 2> 563621 INFO (zkCallback-2608-thread-1) [ ] o.a.s.c.c.ZkStateReader A cluster state change: [WatchedEvent state:SyncConnected type:NodeDataChanged path:/collections/testExecute/state.json] for collection [testExecute] has occurred - updating... (live nodes size: [2]) [junit4] 2> 563621 INFO (zkCallback-2609-thread-1) [ ] o.a.s.c.c.ZkStateReader A cluster state change: [WatchedEvent state:SyncConnected type:NodeDataChanged path:/collections/testExecute/state.json] for collection [testExecute] has occurred - updating... (live nodes size: [2]) [junit4] 2> 563622 INFO (zkCallback-2608-thread-2) [ ] o.a.s.c.c.ZkStateReader A cluster state change: [WatchedEvent state:SyncConnected type:NodeDataChanged path:/collections/testExecute/state.json] for collection [testExecute] has occurred - updating... (live nodes size: [2]) [junit4] 2> 563622 INFO (zkCallback-2609-thread-2) [ ] o.a.s.c.c.ZkStateReader A cluster state change: [WatchedEvent state:SyncConnected type:NodeDataChanged path:/collections/testExecute/state.json] for collection [testExecute] has occurred - updating... (live nodes size: [2]) [junit4] 2> 564512 INFO (qtp2014545226-11036) [ ] o.a.s.c.SolrConfig Using Lucene MatchVersion: 8.0.0 [junit4] 2> 564523 INFO (qtp2014545226-11036) [ ] o.a.s.s.IndexSchema [testExecute_shard1_replica_n1] Schema name=minimal [junit4] 2> 564527 INFO (qtp2014545226-11036) [ ] o.a.s.s.IndexSchema Loaded schema minimal/1.1 with uniqueid field id [junit4] 2> 564527 INFO (qtp2014545226-11036) [ ] o.a.s.c.CoreContainer Creating SolrCore 'testExecute_shard1_replica_n1' using configuration from collection testExecute, trusted=true [junit4] 2> 564528 INFO (qtp2014545226-11036) [ ] o.a.s.m.r.SolrJmxReporter JMX monitoring for 'solr_53688.solr.core.testExecute.shard1.replica_n1' (registry 'solr.core.testExecute.shard1.replica_n1') enabled at server: com.sun.jmx.mbeanserver.JmxMBeanServer@3bc60d85 [junit4] 2> 564528 INFO (qtp2014545226-11036) [ ] o.a.s.c.SolrCore solr.RecoveryStrategy.Builder [junit4] 2> 564528 INFO (qtp2014545226-11036) [ ] o.a.s.c.SolrCore [[testExecute_shard1_replica_n1] ] Opening new SolrCore at [C:\Users\jenkins\workspace\Lucene-Solr-master-Windows\solr\build\solr-core\test\J1\temp\solr.cloud.autoscaling.ExecutePlanActionTest_216A22F099D20562-001\tempDir-001\node2\testExecute_shard1_replica_n1], dataDir=[C:\Users\jenkins\workspace\Lucene-Solr-master-Windows\solr\build\solr-core\test\J1\temp\solr.cloud.autoscaling.ExecutePlanActionTest_216A22F099D20562-001\tempDir-001\node2\.\testExecute_shard1_replica_n1\data\] [junit4] 2> 564528 INFO (qtp440481688-11042) [ ] o.a.s.c.SolrConfig Using Lucene MatchVersion: 8.0.0 [junit4] 2> 564537 INFO (qtp440481688-11042) [ ] o.a.s.s.IndexSchema [testExecute_shard1_replica_n2] Schema name=minimal [junit4] 2> 564541 INFO (qtp440481688-11042) [ ] o.a.s.s.IndexSchema Loaded schema minimal/1.1 with uniqueid field id [junit4] 2> 564541 INFO (qtp440481688-11042) [ ] o.a.s.c.CoreContainer Creating SolrCore 'testExecute_shard1_replica_n2' using configuration from collection testExecute, trusted=true [junit4] 2> 564543 INFO (qtp440481688-11042) [ ] o.a.s.m.r.SolrJmxReporter JMX monitoring for 'solr_53683.solr.core.testExecute.shard1.replica_n2' (registry 'solr.core.testExecute.shard1.replica_n2') enabled at server: com.sun.jmx.mbeanserver.JmxMBeanServer@3bc60d85 [junit4] 2> 564543 INFO (qtp440481688-11042) [ ] o.a.s.c.SolrCore solr.RecoveryStrategy.Builder [junit4] 2> 564543 INFO (qtp440481688-11042) [ ] o.a.s.c.SolrCore [[testExecute_shard1_replica_n2] ] Opening new SolrCore at [C:\Users\jenkins\workspace\Lucene-Solr-master-Windows\solr\build\solr-core\test\J1\temp\solr.cloud.autoscaling.ExecutePlanActionTest_216A22F099D20562-001\tempDir-001\node1\testExecute_shard1_replica_n2], dataDir=[C:\Users\jenkins\workspace\Lucene-Solr-master-Windows\solr\build\solr-core\test\J1\temp\solr.cloud.autoscaling.ExecutePlanActionTest_216A22F099D20562-001\tempDir-001\node1\.\testExecute_shard1_replica_n2\data\] [junit4] 2> 564611 INFO (qtp2014545226-11036) [ ] o.a.s.u.UpdateHandler Using UpdateLog implementation: org.apache.solr.update.UpdateLog [junit4] 2> 564611 INFO (qtp2014545226-11036) [ ] o.a.s.u.UpdateLog Initializing UpdateLog: dataDir=null defaultSyncLevel=FLUSH numRecordsToKeep=100 maxNumLogsToKeep=10 numVersionBuckets=65536 [junit4] 2> 564613 INFO (qtp2014545226-11036) [ ] o.a.s.u.CommitTracker Hard AutoCommit: disabled [junit4] 2> 564613 INFO (qtp2014545226-11036) [ ] o.a.s.u.CommitTracker Soft AutoCommit: disabled [junit4] 2> 564617 INFO (qtp440481688-11042) [ ] o.a.s.u.UpdateHandler Using UpdateLog implementation: org.apache.solr.update.UpdateLog [junit4] 2> 564617 INFO (qtp440481688-11042) [ ] o.a.s.u.UpdateLog Initializing UpdateLog: dataDir=null defaultSyncLevel=FLUSH numRecordsToKeep=100 maxNumLogsToKeep=10 numVersionBuckets=65536 [junit4] 2> 564619 INFO (qtp440481688-11042) [ ] o.a.s.u.CommitTracker Hard AutoCommit: disabled [junit4] 2> 564619 INFO (qtp440481688-11042) [ ] o.a.s.u.CommitTracker Soft AutoCommit: disabled [junit4] 2> 564620 INFO (qtp2014545226-11036) [ ] o.a.s.s.SolrIndexSearcher Opening [Searcher@49062e88[testExecute_shard1_replica_n1] main] [junit4] 2> 564621 INFO (qtp2014545226-11036) [ ] o.a.s.r.ManagedResourceStorage Configured ZooKeeperStorageIO with znodeBase: /configs/conf [junit4] 2> 564621 INFO (qtp440481688-11042) [ ] o.a.s.s.SolrIndexSearcher Opening [Searcher@2d66cd10[testExecute_shard1_replica_n2] main] [junit4] 2> 564621 INFO (qtp2014545226-11036) [ ] o.a.s.r.ManagedResourceStorage Loaded null at path _rest_managed.json using ZooKeeperStorageIO:path=/configs/conf [junit4] 2> 564622 INFO (qtp2014545226-11036) [ ] o.a.s.h.ReplicationHandler Commits will be reserved for 10000ms. [junit4] 2> 564622 INFO (qtp2014545226-11036) [ ] o.a.s.u.UpdateLog Could not find max version in index or recent updates, using new clock 1582002800718512128 [junit4] 2> 564623 INFO (searcherExecutor-3727-thread-1) [ ] o.a.s.c.SolrCore [testExecute_shard1_replica_n1] Registered new searcher Searcher@49062e88[testExecute_shard1_replica_n1] main{ExitableDirectoryReader(UninvertingDirectoryReader())} [junit4] 2> 564625 INFO (qtp440481688-11042) [ ] o.a.s.r.ManagedResourceStorage Configured ZooKeeperStorageIO with znodeBase: /configs/conf [junit4] 2> 564626 INFO (qtp440481688-11042) [ ] o.a.s.r.ManagedResourceStorage Loaded null at path _rest_managed.json using ZooKeeperStorageIO:path=/configs/conf [junit4] 2> 564626 INFO (qtp440481688-11042) [ ] o.a.s.h.ReplicationHandler Commits will be reserved for 10000ms. [junit4] 2> 564627 INFO (qtp440481688-11042) [ ] o.a.s.u.UpdateLog Could not find max version in index or recent updates, using new clock 1582002800723755008 [junit4] 2> 564627 INFO (searcherExecutor-3728-thread-1) [ ] o.a.s.c.SolrCore [testExecute_shard1_replica_n2] Registered new searcher Searcher@2d66cd10[testExecute_shard1_replica_n2] main{ExitableDirectoryReader(UninvertingDirectoryReader())} [junit4] 2> 564633 INFO (qtp2014545226-11036) [ ] o.a.s.c.ShardLeaderElectionContext Enough replicas found to continue. [junit4] 2> 564634 INFO (qtp2014545226-11036) [ ] o.a.s.c.ShardLeaderElectionContext I may be the new leader - try and sync [junit4] 2> 564634 INFO (qtp2014545226-11036) [ ] o.a.s.c.SyncStrategy Sync replicas to https://127.0.0.1:53688/solr/testExecute_shard1_replica_n1/ [junit4] 2> 564634 INFO (qtp2014545226-11036) [ ] o.a.s.u.PeerSync PeerSync: core=testExecute_shard1_replica_n1 url=https://127.0.0.1:53688/solr START replicas=[https://127.0.0.1:53683/solr/testExecute_shard1_replica_n2/] nUpdates=100 [junit4] 2> 564639 INFO (qtp440481688-11045) [ ] o.a.s.c.S.Request [testExecute_shard1_replica_n2] webapp=/solr path=/get params={distrib=false&qt=/get&fingerprint=false&getVersions=100&wt=javabin&version=2} status=0 QTime=0 [junit4] 2> 564736 INFO (zkCallback-2608-thread-2) [ ] o.a.s.c.c.ZkStateReader A cluster state change: [WatchedEvent state:SyncConnected type:NodeDataChanged path:/collections/testExecute/state.json] for collection [testExecute] has occurred - updating... (live nodes size: [2]) [junit4] 2> 564737 INFO (zkCallback-2608-thread-1) [ ] o.a.s.c.c.ZkStateReader A cluster state change: [WatchedEvent state:SyncConnected type:NodeDataChanged path:/collections/testExecute/state.json] for collection [testExecute] has occurred - updating... (live nodes size: [2]) [junit4] 2> 564737 INFO (zkCallback-2609-thread-2) [ ] o.a.s.c.c.ZkStateReader A cluster state change: [WatchedEvent state:SyncConnected type:NodeDataChanged path:/collections/testExecute/state.json] for collection [testExecute] has occurred - updating... (live nodes size: [2]) [junit4] 2> 564737 INFO (zkCallback-2609-thread-3) [ ] o.a.s.c.c.ZkStateReader A cluster state change: [WatchedEvent state:SyncConnected type:NodeDataChanged path:/collections/testExecute/state.json] for collection [testExecute] has occurred - updating... (live nodes size: [2]) [junit4] 2> 564935 INFO (qtp2014545226-11036) [ ] o.a.s.u.PeerSync PeerSync: core=testExecute_shard1_replica_n1 url=https://127.0.0.1:53688/solr DONE. We have no versions. sync failed. [junit4] 2> 564935 INFO (qtp2014545226-11036) [ ] o.a.s.c.SyncStrategy Leader's attempt to sync with shard failed, moving to the next candidate [junit4] 2> 564935 INFO (qtp2014545226-11036) [ ] o.a.s.c.ShardLeaderElectionContext We failed sync, but we have no versions - we can't sync in that case - we were active before, so become leader anyway [junit4] 2> 564935 INFO (qtp2014545226-11036) [ ] o.a.s.c.ShardLeaderElectionContext Found all replicas participating in election, clear LIR [junit4] 2> 564939 INFO (qtp2014545226-11036) [ ] o.a.s.c.ShardLeaderElectionContext I am the new leader: https://127.0.0.1:53688/solr/testExecute_shard1_replica_n1/ shard1 [junit4] 2> 565042 INFO (zkCallback-2609-thread-3) [ ] o.a.s.c.c.ZkStateReader A cluster state change: [WatchedEvent state:SyncConnected type:NodeDataChanged path:/collections/testExecute/state.json] for collection [testExecute] has occurred - updating... (live nodes size: [2]) [junit4] 2> 565042 INFO (zkCallback-2608-thread-2) [ ] o.a.s.c.c.ZkStateReader A cluster state change: [WatchedEvent state:SyncConnected type:NodeDataChanged path:/collections/testExecute/state.json] for collection [testExecute] has occurred - updating... (live nodes size: [2]) [junit4] 2> 565042 INFO (zkCallback-2608-thread-1) [ ] o.a.s.c.c.ZkStateReader A cluster state change: [WatchedEvent state:SyncConnected type:NodeDataChanged path:/collections/testExecute/state.json] for collection [testExecute] has occurred - updating... (live nodes size: [2]) [junit4] 2> 565042 INFO (zkCallback-2609-thread-2) [ ] o.a.s.c.c.ZkStateReader A cluster state change: [WatchedEvent state:SyncConnected type:NodeDataChanged path:/collections/testExecute/state.json] for collection [testExecute] has occurred - updating... (live nodes size: [2]) [junit4] 2> 565092 INFO (qtp2014545226-11036) [ ] o.a.s.c.ZkController I am the leader, no recovery necessary [junit4] 2> 565094 INFO (qtp2014545226-11036) [ ] o.a.s.s.HttpSolrCall [admin] webapp=null path=/admin/cores params={qt=/admin/cores&coreNodeName=core_node3&collection.configName=conf&newCollection=true&name=testExecute_shard1_replica_n1&action=CREATE&numShards=1&collection=testExecute&shard=shard1&wt=javabin&version=2&replicaType=NRT} status=0 QTime=1596 [junit4] 2> 565196 INFO (zkCallback-2609-thread-1) [ ] o.a.s.c.c.ZkStateReader A cluster state change: [WatchedEvent state:SyncConnected type:NodeDataChanged path:/collections/testExecute/state.json] for collection [testExecute] has occurred - updating... (live nodes size: [2]) [junit4] 2> 565196 INFO (zkCallback-2608-thread-1) [ ] o.a.s.c.c.ZkStateReader A cluster state change: [WatchedEvent state:SyncConnected type:NodeDataChanged path:/collections/testExecute/state.json] for collection [testExecute] has occurred - updating... (live nodes size: [2]) [junit4] 2> 565197 INFO (zkCallback-2608-thread-2) [ ] o.a.s.c.c.ZkStateReader A cluster state change: [WatchedEvent state:SyncConnected type:NodeDataChanged path:/collections/testExecute/state.json] for collection [testExecute] has occurred - updating... (live nodes size: [2]) [junit4] 2> 565196 INFO (zkCallback-2609-thread-2) [ ] o.a.s.c.c.ZkStateReader A cluster state change: [WatchedEvent state:SyncConnected type:NodeDataChanged path:/collections/testExecute/state.json] for collection [testExecute] has occurred - updating... (live nodes size: [2]) [junit4] 2> 565644 INFO (qtp440481688-11042) [ ] o.a.s.s.HttpSolrCall [admin] webapp=null path=/admin/cores params={qt=/admin/cores&coreNodeName=core_node4&collection.configName=conf&newCollection=true&name=testExecute_shard1_replica_n2&action=CREATE&numShards=1&collection=testExecute&shard=shard1&wt=javabin&version=2&replicaType=NRT} status=0 QTime=2131 [junit4] 2> 565659 INFO (qtp2014545226-11034) [ ] o.a.s.h.a.CollectionsHandler Wait for new collection to be active for at most 30 seconds. Check all shard replicas [junit4] 2> 565768 INFO (zkCallback-2608-thread-2) [ ] o.a.s.c.c.ZkStateReader A cluster state change: [WatchedEvent state:SyncConnected type:NodeDataChanged path:/collections/testExecute/state.json] for collection [testExecute] has occurred - updating... (live nodes size: [2]) [junit4] 2> 565768 INFO (zkCallback-2608-thread-1) [ ] o.a.s.c.c.ZkStateReader A cluster state change: [WatchedEvent state:SyncConnected type:NodeDataChanged path:/collections/testExecute/state.json] for collection [testExecute] has occurred - updating... (live nodes size: [2]) [junit4] 2> 565769 INFO (zkCallback-2609-thread-2) [ ] o.a.s.c.c.ZkStateReader A cluster state change: [WatchedEvent state:SyncConnected type:NodeDataChanged path:/collections/testExecute/state.json] for collection [testExecute] has occurred - updating... (live nodes size: [2]) [junit4] 2> 565769 INFO (zkCallback-2609-thread-1) [ ] o.a.s.c.c.ZkStateReader A cluster state change: [WatchedEvent state:SyncConnected type:NodeDataChanged path:/collections/testExecute/state.json] for collection [testExecute] has occurred - updating... (live nodes size: [2]) [junit4] 2> 566659 INFO (qtp2014545226-11034) [ ] o.a.s.s.HttpSolrCall [admin] webapp=null path=/admin/collections params={replicationFactor=2&collection.configName=conf&maxShardsPerNode=1&name=testExecute&nrtReplicas=2&action=CREATE&numShards=1&wt=javabin&version=2} status=0 QTime=3537 [junit4] 2> 566665 DEBUG (TEST-ExecutePlanActionTest.testExecute-seed#[216A22F099D20562]) [ ] o.a.s.c.a.ExecutePlanAction -- processing event: { [junit4] 2> "id":"14f008b359fc6ec0Ta83csubplbw55yuenqvn7zxmw", [junit4] 2> "source":"mock_trigger_name", [junit4] 2> "eventTime":1508715441571000000, [junit4] 2> "eventType":"NODELOST", [junit4] 2> "properties":{ [junit4] 2> "eventTimes":[1508715441571000000], [junit4] 2> "nodeNames":["127.0.0.1:53683_solr"]}} with context properties: {operations=[org.apache.solr.client.solrj.request.CollectionAdminRequest$MoveReplica@3aa12252, org.apache.solr.cloud.autoscaling.ExecutePlanActionTest$1@64d5b490]} [junit4] 2> 566666 INFO (TEST-ExecutePlanActionTest.testExecute-seed#[216A22F099D20562]) [ ] o.a.s.c.a.ExecutePlanAction Executing operation: action=MOVEREPLICA&collection=testExecute&targetNode=127.0.0.1:53688_solr&replica=core_node4 [junit4] 2> 566672 DEBUG (TEST-ExecutePlanActionTest.testExecute-seed#[216A22F099D20562]) [ ] o.a.s.c.a.ExecutePlanAction Saved requestId: mock_trigger_name/14f008b359fc6ec0Ta83csubplbw55yuenqvn7zxmw/0 in znode: /autoscaling/triggerState/mock_trigger_name/execute_plan/op-0000000000 [junit4] 2> 566678 INFO (qtp2014545226-11054) [ ] o.a.s.h.a.CollectionsHandler Invoked Collection Action :movereplica with params async=mock_trigger_name/14f008b359fc6ec0Ta83csubplbw55yuenqvn7zxmw/0&replica=core_node4&action=MOVEREPLICA&collection=testExecute&targetNode=127.0.0.1:53688_solr&wt=javabin&version=2 and sendToOCPQueue=true [junit4] 2> 566682 INFO (qtp2014545226-11054) [ ] o.a.s.s.HttpSolrCall [admin] webapp=null path=/admin/collections params={async=mock_trigger_name/14f008b359fc6ec0Ta83csubplbw55yuenqvn7zxmw/0&replica=core_node4&action=MOVEREPLICA&collection=testExecute&targetNode=127.0.0.1:53688_solr&wt=javabin&version=2} status=0 QTime=4 [junit4] 2> 566684 INFO (qtp2014545226-11030) [ ] o.a.s.h.a.CollectionsHandler Invoked Collection Action :requeststatus with params requestid=mock_trigger_name/14f008b359fc6ec0Ta83csubplbw55yuenqvn7zxmw/0&action=REQUESTSTATUS&wt=javabin&version=2 and sendToOCPQueue=true [junit4] 2> 566688 INFO (qtp2014545226-11030) [ ] o.a.s.s.HttpSolrCall [admin] webapp=null path=/admin/collections params={requestid=mock_trigger_name/14f008b359fc6ec0Ta83csubplbw55yuenqvn7zxmw/0&action=REQUESTSTATUS&wt=javabin&version=2} status=0 QTime=4 [junit4] 2> 566694 INFO (OverseerCollectionConfigSetProcessor-98875174915080198-127.0.0.1:53688_solr-n_0000000000) [ ] o.a.s.c.OverseerTaskQueue Response ZK path: /overseer/collection-queue-work/qnr-0000000000 doesn't exist. Requestor may have disconnected from ZooKeeper [junit4] 2> 566694 INFO (OverseerThreadFactory-3722-thread-2) [ ] o.a.s.c.MoveReplicaCmd Replica will be moved core_node4:{"core":"testExecute_shard1_replica_n2","base_url":"https://127.0.0.1:53683/solr","node_name":"127.0.0.1:53683_solr","state":"active","type":"NRT"} [junit4] 2> 566699 INFO (OverseerThreadFactory-3722-thread-2) [ ] o.a.s.c.AddReplicaCmd Node Identified 127.0.0.1:53688_solr for creating new replica [junit4] 2> 566703 INFO (OverseerStateUpdate-98875174915080198-127.0.0.1:53688_solr-n_0000000000) [ ] o.a.s.c.o.SliceMutator createReplica() { [junit4] 2> "operation":"addreplica", [junit4] 2> "collection":"testExecute", [junit4] 2> "shard":"shard1", [junit4] 2> "core":"testExecute_shard1_replica_n5", [junit4] 2> "state":"down", [junit4] 2> "base_url":"https://127.0.0.1:53688/solr", [junit4] 2> "node_name":"127.0.0.1:53688_solr", [junit4] 2> "type":"NRT"} [junit4] 2> 566807 INFO (zkCallback-2609-thread-1) [ ] o.a.s.c.c.ZkStateReader A cluster state change: [WatchedEvent state:SyncConnected type:NodeDataChanged path:/collections/testExecute/state.json] for collection [testExecute] has occurred - updating... (live nodes size: [2]) [junit4] 2> 566807 INFO (zkCallback-2608-thread-2) [ ] o.a.s.c.c.ZkStateReader A cluster state change: [WatchedEvent state:SyncConnected type:NodeDataChanged path:/collections/testExecute/state.json] for collection [testExecute] has occurred - updating... (live nodes size: [2]) [junit4] 2> 566807 INFO (zkCallback-2609-thread-2) [ ] o.a.s.c.c.ZkStateReader A cluster state change: [WatchedEvent state:SyncConnected type:NodeDataChanged path:/collections/testExecute/state.json] for collection [testExecute] has occurred - updating... (live nodes size: [2]) [junit4] 2> 566807 INFO (zkCallback-2608-thread-1) [ ] o.a.s.c.c.ZkStateReader A cluster state change: [WatchedEvent state:SyncConnected type:NodeDataChanged path:/collections/testExecute/state.json] for collection [testExecute] has occurred - updating... (live nodes size: [2]) [junit4] 2> 566906 INFO (qtp2014545226-11033) [ ] o.a.s.s.HttpSolrCall [admin] webapp=null path=/admin/cores params={async=mock_trigger_name/14f008b359fc6ec0Ta83csubplbw55yuenqvn7zxmw/045053573538651&qt=/admin/cores&coreNodeName=core_node6&collection.configName=conf&name=testExecute_shard1_replica_n5&action=CREATE&collection=testExecute&shard=shard1&wt=javabin&version=2&replicaType=NRT} status=0 QTime=0 [junit4] 2> 566907 INFO (parallelCoreAdminExecutor-3724-thread-1) [ ] o.a.s.h.a.CoreAdminOperation core create command async=mock_trigger_name/14f008b359fc6ec0Ta83csubplbw55yuenqvn7zxmw/045053573538651&qt=/admin/cores&coreNodeName=core_node6&collection.configName=conf&name=testExecute_shard1_replica_n5&action=CREATE&collection=testExecute&shard=shard1&wt=javabin&version=2&replicaType=NRT [junit4] 2> 566907 INFO (qtp2014545226-11035) [ ] o.a.s.h.a.CoreAdminOperation Checking request status for : mock_trigger_name/14f008b359fc6ec0Ta83csubplbw55yuenqvn7zxmw/045053573538651 [junit4] 2> 566907 INFO (qtp2014545226-11035) [ ] o.a.s.s.HttpSolrCall [admin] webapp=null path=/admin/cores params={qt=/admin/cores&requestid=mock_trigger_name/14f008b359fc6ec0Ta83csubplbw55yuenqvn7zxmw/045053573538651&action=REQUESTSTATUS&wt=javabin&version=2} status=0 QTime=0 [junit4] 2> 566942 INFO (parallelCoreAdminExecutor-3724-thread-1) [ ] o.a.s.c.SolrConfig Using Lucene MatchVersion: 8.0.0 [junit4] 2> 566954 INFO (parallelCoreAdminExecutor-3724-thread-1) [ ] o.a.s.s.IndexSchema [testExecute_shard1_replica_n5] Schema name=minimal [junit4] 2> 566956 INFO (parallelCoreAdminExecutor-3724-thread-1) [ ] o.a.s.s.IndexSchema Loaded schema minimal/1.1 with uniqueid field id [junit4] 2> 566956 INFO (parallelCoreAdminExecutor-3724-thread-1) [ ] o.a.s.c.CoreContainer Creating SolrCore 'testExecute_shard1_replica_n5' using configuration from collection testExecute, trusted=true [junit4] 2> 566956 INFO (parallelCoreAdminExecutor-3724-thread-1) [ ] o.a.s.m.r.SolrJmxReporter JMX monitoring for 'solr_53688.solr.core.testExecute.shard1.replica_n5' (registry 'solr.core.testExecute.shard1.replica_n5') enabled at server: com.sun.jmx.mbeanserver.JmxMBeanServer@3bc60d85 [junit4] 2> 566957 INFO (parallelCoreAdminExecutor-3724-thread-1) [ ] o.a.s.c.SolrCore solr.RecoveryStrategy.Builder [junit4] 2> 566957 INFO (parallelCoreAdminExecutor-3724-thread-1) [ ] o.a.s.c.SolrCore [[testExecute_shard1_replica_n5] ] Opening new SolrCore at [C:\Users\jenkins\workspace\Lucene-Solr-master-Windows\solr\build\solr-core\test\J1\temp\solr.cloud.autoscaling.ExecutePlanActionTest_216A22F099D20562-001\tempDir-001\node2\testExecute_shard1_replica_n5], dataDir=[C:\Users\jenkins\workspace\Lucene-Solr-master-Windows\solr\build\solr-core\test\J1\temp\solr.cloud.autoscaling.ExecutePlanActionTest_216A22F099D20562-001\tempDir-001\node2\.\testExecute_shard1_replica_n5\data\] [junit4] 2> 567017 INFO (zkCallback-2609-thread-2) [ ] o.a.s.c.c.ZkStateReader A cluster state change: [WatchedEvent state:SyncConnected type:NodeDataChanged path:/collections/testExecute/state.json] for collection [testExecute] has occurred - updating... (live nodes size: [2]) [junit4] 2> 567017 INFO (zkCallback-2608-thread-2) [ ] o.a.s.c.c.ZkStateReader A cluster state change: [WatchedEvent state:SyncConnected type:NodeDataChanged path:/collections/testExecute/state.json] for collection [testExecute] has occurred - updating... (live nodes size: [2]) [junit4] 2> 567017 INFO (zkCallback-2608-thread-1) [ ] o.a.s.c.c.ZkStateReader A cluster state change: [WatchedEvent state:SyncConnected type:NodeDataChanged path:/collections/testExecute/state.json] for collection [testExecute] has occurred - updating... (live nodes size: [2]) [junit4] 2> 567017 INFO (zkCallback-2609-thread-1) [ ] o.a.s.c.c.ZkStateReader A cluster state change: [WatchedEvent state:SyncConnected type:NodeDataChanged path:/collections/testExecute/state.json] for collection [testExecute] has occurred - updating... (live nodes size: [2]) [junit4] 2> 567021 INFO (parallelCoreAdminExecutor-3724-thread-1) [ ] o.a.s.u.UpdateHandler Using UpdateLog implementation: org.apache.solr.update.UpdateLog [junit4] 2> 567021 INFO (parallelCoreAdminExecutor-3724-thread-1) [ ] o.a.s.u.UpdateLog Initializing UpdateLog: dataDir=null defaultSyncLevel=FLUSH numRecordsToKeep=100 maxNumLogsToKeep=10 numVersionBuckets=65536 [junit4] 2> 567023 INFO (parallelCoreAdminExecutor-3724-thread-1) [ ] o.a.s.u.CommitTracker Hard AutoCommit: disabled [junit4] 2> 567023 INFO (parallelCoreAdminExecutor-3724-thread-1) [ ] o.a.s.u.CommitTracker Soft AutoCommit: disabled [junit4] 2> 567024 INFO (parallelCoreAdminExecutor-3724-thread-1) [ ] o.a.s.s.SolrIndexSearcher Opening [Searcher@5d740a8b[testExecute_shard1_replica_n5] main] [junit4] 2> 567026 INFO (parallelCoreAdminExecutor-3724-thread-1) [ ] o.a.s.r.ManagedResourceStorage Configured ZooKeeperStorageIO with znodeBase: /configs/conf [junit4] 2> 567026 INFO (parallelCoreAdminExecutor-3724-thread-1) [ ] o.a.s.r.ManagedResourceStorage Loaded null at path _rest_managed.json using ZooKeeperStorageIO:path=/configs/conf [junit4] 2> 567027 INFO (parallelCoreAdminExecutor-3724-thread-1) [ ] o.a.s.h.ReplicationHandler Commits will be reserved for 10000ms. [junit4] 2> 567027 INFO (searcherExecutor-3737-thread-1) [ ] o.a.s.c.SolrCore [testExecute_shard1_replica_n5] Registered new searcher Searcher@5d740a8b[testExecute_shard1_replica_n5] main{ExitableDirectoryReader(UninvertingDirectoryReader())} [junit4] 2> 567027 INFO (parallelCoreAdminExecutor-3724-thread-1) [ ] o.a.s.u.UpdateLog Could not find max version in index or recent updates, using new clock 1582002803240337408 [junit4] 2> 567030 INFO (parallelCoreAdminExecutor-3724-thread-1) [ ] o.a.s.c.ZkController Core needs to recover:testExecute_shard1_replica_n5 [junit4] 2> 567031 INFO (updateExecutor-2605-thread-1) [ ] o.a.s.u.DefaultSolrCoreState Running recovery [junit4] 2> 567032 INFO (recoveryExecutor-2606-thread-1) [ ] o.a.s.c.RecoveryStrategy Starting recovery process. recoveringAfterStartup=true [junit4] 2> 567032 INFO (recoveryExecutor-2606-thread-1) [ ] o.a.s.c.RecoveryStrategy ###### startupVersions=[[]] [junit4] 2> 567032 INFO (recoveryExecutor-2606-thread-1) [ ] o.a.s.c.RecoveryStrategy Begin buffering updates. core=[testExecute_shard1_replica_n5] [junit4] 2> 567032 INFO (recoveryExecutor-2606-thread-1) [ ] o.a.s.u.UpdateLog Starting to buffer updates. FSUpdateLog{state=ACTIVE, tlog=null} [junit4] 2> 567032 INFO (recoveryExecutor-2606-thread-1) [ ] o.a.s.c.RecoveryStrategy Publishing state of core [testExecute_shard1_replica_n5] as recovering, leader is [https://127.0.0.1:53688/solr/testExecute_shard1_replica_n1/] and I am [https://127.0.0.1:53688/solr/testExecute_shard1_replica_n5/] [junit4] 2> 567034 INFO (recoveryExecutor-2606-thread-1) [ ] o.a.s.c.RecoveryStrategy Sending prep recovery command to [https://127.0.0.1:53688/solr]; [WaitForState: action=PREPRECOVERY&core=testExecute_shard1_replica_n1&nodeName=127.0.0.1:53688_solr&coreNodeName=core_node6&state=recovering&checkLive=true&onlyIfLeader=true&onlyIfLeaderActive=true] [junit4] 2> 567038 INFO (qtp2014545226-11034) [ ] o.a.s.h.a.PrepRecoveryOp Going to wait for coreNodeName: core_node6, state: recovering, checkLive: true, onlyIfLeader: true, onlyIfLeaderActive: true, maxTime: 183 s [junit4] 2> 567039 INFO (qtp2014545226-11034) [ ] o.a.s.h.a.PrepRecoveryOp In WaitForState(recovering): collection=testExecute, shard=shard1, thisCore=testExecute_shard1_replica_n1, leaderDoesNotNeedRecovery=false, isLeader? true, live=true, checkLive=true, currentState=down, localState=active, nodeName=127.0.0.1:53688_solr, coreNodeName=core_node6, onlyIfActiveCheckResult=false, nodeProps: core_node6:{"core":"testExecute_shard1_replica_n5","base_url":"https://127.0.0.1:53688/solr","node_name":"127.0.0.1:53688_solr","state":"down","type":"NRT"} [junit4] 2> 567136 INFO (zkCallback-2608-thread-1) [ ] o.a.s.c.c.ZkStateReader A cluster state change: [WatchedEvent state:SyncConnected type:NodeDataChanged path:/collections/testExecute/state.json] for collection [testExecute] has occurred - updating... (live nodes size: [2]) [junit4] 2> 567136 INFO (zkCallback-2609-thread-2) [ ] o.a.s.c.c.ZkStateReader A cluster state change: [Watche [...truncated too long message...] im) ---- [junit4] Java HotSpot(TM) 64-Bit Server VM warning: Option UseConcMarkSweepGC was deprecated in version 9.0 and will likely be removed in a future release. [junit4] <<< JVM J0: EOF ---- [...truncated 3 lines...] [junit4] JVM J1: stderr was not empty, see: C:\Users\jenkins\workspace\Lucene-Solr-master-Windows\solr\build\solr-solrj\test\temp\junit4-J1-20171023_003338_39018061414474526055607.syserr [junit4] >>> JVM J1 emitted unexpected output (verbatim) ---- [junit4] Java HotSpot(TM) 64-Bit Server VM warning: Option UseConcMarkSweepGC was deprecated in version 9.0 and will likely be removed in a future release. [junit4] <<< JVM J1: EOF ---- [...truncated 1363 lines...] [junit4] JVM J1: stderr was not empty, see: C:\Users\jenkins\workspace\Lucene-Solr-master-Windows\solr\build\contrib\solr-analysis-extras\test\temp\junit4-J1-20171023_003712_8726549270890754220504.syserr [junit4] >>> JVM J1 emitted unexpected output (verbatim) ---- [junit4] Java HotSpot(TM) 64-Bit Server VM warning: Option UseConcMarkSweepGC was deprecated in version 9.0 and will likely be removed in a future release. [junit4] <<< JVM J1: EOF ---- [junit4] JVM J0: stderr was not empty, see: C:\Users\jenkins\workspace\Lucene-Solr-master-Windows\solr\build\contrib\solr-analysis-extras\test\temp\junit4-J0-20171023_003712_8724030012748488774311.syserr [junit4] >>> JVM J0 emitted unexpected output (verbatim) ---- [junit4] Java HotSpot(TM) 64-Bit Server VM warning: Option UseConcMarkSweepGC was deprecated in version 9.0 and will likely be removed in a future release. [junit4] <<< JVM J0: EOF ---- [...truncated 785 lines...] [junit4] JVM J1: stderr was not empty, see: C:\Users\jenkins\workspace\Lucene-Solr-master-Windows\solr\build\contrib\solr-analytics\test\temp\junit4-J1-20171023_003736_6101184714034593917814.syserr [junit4] >>> JVM J1 emitted unexpected output (verbatim) ---- [junit4] Java HotSpot(TM) 64-Bit Server VM warning: Option UseConcMarkSweepGC was deprecated in version 9.0 and will likely be removed in a future release. [junit4] <<< JVM J1: EOF ---- [junit4] JVM J0: stderr was not empty, see: C:\Users\jenkins\workspace\Lucene-Solr-master-Windows\solr\build\contrib\solr-analytics\test\temp\junit4-J0-20171023_003736_61013927642858910562779.syserr [junit4] >>> JVM J0 emitted unexpected output (verbatim) ---- [junit4] Java HotSpot(TM) 64-Bit Server VM warning: Option UseConcMarkSweepGC was deprecated in version 9.0 and will likely be removed in a future release. [junit4] <<< JVM J0: EOF ---- [...truncated 554 lines...] [junit4] JVM J1: stderr was not empty, see: C:\Users\jenkins\workspace\Lucene-Solr-master-Windows\solr\build\contrib\solr-clustering\test\temp\junit4-J1-20171023_003858_2399433338378636379844.syserr [junit4] >>> JVM J1 emitted unexpected output (verbatim) ---- [junit4] Java HotSpot(TM) 64-Bit Server VM warning: Option UseConcMarkSweepGC was deprecated in version 9.0 and will likely be removed in a future release. [junit4] <<< JVM J1: EOF ---- [...truncated 3 lines...] [junit4] JVM J0: stderr was not empty, see: C:\Users\jenkins\workspace\Lucene-Solr-master-Windows\solr\build\contrib\solr-clustering\test\temp\junit4-J0-20171023_003858_2395012851022497297066.syserr [junit4] >>> JVM J0 emitted unexpected output (verbatim) ---- [junit4] Java HotSpot(TM) 64-Bit Server VM warning: Option UseConcMarkSweepGC was deprecated in version 9.0 and will likely be removed in a future release. [junit4] <<< JVM J0: EOF ---- [...truncated 1258 lines...] [junit4] JVM J1: stderr was not empty, see: C:\Users\jenkins\workspace\Lucene-Solr-master-Windows\solr\build\contrib\solr-dataimporthandler-extras\test\temp\junit4-J1-20171023_003937_7908393417941007942170.syserr [junit4] >>> JVM J1 emitted unexpected output (verbatim) ---- [junit4] Java HotSpot(TM) 64-Bit Server VM warning: Option UseConcMarkSweepGC was deprecated in version 9.0 and will likely be removed in a future release. [junit4] <<< JVM J1: EOF ---- [...truncated 3 lines...] [junit4] JVM J0: stderr was not empty, see: C:\Users\jenkins\workspace\Lucene-Solr-master-Windows\solr\build\contrib\solr-dataimporthandler-extras\test\temp\junit4-J0-20171023_003937_7906845277113267456994.syserr [junit4] >>> JVM J0 emitted unexpected output (verbatim) ---- [junit4] Java HotSpot(TM) 64-Bit Server VM warning: Option UseConcMarkSweepGC was deprecated in version 9.0 and will likely be removed in a future release. [junit4] <<< JVM J0: EOF ---- [...truncated 647 lines...] [junit4] JVM J0: stderr was not empty, see: C:\Users\jenkins\workspace\Lucene-Solr-master-Windows\solr\build\contrib\solr-dataimporthandler\test\temp\junit4-J0-20171023_004001_5211277554325405937641.syserr [junit4] >>> JVM J0 emitted unexpected output (verbatim) ---- [junit4] Java HotSpot(TM) 64-Bit Server VM warning: Option UseConcMarkSweepGC was deprecated in version 9.0 and will likely be removed in a future release. [junit4] <<< JVM J0: EOF ---- [...truncated 3 lines...] [junit4] JVM J1: stderr was not empty, see: C:\Users\jenkins\workspace\Lucene-Solr-master-Windows\solr\build\contrib\solr-dataimporthandler\test\temp\junit4-J1-20171023_004001_5219312666664877542635.syserr [junit4] >>> JVM J1 emitted unexpected output (verbatim) ---- [junit4] Java HotSpot(TM) 64-Bit Server VM warning: Option UseConcMarkSweepGC was deprecated in version 9.0 and will likely be removed in a future release. [junit4] <<< JVM J1: EOF ---- [...truncated 558 lines...] [junit4] JVM J1: stderr was not empty, see: C:\Users\jenkins\workspace\Lucene-Solr-master-Windows\solr\build\contrib\solr-cell\test\temp\junit4-J1-20171023_004051_37410488790944452714586.syserr [junit4] >>> JVM J1 emitted unexpected output (verbatim) ---- [junit4] Java HotSpot(TM) 64-Bit Server VM warning: Option UseConcMarkSweepGC was deprecated in version 9.0 and will likely be removed in a future release. [junit4] <<< JVM J1: EOF ---- [...truncated 3 lines...] [junit4] JVM J0: stderr was not empty, see: C:\Users\jenkins\workspace\Lucene-Solr-master-Windows\solr\build\contrib\solr-cell\test\temp\junit4-J0-20171023_004051_3744395920186976814122.syserr [junit4] >>> JVM J0 emitted unexpected output (verbatim) ---- [junit4] Java HotSpot(TM) 64-Bit Server VM warning: Option UseConcMarkSweepGC was deprecated in version 9.0 and will likely be removed in a future release. [junit4] <<< JVM J0: EOF ---- [...truncated 559 lines...] [junit4] JVM J1: stderr was not empty, see: C:\Users\jenkins\workspace\Lucene-Solr-master-Windows\solr\build\contrib\solr-langid\test\temp\junit4-J1-20171023_004122_82417891747140687865525.syserr [junit4] >>> JVM J1 emitted unexpected output (verbatim) ---- [junit4] Java HotSpot(TM) 64-Bit Server VM warning: Option UseConcMarkSweepGC was deprecated in version 9.0 and will likely be removed in a future release. [junit4] <<< JVM J1: EOF ---- [...truncated 3 lines...] [junit4] JVM J0: stderr was not empty, see: C:\Users\jenkins\workspace\Lucene-Solr-master-Windows\solr\build\contrib\solr-langid\test\temp\junit4-J0-20171023_004122_82415645547389131526349.syserr [junit4] >>> JVM J0 emitted unexpected output (verbatim) ---- [junit4] Java HotSpot(TM) 64-Bit Server VM warning: Option UseConcMarkSweepGC was deprecated in version 9.0 and will likely be removed in a future release. [junit4] <<< JVM J0: EOF ---- [...truncated 649 lines...] [junit4] JVM J0: stderr was not empty, see: C:\Users\jenkins\workspace\Lucene-Solr-master-Windows\solr\build\contrib\solr-ltr\test\temp\junit4-J0-20171023_004147_0106685550120816859837.syserr [junit4] >>> JVM J0 emitted unexpected output (verbatim) ---- [junit4] Java HotSpot(TM) 64-Bit Server VM warning: Option UseConcMarkSweepGC was deprecated in version 9.0 and will likely be removed in a future release. [junit4] <<< JVM J0: EOF ---- [...truncated 3 lines...] [junit4] JVM J1: stderr was not empty, see: C:\Users\jenkins\workspace\Lucene-Solr-master-Windows\solr\build\contrib\solr-ltr\test\temp\junit4-J1-20171023_004147_0101061062818587628967.syserr [junit4] >>> JVM J1 emitted unexpected output (verbatim) ---- [junit4] Java HotSpot(TM) 64-Bit Server VM warning: Option UseConcMarkSweepGC was deprecated in version 9.0 and will likely be removed in a future release. [junit4] <<< JVM J1: EOF ---- [...truncated 596 lines...] [junit4] JVM J1: stderr was not empty, see: C:\Users\jenkins\workspace\Lucene-Solr-master-Windows\solr\build\contrib\solr-uima\test\temp\junit4-J1-20171023_004241_99916069565893985822201.syserr [junit4] >>> JVM J1 emitted unexpected output (verbatim) ---- [junit4] Java HotSpot(TM) 64-Bit Server VM warning: Option UseConcMarkSweepGC was deprecated in version 9.0 and will likely be removed in a future release. [junit4] <<< JVM J1: EOF ---- [...truncated 3 lines...] [junit4] JVM J0: stderr was not empty, see: C:\Users\jenkins\workspace\Lucene-Solr-master-Windows\solr\build\contrib\solr-uima\test\temp\junit4-J0-20171023_004241_9998635607550482166213.syserr [junit4] >>> JVM J0 emitted unexpected output (verbatim) ---- [junit4] Java HotSpot(TM) 64-Bit Server VM warning: Option UseConcMarkSweepGC was deprecated in version 9.0 and will likely be removed in a future release. [junit4] <<< JVM J0: EOF ---- [...truncated 549 lines...] [junit4] JVM J0: stderr was not empty, see: C:\Users\jenkins\workspace\Lucene-Solr-master-Windows\solr\build\contrib\solr-velocity\test\temp\junit4-J0-20171023_004317_69111414069563266391755.syserr [junit4] >>> JVM J0 emitted unexpected output (verbatim) ---- [junit4] Java HotSpot(TM) 64-Bit Server VM warning: Option UseConcMarkSweepGC was deprecated in version 9.0 and will likely be removed in a future release. [junit4] <<< JVM J0: EOF ---- [...truncated 31562 lines...]