Build: https://jenkins.thetaphi.de/job/Lucene-Solr-master-Linux/20609/ Java: 64bit/jdk-9 -XX:+UseCompressedOops -XX:+UseConcMarkSweepGC --illegal-access=deny 3 tests failed. FAILED: org.apache.solr.cloud.TestCollectionsAPIViaSolrCloudCluster.testCollectionCreateSearchDelete Error Message: Error from server at https://127.0.0.1:34373/solr/testcollection_shard1_replica_n2: Expected mime type application/octet-stream but got text/html. Error 404

HTTP ERROR: 404

Problem accessing /solr/testcollection_shard1_replica_n2/update. Reason:

    Can not find: /solr/testcollection_shard1_replica_n2/update


Powered by Jetty:// 9.3.20.v20170531
Stack Trace: org.apache.solr.client.solrj.impl.CloudSolrClient$RouteException: Error from server at https://127.0.0.1:34373/solr/testcollection_shard1_replica_n2: Expected mime type application/octet-stream but got text/html. Error 404

HTTP ERROR: 404

Problem accessing /solr/testcollection_shard1_replica_n2/update. Reason:

    Can not find: /solr/testcollection_shard1_replica_n2/update


Powered by Jetty:// 9.3.20.v20170531
at __randomizedtesting.SeedInfo.seed([28D3DB2A20700A5D:8B29758FA798E0F8]:0) at org.apache.solr.client.solrj.impl.CloudSolrClient.directUpdate(CloudSolrClient.java:539) at org.apache.solr.client.solrj.impl.CloudSolrClient.sendRequest(CloudSolrClient.java:993) at org.apache.solr.client.solrj.impl.CloudSolrClient.requestWithRetryOnStaleState(CloudSolrClient.java:862) at org.apache.solr.client.solrj.impl.CloudSolrClient.request(CloudSolrClient.java:793) at org.apache.solr.client.solrj.SolrRequest.process(SolrRequest.java:178) at org.apache.solr.client.solrj.request.UpdateRequest.commit(UpdateRequest.java:233) at org.apache.solr.cloud.TestCollectionsAPIViaSolrCloudCluster.testCollectionCreateSearchDelete(TestCollectionsAPIViaSolrCloudCluster.java:167) at java.base/jdk.internal.reflect.NativeMethodAccessorImpl.invoke0(Native Method) at java.base/jdk.internal.reflect.NativeMethodAccessorImpl.invoke(NativeMethodAccessorImpl.java:62) at java.base/jdk.internal.reflect.DelegatingMethodAccessorImpl.invoke(DelegatingMethodAccessorImpl.java:43) at java.base/java.lang.reflect.Method.invoke(Method.java:564) at com.carrotsearch.randomizedtesting.RandomizedRunner.invoke(RandomizedRunner.java:1737) at com.carrotsearch.randomizedtesting.RandomizedRunner$8.evaluate(RandomizedRunner.java:934) at com.carrotsearch.randomizedtesting.RandomizedRunner$9.evaluate(RandomizedRunner.java:970) at com.carrotsearch.randomizedtesting.RandomizedRunner$10.evaluate(RandomizedRunner.java:984) at com.carrotsearch.randomizedtesting.rules.SystemPropertiesRestoreRule$1.evaluate(SystemPropertiesRestoreRule.java:57) at org.apache.lucene.util.TestRuleSetupTeardownChained$1.evaluate(TestRuleSetupTeardownChained.java:49) at org.apache.lucene.util.AbstractBeforeAfterRule$1.evaluate(AbstractBeforeAfterRule.java:45) at org.apache.lucene.util.TestRuleThreadAndTestName$1.evaluate(TestRuleThreadAndTestName.java:48) at org.apache.lucene.util.TestRuleIgnoreAfterMaxFailures$1.evaluate(TestRuleIgnoreAfterMaxFailures.java:64) at org.apache.lucene.util.TestRuleMarkFailure$1.evaluate(TestRuleMarkFailure.java:47) at com.carrotsearch.randomizedtesting.rules.StatementAdapter.evaluate(StatementAdapter.java:36) at com.carrotsearch.randomizedtesting.ThreadLeakControl$StatementRunner.run(ThreadLeakControl.java:368) at com.carrotsearch.randomizedtesting.ThreadLeakControl.forkTimeoutingTask(ThreadLeakControl.java:817) at com.carrotsearch.randomizedtesting.ThreadLeakControl$3.evaluate(ThreadLeakControl.java:468) at com.carrotsearch.randomizedtesting.RandomizedRunner.runSingleTest(RandomizedRunner.java:943) at com.carrotsearch.randomizedtesting.RandomizedRunner$5.evaluate(RandomizedRunner.java:829) at com.carrotsearch.randomizedtesting.RandomizedRunner$6.evaluate(RandomizedRunner.java:879) at com.carrotsearch.randomizedtesting.RandomizedRunner$7.evaluate(RandomizedRunner.java:890) at com.carrotsearch.randomizedtesting.rules.StatementAdapter.evaluate(StatementAdapter.java:36) at com.carrotsearch.randomizedtesting.rules.SystemPropertiesRestoreRule$1.evaluate(SystemPropertiesRestoreRule.java:57) at org.apache.lucene.util.AbstractBeforeAfterRule$1.evaluate(AbstractBeforeAfterRule.java:45) at com.carrotsearch.randomizedtesting.rules.StatementAdapter.evaluate(StatementAdapter.java:36) at org.apache.lucene.util.TestRuleStoreClassName$1.evaluate(TestRuleStoreClassName.java:41) at com.carrotsearch.randomizedtesting.rules.NoShadowingOrOverridesOnMethodsRule$1.evaluate(NoShadowingOrOverridesOnMethodsRule.java:40) at com.carrotsearch.randomizedtesting.rules.NoShadowingOrOverridesOnMethodsRule$1.evaluate(NoShadowingOrOverridesOnMethodsRule.java:40) at com.carrotsearch.randomizedtesting.rules.StatementAdapter.evaluate(StatementAdapter.java:36) at com.carrotsearch.randomizedtesting.rules.StatementAdapter.evaluate(StatementAdapter.java:36) at org.apache.lucene.util.TestRuleAssertionsRequired$1.evaluate(TestRuleAssertionsRequired.java:53) at org.apache.lucene.util.TestRuleMarkFailure$1.evaluate(TestRuleMarkFailure.java:47) at org.apache.lucene.util.TestRuleIgnoreAfterMaxFailures$1.evaluate(TestRuleIgnoreAfterMaxFailures.java:64) at org.apache.lucene.util.TestRuleIgnoreTestSuites$1.evaluate(TestRuleIgnoreTestSuites.java:54) at com.carrotsearch.randomizedtesting.rules.StatementAdapter.evaluate(StatementAdapter.java:36) at com.carrotsearch.randomizedtesting.ThreadLeakControl$StatementRunner.run(ThreadLeakControl.java:368) at java.base/java.lang.Thread.run(Thread.java:844) Caused by: org.apache.solr.client.solrj.impl.HttpSolrClient$RemoteSolrException: Error from server at https://127.0.0.1:34373/solr/testcollection_shard1_replica_n2: Expected mime type application/octet-stream but got text/html. Error 404

HTTP ERROR: 404

Problem accessing /solr/testcollection_shard1_replica_n2/update. Reason:

    Can not find: /solr/testcollection_shard1_replica_n2/update


Powered by Jetty:// 9.3.20.v20170531
at org.apache.solr.client.solrj.impl.HttpSolrClient.executeMethod(HttpSolrClient.java:590) at org.apache.solr.client.solrj.impl.HttpSolrClient.request(HttpSolrClient.java:253) at org.apache.solr.client.solrj.impl.HttpSolrClient.request(HttpSolrClient.java:242) at org.apache.solr.client.solrj.impl.LBHttpSolrClient.doRequest(LBHttpSolrClient.java:483) at org.apache.solr.client.solrj.impl.LBHttpSolrClient.request(LBHttpSolrClient.java:413) at org.apache.solr.client.solrj.impl.CloudSolrClient.lambda$directUpdate$0(CloudSolrClient.java:516) at java.base/java.util.concurrent.FutureTask.run(FutureTask.java:264) at org.apache.solr.common.util.ExecutorUtil$MDCAwareThreadPoolExecutor.lambda$execute$0(ExecutorUtil.java:188) at java.base/java.util.concurrent.ThreadPoolExecutor.runWorker(ThreadPoolExecutor.java:1167) at java.base/java.util.concurrent.ThreadPoolExecutor$Worker.run(ThreadPoolExecutor.java:641) ... 1 more FAILED: org.apache.solr.update.AutoCommitTest.testCommitWithin Error Message: Exception during query Stack Trace: java.lang.RuntimeException: Exception during query at __randomizedtesting.SeedInfo.seed([28D3DB2A20700A5D:9201B452A35EE448]:0) at org.apache.solr.SolrTestCaseJ4.assertQ(SolrTestCaseJ4.java:884) at org.apache.solr.update.AutoCommitTest.testCommitWithin(AutoCommitTest.java:353) at java.base/jdk.internal.reflect.NativeMethodAccessorImpl.invoke0(Native Method) at java.base/jdk.internal.reflect.NativeMethodAccessorImpl.invoke(NativeMethodAccessorImpl.java:62) at java.base/jdk.internal.reflect.DelegatingMethodAccessorImpl.invoke(DelegatingMethodAccessorImpl.java:43) at java.base/java.lang.reflect.Method.invoke(Method.java:564) at com.carrotsearch.randomizedtesting.RandomizedRunner.invoke(RandomizedRunner.java:1737) at com.carrotsearch.randomizedtesting.RandomizedRunner$8.evaluate(RandomizedRunner.java:934) at com.carrotsearch.randomizedtesting.RandomizedRunner$9.evaluate(RandomizedRunner.java:970) at com.carrotsearch.randomizedtesting.RandomizedRunner$10.evaluate(RandomizedRunner.java:984) at com.carrotsearch.randomizedtesting.rules.SystemPropertiesRestoreRule$1.evaluate(SystemPropertiesRestoreRule.java:57) at org.apache.lucene.util.TestRuleSetupTeardownChained$1.evaluate(TestRuleSetupTeardownChained.java:49) at org.apache.lucene.util.AbstractBeforeAfterRule$1.evaluate(AbstractBeforeAfterRule.java:45) at org.apache.lucene.util.TestRuleThreadAndTestName$1.evaluate(TestRuleThreadAndTestName.java:48) at org.apache.lucene.util.TestRuleIgnoreAfterMaxFailures$1.evaluate(TestRuleIgnoreAfterMaxFailures.java:64) at org.apache.lucene.util.TestRuleMarkFailure$1.evaluate(TestRuleMarkFailure.java:47) at com.carrotsearch.randomizedtesting.rules.StatementAdapter.evaluate(StatementAdapter.java:36) at com.carrotsearch.randomizedtesting.ThreadLeakControl$StatementRunner.run(ThreadLeakControl.java:368) at com.carrotsearch.randomizedtesting.ThreadLeakControl.forkTimeoutingTask(ThreadLeakControl.java:817) at com.carrotsearch.randomizedtesting.ThreadLeakControl$3.evaluate(ThreadLeakControl.java:468) at com.carrotsearch.randomizedtesting.RandomizedRunner.runSingleTest(RandomizedRunner.java:943) at com.carrotsearch.randomizedtesting.RandomizedRunner$5.evaluate(RandomizedRunner.java:829) at com.carrotsearch.randomizedtesting.RandomizedRunner$6.evaluate(RandomizedRunner.java:879) at com.carrotsearch.randomizedtesting.RandomizedRunner$7.evaluate(RandomizedRunner.java:890) at com.carrotsearch.randomizedtesting.rules.StatementAdapter.evaluate(StatementAdapter.java:36) at com.carrotsearch.randomizedtesting.rules.SystemPropertiesRestoreRule$1.evaluate(SystemPropertiesRestoreRule.java:57) at org.apache.lucene.util.AbstractBeforeAfterRule$1.evaluate(AbstractBeforeAfterRule.java:45) at com.carrotsearch.randomizedtesting.rules.StatementAdapter.evaluate(StatementAdapter.java:36) at org.apache.lucene.util.TestRuleStoreClassName$1.evaluate(TestRuleStoreClassName.java:41) at com.carrotsearch.randomizedtesting.rules.NoShadowingOrOverridesOnMethodsRule$1.evaluate(NoShadowingOrOverridesOnMethodsRule.java:40) at com.carrotsearch.randomizedtesting.rules.NoShadowingOrOverridesOnMethodsRule$1.evaluate(NoShadowingOrOverridesOnMethodsRule.java:40) at com.carrotsearch.randomizedtesting.rules.StatementAdapter.evaluate(StatementAdapter.java:36) at com.carrotsearch.randomizedtesting.rules.StatementAdapter.evaluate(StatementAdapter.java:36) at org.apache.lucene.util.TestRuleAssertionsRequired$1.evaluate(TestRuleAssertionsRequired.java:53) at org.apache.lucene.util.TestRuleMarkFailure$1.evaluate(TestRuleMarkFailure.java:47) at org.apache.lucene.util.TestRuleIgnoreAfterMaxFailures$1.evaluate(TestRuleIgnoreAfterMaxFailures.java:64) at org.apache.lucene.util.TestRuleIgnoreTestSuites$1.evaluate(TestRuleIgnoreTestSuites.java:54) at com.carrotsearch.randomizedtesting.rules.StatementAdapter.evaluate(StatementAdapter.java:36) at com.carrotsearch.randomizedtesting.ThreadLeakControl$StatementRunner.run(ThreadLeakControl.java:368) at java.base/java.lang.Thread.run(Thread.java:844) Caused by: java.lang.RuntimeException: REQUEST FAILED: xpath=//result[@numFound=1] xml response was: 00 request was:q=id:529&qt=&start=0&rows=20&version=2.2 at org.apache.solr.SolrTestCaseJ4.assertQ(SolrTestCaseJ4.java:877) ... 39 more FAILED: org.apache.solr.cloud.TestLeaderElectionZkExpiry.testLeaderElectionWithZkExpiry Error Message: Captured an uncaught exception in thread: Thread[id=17145, name=OverseerAutoScalingTriggerThread-98774386767036418-dummy.host.com:8984_solr-n_0000000000, state=RUNNABLE, group=Overseer autoscaling triggers] Stack Trace: com.carrotsearch.randomizedtesting.UncaughtExceptionError: Captured an uncaught exception in thread: Thread[id=17145, name=OverseerAutoScalingTriggerThread-98774386767036418-dummy.host.com:8984_solr-n_0000000000, state=RUNNABLE, group=Overseer autoscaling triggers] at __randomizedtesting.SeedInfo.seed([28D3DB2A20700A5D:FE0CFA70166D19C5]:0) Caused by: org.apache.solr.common.SolrException: org.apache.zookeeper.KeeperException$SessionExpiredException: KeeperErrorCode = Session expired for /autoscaling/events/.auto_add_replicas at __randomizedtesting.SeedInfo.seed([28D3DB2A20700A5D]:0) at org.apache.solr.cloud.ZkDistributedQueue.(ZkDistributedQueue.java:107) at org.apache.solr.cloud.autoscaling.TriggerEventQueue.(TriggerEventQueue.java:44) at org.apache.solr.cloud.autoscaling.ScheduledTriggers$ScheduledTrigger.(ScheduledTriggers.java:398) at org.apache.solr.cloud.autoscaling.ScheduledTriggers.add(ScheduledTriggers.java:149) at org.apache.solr.cloud.autoscaling.OverseerTriggerThread.run(OverseerTriggerThread.java:220) at java.base/java.lang.Thread.run(Thread.java:844) Caused by: org.apache.zookeeper.KeeperException$SessionExpiredException: KeeperErrorCode = Session expired for /autoscaling/events/.auto_add_replicas at org.apache.zookeeper.KeeperException.create(KeeperException.java:127) at org.apache.zookeeper.KeeperException.create(KeeperException.java:51) at org.apache.zookeeper.ZooKeeper.exists(ZooKeeper.java:1102) at org.apache.solr.common.cloud.SolrZkClient$5.execute(SolrZkClient.java:323) at org.apache.solr.common.cloud.SolrZkClient$5.execute(SolrZkClient.java:320) at org.apache.solr.common.cloud.ZkCmdExecutor.retryOperation(ZkCmdExecutor.java:60) at org.apache.solr.common.cloud.SolrZkClient.exists(SolrZkClient.java:320) at org.apache.solr.common.cloud.ZkCmdExecutor.ensureExists(ZkCmdExecutor.java:93) at org.apache.solr.common.cloud.ZkCmdExecutor.ensureExists(ZkCmdExecutor.java:78) at org.apache.solr.cloud.ZkDistributedQueue.(ZkDistributedQueue.java:105) ... 5 more Build Log: [...truncated 1704 lines...] [junit4] JVM J2: stderr was not empty, see: /home/jenkins/workspace/Lucene-Solr-master-Linux/lucene/build/core/test/temp/junit4-J2-20171005_033119_69314768796961677233781.syserr [junit4] >>> JVM J2 emitted unexpected output (verbatim) ---- [junit4] Java HotSpot(TM) 64-Bit Server VM warning: Option UseConcMarkSweepGC was deprecated in version 9.0 and will likely be removed in a future release. [junit4] <<< JVM J2: EOF ---- [...truncated 3 lines...] [junit4] JVM J0: stderr was not empty, see: /home/jenkins/workspace/Lucene-Solr-master-Linux/lucene/build/core/test/temp/junit4-J0-20171005_033119_69716275596517201888641.syserr [junit4] >>> JVM J0 emitted unexpected output (verbatim) ---- [junit4] Java HotSpot(TM) 64-Bit Server VM warning: Option UseConcMarkSweepGC was deprecated in version 9.0 and will likely be removed in a future release. [junit4] <<< JVM J0: EOF ---- [...truncated 9 lines...] [junit4] JVM J1: stderr was not empty, see: /home/jenkins/workspace/Lucene-Solr-master-Linux/lucene/build/core/test/temp/junit4-J1-20171005_033119_6929808626830902123974.syserr [junit4] >>> JVM J1 emitted unexpected output (verbatim) ---- [junit4] Java HotSpot(TM) 64-Bit Server VM warning: Option UseConcMarkSweepGC was deprecated in version 9.0 and will likely be removed in a future release. [junit4] <<< JVM J1: EOF ---- [...truncated 281 lines...] [junit4] JVM J0: stderr was not empty, see: /home/jenkins/workspace/Lucene-Solr-master-Linux/lucene/build/test-framework/test/temp/junit4-J0-20171005_033851_28211985142682110075159.syserr [junit4] >>> JVM J0 emitted unexpected output (verbatim) ---- [junit4] Java HotSpot(TM) 64-Bit Server VM warning: Option UseConcMarkSweepGC was deprecated in version 9.0 and will likely be removed in a future release. [junit4] <<< JVM J0: EOF ---- [...truncated 18 lines...] [junit4] JVM J2: stderr was not empty, see: /home/jenkins/workspace/Lucene-Solr-master-Linux/lucene/build/test-framework/test/temp/junit4-J2-20171005_033851_2921013758008269703543.syserr [junit4] >>> JVM J2 emitted unexpected output (verbatim) ---- [junit4] Java HotSpot(TM) 64-Bit Server VM warning: Option UseConcMarkSweepGC was deprecated in version 9.0 and will likely be removed in a future release. [junit4] <<< JVM J2: EOF ---- [...truncated 3 lines...] [junit4] JVM J1: stderr was not empty, see: /home/jenkins/workspace/Lucene-Solr-master-Linux/lucene/build/test-framework/test/temp/junit4-J1-20171005_033851_2833311914182753033477.syserr [junit4] >>> JVM J1 emitted unexpected output (verbatim) ---- [junit4] Java HotSpot(TM) 64-Bit Server VM warning: Option UseConcMarkSweepGC was deprecated in version 9.0 and will likely be removed in a future release. [junit4] <<< JVM J1: EOF ---- [...truncated 1054 lines...] [junit4] JVM J1: stderr was not empty, see: /home/jenkins/workspace/Lucene-Solr-master-Linux/lucene/build/analysis/common/test/temp/junit4-J1-20171005_034023_49716535219653096353837.syserr [junit4] >>> JVM J1 emitted unexpected output (verbatim) ---- [junit4] Java HotSpot(TM) 64-Bit Server VM warning: Option UseConcMarkSweepGC was deprecated in version 9.0 and will likely be removed in a future release. [junit4] <<< JVM J1: EOF ---- [...truncated 3 lines...] [junit4] JVM J0: stderr was not empty, see: /home/jenkins/workspace/Lucene-Solr-master-Linux/lucene/build/analysis/common/test/temp/junit4-J0-20171005_034023_4975423825249964632401.syserr [junit4] >>> JVM J0 emitted unexpected output (verbatim) ---- [junit4] Java HotSpot(TM) 64-Bit Server VM warning: Option UseConcMarkSweepGC was deprecated in version 9.0 and will likely be removed in a future release. [junit4] <<< JVM J0: EOF ---- [...truncated 3 lines...] [junit4] JVM J2: stderr was not empty, see: /home/jenkins/workspace/Lucene-Solr-master-Linux/lucene/build/analysis/common/test/temp/junit4-J2-20171005_034023_4976384749011908102534.syserr [junit4] >>> JVM J2 emitted unexpected output (verbatim) ---- [junit4] Java HotSpot(TM) 64-Bit Server VM warning: Option UseConcMarkSweepGC was deprecated in version 9.0 and will likely be removed in a future release. [junit4] <<< JVM J2: EOF ---- [...truncated 228 lines...] [junit4] JVM J2: stderr was not empty, see: /home/jenkins/workspace/Lucene-Solr-master-Linux/lucene/build/analysis/icu/test/temp/junit4-J2-20171005_034210_9043577640471331473250.syserr [junit4] >>> JVM J2 emitted unexpected output (verbatim) ---- [junit4] Java HotSpot(TM) 64-Bit Server VM warning: Option UseConcMarkSweepGC was deprecated in version 9.0 and will likely be removed in a future release. [junit4] <<< JVM J2: EOF ---- [junit4] JVM J1: stderr was not empty, see: /home/jenkins/workspace/Lucene-Solr-master-Linux/lucene/build/analysis/icu/test/temp/junit4-J1-20171005_034210_90313441553465387519895.syserr [junit4] >>> JVM J1 emitted unexpected output (verbatim) ---- [junit4] Java HotSpot(TM) 64-Bit Server VM warning: Option UseConcMarkSweepGC was deprecated in version 9.0 and will likely be removed in a future release. [junit4] <<< JVM J1: EOF ---- [...truncated 3 lines...] [junit4] JVM J0: stderr was not empty, see: /home/jenkins/workspace/Lucene-Solr-master-Linux/lucene/build/analysis/icu/test/temp/junit4-J0-20171005_034210_9034219894128676459536.syserr [junit4] >>> JVM J0 emitted unexpected output (verbatim) ---- [junit4] Java HotSpot(TM) 64-Bit Server VM warning: Option UseConcMarkSweepGC was deprecated in version 9.0 and will likely be removed in a future release. [junit4] <<< JVM J0: EOF ---- [...truncated 249 lines...] [junit4] JVM J2: stderr was not empty, see: /home/jenkins/workspace/Lucene-Solr-master-Linux/lucene/build/analysis/kuromoji/test/temp/junit4-J2-20171005_034222_48110132953381741641360.syserr [junit4] >>> JVM J2 emitted unexpected output (verbatim) ---- [junit4] Java HotSpot(TM) 64-Bit Server VM warning: Option UseConcMarkSweepGC was deprecated in version 9.0 and will likely be removed in a future release. [junit4] <<< JVM J2: EOF ---- [junit4] JVM J0: stderr was not empty, see: /home/jenkins/workspace/Lucene-Solr-master-Linux/lucene/build/analysis/kuromoji/test/temp/junit4-J0-20171005_034222_4812536319548717571414.syserr [junit4] >>> JVM J0 emitted unexpected output (verbatim) ---- [junit4] Java HotSpot(TM) 64-Bit Server VM warning: Option UseConcMarkSweepGC was deprecated in version 9.0 and will likely be removed in a future release. [junit4] <<< JVM J0: EOF ---- [...truncated 6 lines...] [junit4] JVM J1: stderr was not empty, see: /home/jenkins/workspace/Lucene-Solr-master-Linux/lucene/build/analysis/kuromoji/test/temp/junit4-J1-20171005_034222_48112454738588385452876.syserr [junit4] >>> JVM J1 emitted unexpected output (verbatim) ---- [junit4] Java HotSpot(TM) 64-Bit Server VM warning: Option UseConcMarkSweepGC was deprecated in version 9.0 and will likely be removed in a future release. [junit4] <<< JVM J1: EOF ---- [...truncated 154 lines...] [junit4] JVM J1: stderr was not empty, see: /home/jenkins/workspace/Lucene-Solr-master-Linux/lucene/build/analysis/morfologik/test/temp/junit4-J1-20171005_034247_45116526765864522969130.syserr [junit4] >>> JVM J1 emitted unexpected output (verbatim) ---- [junit4] Java HotSpot(TM) 64-Bit Server VM warning: Option UseConcMarkSweepGC was deprecated in version 9.0 and will likely be removed in a future release. [junit4] <<< JVM J1: EOF ---- [...truncated 3 lines...] [junit4] JVM J2: stderr was not empty, see: /home/jenkins/workspace/Lucene-Solr-master-Linux/lucene/build/analysis/morfologik/test/temp/junit4-J2-20171005_034247_4515787786847391422123.syserr [junit4] >>> JVM J2 emitted unexpected output (verbatim) ---- [junit4] Java HotSpot(TM) 64-Bit Server VM warning: Option UseConcMarkSweepGC was deprecated in version 9.0 and will likely be removed in a future release. [junit4] <<< JVM J2: EOF ---- [...truncated 3 lines...] [junit4] JVM J0: stderr was not empty, see: /home/jenkins/workspace/Lucene-Solr-master-Linux/lucene/build/analysis/morfologik/test/temp/junit4-J0-20171005_034247_451359494162256725553.syserr [junit4] >>> JVM J0 emitted unexpected output (verbatim) ---- [junit4] Java HotSpot(TM) 64-Bit Server VM warning: Option UseConcMarkSweepGC was deprecated in version 9.0 and will likely be removed in a future release. [junit4] <<< JVM J0: EOF ---- [...truncated 166 lines...] [junit4] JVM J0: stderr was not empty, see: /home/jenkins/workspace/Lucene-Solr-master-Linux/lucene/build/analysis/phonetic/test/temp/junit4-J0-20171005_034251_32613404187525791893128.syserr [junit4] >>> JVM J0 emitted unexpected output (verbatim) ---- [junit4] Java HotSpot(TM) 64-Bit Server VM warning: Option UseConcMarkSweepGC was deprecated in version 9.0 and will likely be removed in a future release. [junit4] <<< JVM J0: EOF ---- [...truncated 3 lines...] [junit4] JVM J2: stderr was not empty, see: /home/jenkins/workspace/Lucene-Solr-master-Linux/lucene/build/analysis/phonetic/test/temp/junit4-J2-20171005_034251_3262769919217982297159.syserr [junit4] >>> JVM J2 emitted unexpected output (verbatim) ---- [junit4] Java HotSpot(TM) 64-Bit Server VM warning: Option UseConcMarkSweepGC was deprecated in version 9.0 and will likely be removed in a future release. [junit4] <<< JVM J2: EOF ---- [...truncated 3 lines...] [junit4] JVM J1: stderr was not empty, see: /home/jenkins/workspace/Lucene-Solr-master-Linux/lucene/build/analysis/phonetic/test/temp/junit4-J1-20171005_034251_326375730652394653621.syserr [junit4] >>> JVM J1 emitted unexpected output (verbatim) ---- [junit4] Java HotSpot(TM) 64-Bit Server VM warning: Option UseConcMarkSweepGC was deprecated in version 9.0 and will likely be removed in a future release. [junit4] <<< JVM J1: EOF ---- [...truncated 153 lines...] [junit4] JVM J0: stderr was not empty, see: /home/jenkins/workspace/Lucene-Solr-master-Linux/lucene/build/analysis/smartcn/test/temp/junit4-J0-20171005_034302_00917425521707575718019.syserr [junit4] >>> JVM J0 emitted unexpected output (verbatim) ---- [junit4] Java HotSpot(TM) 64-Bit Server VM warning: Option UseConcMarkSweepGC was deprecated in version 9.0 and will likely be removed in a future release. [junit4] <<< JVM J0: EOF ---- [...truncated 3 lines...] [junit4] JVM J1: stderr was not empty, see: /home/jenkins/workspace/Lucene-Solr-master-Linux/lucene/build/analysis/smartcn/test/temp/junit4-J1-20171005_034302_0099478579284211012174.syserr [junit4] >>> JVM J1 emitted unexpected output (verbatim) ---- [junit4] Java HotSpot(TM) 64-Bit Server VM warning: Option UseConcMarkSweepGC was deprecated in version 9.0 and will likely be removed in a future release. [junit4] <<< JVM J1: EOF ---- [...truncated 154 lines...] [junit4] JVM J1: stderr was not empty, see: /home/jenkins/workspace/Lucene-Solr-master-Linux/lucene/build/analysis/stempel/test/temp/junit4-J1-20171005_034309_6619049450982674514932.syserr [junit4] >>> JVM J1 emitted unexpected output (verbatim) ---- [junit4] Java HotSpot(TM) 64-Bit Server VM warning: Option UseConcMarkSweepGC was deprecated in version 9.0 and will likely be removed in a future release. [junit4] <<< JVM J1: EOF ---- [...truncated 3 lines...] [junit4] JVM J2: stderr was not empty, see: /home/jenkins/workspace/Lucene-Solr-master-Linux/lucene/build/analysis/stempel/test/temp/junit4-J2-20171005_034309_6625194037727922553211.syserr [junit4] >>> JVM J2 emitted unexpected output (verbatim) ---- [junit4] Java HotSpot(TM) 64-Bit Server VM warning: Option UseConcMarkSweepGC was deprecated in version 9.0 and will likely be removed in a future release. [junit4] <<< JVM J2: EOF ---- [...truncated 3 lines...] [junit4] JVM J0: stderr was not empty, see: /home/jenkins/workspace/Lucene-Solr-master-Linux/lucene/build/analysis/stempel/test/temp/junit4-J0-20171005_034309_6616697789316564728222.syserr [junit4] >>> JVM J0 emitted unexpected output (verbatim) ---- [junit4] Java HotSpot(TM) 64-Bit Server VM warning: Option UseConcMarkSweepGC was deprecated in version 9.0 and will likely be removed in a future release. [junit4] <<< JVM J0: EOF ---- [...truncated 169 lines...] [junit4] JVM J0: stderr was not empty, see: /home/jenkins/workspace/Lucene-Solr-master-Linux/lucene/build/analysis/uima/test/temp/junit4-J0-20171005_034312_5141360200388733651182.syserr [junit4] >>> JVM J0 emitted unexpected output (verbatim) ---- [junit4] Java HotSpot(TM) 64-Bit Server VM warning: Option UseConcMarkSweepGC was deprecated in version 9.0 and will likely be removed in a future release. [junit4] <<< JVM J0: EOF ---- [...truncated 153 lines...] [junit4] JVM J0: stderr was not empty, see: /home/jenkins/workspace/Lucene-Solr-master-Linux/lucene/build/backward-codecs/test/temp/junit4-J0-20171005_034319_3546844449337579887504.syserr [junit4] >>> JVM J0 emitted unexpected output (verbatim) ---- [junit4] Java HotSpot(TM) 64-Bit Server VM warning: Option UseConcMarkSweepGC was deprecated in version 9.0 and will likely be removed in a future release. [junit4] <<< JVM J0: EOF ---- [junit4] JVM J1: stderr was not empty, see: /home/jenkins/workspace/Lucene-Solr-master-Linux/lucene/build/backward-codecs/test/temp/junit4-J1-20171005_034319_35414351574779761211975.syserr [junit4] >>> JVM J1 emitted unexpected output (verbatim) ---- [junit4] Java HotSpot(TM) 64-Bit Server VM warning: Option UseConcMarkSweepGC was deprecated in version 9.0 and will likely be removed in a future release. [junit4] <<< JVM J1: EOF ---- [...truncated 19 lines...] [junit4] JVM J2: stderr was not empty, see: /home/jenkins/workspace/Lucene-Solr-master-Linux/lucene/build/backward-codecs/test/temp/junit4-J2-20171005_034319_35410105533925839075193.syserr [junit4] >>> JVM J2 emitted unexpected output (verbatim) ---- [junit4] Java HotSpot(TM) 64-Bit Server VM warning: Option UseConcMarkSweepGC was deprecated in version 9.0 and will likely be removed in a future release. [junit4] <<< JVM J2: EOF ---- [...truncated 1258 lines...] [junit4] JVM J2: stderr was not empty, see: /home/jenkins/workspace/Lucene-Solr-master-Linux/lucene/build/benchmark/test/temp/junit4-J2-20171005_034333_9322837712403821264370.syserr [junit4] >>> JVM J2 emitted unexpected output (verbatim) ---- [junit4] Java HotSpot(TM) 64-Bit Server VM warning: Option UseConcMarkSweepGC was deprecated in version 9.0 and will likely be removed in a future release. [junit4] <<< JVM J2: EOF ---- [junit4] JVM J1: stderr was not empty, see: /home/jenkins/workspace/Lucene-Solr-master-Linux/lucene/build/benchmark/test/temp/junit4-J1-20171005_034333_9326956281743304843324.syserr [junit4] >>> JVM J1 emitted unexpected output (verbatim) ---- [junit4] Java HotSpot(TM) 64-Bit Server VM warning: Option UseConcMarkSweepGC was deprecated in version 9.0 and will likely be removed in a future release. [junit4] <<< JVM J1: EOF ---- [...truncated 3 lines...] [junit4] JVM J0: stderr was not empty, see: /home/jenkins/workspace/Lucene-Solr-master-Linux/lucene/build/benchmark/test/temp/junit4-J0-20171005_034333_93217609145534984797320.syserr [junit4] >>> JVM J0 emitted unexpected output (verbatim) ---- [junit4] Java HotSpot(TM) 64-Bit Server VM warning: Option UseConcMarkSweepGC was deprecated in version 9.0 and will likely be removed in a future release. [junit4] <<< JVM J0: EOF ---- [...truncated 230 lines...] [junit4] JVM J2: stderr was not empty, see: /home/jenkins/workspace/Lucene-Solr-master-Linux/lucene/build/classification/test/temp/junit4-J2-20171005_034342_9556771611091767940106.syserr [junit4] >>> JVM J2 emitted unexpected output (verbatim) ---- [junit4] Java HotSpot(TM) 64-Bit Server VM warning: Option UseConcMarkSweepGC was deprecated in version 9.0 and will likely be removed in a future release. [junit4] <<< JVM J2: EOF ---- [...truncated 3 lines...] [junit4] JVM J1: stderr was not empty, see: /home/jenkins/workspace/Lucene-Solr-master-Linux/lucene/build/classification/test/temp/junit4-J1-20171005_034342_95416785656972094127860.syserr [junit4] >>> JVM J1 emitted unexpected output (verbatim) ---- [junit4] Java HotSpot(TM) 64-Bit Server VM warning: Option UseConcMarkSweepGC was deprecated in version 9.0 and will likely be removed in a future release. [junit4] <<< JVM J1: EOF ---- [...truncated 3 lines...] [junit4] JVM J0: stderr was not empty, see: /home/jenkins/workspace/Lucene-Solr-master-Linux/lucene/build/classification/test/temp/junit4-J0-20171005_034342_95416696191795577840459.syserr [junit4] >>> JVM J0 emitted unexpected output (verbatim) ---- [junit4] Java HotSpot(TM) 64-Bit Server VM warning: Option UseConcMarkSweepGC was deprecated in version 9.0 and will likely be removed in a future release. [junit4] <<< JVM J0: EOF ---- [...truncated 255 lines...] [junit4] JVM J1: stderr was not empty, see: /home/jenkins/workspace/Lucene-Solr-master-Linux/lucene/build/codecs/test/temp/junit4-J1-20171005_034353_4261823337231187193141.syserr [junit4] >>> JVM J1 emitted unexpected output (verbatim) ---- [junit4] Java HotSpot(TM) 64-Bit Server VM warning: Option UseConcMarkSweepGC was deprecated in version 9.0 and will likely be removed in a future release. [junit4] <<< JVM J1: EOF ---- [...truncated 8 lines...] [junit4] JVM J2: stderr was not empty, see: /home/jenkins/workspace/Lucene-Solr-master-Linux/lucene/build/codecs/test/temp/junit4-J2-20171005_034353_42613795252833378588986.syserr [junit4] >>> JVM J2 emitted unexpected output (verbatim) ---- [junit4] Java HotSpot(TM) 64-Bit Server VM warning: Option UseConcMarkSweepGC was deprecated in version 9.0 and will likely be removed in a future release. [junit4] <<< JVM J2: EOF ---- [...truncated 3 lines...] [junit4] JVM J0: stderr was not empty, see: /home/jenkins/workspace/Lucene-Solr-master-Linux/lucene/build/codecs/test/temp/junit4-J0-20171005_034353_42611073804823871104928.syserr [junit4] >>> JVM J0 emitted unexpected output (verbatim) ---- [junit4] Java HotSpot(TM) 64-Bit Server VM warning: Option UseConcMarkSweepGC was deprecated in version 9.0 and will likely be removed in a future release. [junit4] <<< JVM J0: EOF ---- [...truncated 238 lines...] [junit4] JVM J1: stderr was not empty, see: /home/jenkins/workspace/Lucene-Solr-master-Linux/lucene/build/demo/test/temp/junit4-J1-20171005_034638_4599502663086832780605.syserr [junit4] >>> JVM J1 emitted unexpected output (verbatim) ---- [junit4] Java HotSpot(TM) 64-Bit Server VM warning: Option UseConcMarkSweepGC was deprecated in version 9.0 and will likely be removed in a future release. [junit4] <<< JVM J1: EOF ---- [...truncated 3 lines...] [junit4] JVM J2: stderr was not empty, see: /home/jenkins/workspace/Lucene-Solr-master-Linux/lucene/build/demo/test/temp/junit4-J2-20171005_034638_4595643195283003129214.syserr [junit4] >>> JVM J2 emitted unexpected output (verbatim) ---- [junit4] Java HotSpot(TM) 64-Bit Server VM warning: Option UseConcMarkSweepGC was deprecated in version 9.0 and will likely be removed in a future release. [junit4] <<< JVM J2: EOF ---- [junit4] JVM J0: stderr was not empty, see: /home/jenkins/workspace/Lucene-Solr-master-Linux/lucene/build/demo/test/temp/junit4-J0-20171005_034638_4591869624772302921376.syserr [junit4] >>> JVM J0 emitted unexpected output (verbatim) ---- [junit4] Java HotSpot(TM) 64-Bit Server VM warning: Option UseConcMarkSweepGC was deprecated in version 9.0 and will likely be removed in a future release. [junit4] <<< JVM J0: EOF ---- [...truncated 170 lines...] [junit4] JVM J2: stderr was not empty, see: /home/jenkins/workspace/Lucene-Solr-master-Linux/lucene/build/expressions/test/temp/junit4-J2-20171005_034641_0677463472574448445453.syserr [junit4] >>> JVM J2 emitted unexpected output (verbatim) ---- [junit4] Java HotSpot(TM) 64-Bit Server VM warning: Option UseConcMarkSweepGC was deprecated in version 9.0 and will likely be removed in a future release. [junit4] <<< JVM J2: EOF ---- [junit4] JVM J1: stderr was not empty, see: /home/jenkins/workspace/Lucene-Solr-master-Linux/lucene/build/expressions/test/temp/junit4-J1-20171005_034641_06610012821988200169686.syserr [junit4] >>> JVM J1 emitted unexpected output (verbatim) ---- [junit4] Java HotSpot(TM) 64-Bit Server VM warning: Option UseConcMarkSweepGC was deprecated in version 9.0 and will likely be removed in a future release. [junit4] <<< JVM J1: EOF ---- [...truncated 6 lines...] [junit4] JVM J0: stderr was not empty, see: /home/jenkins/workspace/Lucene-Solr-master-Linux/lucene/build/expressions/test/temp/junit4-J0-20171005_034641_0668811251083858863773.syserr [junit4] >>> JVM J0 emitted unexpected output (verbatim) ---- [junit4] Java HotSpot(TM) 64-Bit Server VM warning: Option UseConcMarkSweepGC was deprecated in version 9.0 and will likely be removed in a future release. [junit4] <<< JVM J0: EOF ---- [...truncated 223 lines...] [junit4] JVM J2: stderr was not empty, see: /home/jenkins/workspace/Lucene-Solr-master-Linux/lucene/build/facet/test/temp/junit4-J2-20171005_034645_7332282099158964550730.syserr [junit4] >>> JVM J2 emitted unexpected output (verbatim) ---- [junit4] Java HotSpot(TM) 64-Bit Server VM warning: Option UseConcMarkSweepGC was deprecated in version 9.0 and will likely be removed in a future release. [junit4] <<< JVM J2: EOF ---- [...truncated 3 lines...] [junit4] JVM J0: stderr was not empty, see: /home/jenkins/workspace/Lucene-Solr-master-Linux/lucene/build/facet/test/temp/junit4-J0-20171005_034645_733590779228886466907.syserr [junit4] >>> JVM J0 emitted unexpected output (verbatim) ---- [junit4] Java HotSpot(TM) 64-Bit Server VM warning: Option UseConcMarkSweepGC was deprecated in version 9.0 and will likely be removed in a future release. [junit4] <<< JVM J0: EOF ---- [...truncated 6 lines...] [junit4] JVM J1: stderr was not empty, see: /home/jenkins/workspace/Lucene-Solr-master-Linux/lucene/build/facet/test/temp/junit4-J1-20171005_034645_7335480101095161913671.syserr [junit4] >>> JVM J1 emitted unexpected output (verbatim) ---- [junit4] Java HotSpot(TM) 64-Bit Server VM warning: Option UseConcMarkSweepGC was deprecated in version 9.0 and will likely be removed in a future release. [junit4] <<< JVM J1: EOF ---- [...truncated 179 lines...] [junit4] JVM J1: stderr was not empty, see: /home/jenkins/workspace/Lucene-Solr-master-Linux/lucene/build/grouping/test/temp/junit4-J1-20171005_034714_80015981432913005622546.syserr [junit4] >>> JVM J1 emitted unexpected output (verbatim) ---- [junit4] Java HotSpot(TM) 64-Bit Server VM warning: Option UseConcMarkSweepGC was deprecated in version 9.0 and will likely be removed in a future release. [junit4] <<< JVM J1: EOF ---- [...truncated 6 lines...] [junit4] JVM J2: stderr was not empty, see: /home/jenkins/workspace/Lucene-Solr-master-Linux/lucene/build/grouping/test/temp/junit4-J2-20171005_034714_800724343523599428931.syserr [junit4] >>> JVM J2 emitted unexpected output (verbatim) ---- [junit4] Java HotSpot(TM) 64-Bit Server VM warning: Option UseConcMarkSweepGC was deprecated in version 9.0 and will likely be removed in a future release. [junit4] <<< JVM J2: EOF ---- [junit4] JVM J0: stderr was not empty, see: /home/jenkins/workspace/Lucene-Solr-master-Linux/lucene/build/grouping/test/temp/junit4-J0-20171005_034714_8001471588828428542578.syserr [junit4] >>> JVM J0 emitted unexpected output (verbatim) ---- [junit4] Java HotSpot(TM) 64-Bit Server VM warning: Option UseConcMarkSweepGC was deprecated in version 9.0 and will likely be removed in a future release. [junit4] <<< JVM J0: EOF ---- [...truncated 246 lines...] [junit4] JVM J0: stderr was not empty, see: /home/jenkins/workspace/Lucene-Solr-master-Linux/lucene/build/highlighter/test/temp/junit4-J0-20171005_034723_81116119198996954951628.syserr [junit4] >>> JVM J0 emitted unexpected output (verbatim) ---- [junit4] Java HotSpot(TM) 64-Bit Server VM warning: Option UseConcMarkSweepGC was deprecated in version 9.0 and will likely be removed in a future release. [junit4] <<< JVM J0: EOF ---- [junit4] JVM J1: stderr was not empty, see: /home/jenkins/workspace/Lucene-Solr-master-Linux/lucene/build/highlighter/test/temp/junit4-J1-20171005_034723_8119352341898386671412.syserr [junit4] >>> JVM J1 emitted unexpected output (verbatim) ---- [junit4] Java HotSpot(TM) 64-Bit Server VM warning: Option UseConcMarkSweepGC was deprecated in version 9.0 and will likely be removed in a future release. [junit4] <<< JVM J1: EOF ---- [...truncated 3 lines...] [junit4] JVM J2: stderr was not empty, see: /home/jenkins/workspace/Lucene-Solr-master-Linux/lucene/build/highlighter/test/temp/junit4-J2-20171005_034723_81115143061509976229110.syserr [junit4] >>> JVM J2 emitted unexpected output (verbatim) ---- [junit4] Java HotSpot(TM) 64-Bit Server VM warning: Option UseConcMarkSweepGC was deprecated in version 9.0 and will likely be removed in a future release. [junit4] <<< JVM J2: EOF ---- [...truncated 160 lines...] [junit4] JVM J2: stderr was not empty, see: /home/jenkins/workspace/Lucene-Solr-master-Linux/lucene/build/join/test/temp/junit4-J2-20171005_034745_2695945282730237910573.syserr [junit4] >>> JVM J2 emitted unexpected output (verbatim) ---- [junit4] Java HotSpot(TM) 64-Bit Server VM warning: Option UseConcMarkSweepGC was deprecated in version 9.0 and will likely be removed in a future release. [junit4] <<< JVM J2: EOF ---- [...truncated 3 lines...] [junit4] JVM J0: stderr was not empty, see: /home/jenkins/workspace/Lucene-Solr-master-Linux/lucene/build/join/test/temp/junit4-J0-20171005_034745_2682266481201948937433.syserr [junit4] >>> JVM J0 emitted unexpected output (verbatim) ---- [junit4] Java HotSpot(TM) 64-Bit Server VM warning: Option UseConcMarkSweepGC was deprecated in version 9.0 and will likely be removed in a future release. [junit4] <<< JVM J0: EOF ---- [...truncated 6 lines...] [junit4] JVM J1: stderr was not empty, see: /home/jenkins/workspace/Lucene-Solr-master-Linux/lucene/build/join/test/temp/junit4-J1-20171005_034745_2685018576185241738209.syserr [junit4] >>> JVM J1 emitted unexpected output (verbatim) ---- [junit4] Java HotSpot(TM) 64-Bit Server VM warning: Option UseConcMarkSweepGC was deprecated in version 9.0 and will likely be removed in a future release. [junit4] <<< JVM J1: EOF ---- [...truncated 149 lines...] [junit4] JVM J0: stderr was not empty, see: /home/jenkins/workspace/Lucene-Solr-master-Linux/lucene/build/memory/test/temp/junit4-J0-20171005_034810_1717351038735340587266.syserr [junit4] >>> JVM J0 emitted unexpected output (verbatim) ---- [junit4] Java HotSpot(TM) 64-Bit Server VM warning: Option UseConcMarkSweepGC was deprecated in version 9.0 and will likely be removed in a future release. [junit4] <<< JVM J0: EOF ---- [...truncated 3 lines...] [junit4] JVM J1: stderr was not empty, see: /home/jenkins/workspace/Lucene-Solr-master-Linux/lucene/build/memory/test/temp/junit4-J1-20171005_034810_1713302006106460594550.syserr [junit4] >>> JVM J1 emitted unexpected output (verbatim) ---- [junit4] Java HotSpot(TM) 64-Bit Server VM warning: Option UseConcMarkSweepGC was deprecated in version 9.0 and will likely be removed in a future release. [junit4] <<< JVM J1: EOF ---- [...truncated 180 lines...] [junit4] JVM J1: stderr was not empty, see: /home/jenkins/workspace/Lucene-Solr-master-Linux/lucene/build/misc/test/temp/junit4-J1-20171005_034823_82616811779592122579325.syserr [junit4] >>> JVM J1 emitted unexpected output (verbatim) ---- [junit4] Java HotSpot(TM) 64-Bit Server VM warning: Option UseConcMarkSweepGC was deprecated in version 9.0 and will likely be removed in a future release. [junit4] <<< JVM J1: EOF ---- [...truncated 3 lines...] [junit4] JVM J2: stderr was not empty, see: /home/jenkins/workspace/Lucene-Solr-master-Linux/lucene/build/misc/test/temp/junit4-J2-20171005_034823_82912509648727274610052.syserr [junit4] >>> JVM J2 emitted unexpected output (verbatim) ---- [junit4] Java HotSpot(TM) 64-Bit Server VM warning: Option UseConcMarkSweepGC was deprecated in version 9.0 and will likely be removed in a future release. [junit4] <<< JVM J2: EOF ---- [...truncated 3 lines...] [junit4] JVM J0: stderr was not empty, see: /home/jenkins/workspace/Lucene-Solr-master-Linux/lucene/build/misc/test/temp/junit4-J0-20171005_034823_8267143406179133212718.syserr [junit4] >>> JVM J0 emitted unexpected output (verbatim) ---- [junit4] Java HotSpot(TM) 64-Bit Server VM warning: Option UseConcMarkSweepGC was deprecated in version 9.0 and will likely be removed in a future release. [junit4] <<< JVM J0: EOF ---- [...truncated 315 lines...] [junit4] JVM J0: stderr was not empty, see: /home/jenkins/workspace/Lucene-Solr-master-Linux/lucene/build/queries/test/temp/junit4-J0-20171005_034845_8516196373025787068616.syserr [junit4] >>> JVM J0 emitted unexpected output (verbatim) ---- [junit4] Java HotSpot(TM) 64-Bit Server VM warning: Option UseConcMarkSweepGC was deprecated in version 9.0 and will likely be removed in a future release. [junit4] <<< JVM J0: EOF ---- [...truncated 3 lines...] [junit4] JVM J2: stderr was not empty, see: /home/jenkins/workspace/Lucene-Solr-master-Linux/lucene/build/queries/test/temp/junit4-J2-20171005_034845_85312867543129568164202.syserr [junit4] >>> JVM J2 emitted unexpected output (verbatim) ---- [junit4] Java HotSpot(TM) 64-Bit Server VM warning: Option UseConcMarkSweepGC was deprecated in version 9.0 and will likely be removed in a future release. [junit4] <<< JVM J2: EOF ---- [junit4] JVM J1: stderr was not empty, see: /home/jenkins/workspace/Lucene-Solr-master-Linux/lucene/build/queries/test/temp/junit4-J1-20171005_034845_8512102972373338560433.syserr [junit4] >>> JVM J1 emitted unexpected output (verbatim) ---- [junit4] Java HotSpot(TM) 64-Bit Server VM warning: Option UseConcMarkSweepGC was deprecated in version 9.0 and will likely be removed in a future release. [junit4] <<< JVM J1: EOF ---- [...truncated 224 lines...] [junit4] JVM J0: stderr was not empty, see: /home/jenkins/workspace/Lucene-Solr-master-Linux/lucene/build/queryparser/test/temp/junit4-J0-20171005_034855_0619186637655965223235.syserr [junit4] >>> JVM J0 emitted unexpected output (verbatim) ---- [junit4] Java HotSpot(TM) 64-Bit Server VM warning: Option UseConcMarkSweepGC was deprecated in version 9.0 and will likely be removed in a future release. [junit4] <<< JVM J0: EOF ---- [...truncated 6 lines...] [junit4] JVM J2: stderr was not empty, see: /home/jenkins/workspace/Lucene-Solr-master-Linux/lucene/build/queryparser/test/temp/junit4-J2-20171005_034855_0647695983702687377429.syserr [junit4] >>> JVM J2 emitted unexpected output (verbatim) ---- [junit4] Java HotSpot(TM) 64-Bit Server VM warning: Option UseConcMarkSweepGC was deprecated in version 9.0 and will likely be removed in a future release. [junit4] <<< JVM J2: EOF ---- [junit4] JVM J1: stderr was not empty, see: /home/jenkins/workspace/Lucene-Solr-master-Linux/lucene/build/queryparser/test/temp/junit4-J1-20171005_034855_06215717902195459526103.syserr [junit4] >>> JVM J1 emitted unexpected output (verbatim) ---- [junit4] Java HotSpot(TM) 64-Bit Server VM warning: Option UseConcMarkSweepGC was deprecated in version 9.0 and will likely be removed in a future release. [junit4] <<< JVM J1: EOF ---- [...truncated 207 lines...] [junit4] JVM J1: stderr was not empty, see: /home/jenkins/workspace/Lucene-Solr-master-Linux/lucene/build/replicator/test/temp/junit4-J1-20171005_034905_51713398571984502056907.syserr [junit4] >>> JVM J1 emitted unexpected output (verbatim) ---- [junit4] Java HotSpot(TM) 64-Bit Server VM warning: Option UseConcMarkSweepGC was deprecated in version 9.0 and will likely be removed in a future release. [junit4] <<< JVM J1: EOF ---- [...truncated 3 lines...] [junit4] JVM J2: stderr was not empty, see: /home/jenkins/workspace/Lucene-Solr-master-Linux/lucene/build/replicator/test/temp/junit4-J2-20171005_034905_51811828717761731037174.syserr [junit4] >>> JVM J2 emitted unexpected output (verbatim) ---- [junit4] Java HotSpot(TM) 64-Bit Server VM warning: Option UseConcMarkSweepGC was deprecated in version 9.0 and will likely be removed in a future release. [junit4] <<< JVM J2: EOF ---- [...truncated 3 lines...] [junit4] JVM J0: stderr was not empty, see: /home/jenkins/workspace/Lucene-Solr-master-Linux/lucene/build/replicator/test/temp/junit4-J0-20171005_034905_5172250218231025507455.syserr [junit4] >>> JVM J0 emitted unexpected output (verbatim) ---- [junit4] Java HotSpot(TM) 64-Bit Server VM warning: Option UseConcMarkSweepGC was deprecated in version 9.0 and will likely be removed in a future release. [junit4] <<< JVM J0: EOF ---- [...truncated 202 lines...] [junit4] JVM J2: stderr was not empty, see: /home/jenkins/workspace/Lucene-Solr-master-Linux/lucene/build/sandbox/test/temp/junit4-J2-20171005_034919_3087302643850685845855.syserr [junit4] >>> JVM J2 emitted unexpected output (verbatim) ---- [junit4] Java HotSpot(TM) 64-Bit Server VM warning: Option UseConcMarkSweepGC was deprecated in version 9.0 and will likely be removed in a future release. [junit4] <<< JVM J2: EOF ---- [...truncated 3 lines...] [junit4] JVM J1: stderr was not empty, see: /home/jenkins/workspace/Lucene-Solr-master-Linux/lucene/build/sandbox/test/temp/junit4-J1-20171005_034919_30817220750701773495322.syserr [junit4] >>> JVM J1 emitted unexpected output (verbatim) ---- [junit4] Java HotSpot(TM) 64-Bit Server VM warning: Option UseConcMarkSweepGC was deprecated in version 9.0 and will likely be removed in a future release. [junit4] <<< JVM J1: EOF ---- [...truncated 21 lines...] [junit4] JVM J0: stderr was not empty, see: /home/jenkins/workspace/Lucene-Solr-master-Linux/lucene/build/sandbox/test/temp/junit4-J0-20171005_034919_30830905582857768686.syserr [junit4] >>> JVM J0 emitted unexpected output (verbatim) ---- [junit4] Java HotSpot(TM) 64-Bit Server VM warning: Option UseConcMarkSweepGC was deprecated in version 9.0 and will likely be removed in a future release. [junit4] <<< JVM J0: EOF ---- [...truncated 415 lines...] [junit4] JVM J1: stderr was not empty, see: /home/jenkins/workspace/Lucene-Solr-master-Linux/lucene/build/spatial-extras/test/temp/junit4-J1-20171005_035017_6167861536671468844493.syserr [junit4] >>> JVM J1 emitted unexpected output (verbatim) ---- [junit4] Java HotSpot(TM) 64-Bit Server VM warning: Option UseConcMarkSweepGC was deprecated in version 9.0 and will likely be removed in a future release. [junit4] <<< JVM J1: EOF ---- [junit4] JVM J0: stderr was not empty, see: /home/jenkins/workspace/Lucene-Solr-master-Linux/lucene/build/spatial-extras/test/temp/junit4-J0-20171005_035017_61612992469922958780443.syserr [junit4] >>> JVM J0 emitted unexpected output (verbatim) ---- [junit4] Java HotSpot(TM) 64-Bit Server VM warning: Option UseConcMarkSweepGC was deprecated in version 9.0 and will likely be removed in a future release. [junit4] <<< JVM J0: EOF ---- [...truncated 6 lines...] [junit4] JVM J2: stderr was not empty, see: /home/jenkins/workspace/Lucene-Solr-master-Linux/lucene/build/spatial-extras/test/temp/junit4-J2-20171005_035017_6166713842610639083165.syserr [junit4] >>> JVM J2 emitted unexpected output (verbatim) ---- [junit4] Java HotSpot(TM) 64-Bit Server VM warning: Option UseConcMarkSweepGC was deprecated in version 9.0 and will likely be removed in a future release. [junit4] <<< JVM J2: EOF ---- [...truncated 148 lines...] [junit4] JVM J0: stderr was not empty, see: /home/jenkins/workspace/Lucene-Solr-master-Linux/lucene/build/spatial/test/temp/junit4-J0-20171005_035037_07410862663285354553124.syserr [junit4] >>> JVM J0 emitted unexpected output (verbatim) ---- [junit4] Java HotSpot(TM) 64-Bit Server VM warning: Option UseConcMarkSweepGC was deprecated in version 9.0 and will likely be removed in a future release. [junit4] <<< JVM J0: EOF ---- [...truncated 169 lines...] [junit4] JVM J0: stderr was not empty, see: /home/jenkins/workspace/Lucene-Solr-master-Linux/lucene/build/spatial3d/test/temp/junit4-J0-20171005_035039_1297304483893235654259.syserr [junit4] >>> JVM J0 emitted unexpected output (verbatim) ---- [junit4] Java HotSpot(TM) 64-Bit Server VM warning: Option UseConcMarkSweepGC was deprecated in version 9.0 and will likely be removed in a future release. [junit4] <<< JVM J0: EOF ---- [...truncated 3 lines...] [junit4] JVM J2: stderr was not empty, see: /home/jenkins/workspace/Lucene-Solr-master-Linux/lucene/build/spatial3d/test/temp/junit4-J2-20171005_035039_1296215735372815868535.syserr [junit4] >>> JVM J2 emitted unexpected output (verbatim) ---- [junit4] Java HotSpot(TM) 64-Bit Server VM warning: Option UseConcMarkSweepGC was deprecated in version 9.0 and will likely be removed in a future release. [junit4] <<< JVM J2: EOF ---- [...truncated 8 lines...] [junit4] JVM J1: stderr was not empty, see: /home/jenkins/workspace/Lucene-Solr-master-Linux/lucene/build/spatial3d/test/temp/junit4-J1-20171005_035039_1299574715200034075245.syserr [junit4] >>> JVM J1 emitted unexpected output (verbatim) ---- [junit4] Java HotSpot(TM) 64-Bit Server VM warning: Option UseConcMarkSweepGC was deprecated in version 9.0 and will likely be removed in a future release. [junit4] <<< JVM J1: EOF ---- [...truncated 250 lines...] [junit4] JVM J0: stderr was not empty, see: /home/jenkins/workspace/Lucene-Solr-master-Linux/lucene/build/suggest/test/temp/junit4-J0-20171005_035146_00813557453640104677746.syserr [junit4] >>> JVM J0 emitted unexpected output (verbatim) ---- [junit4] Java HotSpot(TM) 64-Bit Server VM warning: Option UseConcMarkSweepGC was deprecated in version 9.0 and will likely be removed in a future release. [junit4] <<< JVM J0: EOF ---- [...truncated 3 lines...] [junit4] JVM J2: stderr was not empty, see: /home/jenkins/workspace/Lucene-Solr-master-Linux/lucene/build/suggest/test/temp/junit4-J2-20171005_035146_008779857234120273094.syserr [junit4] >>> JVM J2 emitted unexpected output (verbatim) ---- [junit4] Java HotSpot(TM) 64-Bit Server VM warning: Option UseConcMarkSweepGC was deprecated in version 9.0 and will likely be removed in a future release. [junit4] <<< JVM J2: EOF ---- [...truncated 3 lines...] [junit4] JVM J1: stderr was not empty, see: /home/jenkins/workspace/Lucene-Solr-master-Linux/lucene/build/suggest/test/temp/junit4-J1-20171005_035146_00810588153078850840342.syserr [junit4] >>> JVM J1 emitted unexpected output (verbatim) ---- [junit4] Java HotSpot(TM) 64-Bit Server VM warning: Option UseConcMarkSweepGC was deprecated in version 9.0 and will likely be removed in a future release. [junit4] <<< JVM J1: EOF ---- [...truncated 1579 lines...] [junit4] Suite: org.apache.solr.update.AutoCommitTest [junit4] 2> Creating dataDir: /home/jenkins/workspace/Lucene-Solr-master-Linux/solr/build/solr-core/test/J2/temp/solr.update.AutoCommitTest_28D3DB2A20700A5D-001/init-core-data-001 [junit4] 2> 6327 WARN (SUITE-AutoCommitTest-seed#[28D3DB2A20700A5D]-worker) [ ] o.a.s.SolrTestCaseJ4 startTrackingSearchers: numOpens=1 numCloses=1 [junit4] 2> 6335 INFO (SUITE-AutoCommitTest-seed#[28D3DB2A20700A5D]-worker) [ ] o.a.s.SolrTestCaseJ4 Using PointFields (NUMERIC_POINTS_SYSPROP=true) w/NUMERIC_DOCVALUES_SYSPROP=true [junit4] 2> 6336 INFO (SUITE-AutoCommitTest-seed#[28D3DB2A20700A5D]-worker) [ ] o.a.s.SolrTestCaseJ4 Randomized ssl (true) and clientAuth (true) via: @org.apache.solr.util.RandomizeSSL(reason="", value=0.0/0.0, ssl=0.0/0.0, clientAuth=0.0/0.0) [junit4] 2> 6343 INFO (SUITE-AutoCommitTest-seed#[28D3DB2A20700A5D]-worker) [ ] o.a.s.SolrTestCaseJ4 SecureRandom sanity checks: test.solr.allowed.securerandom=null & java.security.egd=file:/dev/./urandom [junit4] 2> 6344 INFO (SUITE-AutoCommitTest-seed#[28D3DB2A20700A5D]-worker) [ ] o.a.s.SolrTestCaseJ4 ####initCore [junit4] 2> 6346 INFO (SUITE-AutoCommitTest-seed#[28D3DB2A20700A5D]-worker) [ ] o.a.s.c.SolrResourceLoader [null] Added 2 libs to classloader, from paths: [/home/jenkins/workspace/Lucene-Solr-master-Linux/solr/core/src/test-files/solr/collection1/lib, /home/jenkins/workspace/Lucene-Solr-master-Linux/solr/core/src/test-files/solr/collection1/lib/classes] [junit4] 2> 6398 INFO (SUITE-AutoCommitTest-seed#[28D3DB2A20700A5D]-worker) [ ] o.a.s.c.SolrConfig Using Lucene MatchVersion: 8.0.0 [junit4] 2> 6501 INFO (SUITE-AutoCommitTest-seed#[28D3DB2A20700A5D]-worker) [ ] o.a.s.s.IndexSchema [null] Schema name=test [junit4] 2> 6641 INFO (SUITE-AutoCommitTest-seed#[28D3DB2A20700A5D]-worker) [ ] o.a.s.s.IndexSchema Loaded schema test/1.0 with uniqueid field id [junit4] 2> 6704 WARN (SUITE-AutoCommitTest-seed#[28D3DB2A20700A5D]-worker) [ ] o.a.s.m.r.SolrJmxReporter No JMX server found. Not exposing Solr metrics via JMX. [junit4] 2> 6705 WARN (SUITE-AutoCommitTest-seed#[28D3DB2A20700A5D]-worker) [ ] o.a.s.m.r.SolrJmxReporter No JMX server found. Not exposing Solr metrics via JMX. [junit4] 2> 6705 WARN (SUITE-AutoCommitTest-seed#[28D3DB2A20700A5D]-worker) [ ] o.a.s.m.r.SolrJmxReporter No JMX server found. Not exposing Solr metrics via JMX. [junit4] 2> 6729 INFO (coreLoadExecutor-19-thread-1) [ ] o.a.s.c.TransientSolrCoreCacheDefault Allocating transient cache for 2147483647 transient cores [junit4] 2> 6730 INFO (coreLoadExecutor-19-thread-1) [ ] o.a.s.c.SolrResourceLoader [null] Added 2 libs to classloader, from paths: [/home/jenkins/workspace/Lucene-Solr-master-Linux/solr/core/src/test-files/solr/collection1/lib, /home/jenkins/workspace/Lucene-Solr-master-Linux/solr/core/src/test-files/solr/collection1/lib/classes] [junit4] 2> 6776 INFO (coreLoadExecutor-19-thread-1) [ ] o.a.s.c.SolrConfig Using Lucene MatchVersion: 8.0.0 [junit4] 2> 6821 INFO (coreLoadExecutor-19-thread-1) [ ] o.a.s.s.IndexSchema [collection1] Schema name=test [junit4] 2> 6930 INFO (coreLoadExecutor-19-thread-1) [ ] o.a.s.s.IndexSchema Loaded schema test/1.0 with uniqueid field id [junit4] 2> 6958 INFO (coreLoadExecutor-19-thread-1) [ ] o.a.s.c.CoreContainer Creating SolrCore 'collection1' using configuration from instancedir /home/jenkins/workspace/Lucene-Solr-master-Linux/solr/core/src/test-files/solr/collection1, trusted=true [junit4] 2> 6981 WARN (coreLoadExecutor-19-thread-1) [ ] o.a.s.m.r.SolrJmxReporter No JMX server found. Not exposing Solr metrics via JMX. [junit4] 2> 6985 INFO (coreLoadExecutor-19-thread-1) [ ] o.a.s.c.SolrCore solr.RecoveryStrategy.Builder [junit4] 2> 6986 INFO (coreLoadExecutor-19-thread-1) [ ] o.a.s.c.SolrCore [[collection1] ] Opening new SolrCore at [/home/jenkins/workspace/Lucene-Solr-master-Linux/solr/core/src/test-files/solr/collection1], dataDir=[/home/jenkins/workspace/Lucene-Solr-master-Linux/solr/build/solr-core/test/J2/temp/solr.update.AutoCommitTest_28D3DB2A20700A5D-001/init-core-data-001/] [junit4] 2> 6989 INFO (coreLoadExecutor-19-thread-1) [ ] o.a.s.u.RandomMergePolicy RandomMergePolicy wrapping class org.apache.lucene.index.LogDocMergePolicy: [LogDocMergePolicy: minMergeSize=1000, mergeFactor=47, maxMergeSize=9223372036854775807, maxMergeSizeForForcedMerge=9223372036854775807, calibrateSizeByDeletes=false, maxMergeDocs=2147483647, maxCFSSegmentSizeMB=8.796093022207999E12, noCFSRatio=0.0] [junit4] 2> 7083 INFO (coreLoadExecutor-19-thread-1) [ ] o.a.s.u.UpdateHandler Using UpdateLog implementation: org.apache.solr.update.UpdateLog [junit4] 2> 7083 INFO (coreLoadExecutor-19-thread-1) [ ] o.a.s.u.UpdateLog Initializing UpdateLog: dataDir= defaultSyncLevel=FLUSH numRecordsToKeep=100 maxNumLogsToKeep=10 numVersionBuckets=65536 [junit4] 2> 7090 INFO (coreLoadExecutor-19-thread-1) [ ] o.a.s.u.CommitTracker Hard AutoCommit: disabled [junit4] 2> 7090 INFO (coreLoadExecutor-19-thread-1) [ ] o.a.s.u.CommitTracker Soft AutoCommit: disabled [junit4] 2> 7091 INFO (coreLoadExecutor-19-thread-1) [ ] o.a.s.u.RandomMergePolicy RandomMergePolicy wrapping class org.apache.lucene.index.TieredMergePolicy: [TieredMergePolicy: maxMergeAtOnce=44, maxMergeAtOnceExplicit=27, maxMergedSegmentMB=84.34765625, floorSegmentMB=0.2783203125, forceMergeDeletesPctAllowed=13.292761648125733, segmentsPerTier=37.0, maxCFSSegmentSizeMB=8.796093022207999E12, noCFSRatio=0.6809189129438984 [junit4] 2> 7092 INFO (coreLoadExecutor-19-thread-1) [ ] o.a.s.s.SolrIndexSearcher Opening [Searcher@1fcb98d1[collection1] main] [junit4] 2> 7094 INFO (coreLoadExecutor-19-thread-1) [ ] o.a.s.h.c.SpellCheckComponent Initializing spell checkers [junit4] 2> 7140 INFO (coreLoadExecutor-19-thread-1) [ ] o.a.s.s.DirectSolrSpellChecker init: {name=direct,classname=DirectSolrSpellChecker,field=lowerfilt,minQueryLength=3} [junit4] 2> 7229 INFO (coreLoadExecutor-19-thread-1) [ ] o.a.s.h.ReplicationHandler Commits will be reserved for 10000ms. [junit4] 2> 7234 INFO (searcherExecutor-20-thread-1) [ ] o.a.s.h.c.SpellCheckComponent Loading spell index for spellchecker: default [junit4] 2> 7235 INFO (searcherExecutor-20-thread-1) [ ] o.a.s.h.c.SpellCheckComponent Loading spell index for spellchecker: direct [junit4] 2> 7235 INFO (searcherExecutor-20-thread-1) [ ] o.a.s.h.c.SpellCheckComponent Loading spell index for spellchecker: wordbreak [junit4] 2> 7235 INFO (searcherExecutor-20-thread-1) [ ] o.a.s.h.c.SpellCheckComponent Loading spell index for spellchecker: multipleFields [junit4] 2> 7240 INFO (coreLoadExecutor-19-thread-1) [ ] o.a.s.u.UpdateLog Could not find max version in index or recent updates, using new clock 1580388143869198336 [junit4] 2> 7241 INFO (searcherExecutor-20-thread-1) [ ] o.a.s.h.c.SpellCheckComponent Loading spell index for spellchecker: jarowinkler [junit4] 2> 7246 INFO (searcherExecutor-20-thread-1) [ ] o.a.s.h.c.SpellCheckComponent Loading spell index for spellchecker: external [junit4] 2> 7247 INFO (searcherExecutor-20-thread-1) [ ] o.a.s.h.c.SpellCheckComponent Loading spell index for spellchecker: freq [junit4] 2> 7247 INFO (searcherExecutor-20-thread-1) [ ] o.a.s.h.c.SpellCheckComponent Loading spell index for spellchecker: fqcn [junit4] 2> 7247 INFO (searcherExecutor-20-thread-1) [ ] o.a.s.h.c.SpellCheckComponent Loading spell index for spellchecker: perDict [junit4] 2> 7252 INFO (SUITE-AutoCommitTest-seed#[28D3DB2A20700A5D]-worker) [ ] o.a.s.SolrTestCaseJ4 ####initCore end [junit4] 2> 7253 INFO (TEST-AutoCommitTest.testMaxDocs-seed#[28D3DB2A20700A5D]) [ ] o.a.s.SolrTestCaseJ4 ###Starting testMaxDocs [junit4] 2> 7268 INFO (searcherExecutor-20-thread-1) [ ] o.a.s.c.SolrCore [collection1] Registered new searcher Searcher@1fcb98d1[collection1] main{ExitableDirectoryReader(UninvertingDirectoryReader())} [junit4] 2> 7269 INFO (TEST-AutoCommitTest.testMaxDocs-seed#[28D3DB2A20700A5D]) [ ] o.a.s.u.DirectUpdateHandler2 [collection1] REMOVING ALL DOCUMENTS FROM INDEX [junit4] 2> 7276 INFO (TEST-AutoCommitTest.testMaxDocs-seed#[28D3DB2A20700A5D]) [ ] o.a.s.s.SolrIndexSearcher Opening [Searcher@60c61b04[collection1] realtime] [junit4] 2> 7277 INFO (TEST-AutoCommitTest.testMaxDocs-seed#[28D3DB2A20700A5D]) [ ] o.a.s.u.p.LogUpdateProcessorFactory [collection1] webapp=null path=null params={_version_=-9223372036854775807&update.distrib=FROMLEADER&versions=true&wt=json&indent=true}{deleteByQuery=*:* (-9223372036854775807)} 0 22 [junit4] 2> 7282 ERROR (TEST-AutoCommitTest.testMaxDocs-seed#[28D3DB2A20700A5D]) [ ] o.a.s.c.CorePropertiesLocator Couldn't load core descriptor from /home/jenkins/workspace/Lucene-Solr-master-Linux/solr/core/src/test-files/solr/collection1/core.properties:java.nio.file.NoSuchFileException: /home/jenkins/workspace/Lucene-Solr-master-Linux/solr/core/src/test-files/solr/collection1/core.properties [junit4] 2> 7286 INFO (TEST-AutoCommitTest.testMaxDocs-seed#[28D3DB2A20700A5D]) [ ] o.a.s.c.SolrResourceLoader [null] Added 2 libs to classloader, from paths: [/home/jenkins/workspace/Lucene-Solr-master-Linux/solr/core/src/test-files/solr/collection1/lib, /home/jenkins/workspace/Lucene-Solr-master-Linux/solr/core/src/test-files/solr/collection1/lib/classes] [junit4] 2> 7321 INFO (TEST-AutoCommitTest.testMaxDocs-seed#[28D3DB2A20700A5D]) [ ] o.a.s.c.SolrConfig Using Lucene MatchVersion: 8.0.0 [junit4] 2> 7365 INFO (TEST-AutoCommitTest.testMaxDocs-seed#[28D3DB2A20700A5D]) [ ] o.a.s.s.IndexSchema [collection1] Schema name=test [junit4] 2> 7671 INFO (TEST-AutoCommitTest.testMaxDocs-seed#[28D3DB2A20700A5D]) [ ] o.a.s.s.IndexSchema Loaded schema test/1.0 with uniqueid field id [junit4] 2> 7706 INFO (TEST-AutoCommitTest.testMaxDocs-seed#[28D3DB2A20700A5D]) [ ] o.a.s.c.CoreContainer Reloading SolrCore 'collection1' using configuration from instancedir /home/jenkins/workspace/Lucene-Solr-master-Linux/solr/core/src/test-files/solr/collection1 [junit4] 2> 7707 WARN (TEST-AutoCommitTest.testMaxDocs-seed#[28D3DB2A20700A5D]) [ ] o.a.s.m.r.SolrJmxReporter No JMX server found. Not exposing Solr metrics via JMX. [junit4] 2> 7707 INFO (TEST-AutoCommitTest.testMaxDocs-seed#[28D3DB2A20700A5D]) [ ] o.a.s.c.SolrCore [[collection1] ] Opening new SolrCore at [/home/jenkins/workspace/Lucene-Solr-master-Linux/solr/core/src/test-files/solr/collection1], dataDir=[/home/jenkins/workspace/Lucene-Solr-master-Linux/solr/build/solr-core/test/J2/temp/solr.update.AutoCommitTest_28D3DB2A20700A5D-001/init-core-data-001/] [junit4] 2> 7781 INFO (TEST-AutoCommitTest.testMaxDocs-seed#[28D3DB2A20700A5D]) [ ] o.a.s.u.CommitTracker Hard AutoCommit: disabled [junit4] 2> 7781 INFO (TEST-AutoCommitTest.testMaxDocs-seed#[28D3DB2A20700A5D]) [ ] o.a.s.u.CommitTracker Soft AutoCommit: disabled [junit4] 2> 7783 INFO (TEST-AutoCommitTest.testMaxDocs-seed#[28D3DB2A20700A5D]) [ ] o.a.s.s.SolrIndexSearcher Opening [Searcher@777d92f[collection1] main] [junit4] 2> 7786 INFO (TEST-AutoCommitTest.testMaxDocs-seed#[28D3DB2A20700A5D]) [ ] o.a.s.h.c.SpellCheckComponent Initializing spell checkers [junit4] 2> 7787 INFO (TEST-AutoCommitTest.testMaxDocs-seed#[28D3DB2A20700A5D]) [ ] o.a.s.s.DirectSolrSpellChecker init: {name=direct,classname=DirectSolrSpellChecker,field=lowerfilt,minQueryLength=3} [junit4] 2> 7794 INFO (TEST-AutoCommitTest.testMaxDocs-seed#[28D3DB2A20700A5D]) [ ] o.a.s.h.ReplicationHandler Commits will be reserved for 10000ms. [junit4] 2> 7794 INFO (TEST-AutoCommitTest.testMaxDocs-seed#[28D3DB2A20700A5D]) [ ] o.a.s.u.UpdateLog Could not find max version in index or recent updates, using new clock 1580388144450109440 [junit4] 2> 7795 INFO (searcherExecutor-25-thread-1) [ ] o.a.s.h.c.SpellCheckComponent Loading spell index for spellchecker: default [junit4] 2> 7798 INFO (searcherExecutor-25-thread-1) [ ] o.a.s.h.c.SpellCheckComponent Loading spell index for spellchecker: direct [junit4] 2> 7799 INFO (searcherExecutor-25-thread-1) [ ] o.a.s.h.c.SpellCheckComponent Loading spell index for spellchecker: wordbreak [junit4] 2> 7799 INFO (searcherExecutor-25-thread-1) [ ] o.a.s.h.c.SpellCheckComponent Loading spell index for spellchecker: multipleFields [junit4] 2> 7799 INFO (searcherExecutor-25-thread-1) [ ] o.a.s.h.c.SpellCheckComponent Loading spell index for spellchecker: jarowinkler [junit4] 2> 7800 INFO (searcherExecutor-25-thread-1) [ ] o.a.s.h.c.SpellCheckComponent Loading spell index for spellchecker: external [junit4] 2> 7800 INFO (searcherExecutor-25-thread-1) [ ] o.a.s.h.c.SpellCheckComponent Loading spell index for spellchecker: freq [junit4] 2> 7801 INFO (searcherExecutor-25-thread-1) [ ] o.a.s.h.c.SpellCheckComponent Loading spell index for spellchecker: fqcn [junit4] 2> 7802 INFO (searcherExecutor-25-thread-1) [ ] o.a.s.h.c.SpellCheckComponent Loading spell index for spellchecker: perDict [junit4] 2> 7802 INFO (searcherExecutor-25-thread-1) [ ] o.a.s.c.SolrCore [collection1] Registered new searcher Searcher@777d92f[collection1] main{ExitableDirectoryReader(UninvertingDirectoryReader())} [junit4] 2> 7842 INFO (TEST-AutoCommitTest.testMaxDocs-seed#[28D3DB2A20700A5D]) [ ] o.a.s.u.RandomMergePolicy RandomMergePolicy wrapping class org.apache.lucene.index.TieredMergePolicy: [TieredMergePolicy: maxMergeAtOnce=36, maxMergeAtOnceExplicit=47, maxMergedSegmentMB=92.4326171875, floorSegmentMB=1.1455078125, forceMergeDeletesPctAllowed=1.3295574388045228, segmentsPerTier=12.0, maxCFSSegmentSizeMB=8.796093022207999E12, noCFSRatio=1.0 [junit4] 2> 7843 INFO (TEST-AutoCommitTest.testMaxDocs-seed#[28D3DB2A20700A5D]) [ ] o.a.s.u.DefaultSolrCoreState New IndexWriter is ready to be used. [junit4] 2> 7844 INFO (TEST-AutoCommitTest.testMaxDocs-seed#[28D3DB2A20700A5D]) [ ] o.a.s.s.SolrIndexSearcher Opening [Searcher@41a0e86b[collection1] main] [junit4] 2> 7846 INFO (TEST-AutoCommitTest.testMaxDocs-seed#[28D3DB2A20700A5D]) [ ] o.a.s.c.SolrCore [collection1] CLOSING SolrCore org.apache.solr.core.SolrCore@264118c7 [junit4] 2> 7847 INFO (TEST-AutoCommitTest.testMaxDocs-seed#[28D3DB2A20700A5D]) [ ] o.a.s.m.SolrMetricManager Closing metric reporters for registry=solr.core.collection1, tag=641800391 [junit4] 2> 7848 INFO (searcherExecutor-25-thread-1) [ ] o.a.s.c.SolrCore [collection1] Registered new searcher Searcher@41a0e86b[collection1] main{ExitableDirectoryReader(UninvertingDirectoryReader())} [junit4] 2> 7849 INFO (TEST-AutoCommitTest.testMaxDocs-seed#[28D3DB2A20700A5D]) [ ] o.a.s.m.r.SolrJmxReporter Closing reporter [org.apache.solr.metrics.reporters.SolrJmxReporter@79b2fb99: rootName = null, domain = solr.core.collection1, service url = null, agent id = null] for registry solr.core.collection1 / null [junit4] 2> 8021 INFO (TEST-AutoCommitTest.testMaxDocs-seed#[28D3DB2A20700A5D]) [ ] o.a.s.u.p.LogUpdateProcessorFactory [collection1] {add=[0 (1580388144574889984)]} 0 152 [junit4] 2> 8039 INFO (TEST-AutoCommitTest.testMaxDocs-seed#[28D3DB2A20700A5D]) [ ] o.a.s.u.p.LogUpdateProcessorFactory [collection1] {add=[1 (1580388144705961984)]} 0 169 [junit4] 2> 8040 INFO (TEST-AutoCommitTest.testMaxDocs-seed#[28D3DB2A20700A5D]) [ ] o.a.s.u.p.LogUpdateProcessorFactory [collection1] {add=[2 (1580388144707010560)]} 0 171 [junit4] 2> 8041 INFO (TEST-AutoCommitTest.testMaxDocs-seed#[28D3DB2A20700A5D]) [ ] o.a.s.u.p.LogUpdateProcessorFactory [collection1] {add=[3 (1580388144709107712)]} 0 172 [junit4] 2> 8043 INFO (TEST-AutoCommitTest.testMaxDocs-seed#[28D3DB2A20700A5D]) [ ] o.a.s.u.p.LogUpdateProcessorFactory [collection1] {add=[4 (1580388144710156288)]} 0 173 [junit4] 2> 8044 INFO (TEST-AutoCommitTest.testMaxDocs-seed#[28D3DB2A20700A5D]) [ ] o.a.s.u.p.LogUpdateProcessorFactory [collection1] {add=[5 (1580388144711204864)]} 0 175 [junit4] 2> 8050 INFO (TEST-AutoCommitTest.testMaxDocs-seed#[28D3DB2A20700A5D]) [ ] o.a.s.u.p.LogUpdateProcessorFactory [collection1] {add=[6 (1580388144712253440)]} 0 181 [junit4] 2> 8053 INFO (TEST-AutoCommitTest.testMaxDocs-seed#[28D3DB2A20700A5D]) [ ] o.a.s.u.p.LogUpdateProcessorFactory [collection1] {add=[7 (1580388144719593472)]} 0 184 [junit4] 2> 8055 INFO (TEST-AutoCommitTest.testMaxDocs-seed#[28D3DB2A20700A5D]) [ ] o.a.s.u.p.LogUpdateProcessorFactory [collection1] {add=[8 (1580388144722739200)]} 0 186 [junit4] 2> 8057 INFO (TEST-AutoCommitTest.testMaxDocs-seed#[28D3DB2A20700A5D]) [ ] o.a.s.u.p.LogUpdateProcessorFactory [collection1] {add=[9 (1580388144723787776)]} 0 187 [junit4] 2> 8062 INFO (TEST-AutoCommitTest.testMaxDocs-seed#[28D3DB2A20700A5D]) [ ] o.a.s.u.p.LogUpdateProcessorFactory [collection1] {add=[10 (1580388144725884928)]} 0 193 [junit4] 2> 8066 INFO (TEST-AutoCommitTest.testMaxDocs-seed#[28D3DB2A20700A5D]) [ ] o.a.s.u.p.LogUpdateProcessorFactory [collection1] {add=[11 (1580388144733224960)]} 0 197 [junit4] 2> 8067 INFO (TEST-AutoCommitTest.testMaxDocs-seed#[28D3DB2A20700A5D]) [ ] o.a.s.u.p.LogUpdateProcessorFactory [collection1] {add=[12 (1580388144735322112)]} 0 198 [junit4] 2> 8072 INFO (TEST-AutoCommitTest.testMaxDocs-seed#[28D3DB2A20700A5D]) [ ] o.a.s.u.p.LogUpdateProcessorFactory [collection1] {add=[13 (1580388144737419264)]} 0 203 [junit4] 2> 8075 INFO (TEST-AutoCommitTest.testMaxDocs-seed#[28D3DB2A20700A5D]) [ ] o.a.s.c.S.Request [collection1] webapp=null path=null params={q=id:1&qt=&start=0&rows=20&version=2.2} hits=0 status=0 QTime=2 [junit4] 2> 8084 INFO (TEST-AutoCommitTest.testMaxDocs-seed#[28D3DB2A20700A5D]) [ ] o.a.s.u.p.LogUpdateProcessorFactory [collection1] {add=[14 (1580388144754196480)]} 0 215 [junit4] 2> 8099 INFO (commitScheduler-28-thread-1) [ ] o.a.s.u.DirectUpdateHandler2 start commit{,optimize=false,openSearcher=true,waitSearcher=true,expungeDeletes=false,softCommit=true,prepareCommit=false} [junit4] 2> 8388 INFO (commitScheduler-28-thread-1) [ ] o.a.s.s.SolrIndexSearcher Opening [Searcher@3814ac9e[collection1] main] [junit4] 2> 8417 INFO (commitScheduler-28-thread-1) [ ] o.a.s.u.DirectUpdateHandler2 end_commit_flush [junit4] 2> 8417 INFO (searcherExecutor-25-thread-1) [ ] o.a.s.c.SolrCore [collection1] Registered new searcher Searcher@3814ac9e[collection1] main{ExitableDirectoryReader(UninvertingDirectoryReader(Uninverting(_0(8.0.0):C15)))} [junit4] 2> 8591 INFO (TEST-AutoCommitTest.testMaxDocs-seed#[28D3DB2A20700A5D]) [ ] o.a.s.u.p.LogUpdateProcessorFactory [collection1] {add=[15 (1580388145283727360)]} 0 722 [junit4] 2> 8592 INFO (TEST-AutoCommitTest.testMaxDocs-seed#[28D3DB2A20700A5D]) [ ] o.a.s.c.S.Request [collection1] webapp=null path=null params={q=id:14&qt=&start=0&rows=20&version=2.2} hits=1 status=0 QTime=1 [junit4] 2> 8604 INFO (TEST-AutoCommitTest.testMaxDocs-seed#[28D3DB2A20700A5D]) [ ] o.a.s.c.S.Request [collection1] webapp=null path=null params={q=id:15&qt=&start=0&rows=20&version=2.2} hits=0 status=0 QTime=0 [junit4] 2> 8605 INFO (TEST-AutoCommitTest.testMaxDocs-seed#[28D3DB2A20700A5D]) [ ] o.a.s.SolrTestCaseJ4 ###Ending testMaxDocs [junit4] 2> 8655 INFO (TEST-AutoCommitTest.testCommitWithin-seed#[28D3DB2A20700A5D]) [ ] o.a.s.SolrTestCaseJ4 ###Starting testCommitWithin [junit4] 2> 8655 INFO (TEST-AutoCommitTest.testCommitWithin-seed#[28D3DB2A20700A5D]) [ ] o.a.s.u.DirectUpdateHandler2 [collection1] REMOVING ALL DOCUMENTS FROM INDEX [junit4] 2> 8661 INFO (TEST-AutoCommitTest.testCommitWithin-seed#[28D3DB2A20700A5D]) [ ] o.a.s.s.SolrIndexSearcher Opening [Searcher@526d159[collection1] realtime] [junit4] 2> 8662 INFO (TEST-AutoCommitTest.testCommitWithin-seed#[28D3DB2A20700A5D]) [ ] o.a.s.u.p.LogUpdateProcessorFactory [collection1] webapp=null path=null params={_version_=-9223372036854775807&update.distrib=FROMLEADER&versions=true&wt=json&indent=true}{deleteByQuery=*:* (-9223372036854775807)} 0 7 [junit4] 2> 8662 ERROR (TEST-AutoCommitTest.testCommitWithin-seed#[28D3DB2A20700A5D]) [ ] o.a.s.c.CorePropertiesLocator Couldn't load core descriptor from /home/jenkins/workspace/Lucene-Solr-master-Linux/solr/core/src/test-files/solr/collection1/core.properties:java.nio.file.NoSuchFileException: /home/jenkins/workspace/Lucene-Solr-master-Linux/solr/core/src/test-files/solr/collection1/core.properties [junit4] 2> 8664 INFO (TEST-AutoCommitTest.testCommitWithin-seed#[28D3DB2A20700A5D]) [ ] o.a.s.c.SolrResourceLoader [null] Added 2 libs to classloader, from paths: [/home/jenkins/workspace/Lucene-Solr-master-Linux/solr/core/src/test-files/solr/collection1/lib, /home/jenkins/workspace/Lucene-Solr-master-Linux/solr/core/src/test-files/solr/collection1/lib/classes] [junit4] 2> 8786 INFO (TEST-AutoCommitTest.testCommitWithin-seed#[28D3DB2A20700A5D]) [ ] o.a.s.c.SolrConfig Using Lucene MatchVersion: 8.0.0 [junit4] 2> 8829 INFO (TEST-AutoCommitTest.testCommitWithin-seed#[28D3DB2A20700A5D]) [ ] o.a.s.s.IndexSchema [collection1] Schema name=test [junit4] 2> 9021 INFO (TEST-AutoCommitTest.testCommitWithin-seed#[28D3DB2A20700A5D]) [ ] o.a.s.s.IndexSchema Loaded schema test/1.0 with uniqueid field id [junit4] 2> 9076 INFO (TEST-AutoCommitTest.testCommitWithin-seed#[28D3DB2A20700A5D]) [ ] o.a.s.c.CoreContainer Reloading SolrCore 'collection1' using configuration from instancedir /home/jenkins/workspace/Lucene-Solr-master-Linux/solr/core/src/test-files/solr/collection1 [junit4] 2> 9077 WARN (TEST-AutoCommitTest.testCommitWithin-seed#[28D3DB2A20700A5D]) [ ] o.a.s.m.r.SolrJmxReporter No JMX server found. Not exposing Solr metrics via JMX. [junit4] 2> 9077 INFO (TEST-AutoCommitTest.testCommitWithin-seed#[28D3DB2A20700A5D]) [ ] o.a.s.c.SolrCore [[collection1] ] Opening new SolrCore at [/home/jenkins/workspace/Lucene-Solr-master-Linux/solr/core/src/test-files/solr/collection1], dataDir=[/home/jenkins/workspace/Lucene-Solr-master-Linux/solr/build/solr-core/test/J2/temp/solr.update.AutoCommitTest_28D3DB2A20700A5D-001/init-core-data-001/] [junit4] 2> 9200 INFO (TEST-AutoCommitTest.testCommitWithin-seed#[28D3DB2A20700A5D]) [ ] o.a.s.u.CommitTracker Hard AutoCommit: disabled [junit4] 2> 9200 INFO (TEST-AutoCommitTest.testCommitWithin-seed#[28D3DB2A20700A5D]) [ ] o.a.s.u.CommitTracker Soft AutoCommit: disabled [junit4] 2> 9201 INFO (TEST-AutoCommitTest.testCommitWithin-seed#[28D3DB2A20700A5D]) [ ] o.a.s.s.SolrIndexSearcher Opening [Searcher@12d49605[collection1] main] [junit4] 2> 9202 INFO (TEST-AutoCommitTest.testCommitWithin-seed#[28D3DB2A20700A5D]) [ ] o.a.s.h.c.SpellCheckComponent Initializing spell checkers [junit4] 2> 9204 INFO (TEST-AutoCommitTest.testCommitWithin-seed#[28D3DB2A20700A5D]) [ ] o.a.s.s.DirectSolrSpellChecker init: {name=direct,classname=DirectSolrSpellChecker,field=lowerfilt,minQueryLength=3} [junit4] 2> 9209 INFO (TEST-AutoCommitTest.testCommitWithin-seed#[28D3DB2A20700A5D]) [ ] o.a.s.h.ReplicationHandler Commits will be reserved for 10000ms. [junit4] 2> 9225 INFO (searcherExecutor-29-thread-1) [ ] o.a.s.h.c.SpellCheckComponent Loading spell index for spellchecker: default [junit4] 2> 9225 INFO (searcherExecutor-29-thread-1) [ ] o.a.s.h.c.SpellCheckComponent Loading spell index for spellchecker: direct [junit4] 2> 9225 INFO (searcherExecutor-29-thread-1) [ ] o.a.s.h.c.SpellCheckComponent Loading spell index for spellchecker: wordbreak [junit4] 2> 9226 INFO (searcherExecutor-29-thread-1) [ ] o.a.s.h.c.SpellCheckComponent Loading spell index for spellchecker: multipleFields [junit4] 2> 9226 INFO (TEST-AutoCommitTest.testCommitWithin-seed#[28D3DB2A20700A5D]) [ ] o.a.s.u.RandomMergePolicy RandomMergePolicy wrapping class org.apache.lucene.index.LogDocMergePolicy: [LogDocMergePolicy: minMergeSize=1000, mergeFactor=30, maxMergeSize=9223372036854775807, maxMergeSizeForForcedMerge=9223372036854775807, calibrateSizeByDeletes=true, maxMergeDocs=2147483647, maxCFSSegmentSizeMB=8.796093022207999E12, noCFSRatio=0.6203542851170429] [junit4] 2> 9226 INFO (searcherExecutor-29-thread-1) [ ] o.a.s.h.c.SpellCheckComponent Loading spell index for spellchecker: jarowinkler [junit4] 2> 9227 INFO (searcherExecutor-29-thread-1) [ ] o.a.s.h.c.SpellCheckComponent Loading spell index for spellchecker: external [junit4] 2> 9227 INFO (searcherExecutor-29-thread-1) [ ] o.a.s.h.c.SpellCheckComponent Loading spell index for spellchecker: freq [junit4] 2> 9228 INFO (searcherExecutor-29-thread-1) [ ] o.a.s.h.c.SpellCheckComponent Loading spell index for spellchecker: fqcn [junit4] 2> 9228 INFO (searcherExecutor-29-thread-1) [ ] o.a.s.h.c.SpellCheckComponent Loading spell index for spellchecker: perDict [junit4] 2> 9229 INFO (searcherExecutor-29-thread-1) [ ] o.a.s.c.SolrCore [collection1] Registered new searcher Searcher@12d49605[collection1] main{ExitableDirectoryReader(UninvertingDirectoryReader())} [junit4] 2> 9229 INFO (TEST-AutoCommitTest.testCommitWithin-seed#[28D3DB2A20700A5D]) [ ] o.a.s.u.DefaultSolrCoreState New IndexWriter is ready to be used. [junit4] 2> 9229 INFO (TEST-AutoCommitTest.testCommitWithin-seed#[28D3DB2A20700A5D]) [ ] o.a.s.s.SolrIndexSearcher Opening [Searcher@388865b5[collection1] main] [junit4] 2> 9230 INFO (TEST-AutoCommitTest.testCommitWithin-seed#[28D3DB2A20700A5D]) [ ] o.a.s.c.SolrCore [collection1] CLOSING SolrCore org.apache.solr.core.SolrCore@1b16c238 [junit4] 2> 9230 INFO (TEST-AutoCommitTest.testCommitWithin-seed#[28D3DB2A20700A5D]) [ ] o.a.s.m.SolrMetricManager Closing metric reporters for registry=solr.core.collection1, tag=454476344 [junit4] 2> 9230 INFO (TEST-AutoCommitTest.testCommitWithin-seed#[28D3DB2A20700A5D]) [ ] o.a.s.m.r.SolrJmxReporter Closing reporter [org.apache.solr.metrics.reporters.SolrJmxReporter@286288: rootName = null, domain = solr.core.collection1, service url = null, agent id = null] for registry solr.core.collection1 / null [junit4] 2> 9234 INFO (searcherExecutor-29-thread-1) [ ] o.a.s.c.SolrCore [collection1] Registered new searcher Searcher@388865b5[collection1] main{ExitableDirectoryReader(UninvertingDirectoryReader())} [junit4] 2> 9261 INFO (TEST-AutoCommitTest.testCommitWithin-seed#[28D3DB2A20700A5D]) [ ] o.a.s.u.p.LogUpdateProcessorFactory [collection1] {add=[529 (1580388145959010304)]} 0 28 [junit4] 2> 9262 INFO (TEST-AutoCommitTest.testCommitWithin-seed#[28D3DB2A20700A5D]) [ ] o.a.s.c.S.Request [collection1] webapp=null path=null params={q=id:529&qt=&start=0&rows=20&version=2.2} hits=0 status=0 QTime=0 [junit4] 2> 9264 INFO (TEST-AutoCommitTest.testCommitWithin-seed#[28D3DB2A20700A5D]) [ ] o.a.s.u.p.LogUpdateProcessorFactory [collection1] {add=[530 (1580388145990467584)]} 0 31 [junit4] 2> 9264 INFO (TEST-AutoCommitTest.testCommitWithin-seed#[28D3DB2A20700A5D]) [ ] o.a.s.c.S.Request [collection1] webapp=null path=null params={q=id:530&qt=&start=0&rows=20&version=2.2} hits=0 status=0 QTime=0 [junit4] 2> 9265 INFO (TEST-AutoCommitTest.testCommitWithin-seed#[28D3DB2A20700A5D]) [ ] o.a.s.u.p.LogUpdateProcessorFactory [collection1] {delete=[529 (-1580388145992564736)]} 0 32 [junit4] 2> 9266 INFO (TEST-AutoCommitTest.testCommitWithin-seed#[28D3DB2A20700A5D]) [ ] o.a.s.c.S.Request [collection1] webapp=null path=null params={q=id:529&qt=&start=0&rows=20&version=2.2} hits=0 status=0 QTime=0 [junit4] 2> 9266 ERROR (TEST-AutoCommitTest.testCommitWithin-seed#[28D3DB2A20700A5D]) [ ] o.a.s.SolrTestCaseJ4 REQUEST FAILED: xpath=//result[@numFound=1] [junit4] 2> xml response was: [junit4] 2> [junit4] 2> 00 [junit4] 2> [junit4] 2> [junit4] 2> request was:q=id:529&qt=&start=0&rows=20&version=2.2 [junit4] 2> 9267 ERROR (TEST-AutoCommitTest.testCommitWithin-seed#[28D3DB2A20700A5D]) [ ] o.a.s.SolrTestCaseJ4 REQUEST FAILED: q=id:529&qt=&start=0&rows=20&version=2.2:java.lang.RuntimeException: REQUEST FAILED: xpath=//result[@numFound=1] [junit4] 2> xml response was: [junit4] 2> [junit4] 2> 00 [junit4] 2> [junit4] 2> [junit4] 2> request was:q=id:529&qt=&start=0&rows=20&version=2.2 [junit4] 2> at org.apache.solr.SolrTestCaseJ4.assertQ(SolrTestCaseJ4.java:877) [junit4] 2> at org.apache.solr.update.AutoCommitTest.testCommitWithin(AutoCommitTest.java:353) [junit4] 2> at java.base/jdk.internal.reflect.NativeMethodAccessorImpl.invoke0(Native Method) [junit4] 2> at java.base/jdk.internal.reflect.NativeMethodAccessorImpl.invoke(NativeMethodAccessorImpl.java:62) [junit4] 2> at java.base/jdk.internal.reflect.DelegatingMethodAccessorImpl.invoke(DelegatingMethodAccessorImpl.java:43) [junit4] 2> at java.base/java.lang.reflect.Method.invoke(Method.java:564) [junit4] 2> at com.carrotsearch.randomizedtesting.RandomizedRunner.invoke(RandomizedRunner.java:1737) [junit4] 2> at com.carrotsearch.randomizedtesting.RandomizedRunner$8.evaluate(RandomizedRunner.java:934) [junit4] 2> at com.carrotsearch.randomizedtesting.RandomizedRunner$9.evaluate(RandomizedRunner.java:970) [junit4] 2> at com.carrotsearch.randomizedtesting.RandomizedRunner$10.evaluate(RandomizedRunner.java:984) [junit4] 2> at com.carrotsearch.randomizedtesting.rules.SystemPropertiesRestoreRule$1.evaluate(SystemPropertiesRestoreRule.java:57) [junit4] 2> at org.apache.lucene.util.TestRuleSetupTeardownChained$1.evaluate(TestRuleSetupTeardownChained.java:49) [junit4] 2> at org.apache.lucene.util.AbstractBeforeAfterRule$1.evaluate(AbstractBeforeAfterRule.java:45) [junit4] 2> at org.apache.lucene.util.TestRuleThreadAndTestName$1.evaluate(TestRuleThreadAndTestName.java:48) [junit4] 2> at org.apache.lucene.util.TestRuleIgnoreAfterMaxFailures$1.evaluate(TestRuleIgnoreAfterMaxFailures.java:64) [junit4] 2> at org.apache.lucene.util.TestRuleMarkFailure$1.evaluate(TestRuleMarkFailure.java:47) [junit4] 2> at com.carrotsearch.randomizedtesting.rules.StatementAdapter.evaluate(StatementAdapter.java:36) [junit4] 2> at com.carrotsearch.randomizedtesting.ThreadLeakControl$StatementRunner.run(ThreadLeakControl.java:368) [junit4] 2> at com.carrotsearch.randomizedtesting.ThreadLeakControl.forkTimeoutingTask(ThreadLeakControl.java:817) [junit4] 2> at com.carrotsearch.randomizedtesting.ThreadLeakControl$3.evaluate(ThreadLeakControl.java:468) [junit4] 2> at com.carrotsearch.randomizedtesting.RandomizedRunner.runSingleTest(RandomizedRunner.java:943) [junit4] 2> at com.carrotsearch.randomizedtesting.RandomizedRunner$5.evaluate(RandomizedRunner.java:829) [junit4] 2> at com.carrotsearch.randomizedtesting.RandomizedRunner$6.evaluate(RandomizedRunner.java:879) [junit4] 2> at com.carrotsearch.randomizedtesting.RandomizedRunner$7.evaluate(RandomizedRunner.java:890) [junit4] 2> at com.carrotsearch.randomizedtesting.rules.StatementAdapter.evaluate(StatementAdapter.java:36) [junit4] 2> at com.carrotsearch.randomizedtesting.rules.SystemPropertiesRestoreRule$1.evaluate(SystemPropertiesRestoreRule.java:57) [junit4] 2> at org.apache.lucene.util.AbstractBeforeAfterRule$1.evaluate(AbstractBeforeAfterRule.java:45) [junit4] 2> at com.carrotsearch.randomizedtesting.rules.StatementAdapter.evaluate(StatementAdapter.java:36) [junit4] 2> at org.apache.lucene.util.TestRuleStoreClassName$1.evaluate(TestRuleStoreClassName.java:41) [junit4] 2> at com.carrotsearch.randomizedtesting.rules.NoShadowingOrOverridesOnMethodsRule$1.evaluate(NoShadowingOrOverridesOnMethodsRule.java:40) [junit4] 2> at com.carrotsearch.randomizedtesting.rules.NoShadowingOrOverridesOnMethodsRule$1.evaluate(NoShadowingOrOverridesOnMethodsRule.java:40) [junit4] 2> at com.carrotsearch.randomizedtesting.rules.StatementAdapter.evaluate(StatementAdapter.java:36) [junit4] 2> at com.carrotsearch.randomizedtesting.rules.StatementAdapter.evaluate(StatementAdapter.java:36) [junit4] 2> at org.apache.lucene.util.TestRuleAssertionsRequired$1.evaluate(TestRuleAssertionsRequired.java:53) [junit4] 2> at org.apache.lucene.util.TestRuleMarkFailure$1.evaluate(TestRuleMarkFailure.java:47) [junit4] 2> at org.apache.lucene.util.TestRuleIgnoreAfterMaxFailures$1.evaluate(TestRuleIgnoreAfterMaxFailures.java:64) [junit4] 2> at org.apache.lucene.util.TestRuleIgnoreTestSuites$1.evaluate(TestRuleIgnoreTestSuites.java:54) [junit4] 2> at com.carrotsearch.randomizedtesting.rules.StatementAdapter.evaluate(StatementAdapter.java:36) [junit4] 2> at com.carrotsearch.randomizedtesting.ThreadLeakControl$StatementRunner.run(ThreadLeakControl.java:368) [junit4] 2> at java.base/java.lang.Thread.run(Thread.java:844) [junit4] 2> [junit4] 2> 9267 INFO (TEST-AutoCommitTest.testCommitWithin-seed#[28D3DB2A20700A5D]) [ ] o.a.s.SolrTestCaseJ4 ###Ending testCommitWithin [junit4] 2> NOTE: reproduce with: ant test -Dtestcase=AutoCommitTest -Dtests.method=testCommitWithin -Dtests.seed=28D3DB2A20700A5D -Dtests.multiplier=3 -Dtests.slow=true -Dtests.locale=en-LS -Dtests.timezone=MST -Dtests.asserts=true -Dtests.file.encoding=ISO-8859-1 [junit4] ERROR 0.66s J2 | AutoCommitTest.testCommitWithin <<< [junit4] > Throwable #1: java.lang.RuntimeException: Exception during query [junit4] > at __randomizedtesting.SeedInfo.seed([28D3DB2A20700A5D:9201B452A35EE448]:0) [junit4] > at org.apache.solr.SolrTestCaseJ4.assertQ(SolrTestCaseJ4.java:884) [junit4] > at org.apache.solr.update.AutoCommitTest.testCommitWithin(AutoCommitTest.java:353) [junit4] > at java.base/jdk.internal.reflect.NativeMethodAccessorImpl.invoke0(Native Method) [junit4] > at java.base/jdk.internal.reflect.NativeMethodAccessorImpl.invoke(NativeMethodAccessorImpl.java:62) [junit4] > at java.base/jdk.internal.reflect.DelegatingMethodAccessorImpl.invoke(DelegatingMethodAccessorImpl.java:43) [junit4] > at java.base/java.lang.reflect.Method.invoke(Method.java:564) [junit4] > at java.base/java.lang.Thread.run(Thread.java:844) [junit4] > Caused by: java.lang.RuntimeException: REQUEST FAILED: xpath=//result[@numFound=1] [junit4] > xml response was: [junit4] > [junit4] > 00 [junit4] > [junit4] > request was:q=id:529&qt=&start=0&rows=20&version=2.2 [junit4] > at org.apache.solr.SolrTestCaseJ4.assertQ(SolrTestCaseJ4.java:877) [junit4] > ... 39 more [junit4] 2> 9274 INFO (TEST-AutoCommitTest.testMaxTime-seed#[28D3DB2A20700A5D]) [ ] o.a.s.SolrTestCaseJ4 ###Starting testMaxTime [junit4] 2> 9274 INFO (TEST-AutoCommitTest.testMaxTime-seed#[28D3DB2A20700A5D]) [ ] o.a.s.u.DirectUpdateHandler2 [collection1] REMOVING ALL DOCUMENTS FROM INDEX [junit4] 2 [...truncated too long message...] -Bit Server VM warning: Option UseConcMarkSweepGC was deprecated in version 9.0 and will likely be removed in a future release. [junit4] <<< JVM J2: EOF ---- [...truncated 553 lines...] [junit4] JVM J2: stderr was not empty, see: /home/jenkins/workspace/Lucene-Solr-master-Linux/solr/build/contrib/solr-clustering/test/temp/junit4-J2-20171005_043822_11710499515577528558689.syserr [junit4] >>> JVM J2 emitted unexpected output (verbatim) ---- [junit4] Java HotSpot(TM) 64-Bit Server VM warning: Option UseConcMarkSweepGC was deprecated in version 9.0 and will likely be removed in a future release. [junit4] <<< JVM J2: EOF ---- [...truncated 3 lines...] [junit4] JVM J1: stderr was not empty, see: /home/jenkins/workspace/Lucene-Solr-master-Linux/solr/build/contrib/solr-clustering/test/temp/junit4-J1-20171005_043822_1177572903800287711608.syserr [junit4] >>> JVM J1 emitted unexpected output (verbatim) ---- [junit4] Java HotSpot(TM) 64-Bit Server VM warning: Option UseConcMarkSweepGC was deprecated in version 9.0 and will likely be removed in a future release. [junit4] <<< JVM J1: EOF ---- [...truncated 3 lines...] [junit4] JVM J0: stderr was not empty, see: /home/jenkins/workspace/Lucene-Solr-master-Linux/solr/build/contrib/solr-clustering/test/temp/junit4-J0-20171005_043822_1179375255441045710641.syserr [junit4] >>> JVM J0 emitted unexpected output (verbatim) ---- [junit4] Java HotSpot(TM) 64-Bit Server VM warning: Option UseConcMarkSweepGC was deprecated in version 9.0 and will likely be removed in a future release. [junit4] <<< JVM J0: EOF ---- [...truncated 1259 lines...] [junit4] JVM J1: stderr was not empty, see: /home/jenkins/workspace/Lucene-Solr-master-Linux/solr/build/contrib/solr-dataimporthandler-extras/test/temp/junit4-J1-20171005_043835_68317177823692166711665.syserr [junit4] >>> JVM J1 emitted unexpected output (verbatim) ---- [junit4] Java HotSpot(TM) 64-Bit Server VM warning: Option UseConcMarkSweepGC was deprecated in version 9.0 and will likely be removed in a future release. [junit4] <<< JVM J1: EOF ---- [...truncated 3 lines...] [junit4] JVM J0: stderr was not empty, see: /home/jenkins/workspace/Lucene-Solr-master-Linux/solr/build/contrib/solr-dataimporthandler-extras/test/temp/junit4-J0-20171005_043835_68214352600641940113123.syserr [junit4] >>> JVM J0 emitted unexpected output (verbatim) ---- [junit4] Java HotSpot(TM) 64-Bit Server VM warning: Option UseConcMarkSweepGC was deprecated in version 9.0 and will likely be removed in a future release. [junit4] <<< JVM J0: EOF ---- [...truncated 650 lines...] [junit4] JVM J2: stderr was not empty, see: /home/jenkins/workspace/Lucene-Solr-master-Linux/solr/build/contrib/solr-dataimporthandler/test/temp/junit4-J2-20171005_043841_727381998398665141158.syserr [junit4] >>> JVM J2 emitted unexpected output (verbatim) ---- [junit4] Java HotSpot(TM) 64-Bit Server VM warning: Option UseConcMarkSweepGC was deprecated in version 9.0 and will likely be removed in a future release. [junit4] <<< JVM J2: EOF ---- [junit4] JVM J1: stderr was not empty, see: /home/jenkins/workspace/Lucene-Solr-master-Linux/solr/build/contrib/solr-dataimporthandler/test/temp/junit4-J1-20171005_043841_72712703681523654207683.syserr [junit4] >>> JVM J1 emitted unexpected output (verbatim) ---- [junit4] Java HotSpot(TM) 64-Bit Server VM warning: Option UseConcMarkSweepGC was deprecated in version 9.0 and will likely be removed in a future release. [junit4] <<< JVM J1: EOF ---- [junit4] JVM J0: stderr was not empty, see: /home/jenkins/workspace/Lucene-Solr-master-Linux/solr/build/contrib/solr-dataimporthandler/test/temp/junit4-J0-20171005_043841_72710172679710867285236.syserr [junit4] >>> JVM J0 emitted unexpected output (verbatim) ---- [junit4] Java HotSpot(TM) 64-Bit Server VM warning: Option UseConcMarkSweepGC was deprecated in version 9.0 and will likely be removed in a future release. [junit4] <<< JVM J0: EOF ---- [...truncated 557 lines...] [junit4] JVM J1: stderr was not empty, see: /home/jenkins/workspace/Lucene-Solr-master-Linux/solr/build/contrib/solr-cell/test/temp/junit4-J1-20171005_043904_4028549171050392222418.syserr [junit4] >>> JVM J1 emitted unexpected output (verbatim) ---- [junit4] Java HotSpot(TM) 64-Bit Server VM warning: Option UseConcMarkSweepGC was deprecated in version 9.0 and will likely be removed in a future release. [junit4] <<< JVM J1: EOF ---- [...truncated 3 lines...] [junit4] JVM J2: stderr was not empty, see: /home/jenkins/workspace/Lucene-Solr-master-Linux/solr/build/contrib/solr-cell/test/temp/junit4-J2-20171005_043904_4059010970710639827730.syserr [junit4] >>> JVM J2 emitted unexpected output (verbatim) ---- [junit4] Java HotSpot(TM) 64-Bit Server VM warning: Option UseConcMarkSweepGC was deprecated in version 9.0 and will likely be removed in a future release. [junit4] <<< JVM J2: EOF ---- [...truncated 3 lines...] [junit4] JVM J0: stderr was not empty, see: /home/jenkins/workspace/Lucene-Solr-master-Linux/solr/build/contrib/solr-cell/test/temp/junit4-J0-20171005_043904_40212537211488213438948.syserr [junit4] >>> JVM J0 emitted unexpected output (verbatim) ---- [junit4] Java HotSpot(TM) 64-Bit Server VM warning: Option UseConcMarkSweepGC was deprecated in version 9.0 and will likely be removed in a future release. [junit4] <<< JVM J0: EOF ---- [...truncated 563 lines...] [junit4] JVM J1: stderr was not empty, see: /home/jenkins/workspace/Lucene-Solr-master-Linux/solr/build/contrib/solr-langid/test/temp/junit4-J1-20171005_043913_8223935783122427988306.syserr [junit4] >>> JVM J1 emitted unexpected output (verbatim) ---- [junit4] Java HotSpot(TM) 64-Bit Server VM warning: Option UseConcMarkSweepGC was deprecated in version 9.0 and will likely be removed in a future release. [junit4] <<< JVM J1: EOF ---- [junit4] JVM J0: stderr was not empty, see: /home/jenkins/workspace/Lucene-Solr-master-Linux/solr/build/contrib/solr-langid/test/temp/junit4-J0-20171005_043913_82215665323108388261776.syserr [junit4] >>> JVM J0 emitted unexpected output (verbatim) ---- [junit4] Java HotSpot(TM) 64-Bit Server VM warning: Option UseConcMarkSweepGC was deprecated in version 9.0 and will likely be removed in a future release. [junit4] <<< JVM J0: EOF ---- [...truncated 646 lines...] [junit4] JVM J0: stderr was not empty, see: /home/jenkins/workspace/Lucene-Solr-master-Linux/solr/build/contrib/solr-ltr/test/temp/junit4-J0-20171005_043919_49327594360098976735.syserr [junit4] >>> JVM J0 emitted unexpected output (verbatim) ---- [junit4] Java HotSpot(TM) 64-Bit Server VM warning: Option UseConcMarkSweepGC was deprecated in version 9.0 and will likely be removed in a future release. [junit4] <<< JVM J0: EOF ---- [...truncated 3 lines...] [junit4] JVM J1: stderr was not empty, see: /home/jenkins/workspace/Lucene-Solr-master-Linux/solr/build/contrib/solr-ltr/test/temp/junit4-J1-20171005_043919_4932975300011915603141.syserr [junit4] >>> JVM J1 emitted unexpected output (verbatim) ---- [junit4] Java HotSpot(TM) 64-Bit Server VM warning: Option UseConcMarkSweepGC was deprecated in version 9.0 and will likely be removed in a future release. [junit4] <<< JVM J1: EOF ---- [...truncated 3 lines...] [junit4] JVM J2: stderr was not empty, see: /home/jenkins/workspace/Lucene-Solr-master-Linux/solr/build/contrib/solr-ltr/test/temp/junit4-J2-20171005_043919_49310477484911349548754.syserr [junit4] >>> JVM J2 emitted unexpected output (verbatim) ---- [junit4] Java HotSpot(TM) 64-Bit Server VM warning: Option UseConcMarkSweepGC was deprecated in version 9.0 and will likely be removed in a future release. [junit4] <<< JVM J2: EOF ---- [...truncated 596 lines...] [junit4] JVM J1: stderr was not empty, see: /home/jenkins/workspace/Lucene-Solr-master-Linux/solr/build/contrib/solr-uima/test/temp/junit4-J1-20171005_043945_9168324743758454401145.syserr [junit4] >>> JVM J1 emitted unexpected output (verbatim) ---- [junit4] Java HotSpot(TM) 64-Bit Server VM warning: Option UseConcMarkSweepGC was deprecated in version 9.0 and will likely be removed in a future release. [junit4] <<< JVM J1: EOF ---- [...truncated 3 lines...] [junit4] JVM J0: stderr was not empty, see: /home/jenkins/workspace/Lucene-Solr-master-Linux/solr/build/contrib/solr-uima/test/temp/junit4-J0-20171005_043945_91610889211531681272421.syserr [junit4] >>> JVM J0 emitted unexpected output (verbatim) ---- [junit4] Java HotSpot(TM) 64-Bit Server VM warning: Option UseConcMarkSweepGC was deprecated in version 9.0 and will likely be removed in a future release. [junit4] <<< JVM J0: EOF ---- [...truncated 548 lines...] [junit4] JVM J0: stderr was not empty, see: /home/jenkins/workspace/Lucene-Solr-master-Linux/solr/build/contrib/solr-velocity/test/temp/junit4-J0-20171005_043957_4407119702536197972281.syserr [junit4] >>> JVM J0 emitted unexpected output (verbatim) ---- [junit4] Java HotSpot(TM) 64-Bit Server VM warning: Option UseConcMarkSweepGC was deprecated in version 9.0 and will likely be removed in a future release. [junit4] <<< JVM J0: EOF ---- [...truncated 31439 lines...] BUILD FAILED /home/jenkins/workspace/Lucene-Solr-master-Linux/build.xml:826: The following error occurred while executing this line: /home/jenkins/workspace/Lucene-Solr-master-Linux/build.xml:706: The following error occurred while executing this line: /home/jenkins/workspace/Lucene-Solr-master-Linux/build.xml:693: Source checkout is dirty (unversioned/missing files) after running tests!!! Offending files: * lucene/licenses/morfologik-ukrainian-search-3.7.5.jar.sha1 Total time: 70 minutes 19 seconds Build step 'Invoke Ant' marked build as failure Archiving artifacts [WARNINGS] Skipping publisher since build result is FAILURE Recording test results Email was triggered for: Failure - Any Sending email for trigger: Failure - Any