lucene-dev mailing list archives

Site index · List index
Message view « Date » · « Thread »
Top « Date » · « Thread »
From Policeman Jenkins Server <jenk...@thetaphi.de>
Subject [JENKINS] Lucene-Solr-7.x-Solaris (64bit/jdk1.8.0) - Build # 349 - Still Unstable!
Date Sun, 24 Dec 2017 13:07:10 GMT
Build: https://jenkins.thetaphi.de/job/Lucene-Solr-7.x-Solaris/349/
Java: 64bit/jdk1.8.0 -XX:-UseCompressedOops -XX:+UseG1GC

2 tests failed.
FAILED:  org.apache.solr.cloud.DocValuesNotIndexedTest.testGroupingDVOnly

Error Message:
Unexpected number of elements in the group for intGSF: 5

Stack Trace:
java.lang.AssertionError: Unexpected number of elements in the group for intGSF: 5
	at __randomizedtesting.SeedInfo.seed([F67057F252F1943C:6DCB39AA1FA9A662]:0)
	at org.junit.Assert.fail(Assert.java:93)
	at org.apache.solr.cloud.DocValuesNotIndexedTest.testGroupingDVOnly(DocValuesNotIndexedTest.java:377)
	at sun.reflect.NativeMethodAccessorImpl.invoke0(Native Method)
	at sun.reflect.NativeMethodAccessorImpl.invoke(NativeMethodAccessorImpl.java:62)
	at sun.reflect.DelegatingMethodAccessorImpl.invoke(DelegatingMethodAccessorImpl.java:43)
	at java.lang.reflect.Method.invoke(Method.java:498)
	at com.carrotsearch.randomizedtesting.RandomizedRunner.invoke(RandomizedRunner.java:1737)
	at com.carrotsearch.randomizedtesting.RandomizedRunner$8.evaluate(RandomizedRunner.java:934)
	at com.carrotsearch.randomizedtesting.RandomizedRunner$9.evaluate(RandomizedRunner.java:970)
	at com.carrotsearch.randomizedtesting.RandomizedRunner$10.evaluate(RandomizedRunner.java:984)
	at com.carrotsearch.randomizedtesting.rules.SystemPropertiesRestoreRule$1.evaluate(SystemPropertiesRestoreRule.java:57)
	at org.apache.lucene.util.TestRuleSetupTeardownChained$1.evaluate(TestRuleSetupTeardownChained.java:49)
	at org.apache.lucene.util.AbstractBeforeAfterRule$1.evaluate(AbstractBeforeAfterRule.java:45)
	at org.apache.lucene.util.TestRuleThreadAndTestName$1.evaluate(TestRuleThreadAndTestName.java:48)
	at org.apache.lucene.util.TestRuleIgnoreAfterMaxFailures$1.evaluate(TestRuleIgnoreAfterMaxFailures.java:64)
	at org.apache.lucene.util.TestRuleMarkFailure$1.evaluate(TestRuleMarkFailure.java:47)
	at com.carrotsearch.randomizedtesting.rules.StatementAdapter.evaluate(StatementAdapter.java:36)
	at com.carrotsearch.randomizedtesting.ThreadLeakControl$StatementRunner.run(ThreadLeakControl.java:368)
	at com.carrotsearch.randomizedtesting.ThreadLeakControl.forkTimeoutingTask(ThreadLeakControl.java:817)
	at com.carrotsearch.randomizedtesting.ThreadLeakControl$3.evaluate(ThreadLeakControl.java:468)
	at com.carrotsearch.randomizedtesting.RandomizedRunner.runSingleTest(RandomizedRunner.java:943)
	at com.carrotsearch.randomizedtesting.RandomizedRunner$5.evaluate(RandomizedRunner.java:829)
	at com.carrotsearch.randomizedtesting.RandomizedRunner$6.evaluate(RandomizedRunner.java:879)
	at com.carrotsearch.randomizedtesting.RandomizedRunner$7.evaluate(RandomizedRunner.java:890)
	at com.carrotsearch.randomizedtesting.rules.StatementAdapter.evaluate(StatementAdapter.java:36)
	at com.carrotsearch.randomizedtesting.rules.SystemPropertiesRestoreRule$1.evaluate(SystemPropertiesRestoreRule.java:57)
	at org.apache.lucene.util.AbstractBeforeAfterRule$1.evaluate(AbstractBeforeAfterRule.java:45)
	at com.carrotsearch.randomizedtesting.rules.StatementAdapter.evaluate(StatementAdapter.java:36)
	at org.apache.lucene.util.TestRuleStoreClassName$1.evaluate(TestRuleStoreClassName.java:41)
	at com.carrotsearch.randomizedtesting.rules.NoShadowingOrOverridesOnMethodsRule$1.evaluate(NoShadowingOrOverridesOnMethodsRule.java:40)
	at com.carrotsearch.randomizedtesting.rules.NoShadowingOrOverridesOnMethodsRule$1.evaluate(NoShadowingOrOverridesOnMethodsRule.java:40)
	at com.carrotsearch.randomizedtesting.rules.StatementAdapter.evaluate(StatementAdapter.java:36)
	at com.carrotsearch.randomizedtesting.rules.StatementAdapter.evaluate(StatementAdapter.java:36)
	at com.carrotsearch.randomizedtesting.rules.StatementAdapter.evaluate(StatementAdapter.java:36)
	at org.apache.lucene.util.TestRuleAssertionsRequired$1.evaluate(TestRuleAssertionsRequired.java:53)
	at org.apache.lucene.util.TestRuleMarkFailure$1.evaluate(TestRuleMarkFailure.java:47)
	at org.apache.lucene.util.TestRuleIgnoreAfterMaxFailures$1.evaluate(TestRuleIgnoreAfterMaxFailures.java:64)
	at org.apache.lucene.util.TestRuleIgnoreTestSuites$1.evaluate(TestRuleIgnoreTestSuites.java:54)
	at com.carrotsearch.randomizedtesting.rules.StatementAdapter.evaluate(StatementAdapter.java:36)
	at com.carrotsearch.randomizedtesting.ThreadLeakControl$StatementRunner.run(ThreadLeakControl.java:368)
	at java.lang.Thread.run(Thread.java:748)


FAILED:  junit.framework.TestSuite.org.apache.solr.cloud.TestSolrCloudWithSecureImpersonation

Error Message:
2 threads leaked from SUITE scope at org.apache.solr.cloud.TestSolrCloudWithSecureImpersonation:     1) Thread[id=9759, name=jetty-launcher-2031-thread-1-EventThread, state=TIMED_WAITING, group=TGRP-TestSolrCloudWithSecureImpersonation]         at sun.misc.Unsafe.park(Native Method)         at java.util.concurrent.locks.LockSupport.parkNanos(LockSupport.java:215)         at java.util.concurrent.locks.AbstractQueuedSynchronizer.doAcquireSharedNanos(AbstractQueuedSynchronizer.java:1037)         at java.util.concurrent.locks.AbstractQueuedSynchronizer.tryAcquireSharedNanos(AbstractQueuedSynchronizer.java:1328)         at java.util.concurrent.CountDownLatch.await(CountDownLatch.java:277)         at org.apache.curator.CuratorZookeeperClient.internalBlockUntilConnectedOrTimedOut(CuratorZookeeperClient.java:323)         at org.apache.curator.RetryLoop.callWithRetry(RetryLoop.java:105)         at org.apache.curator.framework.imps.GetDataBuilderImpl.pathInForeground(GetDataBuilderImpl.java:288)         at org.apache.curator.framework.imps.GetDataBuilderImpl.forPath(GetDataBuilderImpl.java:279)         at org.apache.curator.framework.imps.GetDataBuilderImpl.forPath(GetDataBuilderImpl.java:41)         at org.apache.curator.framework.recipes.shared.SharedValue.readValue(SharedValue.java:244)         at org.apache.curator.framework.recipes.shared.SharedValue.access$100(SharedValue.java:44)         at org.apache.curator.framework.recipes.shared.SharedValue$1.process(SharedValue.java:61)         at org.apache.curator.framework.imps.NamespaceWatcher.process(NamespaceWatcher.java:67)         at org.apache.zookeeper.ClientCnxn$EventThread.processEvent(ClientCnxn.java:530)         at org.apache.zookeeper.ClientCnxn$EventThread.run(ClientCnxn.java:505)    2) Thread[id=9762, name=jetty-launcher-2031-thread-2-EventThread, state=TIMED_WAITING, group=TGRP-TestSolrCloudWithSecureImpersonation]         at sun.misc.Unsafe.park(Native Method)         at java.util.concurrent.locks.LockSupport.parkNanos(LockSupport.java:215)         at java.util.concurrent.locks.AbstractQueuedSynchronizer.doAcquireSharedNanos(AbstractQueuedSynchronizer.java:1037)         at java.util.concurrent.locks.AbstractQueuedSynchronizer.tryAcquireSharedNanos(AbstractQueuedSynchronizer.java:1328)         at java.util.concurrent.CountDownLatch.await(CountDownLatch.java:277)         at org.apache.curator.CuratorZookeeperClient.internalBlockUntilConnectedOrTimedOut(CuratorZookeeperClient.java:323)         at org.apache.curator.RetryLoop.callWithRetry(RetryLoop.java:105)         at org.apache.curator.framework.imps.GetDataBuilderImpl.pathInForeground(GetDataBuilderImpl.java:288)         at org.apache.curator.framework.imps.GetDataBuilderImpl.forPath(GetDataBuilderImpl.java:279)         at org.apache.curator.framework.imps.GetDataBuilderImpl.forPath(GetDataBuilderImpl.java:41)         at org.apache.curator.framework.recipes.shared.SharedValue.readValue(SharedValue.java:244)         at org.apache.curator.framework.recipes.shared.SharedValue.access$100(SharedValue.java:44)         at org.apache.curator.framework.recipes.shared.SharedValue$1.process(SharedValue.java:61)         at org.apache.curator.framework.imps.NamespaceWatcher.process(NamespaceWatcher.java:67)         at org.apache.zookeeper.ClientCnxn$EventThread.processEvent(ClientCnxn.java:530)         at org.apache.zookeeper.ClientCnxn$EventThread.run(ClientCnxn.java:505)

Stack Trace:
com.carrotsearch.randomizedtesting.ThreadLeakError: 2 threads leaked from SUITE scope at org.apache.solr.cloud.TestSolrCloudWithSecureImpersonation: 
   1) Thread[id=9759, name=jetty-launcher-2031-thread-1-EventThread, state=TIMED_WAITING, group=TGRP-TestSolrCloudWithSecureImpersonation]
        at sun.misc.Unsafe.park(Native Method)
        at java.util.concurrent.locks.LockSupport.parkNanos(LockSupport.java:215)
        at java.util.concurrent.locks.AbstractQueuedSynchronizer.doAcquireSharedNanos(AbstractQueuedSynchronizer.java:1037)
        at java.util.concurrent.locks.AbstractQueuedSynchronizer.tryAcquireSharedNanos(AbstractQueuedSynchronizer.java:1328)
        at java.util.concurrent.CountDownLatch.await(CountDownLatch.java:277)
        at org.apache.curator.CuratorZookeeperClient.internalBlockUntilConnectedOrTimedOut(CuratorZookeeperClient.java:323)
        at org.apache.curator.RetryLoop.callWithRetry(RetryLoop.java:105)
        at org.apache.curator.framework.imps.GetDataBuilderImpl.pathInForeground(GetDataBuilderImpl.java:288)
        at org.apache.curator.framework.imps.GetDataBuilderImpl.forPath(GetDataBuilderImpl.java:279)
        at org.apache.curator.framework.imps.GetDataBuilderImpl.forPath(GetDataBuilderImpl.java:41)
        at org.apache.curator.framework.recipes.shared.SharedValue.readValue(SharedValue.java:244)
        at org.apache.curator.framework.recipes.shared.SharedValue.access$100(SharedValue.java:44)
        at org.apache.curator.framework.recipes.shared.SharedValue$1.process(SharedValue.java:61)
        at org.apache.curator.framework.imps.NamespaceWatcher.process(NamespaceWatcher.java:67)
        at org.apache.zookeeper.ClientCnxn$EventThread.processEvent(ClientCnxn.java:530)
        at org.apache.zookeeper.ClientCnxn$EventThread.run(ClientCnxn.java:505)
   2) Thread[id=9762, name=jetty-launcher-2031-thread-2-EventThread, state=TIMED_WAITING, group=TGRP-TestSolrCloudWithSecureImpersonation]
        at sun.misc.Unsafe.park(Native Method)
        at java.util.concurrent.locks.LockSupport.parkNanos(LockSupport.java:215)
        at java.util.concurrent.locks.AbstractQueuedSynchronizer.doAcquireSharedNanos(AbstractQueuedSynchronizer.java:1037)
        at java.util.concurrent.locks.AbstractQueuedSynchronizer.tryAcquireSharedNanos(AbstractQueuedSynchronizer.java:1328)
        at java.util.concurrent.CountDownLatch.await(CountDownLatch.java:277)
        at org.apache.curator.CuratorZookeeperClient.internalBlockUntilConnectedOrTimedOut(CuratorZookeeperClient.java:323)
        at org.apache.curator.RetryLoop.callWithRetry(RetryLoop.java:105)
        at org.apache.curator.framework.imps.GetDataBuilderImpl.pathInForeground(GetDataBuilderImpl.java:288)
        at org.apache.curator.framework.imps.GetDataBuilderImpl.forPath(GetDataBuilderImpl.java:279)
        at org.apache.curator.framework.imps.GetDataBuilderImpl.forPath(GetDataBuilderImpl.java:41)
        at org.apache.curator.framework.recipes.shared.SharedValue.readValue(SharedValue.java:244)
        at org.apache.curator.framework.recipes.shared.SharedValue.access$100(SharedValue.java:44)
        at org.apache.curator.framework.recipes.shared.SharedValue$1.process(SharedValue.java:61)
        at org.apache.curator.framework.imps.NamespaceWatcher.process(NamespaceWatcher.java:67)
        at org.apache.zookeeper.ClientCnxn$EventThread.processEvent(ClientCnxn.java:530)
        at org.apache.zookeeper.ClientCnxn$EventThread.run(ClientCnxn.java:505)
	at __randomizedtesting.SeedInfo.seed([F67057F252F1943C]:0)




Build Log:
[...truncated 12251 lines...]
   [junit4] Suite: org.apache.solr.cloud.TestSolrCloudWithSecureImpersonation
   [junit4]   2> Creating dataDir: /export/home/jenkins/workspace/Lucene-Solr-7.x-Solaris/solr/build/solr-core/test/J0/temp/solr.cloud.TestSolrCloudWithSecureImpersonation_F67057F252F1943C-001/init-core-data-001
   [junit4]   2> 1327267 WARN  (SUITE-TestSolrCloudWithSecureImpersonation-seed#[F67057F252F1943C]-worker) [    ] o.a.s.SolrTestCaseJ4 startTrackingSearchers: numOpens=1 numCloses=1
   [junit4]   2> 1327267 INFO  (SUITE-TestSolrCloudWithSecureImpersonation-seed#[F67057F252F1943C]-worker) [    ] o.a.s.SolrTestCaseJ4 Using PointFields (NUMERIC_POINTS_SYSPROP=true) w/NUMERIC_DOCVALUES_SYSPROP=true
   [junit4]   2> 1327268 INFO  (SUITE-TestSolrCloudWithSecureImpersonation-seed#[F67057F252F1943C]-worker) [    ] o.a.s.SolrTestCaseJ4 Randomized ssl (false) and clientAuth (false) via: @org.apache.solr.util.RandomizeSSL(reason=, value=NaN, ssl=NaN, clientAuth=NaN)
   [junit4]   2> 1327268 INFO  (SUITE-TestSolrCloudWithSecureImpersonation-seed#[F67057F252F1943C]-worker) [    ] o.a.s.SolrTestCaseJ4 SecureRandom sanity checks: test.solr.allowed.securerandom=null & java.security.egd=file:/dev/./urandom
   [junit4]   2> 1327293 INFO  (SUITE-TestSolrCloudWithSecureImpersonation-seed#[F67057F252F1943C]-worker) [    ] o.a.s.c.MiniSolrCloudCluster Starting cluster of 2 servers in /export/home/jenkins/workspace/Lucene-Solr-7.x-Solaris/solr/build/solr-core/test/J0/temp/solr.cloud.TestSolrCloudWithSecureImpersonation_F67057F252F1943C-001/tempDir-001
   [junit4]   2> 1327293 INFO  (SUITE-TestSolrCloudWithSecureImpersonation-seed#[F67057F252F1943C]-worker) [    ] o.a.s.c.ZkTestServer STARTING ZK TEST SERVER
   [junit4]   2> 1327293 INFO  (Thread-2464) [    ] o.a.s.c.ZkTestServer client port:0.0.0.0/0.0.0.0:0
   [junit4]   2> 1327293 INFO  (Thread-2464) [    ] o.a.s.c.ZkTestServer Starting server
   [junit4]   2> 1327295 ERROR (Thread-2464) [    ] o.a.z.s.ZooKeeperServer ZKShutdownHandler is not registered, so ZooKeeper server won't take any action on ERROR or SHUTDOWN server state changes
   [junit4]   2> 1327393 INFO  (SUITE-TestSolrCloudWithSecureImpersonation-seed#[F67057F252F1943C]-worker) [    ] o.a.s.c.ZkTestServer start zk server on port:64367
   [junit4]   2> 1327395 INFO  (zkConnectionManagerCallback-2034-thread-1) [    ] o.a.s.c.c.ConnectionManager zkClient has connected
   [junit4]   2> 1327400 INFO  (jetty-launcher-2031-thread-1) [    ] o.e.j.s.Server jetty-9.3.20.v20170531
   [junit4]   2> 1327400 INFO  (jetty-launcher-2031-thread-2) [    ] o.e.j.s.Server jetty-9.3.20.v20170531
   [junit4]   2> 1327402 INFO  (jetty-launcher-2031-thread-2) [    ] o.e.j.s.h.ContextHandler Started o.e.j.s.ServletContextHandler@36b26a5{/solr,null,AVAILABLE}
   [junit4]   2> 1327403 INFO  (jetty-launcher-2031-thread-1) [    ] o.e.j.s.h.ContextHandler Started o.e.j.s.ServletContextHandler@4ead71de{/solr,null,AVAILABLE}
   [junit4]   2> 1327405 INFO  (jetty-launcher-2031-thread-1) [    ] o.e.j.s.AbstractConnector Started ServerConnector@75dbb8d3{HTTP/1.1,[http/1.1]}{127.0.0.1:60630}
   [junit4]   2> 1327405 INFO  (jetty-launcher-2031-thread-2) [    ] o.e.j.s.AbstractConnector Started ServerConnector@a6bbb7a{HTTP/1.1,[http/1.1]}{127.0.0.1:45980}
   [junit4]   2> 1327405 INFO  (jetty-launcher-2031-thread-1) [    ] o.e.j.s.Server Started @1330216ms
   [junit4]   2> 1327405 INFO  (jetty-launcher-2031-thread-2) [    ] o.e.j.s.Server Started @1330216ms
   [junit4]   2> 1327405 INFO  (jetty-launcher-2031-thread-1) [    ] o.a.s.c.s.e.JettySolrRunner Jetty properties: {hostContext=/solr, hostPort=60630}
   [junit4]   2> 1327405 INFO  (jetty-launcher-2031-thread-2) [    ] o.a.s.c.s.e.JettySolrRunner Jetty properties: {hostContext=/solr, hostPort=45980}
   [junit4]   2> 1327405 ERROR (jetty-launcher-2031-thread-1) [    ] o.a.s.u.StartupLoggingUtils Missing Java Option solr.log.dir. Logging may be missing or incomplete.
   [junit4]   2> 1327405 ERROR (jetty-launcher-2031-thread-2) [    ] o.a.s.u.StartupLoggingUtils Missing Java Option solr.log.dir. Logging may be missing or incomplete.
   [junit4]   2> 1327405 INFO  (jetty-launcher-2031-thread-1) [    ] o.a.s.s.SolrDispatchFilter  ___      _       Welcome to Apache Solr? version 7.3.0
   [junit4]   2> 1327405 INFO  (jetty-launcher-2031-thread-1) [    ] o.a.s.s.SolrDispatchFilter / __| ___| |_ _   Starting in cloud mode on port null
   [junit4]   2> 1327405 INFO  (jetty-launcher-2031-thread-2) [    ] o.a.s.s.SolrDispatchFilter  ___      _       Welcome to Apache Solr? version 7.3.0
   [junit4]   2> 1327406 INFO  (jetty-launcher-2031-thread-2) [    ] o.a.s.s.SolrDispatchFilter / __| ___| |_ _   Starting in cloud mode on port null
   [junit4]   2> 1327405 INFO  (jetty-launcher-2031-thread-1) [    ] o.a.s.s.SolrDispatchFilter \__ \/ _ \ | '_|  Install dir: null
   [junit4]   2> 1327406 INFO  (jetty-launcher-2031-thread-2) [    ] o.a.s.s.SolrDispatchFilter \__ \/ _ \ | '_|  Install dir: null
   [junit4]   2> 1327406 INFO  (jetty-launcher-2031-thread-1) [    ] o.a.s.s.SolrDispatchFilter |___/\___/_|_|    Start time: 2017-12-24T11:53:02.157Z
   [junit4]   2> 1327406 INFO  (jetty-launcher-2031-thread-2) [    ] o.a.s.s.SolrDispatchFilter |___/\___/_|_|    Start time: 2017-12-24T11:53:02.157Z
   [junit4]   2> 1327408 INFO  (zkConnectionManagerCallback-2037-thread-1) [    ] o.a.s.c.c.ConnectionManager zkClient has connected
   [junit4]   2> 1327408 INFO  (zkConnectionManagerCallback-2038-thread-1) [    ] o.a.s.c.c.ConnectionManager zkClient has connected
   [junit4]   2> 1327408 INFO  (jetty-launcher-2031-thread-2) [    ] o.a.s.s.SolrDispatchFilter solr.xml found in ZooKeeper. Loading...
   [junit4]   2> 1327408 INFO  (jetty-launcher-2031-thread-1) [    ] o.a.s.s.SolrDispatchFilter solr.xml found in ZooKeeper. Loading...
   [junit4]   2> 1327415 INFO  (jetty-launcher-2031-thread-2) [    ] o.a.s.c.ZkContainer Zookeeper client=127.0.0.1:64367/solr
   [junit4]   2> 1327415 INFO  (jetty-launcher-2031-thread-1) [    ] o.a.s.c.ZkContainer Zookeeper client=127.0.0.1:64367/solr
   [junit4]   2> 1327417 INFO  (zkConnectionManagerCallback-2046-thread-1) [    ] o.a.s.c.c.ConnectionManager zkClient has connected
   [junit4]   2> 1327417 INFO  (zkConnectionManagerCallback-2044-thread-1) [    ] o.a.s.c.c.ConnectionManager zkClient has connected
   [junit4]   2> 1327419 INFO  (zkConnectionManagerCallback-2048-thread-1-processing-n:127.0.0.1:60630_solr) [n:127.0.0.1:60630_solr    ] o.a.s.c.c.ConnectionManager zkClient has connected
   [junit4]   2> 1327419 INFO  (zkConnectionManagerCallback-2050-thread-1-processing-n:127.0.0.1:45980_solr) [n:127.0.0.1:45980_solr    ] o.a.s.c.c.ConnectionManager zkClient has connected
   [junit4]   2> 1327548 INFO  (jetty-launcher-2031-thread-2) [n:127.0.0.1:45980_solr    ] o.a.s.c.Overseer Overseer (id=null) closing
   [junit4]   2> 1327549 INFO  (jetty-launcher-2031-thread-1) [n:127.0.0.1:60630_solr    ] o.a.s.c.Overseer Overseer (id=null) closing
   [junit4]   2> 1327549 INFO  (jetty-launcher-2031-thread-2) [n:127.0.0.1:45980_solr    ] o.a.s.c.OverseerElectionContext I am going to be the leader 127.0.0.1:45980_solr
   [junit4]   2> 1327550 INFO  (jetty-launcher-2031-thread-2) [n:127.0.0.1:45980_solr    ] o.a.s.c.Overseer Overseer (id=99229131213701126-127.0.0.1:45980_solr-n_0000000000) starting
   [junit4]   2> 1327550 INFO  (jetty-launcher-2031-thread-1) [n:127.0.0.1:60630_solr    ] o.a.s.c.ZkController Register node as live in ZooKeeper:/live_nodes/127.0.0.1:60630_solr
   [junit4]   2> 1327552 INFO  (zkCallback-2047-thread-1-processing-n:127.0.0.1:60630_solr) [n:127.0.0.1:60630_solr    ] o.a.s.c.c.ZkStateReader Updated live nodes from ZooKeeper... (0) -> (1)
   [junit4]   2> 1327553 INFO  (zkCallback-2049-thread-1-processing-n:127.0.0.1:45980_solr) [n:127.0.0.1:45980_solr    ] o.a.s.c.c.ZkStateReader Updated live nodes from ZooKeeper... (0) -> (1)
   [junit4]   2> 1327564 INFO  (jetty-launcher-2031-thread-2) [n:127.0.0.1:45980_solr    ] o.a.s.c.ZkController Register node as live in ZooKeeper:/live_nodes/127.0.0.1:45980_solr
   [junit4]   2> 1327567 INFO  (zkCallback-2049-thread-1-processing-n:127.0.0.1:45980_solr) [n:127.0.0.1:45980_solr    ] o.a.s.c.c.ZkStateReader Updated live nodes from ZooKeeper... (1) -> (2)
   [junit4]   2> 1327569 INFO  (zkCallback-2047-thread-1-processing-n:127.0.0.1:60630_solr) [n:127.0.0.1:60630_solr    ] o.a.s.c.c.ZkStateReader Updated live nodes from ZooKeeper... (1) -> (2)
   [junit4]   2> 1327654 INFO  (jetty-launcher-2031-thread-2) [n:127.0.0.1:45980_solr    ] o.a.s.c.CoreContainer Initializing authentication plugin: org.apache.solr.security.HttpParamDelegationTokenPlugin
   [junit4]   2> 1327655 WARN  (jetty-launcher-2031-thread-2) [n:127.0.0.1:45980_solr    ] o.a.s.c.s.i.Krb5HttpClientBuilder org.apache.solr.client.solrj.impl.Krb5HttpClientBuilder is configured without specifying system property 'java.security.auth.login.config'
   [junit4]   2> 1327655 INFO  (jetty-launcher-2031-thread-2) [n:127.0.0.1:45980_solr    ] o.a.s.s.KerberosPlugin Params: {solr.kerberos.impersonator.user.noGroups.hosts=*, solr.kerberos.impersonator.user.bogusGroup.groups=__some_bogus_group, token.valid=30, cookie.domain=127.0.0.1, solr.kerberos.impersonator.user.anyHostAnyUser.groups=*, solr.kerberos.impersonator.user.bogusGroup.hosts=*, solr.kerberos.impersonator.user.anyHostAnyUser.hosts=*, token.validity=36000, solr.kerberos.impersonator.user.noHosts.groups=*, type=kerberos, solr.kerberos.impersonator.user.localHostAnyGroup.groups=*, delegation-token.token-kind=solr-dt, solr.kerberos.impersonator.user.wrongHost.hosts=1.1.1.1.1.1, cookie.path=/, zk-dt-secret-manager.znodeWorkingPath=solr/security/zkdtsm, solr.kerberos.impersonator.user.localHostAnyGroup.hosts=serv1-vm3,localhost,127.0.0.1, signer.secret.provider.zookeeper.path=/token, solr.kerberos.impersonator.user.anyHostUsersGroup.groups=staff, zk-dt-secret-manager.enable=true, solr.kerberos.impersonator.user.wrongHost.groups=*, kerberos.name.rules=DEFAULT, signer.secret.provider=zookeeper, solr.kerberos.impersonator.user.anyHostUsersGroup.hosts=*}
   [junit4]   2> 1327656 INFO  (jetty-launcher-2031-thread-2) [n:127.0.0.1:45980_solr    ] o.a.c.f.i.CuratorFrameworkImpl Starting
   [junit4]   2> 1327658 INFO  (jetty-launcher-2031-thread-1) [n:127.0.0.1:60630_solr    ] o.a.s.c.CoreContainer Initializing authentication plugin: org.apache.solr.security.HttpParamDelegationTokenPlugin
   [junit4]   2> 1327659 WARN  (jetty-launcher-2031-thread-1) [n:127.0.0.1:60630_solr    ] o.a.s.c.s.i.Krb5HttpClientBuilder org.apache.solr.client.solrj.impl.Krb5HttpClientBuilder is configured without specifying system property 'java.security.auth.login.config'
   [junit4]   2> 1327659 INFO  (jetty-launcher-2031-thread-1) [n:127.0.0.1:60630_solr    ] o.a.s.s.KerberosPlugin Params: {solr.kerberos.impersonator.user.noGroups.hosts=*, solr.kerberos.impersonator.user.bogusGroup.groups=__some_bogus_group, token.valid=30, cookie.domain=127.0.0.1, solr.kerberos.impersonator.user.anyHostAnyUser.groups=*, solr.kerberos.impersonator.user.bogusGroup.hosts=*, solr.kerberos.impersonator.user.anyHostAnyUser.hosts=*, token.validity=36000, solr.kerberos.impersonator.user.noHosts.groups=*, type=kerberos, solr.kerberos.impersonator.user.localHostAnyGroup.groups=*, delegation-token.token-kind=solr-dt, solr.kerberos.impersonator.user.wrongHost.hosts=1.1.1.1.1.1, cookie.path=/, zk-dt-secret-manager.znodeWorkingPath=solr/security/zkdtsm, solr.kerberos.impersonator.user.localHostAnyGroup.hosts=serv1-vm3,localhost,127.0.0.1, signer.secret.provider.zookeeper.path=/token, solr.kerberos.impersonator.user.anyHostUsersGroup.groups=staff, zk-dt-secret-manager.enable=true, solr.kerberos.impersonator.user.wrongHost.groups=*, kerberos.name.rules=DEFAULT, signer.secret.provider=zookeeper, solr.kerberos.impersonator.user.anyHostUsersGroup.hosts=*}
   [junit4]   2> 1327660 INFO  (jetty-launcher-2031-thread-1) [n:127.0.0.1:60630_solr    ] o.a.c.f.i.CuratorFrameworkImpl Starting
   [junit4]   2> 1327673 INFO  (jetty-launcher-2031-thread-1-EventThread) [n:127.0.0.1:60630_solr    ] o.a.c.f.s.ConnectionStateManager State change: CONNECTED
   [junit4]   2> 1327673 INFO  (jetty-launcher-2031-thread-2-EventThread) [n:127.0.0.1:45980_solr    ] o.a.c.f.s.ConnectionStateManager State change: CONNECTED
   [junit4]   2> 1327696 WARN  (jetty-launcher-2031-thread-1) [n:127.0.0.1:60630_solr    ] o.a.s.c.s.i.Krb5HttpClientBuilder org.apache.solr.client.solrj.impl.Krb5HttpClientBuilder is configured without specifying system property 'java.security.auth.login.config'
   [junit4]   2> 1327700 WARN  (jetty-launcher-2031-thread-2) [n:127.0.0.1:45980_solr    ] o.a.s.c.s.i.Krb5HttpClientBuilder org.apache.solr.client.solrj.impl.Krb5HttpClientBuilder is configured without specifying system property 'java.security.auth.login.config'
   [junit4]   2> 1327743 INFO  (jetty-launcher-2031-thread-2) [n:127.0.0.1:45980_solr    ] o.a.s.m.r.SolrJmxReporter JMX monitoring for 'solr_45980.solr.node' (registry 'solr.node') enabled at server: com.sun.jmx.mbeanserver.JmxMBeanServer@23f8d3a6
   [junit4]   2> 1327743 INFO  (jetty-launcher-2031-thread-1) [n:127.0.0.1:60630_solr    ] o.a.s.m.r.SolrJmxReporter JMX monitoring for 'solr_60630.solr.node' (registry 'solr.node') enabled at server: com.sun.jmx.mbeanserver.JmxMBeanServer@23f8d3a6
   [junit4]   2> 1327749 INFO  (jetty-launcher-2031-thread-2) [n:127.0.0.1:45980_solr    ] o.a.s.m.r.SolrJmxReporter JMX monitoring for 'solr_45980.solr.jvm' (registry 'solr.jvm') enabled at server: com.sun.jmx.mbeanserver.JmxMBeanServer@23f8d3a6
   [junit4]   2> 1327749 INFO  (jetty-launcher-2031-thread-2) [n:127.0.0.1:45980_solr    ] o.a.s.m.r.SolrJmxReporter JMX monitoring for 'solr_45980.solr.jetty' (registry 'solr.jetty') enabled at server: com.sun.jmx.mbeanserver.JmxMBeanServer@23f8d3a6
   [junit4]   2> 1327749 INFO  (jetty-launcher-2031-thread-1) [n:127.0.0.1:60630_solr    ] o.a.s.m.r.SolrJmxReporter JMX monitoring for 'solr_60630.solr.jvm' (registry 'solr.jvm') enabled at server: com.sun.jmx.mbeanserver.JmxMBeanServer@23f8d3a6
   [junit4]   2> 1327749 INFO  (jetty-launcher-2031-thread-1) [n:127.0.0.1:60630_solr    ] o.a.s.m.r.SolrJmxReporter JMX monitoring for 'solr_60630.solr.jetty' (registry 'solr.jetty') enabled at server: com.sun.jmx.mbeanserver.JmxMBeanServer@23f8d3a6
   [junit4]   2> 1327750 INFO  (jetty-launcher-2031-thread-2) [n:127.0.0.1:45980_solr    ] o.a.s.c.CorePropertiesLocator Found 0 core definitions underneath /export/home/jenkins/workspace/Lucene-Solr-7.x-Solaris/solr/build/solr-core/test/J0/temp/solr.cloud.TestSolrCloudWithSecureImpersonation_F67057F252F1943C-001/tempDir-001/node2/.
   [junit4]   2> 1327750 INFO  (jetty-launcher-2031-thread-1) [n:127.0.0.1:60630_solr    ] o.a.s.c.CorePropertiesLocator Found 0 core definitions underneath /export/home/jenkins/workspace/Lucene-Solr-7.x-Solaris/solr/build/solr-core/test/J0/temp/solr.cloud.TestSolrCloudWithSecureImpersonation_F67057F252F1943C-001/tempDir-001/node1/.
   [junit4]   2> 1327781 INFO  (zkConnectionManagerCallback-2056-thread-1) [    ] o.a.s.c.c.ConnectionManager zkClient has connected
   [junit4]   2> 1327813 INFO  (TEST-TestSolrCloudWithSecureImpersonation.testProxyValidateGroup-seed#[F67057F252F1943C]) [    ] o.a.s.SolrTestCaseJ4 ###Starting testProxyValidateGroup
   [junit4]   2> 1327850 INFO  (qtp1954351823-9717) [n:127.0.0.1:45980_solr    ] o.a.s.h.a.CollectionsHandler Invoked Collection Action :list with params doAs=jenkins&action=LIST&wt=javabin&version=2 and sendToOCPQueue=true
   [junit4]   2> 1327850 INFO  (qtp1954351823-9717) [n:127.0.0.1:45980_solr    ] o.a.s.s.HttpSolrCall [admin] webapp=null path=/admin/collections params={doAs=jenkins&action=LIST&wt=javabin&version=2} status=0 QTime=0
   [junit4]   2> 1327851 WARN  (TEST-TestSolrCloudWithSecureImpersonation.testProxyValidateGroup-seed#[F67057F252F1943C]) [    ] o.a.h.c.p.ResponseProcessCookies Invalid cookie header: "Set-Cookie: hadoop.auth="u=anyHostUsersGroup&p=anyHostUsersGroup&t=test&e=1514152382568&s=20NuCm1aLPdzS5ltb2gIuV7ffQw="; Path=/; Domain=127.0.0.1; Expires=ned, 24-pro-2017 21:53:02 GMT; HttpOnly". Invalid 'expires' attribute: ned, 24-pro-2017 21:53:02 GMT
   [junit4]   2> 1327851 INFO  (TEST-TestSolrCloudWithSecureImpersonation.testProxyValidateGroup-seed#[F67057F252F1943C]) [    ] o.a.s.SolrTestCaseJ4 ###Ending testProxyValidateGroup
   [junit4]   2> 1327883 INFO  (TEST-TestSolrCloudWithSecureImpersonation.testProxyNullProxyUser-seed#[F67057F252F1943C]) [    ] o.a.s.SolrTestCaseJ4 ###Starting testProxyNullProxyUser
   [junit4]   2> 1327883 INFO  (qtp1954351823-9718) [    ] o.a.s.s.SolrDispatchFilter Error authenticating
   [junit4]   2> java.lang.IllegalArgumentException: userName is NULL, empty or contains a '&'
   [junit4]   2> 	at org.apache.hadoop.security.authentication.util.AuthToken.checkForIllegalArgument(AuthToken.java:87)
   [junit4]   2> 	at org.apache.hadoop.security.authentication.util.AuthToken.<init>(AuthToken.java:70)
   [junit4]   2> 	at org.apache.hadoop.security.authentication.server.AuthenticationToken.<init>(AuthenticationToken.java:58)
   [junit4]   2> 	at org.apache.solr.security.HttpParamDelegationTokenPlugin$HttpParamDelegationTokenAuthenticationHandler$HttpParamAuthenticationHandler.authenticate(HttpParamDelegationTokenPlugin.java:213)
   [junit4]   2> 	at org.apache.hadoop.security.token.delegation.web.DelegationTokenAuthenticationHandler.authenticate(DelegationTokenAuthenticationHandler.java:348)
   [junit4]   2> 	at org.apache.solr.security.RequestContinuesRecorderAuthenticationHandler.authenticate(RequestContinuesRecorderAuthenticationHandler.java:69)
   [junit4]   2> 	at org.apache.hadoop.security.authentication.server.AuthenticationFilter.doFilter(AuthenticationFilter.java:518)
   [junit4]   2> 	at org.apache.solr.security.DelegationTokenKerberosFilter.doFilter(DelegationTokenKerberosFilter.java:134)
   [junit4]   2> 	at org.apache.solr.security.HttpParamDelegationTokenPlugin$HttpParamToRequestFilter.doFilter(HttpParamDelegationTokenPlugin.java:245)
   [junit4]   2> 	at org.apache.solr.security.KerberosPlugin.doAuthenticate(KerberosPlugin.java:243)
   [junit4]   2> 	at org.apache.solr.servlet.SolrDispatchFilter.authenticateRequest(SolrDispatchFilter.java:451)
   [junit4]   2> 	at org.apache.solr.servlet.SolrDispatchFilter.doFilter(SolrDispatchFilter.java:347)
   [junit4]   2> 	at org.apache.solr.servlet.SolrDispatchFilter.doFilter(SolrDispatchFilter.java:326)
   [junit4]   2> 	at org.eclipse.jetty.servlet.ServletHandler$CachedChain.doFilter(ServletHandler.java:1759)
   [junit4]   2> 	at org.apache.solr.client.solrj.embedded.JettySolrRunner$DebugFilter.doFilter(JettySolrRunner.java:139)
   [junit4]   2> 	at org.eclipse.jetty.servlet.ServletHandler$CachedChain.doFilter(ServletHandler.java:1759)
   [junit4]   2> 	at org.eclipse.jetty.servlet.ServletHandler.doHandle(ServletHandler.java:582)
   [junit4]   2> 	at org.eclipse.jetty.server.session.SessionHandler.doHandle(SessionHandler.java:224)
   [junit4]   2> 	at org.eclipse.jetty.server.handler.ContextHandler.doHandle(ContextHandler.java:1180)
   [junit4]   2> 	at org.eclipse.jetty.servlet.ServletHandler.doScope(ServletHandler.java:512)
   [junit4]   2> 	at org.eclipse.jetty.server.session.SessionHandler.doScope(SessionHandler.java:185)
   [junit4]   2> 	at org.eclipse.jetty.server.handler.ContextHandler.doScope(ContextHandler.java:1112)
   [junit4]   2> 	at org.eclipse.jetty.server.handler.ScopedHandler.handle(ScopedHandler.java:141)
   [junit4]   2> 	at org.eclipse.jetty.server.handler.gzip.GzipHandler.handle(GzipHandler.java:493)
   [junit4]   2> 	at org.eclipse.jetty.server.handler.HandlerWrapper.handle(HandlerWrapper.java:134)
   [junit4]   2> 	at org.eclipse.jetty.server.Server.handle(Server.java:534)
   [junit4]   2> 	at org.eclipse.jetty.server.HttpChannel.handle(HttpChannel.java:320)
   [junit4]   2> 	at org.eclipse.jetty.server.HttpConnection.onFillable(HttpConnection.java:251)
   [junit4]   2> 	at org.eclipse.jetty.io.AbstractConnection$ReadCallback.succeeded(AbstractConnection.java:283)
   [junit4]   2> 	at org.eclipse.jetty.io.FillInterest.fillable(FillInterest.java:108)
   [junit4]   2> 	at org.eclipse.jetty.io.SelectChannelEndPoint$2.run(SelectChannelEndPoint.java:93)
   [junit4]   2> 	at org.eclipse.jetty.util.thread.strategy.ExecuteProduceConsume.executeProduceConsume(ExecuteProduceConsume.java:303)
   [junit4]   2> 	at org.eclipse.jetty.util.thread.strategy.ExecuteProduceConsume.produceConsume(ExecuteProduceConsume.java:148)
   [junit4]   2> 	at org.eclipse.jetty.util.thread.strategy.ExecuteProduceConsume.run(ExecuteProduceConsume.java:136)
   [junit4]   2> 	at org.eclipse.jetty.util.thread.QueuedThreadPool.runJob(QueuedThreadPool.java:671)
   [junit4]   2> 	at org.eclipse.jetty.util.thread.QueuedThreadPool$2.run(QueuedThreadPool.java:589)
   [junit4]   2> 	at java.lang.Thread.run(Thread.java:748)
   [junit4]   2> 1327884 WARN  (qtp1954351823-9718) [    ] o.e.j.s.ServletHandler /solr/admin/collections
   [junit4]   2> org.apache.solr.common.SolrException: Error during request authentication, 
   [junit4]   2> 	at org.apache.solr.servlet.SolrDispatchFilter.authenticateRequest(SolrDispatchFilter.java:457)
   [junit4]   2> 	at org.apache.solr.servlet.SolrDispatchFilter.doFilter(SolrDispatchFilter.java:347)
   [junit4]   2> 	at org.apache.solr.servlet.SolrDispatchFilter.doFilter(SolrDispatchFilter.java:326)
   [junit4]   2> 	at org.eclipse.jetty.servlet.ServletHandler$CachedChain.doFilter(ServletHandler.java:1759)
   [junit4]   2> 	at org.apache.solr.client.solrj.embedded.JettySolrRunner$DebugFilter.doFilter(JettySolrRunner.java:139)
   [junit4]   2> 	at org.eclipse.jetty.servlet.ServletHandler$CachedChain.doFilter(ServletHandler.java:1759)
   [junit4]   2> 	at org.eclipse.jetty.servlet.ServletHandler.doHandle(ServletHandler.java:582)
   [junit4]   2> 	at org.eclipse.jetty.server.session.SessionHandler.doHandle(SessionHandler.java:224)
   [junit4]   2> 	at org.eclipse.jetty.server.handler.ContextHandler.doHandle(ContextHandler.java:1180)
   [junit4]   2> 	at org.eclipse.jetty.servlet.ServletHandler.doScope(ServletHandler.java:512)
   [junit4]   2> 	at org.eclipse.jetty.server.session.SessionHandler.doScope(SessionHandler.java:185)
   [junit4]   2> 	at org.eclipse.jetty.server.handler.ContextHandler.doScope(ContextHandler.java:1112)
   [junit4]   2> 	at org.eclipse.jetty.server.handler.ScopedHandler.handle(ScopedHandler.java:141)
   [junit4]   2> 	at org.eclipse.jetty.server.handler.gzip.GzipHandler.handle(GzipHandler.java:493)
   [junit4]   2> 	at org.eclipse.jetty.server.handler.HandlerWrapper.handle(HandlerWrapper.java:134)
   [junit4]   2> 	at org.eclipse.jetty.server.Server.handle(Server.java:534)
   [junit4]   2> 	at org.eclipse.jetty.server.HttpChannel.handle(HttpChannel.java:320)
   [junit4]   2> 	at org.eclipse.jetty.server.HttpConnection.onFillable(HttpConnection.java:251)
   [junit4]   2> 	at org.eclipse.jetty.io.AbstractConnection$ReadCallback.succeeded(AbstractConnection.java:283)
   [junit4]   2> 	at org.eclipse.jetty.io.FillInterest.fillable(FillInterest.java:108)
   [junit4]   2> 	at org.eclipse.jetty.io.SelectChannelEndPoint$2.run(SelectChannelEndPoint.java:93)
   [junit4]   2> 	at org.eclipse.jetty.util.thread.strategy.ExecuteProduceConsume.executeProduceConsume(ExecuteProduceConsume.java:303)
   [junit4]   2> 	at org.eclipse.jetty.util.thread.strategy.ExecuteProduceConsume.produceConsume(ExecuteProduceConsume.java:148)
   [junit4]   2> 	at org.eclipse.jetty.util.thread.strategy.ExecuteProduceConsume.run(ExecuteProduceConsume.java:136)
   [junit4]   2> 	at org.eclipse.jetty.util.thread.QueuedThreadPool.runJob(QueuedThreadPool.java:671)
   [junit4]   2> 	at org.eclipse.jetty.util.thread.QueuedThreadPool$2.run(QueuedThreadPool.java:589)
   [junit4]   2> 	at java.lang.Thread.run(Thread.java:748)
   [junit4]   2> Caused by: java.lang.IllegalArgumentException: userName is NULL, empty or contains a '&'
   [junit4]   2> 	at org.apache.hadoop.security.authentication.util.AuthToken.checkForIllegalArgument(AuthToken.java:87)
   [junit4]   2> 	at org.apache.hadoop.security.authentication.util.AuthToken.<init>(AuthToken.java:70)
   [junit4]   2> 	at org.apache.hadoop.security.authentication.server.AuthenticationToken.<init>(AuthenticationToken.java:58)
   [junit4]   2> 	at org.apache.solr.security.HttpParamDelegationTokenPlugin$HttpParamDelegationTokenAuthenticationHandler$HttpParamAuthenticationHandler.authenticate(HttpParamDelegationTokenPlugin.java:213)
   [junit4]   2> 	at org.apache.hadoop.security.token.delegation.web.DelegationTokenAuthenticationHandler.authenticate(DelegationTokenAuthenticationHandler.java:348)
   [junit4]   2> 	at org.apache.solr.security.RequestContinuesRecorderAuthenticationHandler.authenticate(RequestContinuesRecorderAuthenticationHandler.java:69)
   [junit4]   2> 	at org.apache.hadoop.security.authentication.server.AuthenticationFilter.doFilter(AuthenticationFilter.java:518)
   [junit4]   2> 	at org.apache.solr.security.DelegationTokenKerberosFilter.doFilter(DelegationTokenKerberosFilter.java:134)
   [junit4]   2> 	at org.apache.solr.security.HttpParamDelegationTokenPlugin$HttpParamToRequestFilter.doFilter(HttpParamDelegationTokenPlugin.java:245)
   [junit4]   2> 	at org.apache.solr.security.KerberosPlugin.doAuthenticate(KerberosPlugin.java:243)
   [junit4]   2> 	at org.apache.solr.servlet.SolrDispatchFilter.authenticateRequest(SolrDispatchFilter.java:451)
   [junit4]   2> 	... 26 more
   [junit4]   2> 1327885 INFO  (TEST-TestSolrCloudWithSecureImpersonation.testProxyNullProxyUser-seed#[F67057F252F1943C]) [    ] o.a.s.SolrTestCaseJ4 ###Ending testProxyNullProxyUser
   [junit4]   2> 1327920 INFO  (TEST-TestSolrCloudWithSecureImpersonation.testProxyInvalidGroup-seed#[F67057F252F1943C]) [    ] o.a.s.SolrTestCaseJ4 ###Starting testProxyInvalidGroup
   [junit4]   2> 1327945 WARN  (qtp1954351823-9721) [    ] o.a.h.s.ShellBasedUnixGroupsMapping got exception trying to get groups for user bar: id: invalid user name: "bar"
   [junit4]   2> id: invalid user name: "bar"
   [junit4]   2> 
   [junit4]   2> 1327951 WARN  (TEST-TestSolrCloudWithSecureImpersonation.testProxyInvalidGroup-seed#[F67057F252F1943C]) [    ] o.a.h.c.p.ResponseProcessCookies Invalid cookie header: "Set-Cookie: hadoop.auth="u=bogusGroup&p=bogusGroup&t=test&e=1514152382673&s=LLhRGW+PaIG9oGuuCpkXJsTNzYo="; Path=/; Domain=127.0.0.1; Expires=ned, 24-pro-2017 21:53:02 GMT; HttpOnly". Invalid 'expires' attribute: ned, 24-pro-2017 21:53:02 GMT
   [junit4]   2> 1327951 INFO  (TEST-TestSolrCloudWithSecureImpersonation.testProxyInvalidGroup-seed#[F67057F252F1943C]) [    ] o.a.s.SolrTestCaseJ4 ###Ending testProxyInvalidGroup
   [junit4]   2> 1327984 INFO  (TEST-TestSolrCloudWithSecureImpersonation.testProxyInvalidProxyUser-seed#[F67057F252F1943C]) [    ] o.a.s.SolrTestCaseJ4 ###Starting testProxyInvalidProxyUser
   [junit4]   2> 1327989 WARN  (TEST-TestSolrCloudWithSecureImpersonation.testProxyInvalidProxyUser-seed#[F67057F252F1943C]) [    ] o.a.h.c.p.ResponseProcessCookies Invalid cookie header: "Set-Cookie: hadoop.auth="u=bar&p=bar&t=test&e=1514152382736&s=W+EMdnJ7Z2gYe/Jbyb8/TewYMcw="; Path=/; Domain=127.0.0.1; Expires=ned, 24-pro-2017 21:53:02 GMT; HttpOnly". Invalid 'expires' attribute: ned, 24-pro-2017 21:53:02 GMT
   [junit4]   2> 1327989 INFO  (TEST-TestSolrCloudWithSecureImpersonation.testProxyInvalidProxyUser-seed#[F67057F252F1943C]) [    ] o.a.s.SolrTestCaseJ4 ###Ending testProxyInvalidProxyUser
   [junit4]   2> 1328011 INFO  (TEST-TestSolrCloudWithSecureImpersonation.testProxyWrongHost-seed#[F67057F252F1943C]) [    ] o.a.s.SolrTestCaseJ4 ###Starting testProxyWrongHost
   [junit4]   2> 1333058 WARN  (TEST-TestSolrCloudWithSecureImpersonation.testProxyWrongHost-seed#[F67057F252F1943C]) [    ] o.a.h.c.p.ResponseProcessCookies Invalid cookie header: "Set-Cookie: hadoop.auth="u=wrongHost&p=wrongHost&t=test&e=1514152382763&s=daogwdjcB22zbtGvR4dBYsD88DA="; Path=/; Domain=127.0.0.1; Expires=ned, 24-pro-2017 21:53:02 GMT; HttpOnly". Invalid 'expires' attribute: ned, 24-pro-2017 21:53:02 GMT
   [junit4]   2> 1333059 INFO  (TEST-TestSolrCloudWithSecureImpersonation.testProxyWrongHost-seed#[F67057F252F1943C]) [    ] o.a.s.SolrTestCaseJ4 ###Ending testProxyWrongHost
   [junit4]   2> 1333104 INFO  (TEST-TestSolrCloudWithSecureImpersonation.testProxyNoConfigGroups-seed#[F67057F252F1943C]) [    ] o.a.s.SolrTestCaseJ4 ###Starting testProxyNoConfigGroups
   [junit4]   2> 1333107 WARN  (TEST-TestSolrCloudWithSecureImpersonation.testProxyNoConfigGroups-seed#[F67057F252F1943C]) [    ] o.a.h.c.p.ResponseProcessCookies Invalid cookie header: "Set-Cookie: hadoop.auth="u=noGroups&p=noGroups&t=test&e=1514152387856&s=j6LSznhVZS9y0IAVbBZTINonKjg="; Path=/; Domain=127.0.0.1; Expires=ned, 24-pro-2017 21:53:07 GMT; HttpOnly". Invalid 'expires' attribute: ned, 24-pro-2017 21:53:07 GMT
   [junit4]   2> 1333108 INFO  (TEST-TestSolrCloudWithSecureImpersonation.testProxyNoConfigGroups-seed#[F67057F252F1943C]) [    ] o.a.s.SolrTestCaseJ4 ###Ending testProxyNoConfigGroups
   [junit4]   2> 1333149 INFO  (TEST-TestSolrCloudWithSecureImpersonation.testProxyUnknownRemote-seed#[F67057F252F1943C]) [    ] o.a.s.SolrTestCaseJ4 ###Starting testProxyUnknownRemote
   [junit4]   2> 1349774 WARN  (jetty-launcher-2031-thread-2-SendThread(127.0.0.1:64367)) [n:127.0.0.1:45980_solr    ] o.a.z.ClientCnxn Client session timed out, have not heard from server in 16717ms for sessionid 0x160885e7d5d0006
   [junit4]   2> 1349775 WARN  (jetty-launcher-2031-thread-1-SendThread(127.0.0.1:64367)) [n:127.0.0.1:60630_solr    ] o.a.z.ClientCnxn Client session timed out, have not heard from server in 22024ms for sessionid 0x160885e7d5d0005
   [junit4]   2> 1349776 WARN  (NIOServerCxn.Factory:0.0.0.0/0.0.0.0:0) [    ] o.a.z.s.NIOServerCnxn caught end of stream exception
   [junit4]   2> EndOfStreamException: Unable to read additional data from client sessionid 0x160885e7d5d0006, likely client has closed socket
   [junit4]   2> 	at org.apache.zookeeper.server.NIOServerCnxn.doIO(NIOServerCnxn.java:239)
   [junit4]   2> 	at org.apache.zookeeper.server.NIOServerCnxnFactory.run(NIOServerCnxnFactory.java:203)
   [junit4]   2> 	at java.lang.Thread.run(Thread.java:748)
   [junit4]   2> 1349776 WARN  (TEST-TestSolrCloudWithSecureImpersonation.testProxyUnknownRemote-seed#[F67057F252F1943C]) [    ] o.a.h.c.p.ResponseProcessCookies Invalid cookie header: "Set-Cookie: hadoop.auth="u=localHostAnyGroup&p=localHostAnyGroup&t=test&e=1514152387900&s=a+YSxb2gzUHscFpjSbxMRs/ArmU="; Path=/; Domain=127.0.0.1; Expires=ned, 24-pro-2017 21:53:07 GMT; HttpOnly". Invalid 'expires' attribute: ned, 24-pro-2017 21:53:07 GMT
   [junit4]   2> 1349776 INFO  (TEST-TestSolrCloudWithSecureImpersonation.testProxyUnknownRemote-seed#[F67057F252F1943C]) [    ] o.a.s.SolrTestCaseJ4 ###Ending testProxyUnknownRemote
   [junit4]   2> 1349817 INFO  (TEST-TestSolrCloudWithSecureImpersonation.testForwarding-seed#[F67057F252F1943C]) [    ] o.a.s.SolrTestCaseJ4 ###Starting testForwarding
   [junit4]   2> 1349819 INFO  (zkConnectionManagerCallback-2059-thread-1) [    ] o.a.s.c.c.ConnectionManager zkClient has connected
   [junit4]   2> 1349878 INFO  (jetty-launcher-2031-thread-2-EventThread) [n:127.0.0.1:45980_solr    ] o.a.c.f.s.ConnectionStateManager State change: SUSPENDED
   [junit4]   2> 1349885 WARN  (zkConnectionManagerCallback-2048-thread-1-processing-n:127.0.0.1:60630_solr) [n:127.0.0.1:60630_solr    ] o.a.s.c.c.ConnectionManager Watcher org.apache.solr.common.cloud.ConnectionManager@5f06e356 name: ZooKeeperConnection Watcher:127.0.0.1:64367/solr got event WatchedEvent state:Disconnected type:None path:null path: null type: None
   [junit4]   2> 1349885 WARN  (zkConnectionManagerCallback-2048-thread-1-processing-n:127.0.0.1:60630_solr) [n:127.0.0.1:60630_solr    ] o.a.s.c.c.ConnectionManager zkClient has disconnected
   [junit4]   2> 1349886 WARN  (zkConnectionManagerCallback-2050-thread-1-processing-n:127.0.0.1:45980_solr) [n:127.0.0.1:45980_solr    ] o.a.s.c.c.ConnectionManager Watcher org.apache.solr.common.cloud.ConnectionManager@2cc0a5f name: ZooKeeperConnection Watcher:127.0.0.1:64367/solr got event WatchedEvent state:Disconnected type:None path:null path: null type: None
   [junit4]   2> 1349886 WARN  (zkConnectionManagerCallback-2050-thread-1-processing-n:127.0.0.1:45980_solr) [n:127.0.0.1:45980_solr    ] o.a.s.c.c.ConnectionManager zkClient has disconnected
   [junit4]   2> 1350812 INFO  (zkConnectionManagerCallback-2062-thread-1) [    ] o.a.s.c.c.ConnectionManager zkClient has connected
   [junit4]   2> 1350814 INFO  (TEST-TestSolrCloudWithSecureImpersonation.testForwarding-seed#[F67057F252F1943C]) [    ] o.a.s.c.c.ZkStateReader Updated live nodes from ZooKeeper... (0) -> (1)
   [junit4]   2> 1350816 INFO  (TEST-TestSolrCloudWithSecureImpersonation.testForwarding-seed#[F67057F252F1943C]) [    ] o.a.s.c.s.i.ZkClientClusterStateProvider Cluster at 127.0.0.1:64367/solr ready
   [junit4]   2> 1350817 INFO  (qtp1954351823-9719) [n:127.0.0.1:45980_solr    ] o.a.s.h.a.CollectionsHandler Invoked Collection Action :create with params pullReplicas=0&replicationFactor=1&collection.configName=conf1&maxShardsPerNode=1&name=forwardingCollection&nrtReplicas=1&action=CREATE&numShards=1&tlogReplicas=0&wt=javabin&version=2 and sendToOCPQueue=true
   [junit4]   2> 1351005 WARN  (jetty-launcher-2031-thread-1-SendThread(127.0.0.1:64367)) [n:127.0.0.1:60630_solr    ] o.a.z.ClientCnxn Unable to reconnect to ZooKeeper service, session 0x160885e7d5d0007 has expired
   [junit4]   2> 1351056 WARN  (jetty-launcher-2031-thread-1-SendThread(127.0.0.1:64367)) [n:127.0.0.1:60630_solr    ] o.a.z.ClientCnxn Unable to reconnect to ZooKeeper service, session 0x160885e7d5d0005 has expired
   [junit4]   2> 1351056 WARN  (zkConnectionManagerCallback-2048-thread-1-processing-n:127.0.0.1:60630_solr) [n:127.0.0.1:60630_solr    ] o.a.s.c.c.ConnectionManager Watcher org.apache.solr.common.cloud.ConnectionManager@5f06e356 name: ZooKeeperConnection Watcher:127.0.0.1:64367/solr got event WatchedEvent state:Expired type:None path:null path: null type: None
   [junit4]   2> 1351056 WARN  (zkConnectionManagerCallback-2048-thread-1-processing-n:127.0.0.1:60630_solr) [n:127.0.0.1:60630_solr    ] o.a.s.c.c.ConnectionManager Our previous ZooKeeper session was expired. Attempting to reconnect to recover relationship with ZooKeeper...
   [junit4]   2> 1351056 INFO  (zkConnectionManagerCallback-2048-thread-1-processing-n:127.0.0.1:60630_solr) [n:127.0.0.1:60630_solr    ] o.a.s.c.TransientSolrCoreCacheDefault Allocating transient cache for 2147483647 transient cores
   [junit4]   2> 1351056 WARN  (zkConnectionManagerCallback-2048-thread-1-processing-n:127.0.0.1:60630_solr) [n:127.0.0.1:60630_solr    ] o.a.s.c.c.DefaultConnectionStrategy Connection expired - starting a new one...
   [junit4]   2> 1351060 INFO  (zkConnectionManagerCallback-2048-thread-1-processing-n:127.0.0.1:60630_solr-EventThread) [n:127.0.0.1:60630_solr    ] o.a.s.c.c.ConnectionManager zkClient has connected
   [junit4]   2> 1351060 INFO  (zkConnectionManagerCallback-2048-thread-1-processing-n:127.0.0.1:60630_solr) [n:127.0.0.1:60630_solr    ] o.a.s.c.c.ConnectionManager Connection with ZooKeeper reestablished.
   [junit4]   2> 1351061 INFO  (zkConnectionManagerCallback-2048-thread-1-processing-n:127.0.0.1:60630_solr) [n:127.0.0.1:60630_solr    ] o.a.s.c.ZkController ZooKeeper session re-connected ... refreshing core states after session expiration.
   [junit4]   2> 1351065 INFO  (zkConnectionManagerCallback-2048-thread-1-processing-n:127.0.0.1:60630_solr) [n:127.0.0.1:60630_solr    ] o.a.s.c.c.ZkStateReader Updated live nodes from ZooKeeper... (2) -> (1)
   [junit4]   2> 1351081 INFO  (zkConnectionManagerCallback-2048-thread-1-processing-n:127.0.0.1:60630_solr) [n:127.0.0.1:60630_solr    ] o.a.s.c.ZkController Register node as live in ZooKeeper:/live_nodes/127.0.0.1:60630_solr
   [junit4]   2> 1351083 INFO  (zkConnectionManagerCallback-2048-thread-1-processing-n:127.0.0.1:60630_solr) [n:127.0.0.1:60630_solr    ] o.a.s.c.c.DefaultConnectionStrategy Reconnected to ZooKeeper
   [junit4]   2> 1351083 INFO  (zkConnectionManagerCallback-2048-thread-1-processing-n:127.0.0.1:60630_solr) [n:127.0.0.1:60630_solr    ] o.a.s.c.c.ConnectionManager zkClient Connected:true
   [junit4]   2> 1351084 INFO  (zkCallback-2047-thread-4-processing-n:127.0.0.1:60630_solr) [n:127.0.0.1:60630_solr    ] o.a.s.c.c.ZkStateReader Updated live nodes from ZooKeeper... (1) -> (2)
   [junit4]   2> 1351086 INFO  (zkCallback-2061-thread-1) [    ] o.a.s.c.c.ZkStateReader Updated live nodes from ZooKeeper... (1) -> (2)
   [junit4]   2> 1351244 INFO  (zkConnectionManagerCallback-2050-thread-1-processing-n:127.0.0.1:45980_solr) [n:127.0.0.1:45980_solr    ] o.a.s.c.c.ConnectionManager zkClient has connected
   [junit4]   2> 1351381 INFO  (OverseerThreadFactory-3917-thread-1-processing-n:127.0.0.1:45980_solr) [n:127.0.0.1:45980_solr    ] o.a.s.c.CreateCollectionCmd Create collection forwardingCollection
   [junit4]   2> 1351502 INFO  (OverseerStateUpdate-99229131213701126-127.0.0.1:45980_solr-n_0000000000) [n:127.0.0.1:45980_solr    ] o.a.s.c.o.SliceMutator createReplica() {
   [junit4]   2>   "operation":"ADDREPLICA",
   [junit4]   2>   "collection":"forwardingCollection",
   [junit4]   2>   "shard":"shard1",
   [junit4]   2>   "core":"forwardingCollection_shard1_replica_n1",
   [junit4]   2>   "state":"down",
   [junit4]   2>   "base_url":"http://127.0.0.1:60630/solr",
   [junit4]   2>   "type":"NRT",
   [junit4]   2>   "waitForFinalState":"false"} 
   [junit4]   2> 1351713 INFO  (qtp285414748-9710) [n:127.0.0.1:60630_solr    ] o.a.s.h.a.CoreAdminOperation core create command qt=/admin/cores&coreNodeName=core_node2&collection.configName=conf1&newCollection=true&name=forwardingCollection_shard1_replica_n1&action=CREATE&numShards=1&collection=forwardingCollection&shard=shard1&wt=javabin&version=2&replicaType=NRT
   [junit4]   2> 1351741 WARN  (jetty-launcher-2031-thread-2-SendThread(127.0.0.1:64367)) [n:127.0.0.1:45980_solr    ] o.a.z.ClientCnxn Unable to reconnect to ZooKeeper service, session 0x160885e7d5d0008 has expired
   [junit4]   2> 1351825 INFO  (zkCallback-2047-thread-3-processing-n:127.0.0.1:60630_solr) [n:127.0.0.1:60630_solr    ] o.a.s.c.c.ZkStateReader A cluster state change: [WatchedEvent state:SyncConnected type:NodeDataChanged path:/collections/forwardingCollection/state.json] for collection [forwardingCollection] has occurred - updating... (live nodes size: [2])
   [junit4]   2> 1351825 INFO  (zkCallback-2047-thread-4-processing-n:127.0.0.1:60630_solr) [n:127.0.0.1:60630_solr    ] o.a.s.c.c.ZkStateReader A cluster state change: [WatchedEvent state:SyncConnected type:NodeDataChanged path:/collections/forwardingCollection/state.json] for collection [forwardingCollection] has occurred - updating... (live nodes size: [2])
   [junit4]   2> 1352753 INFO  (qtp285414748-9710) [n:127.0.0.1:60630_solr c:forwardingCollection s:shard1 r:core_node2 x:forwardingCollection_shard1_replica_n1] o.a.s.c.SolrConfig Using Lucene MatchVersion: 7.3.0
   [junit4]   2> 1352796 INFO  (qtp285414748-9710) [n:127.0.0.1:60630_solr c:forwardingCollection s:shard1 r:core_node2 x:forwardingCollection_shard1_replica_n1] o.a.s.s.IndexSchema [forwardingCollection_shard1_replica_n1] Schema name=test
   [junit4]   2> 1352859 INFO  (qtp285414748-9710) [n:127.0.0.1:60630_solr c:forwardingCollection s:shard1 r:core_node2 x:forwardingCollection_shard1_replica_n1] o.a.s.s.IndexSchema Loaded schema test/1.0 with uniqueid field id
   [junit4]   2> 1352888 INFO  (qtp285414748-9710) [n:127.0.0.1:60630_solr c:forwardingCollection s:shard1 r:core_node2 x:forwardingCollection_shard1_replica_n1] o.a.s.c.CoreContainer Creating SolrCore 'forwardingCollection_shard1_replica_n1' using configuration from collection forwardingCollection, trusted=true
   [junit4]   2> 1352888 INFO  (qtp285414748-9710) [n:127.0.0.1:60630_solr c:forwardingCollection s:shard1 r:core_node2 x:forwardingCollection_shard1_replica_n1] o.a.s.m.r.SolrJmxReporter JMX monitoring for 'solr_60630.solr.core.forwardingCollection.shard1.replica_n1' (registry 'solr.core.forwardingCollection.shard1.replica_n1') enabled at server: com.sun.jmx.mbeanserver.JmxMBeanServer@23f8d3a6
   [junit4]   2> 1352888 INFO  (qtp285414748-9710) [n:127.0.0.1:60630_solr c:forwardingCollection s:shard1 r:core_node2 x:forwardingCollection_shard1_replica_n1] o.a.s.c.SolrCore solr.RecoveryStrategy.Builder
   [junit4]   2> 1352888 INFO  (qtp285414748-9710) [n:127.0.0.1:60630_solr c:forwardingCollection s:shard1 r:core_node2 x:forwardingCollection_shard1_replica_n1] o.a.s.c.SolrCore [[forwardingCollection_shard1_replica_n1] ] Opening new SolrCore at [/export/home/jenkins/workspace/Lucene-Solr-7.x-Solaris/solr/build/solr-core/test/J0/temp/solr.cloud.TestSolrCloudWithSecureImpersonation_F67057F252F1943C-001/tempDir-001/node1/forwardingCollection_shard1_replica_n1], dataDir=[/export/home/jenkins/workspace/Lucene-Solr-7.x-Solaris/solr/build/solr-core/test/J0/temp/solr.cloud.TestSolrCloudWithSecureImpersonation_F67057F252F1943C-001/tempDir-001/node1/./forwardingCollection_shard1_replica_n1/data/]
   [junit4]   2> 1352890 INFO  (qtp285414748-9710) [n:127.0.0.1:60630_solr c:forwardingCollection s:shard1 r:core_node2 x:forwardingCollection_shard1_replica_n1] o.a.s.u.RandomMergePolicy RandomMergePolicy wrapping class org.apache.lucene.index.TieredMergePolicy: [TieredMergePolicy: maxMergeAtOnce=18, maxMergeAtOnceExplicit=42, maxMergedSegmentMB=11.0302734375, floorSegmentMB=0.91015625, forceMergeDeletesPctAllowed=18.24985939423263, segmentsPerTier=43.0, maxCFSSegmentSizeMB=8.796093022207999E12, noCFSRatio=0.0
   [junit4]   2> 1352937 INFO  (qtp285414748-9710) [n:127.0.0.1:60630_solr c:forwardingCollection s:shard1 r:core_node2 x:forwardingCollection_shard1_replica_n1] o.a.s.u.UpdateHandler Using UpdateLog implementation: org.apache.solr.update.UpdateLog
   [junit4]   2> 1352937 INFO  (qtp285414748-9710) [n:127.0.0.1:60630_solr c:forwardingCollection s:shard1 r:core_node2 x:forwardingCollection_shard1_replica_n1] o.a.s.u.UpdateLog Initializing UpdateLog: dataDir= defaultSyncLevel=FLUSH numRecordsToKeep=100 maxNumLogsToKeep=10 numVersionBuckets=65536
   [junit4]   2> 1352938 INFO  (qtp285414748-9710) [n:127.0.0.1:60630_solr c:forwardingCollection s:shard1 r:core_node2 x:forwardingCollection_shard1_replica_n1] o.a.s.u.CommitTracker Hard AutoCommit: disabled
   [junit4]   2> 1352938 INFO  (qtp285414748-9710) [n:127.0.0.1:60630_solr c:forwardingCollection s:shard1 r:core_node2 x:forwardingCollection_shard1_replica_n1] o.a.s.u.CommitTracker Soft AutoCommit: disabled
   [junit4]   2> 1352939 INFO  (qtp285414748-9710) [n:127.0.0.1:60630_solr c:forwardingCollection s:shard1 r:core_node2 x:forwardingCollection_shard1_replica_n1] o.a.s.u.RandomMergePolicy RandomMergePolicy wrapping class org.apache.lucene.index.TieredMergePolicy: [TieredMergePolicy: maxMergeAtOnce=44, maxMergeAtOnceExplicit=47, maxMergedSegmentMB=67.1640625, floorSegmentMB=0.5390625, forceMergeDeletesPctAllowed=3.830005898331051, segmentsPerTier=24.0, maxCFSSegmentSizeMB=8.796093022207999E12, noCFSRatio=1.0
   [junit4]   2> 1352939 INFO  (qtp285414748-9710) [n:127.0.0.1:60630_solr c:forwardingCollection s:shard1 r:core_node2 x:forwardingCollection_shard1_replica_n1] o.a.s.s.SolrIndexSearcher Opening [Searcher@1ebd8271[forwardingCollection_shard1_replica_n1] main]
   [junit4]   2> 1352941 INFO  (qtp285414748-9710) [n:127.0.0.1:60630_solr c:forwardingCollection s:shard1 r:core_node2 x:forwardingCollection_shard1_replica_n1] o.a.s.h.c.SpellCheckComponent Initializing spell checkers
   [junit4]   2> 1352945 INFO  (qtp285414748-9710) [n:127.0.0.1:60630_solr c:forwardingCollection s:shard1 r:core_node2 x:forwardingCollection_shard1_replica_n1] o.a.s.s.DirectSolrSpellChecker init: {name=direct,classname=DirectSolrSpellChecker,field=lowerfilt,minQueryLength=3}
   [junit4]   2> 1352960 INFO  (qtp285414748-9710) [n:127.0.0.1:60630_solr c:forwardingCollection s:shard1 r:core_node2 x:forwardingCollection_shard1_replica_n1] o.a.s.h.ReplicationHandler Commits will be reserved for 10000ms.
   [junit4]   2> 1352960 INFO  (searcherExecutor-3922-thread-1-processing-n:127.0.0.1:60630_solr x:forwardingCollection_shard1_replica_n1 s:shard1 c:forwardingCollection r:core_node2) [n:127.0.0.1:60630_solr c:forwardingCollection s:shard1 r:core_node2 x:forwardingCollection_shard1_replica_n1] o.a.s.h.c.SpellCheckComponent Loading spell index for spellchecker: default
   [junit4]   2> 1352960 INFO  (qtp285414748-9710) [n:127.0.0.1:60630_solr c:forwardingCollection s:shard1 r:core_node2 x:forwardingCollection_shard1_replica_n1] o.a.s.u.UpdateLog Could not find max version in index or recent updates, using new clock 1587666126331969536
   [junit4]   2> 1352961 INFO  (searcherExecutor-3922-thread-1-processing-n:127.0.0.1:60630_solr x:forwardingCollection_shard1_replica_n1 s:shard1 c:forwardingCollection r:core_node2) [n:127.0.0.1:60630_solr c:forwardingCollection s:shard1 r:core_node2 x:forwardingCollection_shard1_replica_n1] o.a.s.h.c.SpellCheckComponent Loading spell index for spellchecker: direct
   [junit4]   2> 1352961 INFO  (searcherExecutor-3922-thread-1-processing-n:127.0.0.1:60630_solr x:forwardingCollection_shard1_replica_n1 s:shard1 c:forwardingCollection r:core_node2) [n:127.0.0.1:60630_solr c:forwardingCollection s:shard1 r:core_node2 x:forwardingCollection_shard1_replica_n1] o.a.s.h.c.SpellCheckComponent Loading spell index for spellchecker: wordbreak
   [junit4]   2> 1352961 INFO  (searcherExecutor-3922-thread-1-processing-n:127.0.0.1:60630_solr x:forwardingCollection_shard1_replica_n1 s:shard1 c:forwardingCollection r:core_node2) [n:127.0.0.1:60630_solr c:forwardingCollection s:shard1 r:core_node2 x:forwardingCollection_shard1_replica_n1] o.a.s.h.c.SpellCheckComponent Loading spell index for spellchecker: multipleFields
   [junit4]   2> 1352961 INFO  (searcherExecutor-3922-thread-1-processing-n:127.0.0.1:60630_solr x:forwardingCollection_shard1_replica_n1 s:shard1 c:forwardingCollection r:core_node2) [n:127.0.0.1:60630_solr c:forwardingCollection s:shard1 r:core_node2 x:forwardingCollection_shard1_replica_n1] o.a.s.h.c.SpellCheckComponent Loading spell index for spellchecker: jarowinkler
   [junit4]   2> 1352961 INFO  (searcherExecutor-3922-thread-1-processing-n:127.0.0.1:60630_solr x:forwardingCollection_shard1_replica_n1 s:shard1 c:forwardingCollection r:core_node2) [n:127.0.0.1:60630_solr c:forwardingCollection s:shard1 r:core_node2 x:forwardingCollection_shard1_replica_n1] o.a.s.h.c.SpellCheckComponent Loading spell index for spellchecker: external
   [junit4]   2> 1352962 INFO  (searcherExecutor-3922-thread-1-processing-n:127.0.0.1:60630_solr x:forwardingCollection_shard1_replica_n1 s:shard1 c:forwardingCollection r:core_node2) [n:127.0.0.1:60630_solr c:forwardingCollection s:shard1 r:core_node2 x:forwardingCollection_shard1_replica_n1] o.a.s.h.c.SpellCheckComponent Loading spell index for spellchecker: freq
   [junit4]   2> 1352963 INFO  (searcherExecutor-3922-thread-1-processing-n:127.0.0.1:60630_solr x:forwardingCollection_shard1_replica_n1 s:shard1 c:forwardingCollection r:core_node2) [n:127.0.0.1:60630_solr c:forwardingCollection s:shard1 r:core_node2 x:forwardingCollection_shard1_replica_n1] o.a.s.h.c.SpellCheckComponent Loading spell index for spellchecker: fqcn
   [junit4]   2> 1352964 INFO  (searcherExecutor-3922-thread-1-processing-n:127.0.0.1:60630_solr x:forwardingCollection_shard1_replica_n1 s:shard1 c:forwardingCollection r:core_node2) [n:127.0.0.1:60630_solr c:forwardingCollection s:shard1 r:core_node2 x:forwardingCollection_shard1_replica_n1] o.a.s.h.c.SpellCheckComponent Loading spell index for spellchecker: perDict
   [junit4]   2> 1352965 INFO  (searcherExecutor-3922-thread-1-processing-n:127.0.0.1:60630_solr x:forwardingCollection_shard1_replica_n1 s:shard1 c:forwardingCollection r:core_node2) [n:127.0.0.1:60630_solr c:forwardingCollection s:shard1 r:core_node2 x:forwardingCollection_shard1_replica_n1] o.a.s.c.SolrCore [forwardingCollection_shard1_replica_n1] Registered new searcher Searcher@1ebd8271[forwardingCollection_shard1_replica_n1] main{ExitableDirectoryReader(UninvertingDirectoryReader())}
   [junit4]   2> 1352967 INFO  (qtp285414748-9710) [n:127.0.0.1:60630_solr c:forwardingCollection s:shard1 r:core_node2 x:forwardingCollection_shard1_replica_n1] o.a.s.c.ShardLeaderElectionContext Enough replicas found to continue.
   [junit4]   2> 1352967 INFO  (qtp285414748-9710) [n:127.0.0.1:60630_solr c:forwardingCollection s:shard1 r:core_node2 x:forwardingCollection_shard1_replica_n1] o.a.s.c.ShardLeaderElectionContext I may be the new leader - try and sync
   [junit4]   2> 1352967 INFO  (qtp285414748-9710) [n:127.0.0.1:60630_solr c:forwardingCollection s:shard1 r:core_node2 x:forwardingCollection_shard1_replica_n1] o.a.s.c.SyncStrategy Sync replicas to http://127.0.0.1:60630/solr/forwardingCollection_shard1_replica_n1/
   [junit4]   2> 1352967 INFO  (qtp285414748-9710) [n:127.0.0.1:60630_solr c:forwardingCollection s:shard1 r:core_node2 x:forwardingCollection_shard1_replica_n1] o.a.s.c.SyncStrategy Sync Success - now sync replicas to me
   [junit4]   2> 1352967 INFO  (qtp285414748-9710) [n:127.0.0.1:60630_solr c:forwardingCollection s:shard1 r:core_node2 x:forwardingCollection_shard1_replica_n1] o.a.s.c.SyncStrategy http://127.0.0.1:60630/solr/forwardingCollection_shard1_replica_n1/ has no replicas
   [junit4]   2> 1352967 INFO  (qtp285414748-9710) [n:127.0.0.1:60630_solr c:forwardingCollection s:shard1 r:core_node2 x:forwardingCollection_shard1_replica_n1] o.a.s.c.ShardLeaderElectionContext Found all replicas participating in election, clear LIR
   [junit4]   2> 1352971 INFO  (qtp285414748-9710) [n:127.0.0.1:60630_solr c:forwardingCollection s:shard1 r:core_node2 x:forwardingCollection_shard1_replica_n1] o.a.s.c.ShardLeaderElectionContext I am the new leader: http://127.0.0.1:60630/solr/forwardingCollection_shard1_replica_n1/ shard1
   [junit4]   2> 1353075 INFO  (zkCallback-2047-thread-3-processing-n:127.0.0.1:60630_solr) [n:127.0.0.1:60630_solr    ] o.a.s.c.c.ZkStateReader A cluster state change: [WatchedEvent state:SyncConnected type:NodeDataChanged path:/collections/forwardingCollection/state.json] for collection [forwardingCollection] has occurred - updating... (live nodes size: [2])
   [junit4]   2> 1353075 INFO  (zkCallback-2047-thread-4-processing-n:127.0.0.1:60630_solr) [n:127.0.0.1:60630_solr    ] o.a.s.c.c.ZkStateReader A cluster state change: [WatchedEvent state:SyncConnected type:NodeDataChanged path:/collections/forwardingCollection/state.json] for collection [forwardingCollection] has occurred - updating... (live nodes size: [2])
   [junit4]   2> 1353145 INFO  (qtp285414748-9710) [n:127.0.0.1:60630_solr c:forwardingCollection s:shard1 r:core_node2 x:forwardingCollection_shard1_replica_n1] o.a.s.c.ZkController I am the leader, no recovery necessary
   [junit4]   2> 1353148 INFO  (qtp285414748-9710) [n:127.0.0.1:60630_solr c:forwardingCollection s:shard1 r:core_node2 x:forwardingCollection_shard1_replica_n1] o.a.s.s.HttpSolrCall [admin] webapp=null path=/admin/cores params={qt=/admin/cores&coreNodeName=core_node2&collection.configName=conf1&newCollection=true&name=forwardingCollection_shard1_replica_n1&action=CREATE&numShards=1&collection=forwardingCollection&shard=shard1&wt=javabin&version=2&replicaType=NRT} status=0 QTime=1436
   [junit4]   2> 1353149 WARN  (httpShardExecutor-3911-thread-1-processing-n:127.0.0.1:45980_solr [http:////127.0.0.1:60630//solr] http:////127.0.0.1:60630//solr) [n:127.0.0.1:45980_solr    ] o.a.h.c.p.ResponseProcessCookies Invalid cookie header: "Set-Cookie: hadoop.auth="u=$&p=$&t=test&e=1514152406463&s=C9CX7/YoKQ1Jmw7j5G2POmfxorU="; Path=/; Domain=127.0.0.1; Expires=ned, 24-pro-2017 21:53:26 GMT; HttpOnly". Invalid 'expires' attribute: ned, 24-pro-2017 21:53:26 GMT
   [junit4]   2> 1353154 INFO  (qtp1954351823-9719) [n:127.0.0.1:45980_solr    ] o.a.s.h.a.CollectionsHandler Wait for new collection to be active for at most 30 seconds. Check all shard replicas
   [junit4]   2> 1353251 INFO  (zkCallback-2047-thread-3-processing-n:127.0.0.1:60630_solr) [n:127.0.0.1:60630_solr    ] o.a.s.c.c.ZkStateReader A cluster state change: [WatchedEvent state:SyncConnected type:NodeDataChanged path:/collections/forwardingCollection/state.json] for collection [forwardingCollection] has occurred - updating... (live nodes size: [2])
   [junit4]   2> 1353251 INFO  (zkCallback-2047-thread-4-processing-n:127.0.0.1:60630_solr) [n:127.0.0.1:60630_solr    ] o.a.s.c.c.ZkStateReader A cluster state change: [WatchedEvent state:SyncConnected type:NodeDataChanged path:/collections/forwardingCollection/state.json] for collection [forwardingCollection] has occurred - updating... (live nodes size: [2])
   [junit4]   2> 1353385 INFO  (OverseerCollectionConfigSetProcessor-99229131213701126-127.0.0.1:45980_solr-n_0000000000) [n:127.0.0.1:45980_solr    ] o.a.s.c.OverseerTaskQueue Response ZK path: /overseer/collection-queue-work/qnr-0000000000 doesn't exist.  Requestor may have disconnected from ZooKeeper
   [junit4]   2> 1354146 ERROR (jetty-launcher-2031-thread-1-EventThread) [n:127.0.0.1:60630_solr    ] o.a.c.f.i.CuratorFrameworkImpl Watcher exception
   [junit4]   2> org.apache.zookeeper.KeeperException$SessionExpiredException: KeeperErrorCode = Session expired for /solr/security/zkdtsm/ZKDTSMRoot/ZKDTSMSeqNumRoot
   [junit4]   2> 	at org.apache.zookeeper.KeeperException.create(KeeperException.java:127)
   [junit4]   2> 	at org.apache.zookeeper.KeeperException.create(KeeperException.java:51)
   [junit4]   2> 	at org.apache.zookeeper.ZooKeeper.getData(ZooKeeper.java:1212)
   [junit4]   2> 	at org.apache.curator.framework.imps.GetDataBuilderImpl$4.call(GetDataBuilderImpl.java:302)
   [junit4]   2> 	at org.apache.curator.framework.imps.GetDataBuilderImpl$4.call(GetDataBuilderImpl.java:291)
   [junit4]   2> 	at org.apache.curator.RetryLoop.callWithRetry(RetryLoop.java:107)
   [junit4]   2> 	at org.apache.curator.framework.imps.GetDataBuilderImpl.pathInForeground(GetDataBuilderImpl.java:288)
   [junit4]   2> 	at org.apache.curator.framework.imps.GetDataBuilderImpl.forPath(GetDataBuilderImpl.java:279)
   [junit4]   2> 	at org.apache.curator.framework.imps.GetDataBuilderImpl.forPath(GetDataBuilderImpl.java:41)
   [junit4]   2> 	at org.apache.curator.framework.recipes.shared.SharedValue.readValue(SharedValue.java:244)
   [junit4]   2> 	at org.apache.curator.framework.recipes.shared.SharedValue.access$100(SharedValue.java:44)
   [junit4]   2> 	at org.apache.curator.framework.recipes.shared.SharedValue$1.process(SharedValue.java:61)
   [junit4]   2> 	at org.apache.curator.framework.imps.NamespaceWatcher.process(NamespaceWatcher.java:67)
   [junit4]   2> 	at org.apache.zookeeper.ClientCnxn$EventThread.processEvent(ClientCnxn.java:530)
   [junit4]   2> 	at org.apache.zookeeper.ClientCnxn$EventThread.run(ClientCnxn.java:505)
   [junit4]   2> 1354166 INFO  (qtp1954351823-9719) [n:127.0.0.1:45980_solr    ] o.a.s.s.HttpSolrCall [admin] webapp=null path=/admin/collections params={pullReplicas=0&replicationFactor=1&collection.configName=conf1&maxShardsPerNode=1&name=forwardingCollection&nrtReplicas=1&action=CREATE&numShards=1&tlogReplicas=0&wt=javabin&version=2} status=0 QTime=3350
   [junit4]   2> 1354167 WARN  (TEST-TestSolrCloudWithSecureImpersonation.testForwarding-seed#[F67057F252F1943C]) [    ] o.a.h.c.p.ResponseProcessCookies Invalid cookie header: "Set-Cookie: hadoop.auth="u=user&p=user&t=test&e=1514152405568&s=9kuIY4e056kDnzJHun5aPBnf5bc="; Path=/; Domain=127.0.0.1; Expires=ned, 24-pro-2017 21:53:25 GMT; HttpOnly". Invalid 'expires' attribute: ned, 24-pro-2017 21:53:25 GMT
   [junit4]   2> 1354167 INFO  (TEST-TestSolrCloudWithSecureImpersonation.testForwarding-seed#[F67057F252F1943C]) [    ] o.a.s.c.AbstractDistribZkTestBase Wait for recoveries to finish - collection: forwardingCollection failOnTimeout:true timeout (sec):100
   [junit4]   2> 1354168 INFO  (TEST-TestSolrCloudWithSecureImpersonation.testForwarding-seed#[F67057F252F1943C]) [    ] o.a.s.c.AbstractDistribZkTestBase Recoveries finished - collection: forwardingCollection
   [junit4]   2> 1354172 INFO  (qtp1954351823-9721) [n:127.0.0.1:45980_solr    ] o.a.s.c.TransientSolrCoreCacheDefault Allocating transient cache for 2147483647 transient cores
   [junit4]   2> 1354179 INFO  (qtp285414748-9712) [n:127.0.0.1:60630_solr c:forwardingCollection s:shard1 r:core_node2 x:forwardingCollection_shard1_replica_n1] o.a.s.c.S.Request [forwardingCollection_shard1_replica_n1]  webapp=/solr path=/select params={q=*:*&wt=javabin&version=2} hits=0 status=0 QTime=0
   [junit4]   2> 1354179 WARN  (qtp1954351823-9721) [n:127.0.0.1:45980_solr    ] o.a.h.c.p.ResponseProcessCookies Invalid cookie header: "Set-Cookie: hadoop.auth="u=$&p=$&t=test&e=1514152408927&s=QcByL7DI3CRLEnmI5uQDFVa6ets="; Path=/; Domain=127.0.0.1; Expires=ned, 24-pro-2017 21:53:28 GMT; HttpOnly". Invalid 'expires' attribute: ned, 24-pro-2017 21:53:28 GMT
   [junit4]   2> 1354186 WARN  (TEST-TestSolrCloudWithSecureImpersonation.testForwarding-seed#[F67057F252F1943C]) [    ] o.a.h.c.p.ResponseProcessCookies Invalid cookie header: "Set-Cookie: hadoop.auth="u=user&p=user&t=test&e=1514152408923&s=ZK38Sjy6f06NjXgL34RxCMAYtyU="; Path=/; Domain=127.0.0.1; Expires=ned, 24-pro-2017 21:53:28 GMT; HttpOnly". Invalid 'expires' attribute: ned, 24-pro-2017 21:53:28 GMT
   [junit4]   2> 1354186 WARN  (TEST-TestSolrCloudWithSecureImpersonation.testForwarding-seed#[F67057F252F1943C]) [    ] o.a.h.c.p.ResponseProcessCookies Invalid cookie header: "Set-Cookie: hadoop.auth="u=$&p=$&t=test&e=1514152408927&s=QcByL7DI3CRLEnmI5uQDFVa6ets="; Path=/; Domain=127.0.0.1; Expires=ned, 24-pro-2017 21:53:28 GMT; HttpOnly". Invalid 'expires' attribute: ned, 24-pro-2017 21:53:28 GMT
   [junit4]   2> 1354191 INFO  (qtp285414748-9715) [n:127.0.0.1:60630_solr c:forwardingCollection s:shard1 r:core_node2 x:forwardingCollection_shard1_replica_n1] o.a.s.c.S.Request [forwardingCollection_shard1_replica_n1]  webapp=/solr path=/select params={q=*:*&wt=javabin&version=2} hits=0 status=0 QTime=0
   [junit4]   2> 1354191 WARN  (TEST-TestSolrCloudWithSecureImpersonation.testForwarding-seed#[F67057F252F1943C]) [    ] o.a.h.c.p.ResponseProcessCookies Invalid cookie header: "Set-Cookie: hadoop.auth="u=user&p=user&t=test&e=1514152408941&s=DJPLp9g4DN1ZFDEq467WUyvG1nA="; Path=/; Domain=127.0.0.1; Expires=ned, 24-pro-2017 21:53:28 GMT; HttpOnly". Invalid 'expires' attribute: ned, 24-pro-2017 21:53:28 GMT
   [junit4]   2> 1354192 INFO  (TEST-TestSolrCloudWithSecureImpersonation.testForwarding-seed#[F67057F252F1943C]) [    ] o.a.s.SolrTestCaseJ4 ###Ending testForwarding
   [junit4]   2> 1354260 INFO  (TEST-TestSolrCloudWithSecureImpersonation.testProxyInvalidRemote-seed#[F67057F252F1943C]) [    ] o.a.s.SolrTestCaseJ4 ###Starting testProxyInvalidRemote
   [junit4]   2> 1354266 WARN  (TEST-TestSolrCloudWithSecureImpersonation.testProxyInvalidRemote-seed#[F67057F252F1943C]) [    ] o.a.h.c.p.ResponseProcessCookies Invalid cookie header: "Set-Cookie: hadoop.auth="u=localHostAnyGroup&p=localHostAnyGroup&t=test&e=1514152409012&s=26m39V6V1QjHXkg8hdAwQ634rcg="; Path=/; Domain=127.0.0.1; Expires=ned, 24-pro-2017 21:53:29 GMT; HttpOnly". Invalid 'expires' attribute: ned, 24-pro-2017 21:53:29 GMT
   [junit4]   2> 1354266 INFO  (TEST-TestSolrCloudWithSecureImpersonation.testProxyInvalidRemote-seed#[F67057F252F1943C]) [    ] o.a.s.SolrTestCaseJ4 ###Ending testProxyInvalidRemote
   [junit4]   2> 1354302 INFO  (TEST-TestSolrCloudWithSecureImpersonation.testProxyValidateAnyHostAnyUser-seed#[F67057F252F1943C]) [    ] o.a.s.SolrTestCaseJ4 ###Starting testProxyValidateAnyHostAnyUser
   [junit4]   2> 1354303 INFO  (qtp1954351823-9718) [n:127.0.0.1:45980_solr    ] o.a.s.h.a.CollectionsHandler Invoked Collection Action :list with params doAs=bar&action=LIST&wt=javabin&version=2 and sendToOCPQueue=true
   [junit4]   2> 1354303 INFO  (qtp1954351823-9718) [n:127.0.0.1:45980_solr    ] o.a.s.s.HttpSolrCall [admin] webapp=null path=/admin/collections params={doAs=bar&action=LIST&wt=javabin&version=2} status=0 QTime=0
   [junit4]   2> 1354304 WARN  (TEST-TestSolrCloudWithSecureImpersonation.testProxyValidateAnyHostAnyUser-seed#[F67057F252F1943C]) [    ] o.a.h.c.p.ResponseProcessCookies Invalid cookie header: "Set-Cookie: hadoop.auth="u=anyHostAnyUser&p=anyHostAnyUser&t=test&e=1514152409053&s=LuT3l8o01GLP8fYUrlYwl3BSTIU="; Path=/; Domain=127.0.0.1; Expires=ned, 24-pro-2017 21:53:29 GMT; HttpOnly". Invalid 'expires' attribute: ned, 24-pro-2017 21:53:29 GMT
   [junit4]   2> 1354304 INFO  (TEST-TestSolrCloudWithSecureImpersonation.testProxyValidateAnyHostAnyUser-seed#[F67057F252F1943C]) [    ] o.a.s.SolrTestCaseJ4 ###Ending testProxyValidateAnyHostAnyUser
   [junit4]   2> 1354335 INFO  (TEST-TestSolrCloudWithSecureImpersonation.testProxyValidateHost-seed#[F67057F252F1943C]) [    ] o.a.s.SolrTestCaseJ4 ###Starting testProxyValidateHost
   [junit4]   2> 1354336 INFO  (qtp1954351823-9720) [n:127.0.0.1:45980_solr    ] o.a.s.h.a.CollectionsHandler Invoked Collection Action :list with params doAs=bar&action=LIST&wt=javabin&version=2 and sendToOCPQueue=true
   [junit4]   2> 1354337 INFO  (qtp1954351823-9720) [n:127.0.0.1:45980_solr    ] o.a.s.s.HttpSolrCall [admin] webapp=null path=/admin/collections params={doAs=bar&action=LIST&wt=javabin&version=2} status=0 QTime=0
   [junit4]   2> 1354337 WARN  (TEST-TestSolrCloudWithSecureImpersonation.testProxyValidateHost-seed#[F67057F252F1943C]) [    ] o.a.h.c.p.ResponseProcessCookies Invalid cookie header: "Set-Cookie: hadoop.auth="u=localHostAnyGroup&p=localHostAnyGroup&t=test&e=1514152409087&s=LMpC2+ht9MmVgrIzfHETqgvnTJc="; Path=/; Domain=127.0.0.1; Expires=ned, 24-pro-2017 21:53:29 GMT; HttpOnly". Invalid 'expires' attribute: ned, 24-pro-2017 21:53:29 GMT
   [junit4]   2> 1354337 INFO  (TEST-TestSolrCloudWithSecureImpersonation.testProxyValidateHost-seed#[F67057F252F1943C]) [    ] o.a.s.SolrTestCaseJ4 ###Ending testProxyValidateHost
   [junit4]   2> 1354375 INFO  (TEST-TestSolrCloudWithSecureImpersonation.testProxyNoConfigHosts-seed#[F67057F252F1943C]) [    ] o.a.s.SolrTestCaseJ4 ###Starting testProxyNoConfigHosts
   [junit4]   2> 1354377 WARN  (TEST-TestSolrCloudWithSecureImpersonation.testProxyNoConfigHosts-seed#[F67057F252F1943C]) [    ] o.a.h.c.p.ResponseProcessCookies Invalid cookie header: "Set-Cookie: hadoop.auth="u=noHosts&p=noHosts&t=test&e=1514152409126&s=AioQykK7OmZCapV0rgchD4jV1ZY="; Path=/; Domain=127.0.0.1; Expires=ned, 24-pro-2017 21:53:29 GMT; HttpOnly". Invalid 'expires' attribute: ned, 24-pro-2017 21:53:29 GMT
   [junit4]   2> 1354377 INFO  (TEST-TestSolrCloudWithSecureImpersonation.testProxyNoConfigHosts-seed#[F67057F252F1943C]) [    ] o.a.s.SolrTestCaseJ4 ###Ending testProxyNoConfigHosts
   [junit4]   2> 1354379 INFO  (jetty-closer-2032-thread-2) [    ] o.e.j.s.AbstractConnector Stopped ServerConnector@75dbb8d3{HTTP/1.1,[http/1.1]}{127.0.0.1:0}
   [junit4]   2> 1354379 INFO  (jetty-closer-2032-thread-1) [    ] o.e.j.s.AbstractConnector Stopped ServerConnector@a6bbb7a{HTTP/1.1,[http/1.1]}{127.0.0.1:0}
   [junit4]   2> 1354380 INFO  (jetty-closer-2032-thread-1) [    ] o.a.s.c.CoreContainer Shutting down CoreContainer instance=2011581309
   [junit4]   2> 1354381 INFO  (jetty-closer-2032-thread-2) [    ] o.a.s.c.CoreContainer Shutting down CoreContainer instance=2081013437
   [junit4]   2> 1354381 INFO  (jetty-closer-2032-thread-2) [    ] o.a.s.m.SolrMetricManager Closing metric reporters for registry=solr.node, tag=null
   [junit4]   2> 1354381 INFO  (jetty-closer-2032-thread-2) [    ] o.a.s.m.r.SolrJmxReporter Closing reporter [org.apache.solr.metrics.reporters.SolrJmxReporter@327e762f: rootName = solr_60630, domain = solr.node, service url = null, agent id = null] for registry solr.node / com.codahale.metrics.MetricRegistry@47e59738
   [junit4]   2> 1354381 INFO  (jetty-closer-2032-thread-1) [    ] o.a.s.m.SolrMetricManager Closing metric reporters for registry=solr.node, tag=null
   [junit4]   2> 1354381 INFO  (jetty-closer-2032-thread-1) [    ] o.a.s.m.r.SolrJmxReporter Closing reporter [org.apache.solr.metrics.reporters.SolrJmxReporter@12f452cd: rootName = solr_45980, domain = solr.node, service url = null, agent id = null] for registry solr.node / com.codahale.metrics.MetricRegistry@6dc0f274
   [junit4]   2> 1354389 INFO  (jetty-closer-2032-thread-2) [    ] o.a.s.m.SolrMetricManager Closing metric reporters for registry=solr.jvm, tag=null
   [junit4]   2> 1354389 INFO  (jetty-closer-2032-thread-2) [    ] o.a.s.m.r.SolrJmxReporter Closing reporter [org.apache.solr.metrics.reporters.SolrJmxReporter@7243cace: rootName = solr_60630, domain = solr.jvm, service url = null, agent id = null] for registry solr.jvm / com.codahale.metrics.MetricRegistry@1971d86c
   [junit4]   2> 1354389 INFO  (jetty-closer-2032-thread-1) [    ] o.a.s.m.SolrMetricManager Closing metric reporters for registry=solr.jvm, tag=null
   [junit4]   2> 1354389 INFO  (jetty-closer-2032-thread-1) [    ] o.a.s.m.r.SolrJmxReporter Closing reporter [org.apache.solr.metrics.reporters.SolrJmxReporter@76bdc3a3: rootName = solr_45980, domain = solr.jvm, service url = null, agent id = null] for registry solr.jvm / com.codahale.metrics.MetricRegistry@1971d86c
   [junit4]   2> 1354394 INFO  (jetty-closer-2032-thread-1) [    ] o.a.s.m.SolrMetricManager Closing metric reporters for registry=solr.jetty, tag=null
   [junit4]   2> 1354394 INFO  (jetty-closer-2032-thread-2) [    ] o.a.s.m.SolrMetricManager Closing metric reporters for registry=solr.jetty, tag=null
   [junit4]   2> 1354394 INFO  (jetty-closer-2032-thread-1) [    ] o.a.s.m.r.SolrJmxReporter Closing reporter [org.apache.solr.metrics.reporters.SolrJmxReporter@3bf79da8: rootName = solr_45980, domain = solr.jetty, service url = null, agent id = null] for registry solr.jetty / com.codahale.metrics.MetricRegistry@1647dfc9
   [junit4]   2> 1354394 INFO  (jetty-closer-2032-thread-2) [    ] o.a.s.m.r.SolrJmxReporter Closing reporter [org.apache.solr.metrics.reporters.SolrJmxReporter@6413ac6d: rootName = solr_60630, domain = solr.jetty, service url = null, agent id = null] for registry solr.jetty / com.codahale.metrics.MetricRegistry@1647dfc9
   [junit4]   2> 1354396 INFO  (jetty-closer-2032-thread-2) [    ] o.a.s.c.ZkController Remove node as live in ZooKeeper:/live_nodes/127.0.0.1:60630_solr
   [junit4]   2> 1354396 INFO  (jetty-closer-2032-thread-1) [    ] o.a.s.c.ZkController Remove node as live in ZooKeeper:/live_nodes/127.0.0.1:45980_solr
   [junit4]   2> 1354397 INFO  (jetty-closer-2032-thread-2) [    ] o.a.s.m.SolrMetricManager Closing metric reporters for registry=solr.cluster, tag=null
   [junit4]   2> 1354397 INFO  (jetty-closer-2032-thread-1) [    ] o.a.s.m.SolrMetricManager Closing metric reporters for registry=solr.cluster, tag=null
   [junit4]   2> 1354397 INFO  (zkCallback-2047-thread-4-processing-n:127.0.0.1:60630_solr) [n:127.0.0.1:60630_solr    ] o.a.s.c.c.ZkStateReader Updated live nodes from ZooKeeper... (2) -> (0)
   [junit4]   2> 1354398 INFO  (jetty-closer-2032-thread-1) [    ] o.a.s.c.Overseer Overseer (id=99229131213701126-127.0.0.1:45980_solr-n_0000000000) closing
   [junit4]   2> 1354398 INFO  (OverseerStateUpdate-99229131213701126-127.0.0.1:45980_solr-n_0000000000) [n:127.0.0.1:45980_solr    ] o.a.s.c.Overseer Overseer Loop exiting : 127.0.0.1:45980_solr
   [junit4]   2> 1354398 INFO  (zkCallback-2049-thread-4-processing-n:127.0.0.1:45980_solr) [n:127.0.0.1:45980_solr    ] o.a.s.c.c.ZkStateReader Updated live nodes from ZooKeeper... (2) -> (0)
   [junit4]   2> 1354399 INFO  (coreCloseExecutor-3928-thread-1) [n:127.0.0.1:60630_solr c:forwardingCollection s:shard1 r:core_node2 x:forwardingCollection_shard1_replica_n1] o.a.s.c.SolrCore [forwardingCollection_shard1_replica_n1]  CLOSING SolrCore org.apache.solr.core.SolrCore@7ca9c882
   [junit4]   2> 1354399 INFO  (coreCloseExecutor-3928-thread-1) [n:127.0.0.1:60630_solr c:forwardingCollection s:shard1 r:core_node2 x:forwardingCollection_shard1_replica_n1] o.a.s.m.SolrMetricManager Closing metric reporters for registry=solr.core.forwardingCollection.shard1.replica_n1, tag=2091501698
   [junit4]   2> 1354399 INFO  (coreCloseExecutor-3928-thread-1) [n:127.0.0.1:60630_solr c:forwardingCollection s:shard1 r:core_node2 x:forwardingCollection_shard1_replica_n1] o.a.s.m.r.SolrJmxReporter Closing reporter [org.apache.solr.metrics.reporters.SolrJmxReporter@5135481c: rootName = solr_60630, domain = solr.core.forwardingCollection.shard1.replica_n1, service url = null, agent id = null] for registry solr.core.forwardingCollection.shard1.replica_n1 / com.codahale.metrics.MetricRegistry@f80592a
   [junit4]   2> 1354399 WARN  (OverseerAutoScalingTriggerThread-99229131213701126-127.0.0.1:45980_solr-n_0000000000) [n:127.0.0.1:45980_solr    ] o.a.s.c.a.OverseerTriggerThread OverseerTriggerThread woken up but we are closed, exiting.
   [junit4]   2> 1354404 INFO  (zkCallback-2047-thread-4-processing-n:127.0.0.1:60630_solr) [n:127.0.0.1:60630_solr    ] o.a.s.c.OverseerElectionContext I am going to be the leader 127.0.0.1:60630_solr
   [junit4]   2> 1354404 ERROR (Thread[Thread-2483,5,TGRP-TestSolrCloudWithSecureImpersonation]) [n:127.0.0.1:45980_solr    ] o.a.h.s.t.d.AbstractDelegationTokenSecretManager ExpiredTokenRemover received java.lang.InterruptedException: sleep interrupted
   [junit4]   2> 1354409 INFO  (jetty-closer-2032-thread-1) [    ] o.e.j.s.h.ContextHandler Stopped o.e.j.s.ServletContextHandler@36b26a5{/solr,null,UNAVAILABLE}
   [junit4]   2> 1354419 INFO  (coreCloseExecutor-3928-thread-1) [n:127.0.0.1:60630_solr c:forwardingCollection s:shard1 r:core_node2 x:forwardingCollection_shard1_replica_n1] o.a.s.m.SolrMetricManager Closing metric reporters for registry=solr.collection.forwardingCollection.shard1.leader, tag=2091501698
   [junit4]   2> 1354426 ERROR (Thread[Thread-2481,5,TGRP-TestSolrCloudWithSecureImpersonation]) [n:127.0.0.1:60630_solr    ] o.a.h.s.t.d.AbstractDelegationTokenSecretManager ExpiredTokenRemover received java.lang.InterruptedException: sleep interrupted
   [junit4]   2> 1354430 INFO  (jetty-closer-2032-thread-2) [    ] o.e.j.s.h.ContextHandler Stopped o.e.j.s.ServletContextHandler@4ead71de{/solr,null,UNAVAILABLE}
   [junit4]   2> 1354432 ERROR (SUITE-TestSolrCloudWithSecureImpersonation-seed#[F67057F252F1943C]-worker) [    ] o.a.z.s.ZooKeeperServer ZKShutdownHandler is not registered, so ZooKeeper server won't take any action on ERROR or SHUTDOWN server state changes
   [junit4]   2> 1354432 INFO  (SUITE-TestSolrCloudWithSecureImpersonation-seed#[F67057F252F1943C]-worker) [    ] o.a.s.c.ZkTestServer connecting to 127.0.0.1:64367 64367
   [junit4]   2> 1354998 INFO  (Thread-2464) [    ] o.a.s.c.ZkTestServer connecting to 127.0.0.1:64367 64367
   [junit4]   2> 1354999 WARN  (Thread-2464) [    ] o.a.s.c.ZkTestServer Watch limit violations: 
   [junit4]   2> Maximum concurrent create/delete watches above limit:
   [junit4]   2> 
   [junit4]   2> 	4	/solr/aliases.json
   [junit4]   2> 	4	/solr/clusterprops.json
   [junit4]   2> 	3	/solr/security.json
   [junit4]   2> 
   [junit4]   2> Maximum concurrent data watches above limit:
   [junit4]   2> 
   [junit4]   2> 	5	/solr/collections/forwardingCollection/state.json
   [junit4]   2> 	4	/solr/clusterstate.json
   [junit4]   2> 	3	/solr/security/zkdtsm/ZKDTSMRoot/ZKDTSMKeyIdRoot
   [junit4]   2> 	2	/solr/security/zkdtsm/ZKDTSMRoot/ZKDTSMMasterKeyRoot/DK_1
   [junit4]   2> 	2	/solr/overseer_elect/election/99229131213701126-127.0.0.1:45980_solr-n_0000000000
   [junit4]   2> 	2	/solr/security/zkdtsm/ZKDTSMRoot/ZKDTSMMasterKeyRoot/DK_3
   [junit4]   2> 	2	/solr/security/zkdtsm/ZKDTSMRoot/ZKDTSMMasterKeyRoot/DK_2
   [junit4]   2> 	2	/solr/security/zkdtsm/ZKDTSMRoot/ZKDTSMMasterKeyRoot/DK_4
   [junit4]   2> 	2	/solr/security/zkdtsm/ZKDTSMRoot/ZKDTSMSeqNumRoot
   [junit4]   2> 
   [junit4]   2> Maximum concurrent children watches above limit:
   [junit4]   2> 
   [junit4]   2> 	4	/solr/collections
   [junit4]   2> 	2	/solr/live_nodes
   [junit4]   2> 	2	/solr/security/zkdtsm/ZKDTSMRoot/ZKDTSMMasterKeyRoot
   [junit4]   2> 	2	/solr/security/zkdtsm/ZKDTSMRoot/ZKDTSMTokensRoot
   [junit4]   2> 
   [junit4]   2> 1355027 INFO  (SUITE-TestSolrCloudWithSecureImpersonation-seed#[F67057F252F1943C]-worker) [    ] o.a.s.SolrTestCaseJ4 ------------------------------------------------------- Done waiting for tracked resources to be released
   [junit4]   2> Dec 24, 2017 11:53:29 AM com.carrotsearch.randomizedtesting.ThreadLeakControl checkThreadLeaks
   [junit4]   2> WARNING: Will linger awaiting termination of 3 leaked thread(s).
   [junit4]   2> Dec 24, 2017 11:53:49 AM com.carrotsearch.randomizedtesting.ThreadLeakControl checkThreadLeaks
   [junit4]   2> SEVERE: 2 threads leaked from SUITE scope at org.apache.solr.cloud.TestSolrCloudWithSecureImpersonation: 
   [junit4]   2>    1) Thread[id=9759, name=jetty-launcher-2031-thread-1-EventThread, state=TIMED_WAITING, group=TGRP-TestSolrCloudWithSecureImpersonation]
   [junit4]   2>         at sun.misc.Unsafe.park(Native Method)
   [junit4]   2>         at java.util.concurrent.locks.LockSupport.parkNanos(LockSupport.java:215)
   [junit4]   2>         at java.util.concurrent.locks.AbstractQueuedSynchronizer.doAcquireSharedNanos(AbstractQueuedSynchronizer.java:1037)
   [junit4]   2>         at java.util.concurrent.locks.AbstractQueuedSynchronizer.tryAcquireSharedNanos(AbstractQueuedSynchronizer.java:1328)
   [junit4]   2>         at java.util.concurrent.CountDownLatch.await(CountDownLatch.java:277)
   [junit4]   2>         at org.apache.curator.CuratorZookeeperClient.internalBlockUntilConnectedOrTimedOut(CuratorZookeeperClient.java:323)
   [junit4]   2>         at org.apache.curator.RetryLoop.callWithRetry(RetryLoop.java:105)
   [junit4]   2>         at org.apache.curator.framework.imps.GetDataBuilderImpl.pathInForeground(GetDataBuilderImpl.java:288)
   [junit4]   2>         at org.apache.curator.framework.imps.GetDataBuilderImpl.forPath(GetDataBuilderImpl.java:279)
   [junit4]   2>         at org.apache.curator.framework.imps.GetDataBuilderImpl.forPath(GetDataBuilderImpl.java:41)
   [junit4]   2>         at org.apache.curator.framework.recipes.shared.SharedValue.readValue(SharedValue.java:244)
   [junit4]   2>         at org.apache.curator.framework.recipes.shared.SharedValue.access$100(SharedValue.java:44)
   [junit4]   2>         at org.apache.curator.framework.recipes.shared.SharedValue$1.process(SharedValue.java:61)
   [junit4]   2>         at org.apache.curator.framework.imps.NamespaceWatcher.process(NamespaceWatcher.java:67)
   [junit4]   2>         at org.apache.zookeeper.ClientCnxn$EventThread.processEvent(ClientCnxn.java:530)
   [junit4]   2>         at org.apache.zookeeper.ClientCnxn$EventThread.run(ClientCnxn.java:505)
   [junit4]   2>    2) Thread[id=9762, name=jetty-launcher-2031-thread-2-EventThread, state=TIMED_WAITING, group=TGRP-TestSolrCloudWithSecureImpersonation]
   [junit4]   2>         at sun.misc.Unsafe.park(Native Method)
   [junit4]   2>         at java.util.concurrent.locks.LockSupport.parkNanos(LockSupport.java:215)
   [junit4]   2>         at java.util.concurrent.locks.AbstractQueuedSynchronizer.doAcquireSharedNanos(AbstractQueuedSynchronizer.java:1037)
   [junit4]   2>         at java.util.concurrent.locks.AbstractQueuedSynchronizer.tryAcquireSharedNanos(AbstractQueuedSynchronizer.java:1328)
   [junit4]   2>         at java.util.concurrent.CountDownLatch.await(CountDownLatch.java:277)
   [junit4]   2>         at org.apache.curator.CuratorZookeeperClient.internalBlockUntilConnectedOrTimedOut(CuratorZookeeperClient.java:323)
   [junit4]   2>         at org.apache.curator.RetryLoop.callWithRetry(RetryLoop.java:105)
   [junit4]   2>         at org.apache.curator.framework.imps.GetDataBuilderImpl.pathInForeground(GetDataBuilderImpl.java:288)
   [junit4]   2>         at org.apache.curator.framework.imps.GetDataBuilderImpl.forPath(GetDataBuilderImpl.java:279)
   [junit4]   2>         at org.apache.curator.framework.imps.GetDataBuilderImpl.forPath(GetDataBuilderImpl.java:41)
   [junit4]   2>         at org.apache.curator.framework.recipes.shared.SharedValue.readValue(SharedValue.java:244)
   [junit4]   2>         at org.apache.curator.framework.recipes.shared.SharedValue.access$100(SharedValue.java:44)
   [junit4]   2>         at org.apache.curator.framework.recipes.shared.SharedValue$1.process(SharedValue.java:61)
   [junit4]   2>         at org.apache.curator.framework.imps.NamespaceWatcher.process(NamespaceWatcher.java:67)
   [junit4]   2>         at org.apache.zookeeper.ClientCnxn$EventThread.processEvent(ClientCnxn.java:530)
   [junit4]   2>         at org.apache.zookeeper.ClientCnxn$EventThread.run(ClientCnxn.java:505)
   [junit4]   2> Dec 24, 2017 11:53:49 AM com.carrotsearch.randomizedtesting.ThreadLeakControl tryToInterruptAll
   [junit4]   2> INFO: Starting to interrupt leaked threads:
   [junit4]   2>    1) Thread[id=9759, name=jetty-launcher-2031-thread-1-EventThread, state=TIMED_WAITING, group=TGRP-TestSolrCloudWithSecureImpersonation]
   [junit4]   2>    2) Thread[id=9762, name=jetty-launcher-2031-thread-2-EventThread, state=TIMED_WAITING, group=TGRP-TestSolrCloudWithSecureImpersonation]
   [junit4]   2> 1375128 ERROR (jetty-launcher-2031-thread-2-EventThread) [n:127.0.0.1:45980_solr    ] o.a.c.f.i.CuratorFrameworkImpl Watcher exception
   [junit4]   2> java.lang.InterruptedException
   [junit4]   2> 	at java.util.concurrent.locks.AbstractQueuedSynchronizer.doAcquireSharedNanos(AbstractQueuedSynchronizer.java:1039)
   [junit4]   2> 	at java.util.concurrent.locks.AbstractQueuedSynchronizer.tryAcquireSharedNanos(AbstractQueuedSynchronizer.java:1328)
   [junit4]   2> 	at java.util.concurrent.CountDownLatch.await(CountDownLatch.java:277)
   [junit4]   2> 	at org.apache.curator.CuratorZookeeperClient.internalBlockUntilConnectedOrTimedOut(CuratorZookeeperClient.java:323)
   [junit4]   2> 	at org.apache.curator.RetryLoop.callWithRetry(RetryLoop.java:105)
   [junit4]   2> 	at org.apache.curator.framework.imps.GetDataBuilderImpl.pathInForeground(GetDataBuilderImpl.java:288)
   [junit4]   2> 	at org.apache.curator.frame

[...truncated too long message...]

Method)
   [junit4]   2> 	at sun.nio.ch.SocketChannelImpl.finishConnect(SocketChannelImpl.java:717)
   [junit4]   2> 	at org.apache.zookeeper.ClientCnxnSocketNIO.doTransport(ClientCnxnSocketNIO.java:361)
   [junit4]   2> 	at org.apache.zookeeper.ClientCnxn$SendThread.run(ClientCnxn.java:1141)
   [junit4]   2> 3117812 INFO  (Thread-6113) [    ] o.a.s.c.ZkTestServer connecting to 127.0.0.1:63705 63705
   [junit4]   2> 3117811 WARN  (jetty-launcher-2031-thread-1-SendThread(127.0.0.1:64367)) [n:127.0.0.1:60630_solr    ] o.a.z.ClientCnxn Session 0x0 for server null, unexpected error, closing socket connection and attempting reconnect
   [junit4]   2> java.net.ConnectException: Connection refused
   [junit4]   2> 	at sun.nio.ch.SocketChannelImpl.checkConnect(Native Method)
   [junit4]   2> 	at sun.nio.ch.SocketChannelImpl.finishConnect(SocketChannelImpl.java:717)
   [junit4]   2> 	at org.apache.zookeeper.ClientCnxnSocketNIO.doTransport(ClientCnxnSocketNIO.java:361)
   [junit4]   2> 	at org.apache.zookeeper.ClientCnxn$SendThread.run(ClientCnxn.java:1141)
   [junit4]   2> 3117813 WARN  (Thread-6113) [    ] o.a.s.c.ZkTestServer Watch limit violations: 
   [junit4]   2> Maximum concurrent create/delete watches above limit:
   [junit4]   2> 
   [junit4]   2> 	6	/solr/configs/conf1/managed-schema
   [junit4]   2> 	4	/solr/configs/conf1
   [junit4]   2> 	3	/solr/aliases.json
   [junit4]   2> 	2	/solr/security.json
   [junit4]   2> 
   [junit4]   2> Maximum concurrent data watches above limit:
   [junit4]   2> 
   [junit4]   2> 	14	/solr/collections/dv_coll/state.json
   [junit4]   2> 	3	/solr/clusterstate.json
   [junit4]   2> 	3	/solr/clusterprops.json
   [junit4]   2> 	2	/solr/configs/conf1/managed-schema
   [junit4]   2> 
   [junit4]   2> Maximum concurrent children watches above limit:
   [junit4]   2> 
   [junit4]   2> 	3	/solr/live_nodes
   [junit4]   2> 	3	/solr/collections
   [junit4]   2> 
   [junit4]   2> NOTE: leaving temporary files on disk at: /export/home/jenkins/workspace/Lucene-Solr-7.x-Solaris/solr/build/solr-core/test/J0/temp/solr.cloud.DocValuesNotIndexedTest_F67057F252F1943C-001
   [junit4]   2> NOTE: test params are: codec=CheapBastard, sim=RandomSimilarity(queryNorm=true): {}, locale=es-EC, timezone=Africa/Cairo
   [junit4]   2> NOTE: SunOS 5.11 amd64/Oracle Corporation 1.8.0_152 (64-bit)/cpus=3,threads=1,free=210962664,total=536870912
   [junit4]   2> NOTE: All tests run in this JVM: [ResourceLoaderTest, TestConfigSetImmutable, LeaderFailureAfterFreshStartTest, ZkCLITest, NodeMutatorTest, HttpTriggerListenerTest, TestExactSharedStatsCache, TestDFRSimilarityFactory, SolrIndexMetricsTest, TestBinaryField, OverseerModifyCollectionTest, HdfsRecoverLeaseTest, TestFieldCacheWithThreads, HdfsBasicDistributedZk2Test, ZkControllerTest, JavabinLoaderTest, CollectionsAPISolrJTest, TestBulkSchemaAPI, ChaosMonkeyNothingIsSafeTest, TestHdfsCloudBackupRestore, TestAuthorizationFramework, TestJoin, UninvertDocValuesMergePolicyTest, TestLMDirichletSimilarityFactory, TestFilteredDocIdSet, ZkStateReaderTest, TestRequestStatusCollectionAPI, TestFiltering, NumberUtilsTest, TestDefaultStatsCache, TestLegacyTerms, TestBinaryResponseWriter, DistributedFacetPivotWhiteBoxTest, SolrCoreMetricManagerTest, TestReplicaProperties, UtilsToolTest, IgnoreCommitOptimizeUpdateProcessorFactoryTest, RecoveryZkTest, DirectUpdateHandlerOptimizeTest, TestSolrCoreProperties, XsltUpdateRequestHandlerTest, TestBulkSchemaConcurrent, TestFieldCacheSortRandom, HighlighterTest, SolrShardReporterTest, TestSearcherReuse, TestMissingGroups, DeleteShardTest, FacetPivotSmallTest, TestCoreAdminApis, SolrXmlInZkTest, TimeZoneUtilsTest, TestHighFrequencyDictionaryFactory, BlockJoinFacetDistribTest, AsyncCallRequestStatusResponseTest, TestTlogReplica, HdfsThreadLeakTest, SpatialHeatmapFacetsTest, OverseerTest, TestDynamicFieldCollectionResource, CollectionReloadTest, TestMacroExpander, SuggesterTest, TestSolrCloudWithDelegationTokens, CSVRequestHandlerTest, FastVectorHighlighterTest, HighlighterConfigTest, TestSizeLimitedDistributedMap, TestLocalFSCloudBackupRestore, TestQueryWrapperFilter, HdfsCollectionsAPIDistributedZkTest, HttpSolrCallGetCoreTest, DirectUpdateHandlerTest, TestNoOpRegenerator, SolrCmdDistributorTest, TestEmbeddedSolrServerSchemaAPI, TestTriggerIntegration, RAMDirectoryFactoryTest, TestUtils, TestUnifiedSolrHighlighter, OverriddenZkACLAndCredentialsProvidersTest, CreateCollectionCleanupTest, MetricsHandlerTest, TestFieldCacheReopen, TestSchemaSimilarityResource, TestSortByMinMaxFunction, UpdateLogTest, URLClassifyProcessorTest, DirectSolrConnectionTest, TestStressInPlaceUpdates, TestIntervalFaceting, TestTolerantUpdateProcessorRandomCloud, TestConfigSets, DefaultValueUpdateProcessorTest, TestEmbeddedSolrServerAdminHandler, ConfigureRecoveryStrategyTest, TestPHPSerializedResponseWriter, TestSolrCloudWithSecureImpersonation, TestPrepRecovery, ManagedSchemaRoundRobinCloudTest, ImplicitSnitchTest, JvmMetricsTest, SolrMetricReporterTest, TestHalfAndHalfDocValues, SolrInfoBeanTest, BinaryUpdateRequestHandlerTest, TestJsonFacetRefinement, TestLegacyNumericRangeQueryBuilder, WordBreakSolrSpellCheckerTest, TestRangeQuery, LeaderElectionTest, TestCloudDeleteByQuery, TestQuerySenderListener, ShardRoutingTest, IndexBasedSpellCheckerTest, AtomicUpdatesTest, TestRawTransformer, TestCustomSort, MetricUtilsTest, TestDistribStateManager, HdfsChaosMonkeyNothingIsSafeTest, SubstringBytesRefFilterTest, SpellCheckCollatorTest, TestNodeAddedTrigger, SolrRequestParserTest, TemplateUpdateProcessorTest, TestHighlightDedupGrouping, CdcrBidirectionalTest, TestJmxIntegration, ExecutePlanActionTest, TestUseDocValuesAsStored2, BasicDistributedZkTest, TestSolrCoreSnapshots, TestIndexingPerformance, AutoScalingHandlerTest, SearchRateTriggerTest, TestSegmentSorting, TestSimpleTextCodec, DistribJoinFromCollectionTest, TestSolrCLIRunExample, TestSQLHandler, DistributedSpellCheckComponentTest, SimpleMLTQParserTest, TestFieldTypeCollectionResource, TestSweetSpotSimilarityFactory, TestCSVResponseWriter, TestCursorMarkWithoutUniqueKey, DistributedVersionInfoTest, OutputWriterTest, LargeFieldTest, TestExpandComponent, TestCodecSupport, AddReplicaTest, TestRandomRequestDistribution, TestDeleteCollectionOnDownNodes, ConvertedLegacyTest, TestInPlaceUpdatesDistrib, FullHLLTest, RequiredFieldsTest, AddSchemaFieldsUpdateProcessorFactoryTest, BigEndianAscendingWordDeserializerTest, ConnectionReuseTest, DistribCursorPagingTest, TestHashQParserPlugin, DeleteInactiveReplicaTest, TestUpdate, TestCoreDiscovery, TestSolrDeletionPolicy2, HdfsDirectoryTest, PeerSyncReplicationTest, SearchHandlerTest, RemoteQueryErrorTest, TestSolr4Spatial, SharedFSAutoReplicaFailoverTest, TestRandomDVFaceting, HdfsUnloadDistributedZkTest, ScriptEngineTest, SyncSliceTest, SpellCheckComponentTest, TestSolrCloudWithHadoopAuthPlugin, TestLRUStatsCache, TestSolrConfigHandlerCloud, AnalysisErrorHandlingTest, TestFileDictionaryLookup, ChaosMonkeySafeLeaderTest, UnloadDistributedZkTest, FullSolrCloudDistribCmdsTest, TestReplicationHandler, ClusterStateUpdateTest, ShardRoutingCustomTest, TestDistributedSearch, TestDistributedGrouping, TestRecovery, TermVectorComponentDistributedTest, TestRealTimeGet, TestStressReorder, TestReload, TestStressVersions, DistributedTermsComponentTest, StatsComponentTest, QueryElevationComponentTest, BadIndexSchemaTest, TestFunctionQuery, BasicFunctionalityTest, TestLazyCores, TestBadConfig, ShowFileRequestHandlerTest, DistributedQueryElevationComponentTest, SolrIndexSplitterTest, SimplePostToolTest, SignatureUpdateProcessorFactoryTest, SuggesterFSTTest, CoreAdminHandlerTest, DocValuesTest, SuggesterTSTTest, TestStressLucene, SpatialFilterTest, SuggesterWFSTTest, PolyFieldTest, NoCacheHeaderTest, SolrCoreCheckLockOnStartupTest, TestPseudoReturnFields, TestAtomicUpdateErrorCases, TestWordDelimiterFilterFactory, SortByFunctionTest, TestRemoteStreaming, DocValuesMultiTest, DistanceFunctionTest, TestSolrDeletionPolicy1, DebugComponentTest, TestSurroundQueryParser, LukeRequestHandlerTest, DisMaxRequestHandlerTest, TestQueryUtils, TestWriterPerf, DirectSolrSpellCheckerTest, TestReversedWildcardFilterFactory, DocumentAnalysisRequestHandlerTest, PrimitiveFieldTypeTest, TestOmitPositions, FileBasedSpellCheckerTest, TermsComponentTest, XmlUpdateRequestHandlerTest, RequestHandlersTest, PathHierarchyTokenizerFactoryTest, FieldAnalysisRequestHandlerTest, TestSolrQueryParser, LoggingHandlerTest, RegexBoostProcessorTest, IndexSchemaTest, TestCollationField, ReturnFieldsTest, QueryParsingTest, TestAnalyzedSuggestions, UniqFieldsUpdateProcessorFactoryTest, JsonLoaderTest, TestComponentsName, TestLFUCache, AlternateDirectoryTest, TestQuerySenderNoQuery, CopyFieldTest, ResponseLogComponentTest, SolrIndexConfigTest, BadComponentTest, TestStressRecovery, MultiTermTest, TestDocSet, TestSearchPerf, NumericFieldsTest, MinimalSchemaTest, TestElisionMultitermQuery, TestFuzzyAnalyzedSuggestions, ExternalFileFieldSortTest, NotRequiredUniqueKeyTest, TestLuceneMatchVersion, TestPhraseSuggestions, SpellPossibilityIteratorTest, TestCharFilters, TestXIncludeConfig, EchoParamsTest, TestIBSimilarityFactory, TestFastWriter, TestFastOutputStream, OpenExchangeRatesOrgProviderTest, PluginInfoTest, DateMathParserTest, PreAnalyzedFieldTest, PrimUtilsTest, DateFieldTest, SpellingQueryConverterTest, DOMUtilTest, ClusterStateTest, TestSolrJ, TestDocumentBuilder, ZkNodePropsTest, SliceStateTest, SystemInfoHandlerTest, UUIDFieldTest, FileUtilsTest, CircularListTest, TestRTGBase, CursorPagingTest, DistributedIntervalFacetingTest, SolrTestCaseJ4Test, TestTolerantSearch, AliasIntegrationTest, ChaosMonkeyNothingIsSafeWithPullReplicasTest, CloudExitableDirectoryReaderTest, CollectionTooManyReplicasTest, ConcurrentDeleteAndCreateCollectionTest, ConfigSetsAPITest, DeleteLastCustomShardedReplicaTest, DocValuesNotIndexedTest]
   [junit4] Completed [520/764 (2!)] on J0 in 10.76s, 4 tests, 1 failure <<< FAILURES!

[...truncated 49021 lines...]

Mime
View raw message