lucene-dev mailing list archives

Site index · List index
Message view « Date » · « Thread »
Top « Date » · « Thread »
From Policeman Jenkins Server <jenk...@thetaphi.de>
Subject [JENKINS-EA] Lucene-Solr-7.x-Linux (64bit/jdk-10-ea+32) - Build # 1031 - Still Unstable!
Date Fri, 22 Dec 2017 20:11:55 GMT
Build: https://jenkins.thetaphi.de/job/Lucene-Solr-7.x-Linux/1031/
Java: 64bit/jdk-10-ea+32 -XX:-UseCompressedOops -XX:+UseG1GC

1 tests failed.
FAILED:  org.apache.lucene.spatial3d.geom.GeoExactCircleTest.RandomPointBearingCardinalTest
{seed=[F75285B66CDA72BF:80B5BB936828052C]}

Error Message:
PlanetModel(ab=1.678384032861434 c=1.030134078698738) 0.003170895832137699 2.8236424896643357

Stack Trace:
java.lang.AssertionError: PlanetModel(ab=1.678384032861434 c=1.030134078698738) 0.003170895832137699
2.8236424896643357
	at __randomizedtesting.SeedInfo.seed([F75285B66CDA72BF:80B5BB936828052C]:0)
	at org.junit.Assert.fail(Assert.java:93)
	at org.junit.Assert.assertTrue(Assert.java:43)
	at org.apache.lucene.spatial3d.geom.GeoExactCircleTest.checkBearingPoint(GeoExactCircleTest.java:117)
	at org.apache.lucene.spatial3d.geom.GeoExactCircleTest.RandomPointBearingCardinalTest(GeoExactCircleTest.java:109)
	at jdk.internal.reflect.GeneratedMethodAccessor5.invoke(Unknown Source)
	at java.base/jdk.internal.reflect.DelegatingMethodAccessorImpl.invoke(DelegatingMethodAccessorImpl.java:43)
	at java.base/java.lang.reflect.Method.invoke(Method.java:564)
	at com.carrotsearch.randomizedtesting.RandomizedRunner.invoke(RandomizedRunner.java:1737)
	at com.carrotsearch.randomizedtesting.RandomizedRunner$8.evaluate(RandomizedRunner.java:934)
	at com.carrotsearch.randomizedtesting.RandomizedRunner$9.evaluate(RandomizedRunner.java:970)
	at com.carrotsearch.randomizedtesting.RandomizedRunner$10.evaluate(RandomizedRunner.java:984)
	at org.apache.lucene.util.TestRuleSetupTeardownChained$1.evaluate(TestRuleSetupTeardownChained.java:49)
	at org.apache.lucene.util.AbstractBeforeAfterRule$1.evaluate(AbstractBeforeAfterRule.java:45)
	at org.apache.lucene.util.TestRuleThreadAndTestName$1.evaluate(TestRuleThreadAndTestName.java:48)
	at org.apache.lucene.util.TestRuleIgnoreAfterMaxFailures$1.evaluate(TestRuleIgnoreAfterMaxFailures.java:64)
	at org.apache.lucene.util.TestRuleMarkFailure$1.evaluate(TestRuleMarkFailure.java:47)
	at com.carrotsearch.randomizedtesting.rules.StatementAdapter.evaluate(StatementAdapter.java:36)
	at com.carrotsearch.randomizedtesting.ThreadLeakControl$StatementRunner.run(ThreadLeakControl.java:368)
	at com.carrotsearch.randomizedtesting.ThreadLeakControl.forkTimeoutingTask(ThreadLeakControl.java:817)
	at com.carrotsearch.randomizedtesting.ThreadLeakControl$3.evaluate(ThreadLeakControl.java:468)
	at com.carrotsearch.randomizedtesting.RandomizedRunner.runSingleTest(RandomizedRunner.java:943)
	at com.carrotsearch.randomizedtesting.RandomizedRunner$5.evaluate(RandomizedRunner.java:829)
	at com.carrotsearch.randomizedtesting.RandomizedRunner$6.evaluate(RandomizedRunner.java:879)
	at com.carrotsearch.randomizedtesting.RandomizedRunner$7.evaluate(RandomizedRunner.java:890)
	at org.apache.lucene.util.AbstractBeforeAfterRule$1.evaluate(AbstractBeforeAfterRule.java:45)
	at com.carrotsearch.randomizedtesting.rules.StatementAdapter.evaluate(StatementAdapter.java:36)
	at org.apache.lucene.util.TestRuleStoreClassName$1.evaluate(TestRuleStoreClassName.java:41)
	at com.carrotsearch.randomizedtesting.rules.NoShadowingOrOverridesOnMethodsRule$1.evaluate(NoShadowingOrOverridesOnMethodsRule.java:40)
	at com.carrotsearch.randomizedtesting.rules.NoShadowingOrOverridesOnMethodsRule$1.evaluate(NoShadowingOrOverridesOnMethodsRule.java:40)
	at com.carrotsearch.randomizedtesting.rules.StatementAdapter.evaluate(StatementAdapter.java:36)
	at com.carrotsearch.randomizedtesting.rules.StatementAdapter.evaluate(StatementAdapter.java:36)
	at org.apache.lucene.util.TestRuleAssertionsRequired$1.evaluate(TestRuleAssertionsRequired.java:53)
	at org.apache.lucene.util.TestRuleMarkFailure$1.evaluate(TestRuleMarkFailure.java:47)
	at org.apache.lucene.util.TestRuleIgnoreAfterMaxFailures$1.evaluate(TestRuleIgnoreAfterMaxFailures.java:64)
	at org.apache.lucene.util.TestRuleIgnoreTestSuites$1.evaluate(TestRuleIgnoreTestSuites.java:54)
	at com.carrotsearch.randomizedtesting.rules.StatementAdapter.evaluate(StatementAdapter.java:36)
	at com.carrotsearch.randomizedtesting.ThreadLeakControl$StatementRunner.run(ThreadLeakControl.java:368)
	at java.base/java.lang.Thread.run(Thread.java:844)




Build Log:
[...truncated 9810 lines...]
   [junit4] Suite: org.apache.lucene.spatial3d.geom.GeoExactCircleTest
   [junit4]   2> NOTE: reproduce with: ant test  -Dtestcase=GeoExactCircleTest -Dtests.method=RandomPointBearingCardinalTest
-Dtests.seed=F75285B66CDA72BF -Dtests.multiplier=3 -Dtests.slow=true -Dtests.locale=en-FM
-Dtests.timezone=Asia/Kabul -Dtests.asserts=true -Dtests.file.encoding=UTF-8
   [junit4] FAILURE 0.02s J1 | GeoExactCircleTest.RandomPointBearingCardinalTest {seed=[F75285B66CDA72BF:80B5BB936828052C]}
<<<
   [junit4]    > Throwable #1: java.lang.AssertionError: PlanetModel(ab=1.678384032861434
c=1.030134078698738) 0.003170895832137699 2.8236424896643357
   [junit4]    > 	at __randomizedtesting.SeedInfo.seed([F75285B66CDA72BF:80B5BB936828052C]:0)
   [junit4]    > 	at org.apache.lucene.spatial3d.geom.GeoExactCircleTest.checkBearingPoint(GeoExactCircleTest.java:117)
   [junit4]    > 	at org.apache.lucene.spatial3d.geom.GeoExactCircleTest.RandomPointBearingCardinalTest(GeoExactCircleTest.java:109)
   [junit4]    > 	at jdk.internal.reflect.GeneratedMethodAccessor5.invoke(Unknown Source)
   [junit4]    > 	at java.base/jdk.internal.reflect.DelegatingMethodAccessorImpl.invoke(DelegatingMethodAccessorImpl.java:43)
   [junit4]    > 	at java.base/java.lang.reflect.Method.invoke(Method.java:564)
   [junit4]    > 	at java.base/java.lang.Thread.run(Thread.java:844)
   [junit4]   2> NOTE: test params are: codec=Asserting(Lucene70): {}, docValues:{}, maxPointsInLeafNode=616,
maxMBSortInHeap=5.21691097814706, sim=RandomSimilarity(queryNorm=false): {}, locale=en-FM,
timezone=Asia/Kabul
   [junit4]   2> NOTE: Linux 4.10.0-40-generic amd64/Oracle Corporation 10-ea (64-bit)/cpus=8,threads=1,free=399328256,total=536870912
   [junit4]   2> NOTE: All tests run in this JVM: [GeoCircleTest, GeoExactCircleTest]
   [junit4] Completed [12/16 (1!)] on J1 in 1.01s, 311 tests, 1 failure <<< FAILURES!

[...truncated 45323 lines...]

Mime
View raw message