lucene-dev mailing list archives

Site index · List index
Message view « Date » · « Thread »
Top « Date » · « Thread »
From Policeman Jenkins Server <jenk...@thetaphi.de>
Subject [JENKINS] Lucene-Solr-7.x-Linux (32bit/jdk1.8.0_144) - Build # 1021 - Still Unstable!
Date Wed, 20 Dec 2017 20:01:15 GMT
Build: https://jenkins.thetaphi.de/job/Lucene-Solr-7.x-Linux/1021/
Java: 32bit/jdk1.8.0_144 -server -XX:+UseConcMarkSweepGC

4 tests failed.
FAILED:  junit.framework.TestSuite.org.apache.solr.core.TestLazyCores

Error Message:
1 thread leaked from SUITE scope at org.apache.solr.core.TestLazyCores:     1) Thread[id=17295, name=searcherExecutor-5861-thread-1, state=WAITING, group=TGRP-TestLazyCores]         at sun.misc.Unsafe.park(Native Method)         at java.util.concurrent.locks.LockSupport.park(LockSupport.java:175)         at java.util.concurrent.locks.AbstractQueuedSynchronizer$ConditionObject.await(AbstractQueuedSynchronizer.java:2039)         at java.util.concurrent.LinkedBlockingQueue.take(LinkedBlockingQueue.java:442)         at java.util.concurrent.ThreadPoolExecutor.getTask(ThreadPoolExecutor.java:1074)         at java.util.concurrent.ThreadPoolExecutor.runWorker(ThreadPoolExecutor.java:1134)         at java.util.concurrent.ThreadPoolExecutor$Worker.run(ThreadPoolExecutor.java:624)         at java.lang.Thread.run(Thread.java:748)

Stack Trace:
com.carrotsearch.randomizedtesting.ThreadLeakError: 1 thread leaked from SUITE scope at org.apache.solr.core.TestLazyCores: 
   1) Thread[id=17295, name=searcherExecutor-5861-thread-1, state=WAITING, group=TGRP-TestLazyCores]
        at sun.misc.Unsafe.park(Native Method)
        at java.util.concurrent.locks.LockSupport.park(LockSupport.java:175)
        at java.util.concurrent.locks.AbstractQueuedSynchronizer$ConditionObject.await(AbstractQueuedSynchronizer.java:2039)
        at java.util.concurrent.LinkedBlockingQueue.take(LinkedBlockingQueue.java:442)
        at java.util.concurrent.ThreadPoolExecutor.getTask(ThreadPoolExecutor.java:1074)
        at java.util.concurrent.ThreadPoolExecutor.runWorker(ThreadPoolExecutor.java:1134)
        at java.util.concurrent.ThreadPoolExecutor$Worker.run(ThreadPoolExecutor.java:624)
        at java.lang.Thread.run(Thread.java:748)
	at __randomizedtesting.SeedInfo.seed([5A8DADF59CCD5288]:0)


FAILED:  junit.framework.TestSuite.org.apache.solr.core.TestLazyCores

Error Message:
There are still zombie threads that couldn't be terminated:    1) Thread[id=17295, name=searcherExecutor-5861-thread-1, state=WAITING, group=TGRP-TestLazyCores]         at sun.misc.Unsafe.park(Native Method)         at java.util.concurrent.locks.LockSupport.park(LockSupport.java:175)         at java.util.concurrent.locks.AbstractQueuedSynchronizer$ConditionObject.await(AbstractQueuedSynchronizer.java:2039)         at java.util.concurrent.LinkedBlockingQueue.take(LinkedBlockingQueue.java:442)         at java.util.concurrent.ThreadPoolExecutor.getTask(ThreadPoolExecutor.java:1074)         at java.util.concurrent.ThreadPoolExecutor.runWorker(ThreadPoolExecutor.java:1134)         at java.util.concurrent.ThreadPoolExecutor$Worker.run(ThreadPoolExecutor.java:624)         at java.lang.Thread.run(Thread.java:748)

Stack Trace:
com.carrotsearch.randomizedtesting.ThreadLeakError: There are still zombie threads that couldn't be terminated:
   1) Thread[id=17295, name=searcherExecutor-5861-thread-1, state=WAITING, group=TGRP-TestLazyCores]
        at sun.misc.Unsafe.park(Native Method)
        at java.util.concurrent.locks.LockSupport.park(LockSupport.java:175)
        at java.util.concurrent.locks.AbstractQueuedSynchronizer$ConditionObject.await(AbstractQueuedSynchronizer.java:2039)
        at java.util.concurrent.LinkedBlockingQueue.take(LinkedBlockingQueue.java:442)
        at java.util.concurrent.ThreadPoolExecutor.getTask(ThreadPoolExecutor.java:1074)
        at java.util.concurrent.ThreadPoolExecutor.runWorker(ThreadPoolExecutor.java:1134)
        at java.util.concurrent.ThreadPoolExecutor$Worker.run(ThreadPoolExecutor.java:624)
        at java.lang.Thread.run(Thread.java:748)
	at __randomizedtesting.SeedInfo.seed([5A8DADF59CCD5288]:0)


FAILED:  org.apache.solr.cloud.autoscaling.sim.TestDistribStateManager.testGetSetRemoveData

Error Message:
Node watch should have fired!

Stack Trace:
java.lang.AssertionError: Node watch should have fired!
	at __randomizedtesting.SeedInfo.seed([5A8DADF59CCD5288:7C1D42A7C8439482]:0)
	at org.junit.Assert.fail(Assert.java:93)
	at org.apache.solr.cloud.autoscaling.sim.TestDistribStateManager.testGetSetRemoveData(TestDistribStateManager.java:256)
	at sun.reflect.NativeMethodAccessorImpl.invoke0(Native Method)
	at sun.reflect.NativeMethodAccessorImpl.invoke(NativeMethodAccessorImpl.java:62)
	at sun.reflect.DelegatingMethodAccessorImpl.invoke(DelegatingMethodAccessorImpl.java:43)
	at java.lang.reflect.Method.invoke(Method.java:498)
	at com.carrotsearch.randomizedtesting.RandomizedRunner.invoke(RandomizedRunner.java:1737)
	at com.carrotsearch.randomizedtesting.RandomizedRunner$8.evaluate(RandomizedRunner.java:934)
	at com.carrotsearch.randomizedtesting.RandomizedRunner$9.evaluate(RandomizedRunner.java:970)
	at com.carrotsearch.randomizedtesting.RandomizedRunner$10.evaluate(RandomizedRunner.java:984)
	at com.carrotsearch.randomizedtesting.rules.SystemPropertiesRestoreRule$1.evaluate(SystemPropertiesRestoreRule.java:57)
	at org.apache.lucene.util.TestRuleSetupTeardownChained$1.evaluate(TestRuleSetupTeardownChained.java:49)
	at org.apache.lucene.util.AbstractBeforeAfterRule$1.evaluate(AbstractBeforeAfterRule.java:45)
	at org.apache.lucene.util.TestRuleThreadAndTestName$1.evaluate(TestRuleThreadAndTestName.java:48)
	at org.apache.lucene.util.TestRuleIgnoreAfterMaxFailures$1.evaluate(TestRuleIgnoreAfterMaxFailures.java:64)
	at org.apache.lucene.util.TestRuleMarkFailure$1.evaluate(TestRuleMarkFailure.java:47)
	at com.carrotsearch.randomizedtesting.rules.StatementAdapter.evaluate(StatementAdapter.java:36)
	at com.carrotsearch.randomizedtesting.ThreadLeakControl$StatementRunner.run(ThreadLeakControl.java:368)
	at com.carrotsearch.randomizedtesting.ThreadLeakControl.forkTimeoutingTask(ThreadLeakControl.java:817)
	at com.carrotsearch.randomizedtesting.ThreadLeakControl$3.evaluate(ThreadLeakControl.java:468)
	at com.carrotsearch.randomizedtesting.RandomizedRunner.runSingleTest(RandomizedRunner.java:943)
	at com.carrotsearch.randomizedtesting.RandomizedRunner$5.evaluate(RandomizedRunner.java:829)
	at com.carrotsearch.randomizedtesting.RandomizedRunner$6.evaluate(RandomizedRunner.java:879)
	at com.carrotsearch.randomizedtesting.RandomizedRunner$7.evaluate(RandomizedRunner.java:890)
	at com.carrotsearch.randomizedtesting.rules.StatementAdapter.evaluate(StatementAdapter.java:36)
	at com.carrotsearch.randomizedtesting.rules.SystemPropertiesRestoreRule$1.evaluate(SystemPropertiesRestoreRule.java:57)
	at org.apache.lucene.util.AbstractBeforeAfterRule$1.evaluate(AbstractBeforeAfterRule.java:45)
	at com.carrotsearch.randomizedtesting.rules.StatementAdapter.evaluate(StatementAdapter.java:36)
	at org.apache.lucene.util.TestRuleStoreClassName$1.evaluate(TestRuleStoreClassName.java:41)
	at com.carrotsearch.randomizedtesting.rules.NoShadowingOrOverridesOnMethodsRule$1.evaluate(NoShadowingOrOverridesOnMethodsRule.java:40)
	at com.carrotsearch.randomizedtesting.rules.NoShadowingOrOverridesOnMethodsRule$1.evaluate(NoShadowingOrOverridesOnMethodsRule.java:40)
	at com.carrotsearch.randomizedtesting.rules.StatementAdapter.evaluate(StatementAdapter.java:36)
	at com.carrotsearch.randomizedtesting.rules.StatementAdapter.evaluate(StatementAdapter.java:36)
	at com.carrotsearch.randomizedtesting.rules.StatementAdapter.evaluate(StatementAdapter.java:36)
	at org.apache.lucene.util.TestRuleAssertionsRequired$1.evaluate(TestRuleAssertionsRequired.java:53)
	at org.apache.lucene.util.TestRuleMarkFailure$1.evaluate(TestRuleMarkFailure.java:47)
	at org.apache.lucene.util.TestRuleIgnoreAfterMaxFailures$1.evaluate(TestRuleIgnoreAfterMaxFailures.java:64)
	at org.apache.lucene.util.TestRuleIgnoreTestSuites$1.evaluate(TestRuleIgnoreTestSuites.java:54)
	at com.carrotsearch.randomizedtesting.rules.StatementAdapter.evaluate(StatementAdapter.java:36)
	at com.carrotsearch.randomizedtesting.ThreadLeakControl$StatementRunner.run(ThreadLeakControl.java:368)
	at java.lang.Thread.run(Thread.java:748)


FAILED:  org.apache.solr.core.TestLazyCores.testNoCommit

Error Message:
Exception during query

Stack Trace:
java.lang.RuntimeException: Exception during query
	at __randomizedtesting.SeedInfo.seed([5A8DADF59CCD5288:85ED0C2457EA312D]:0)
	at org.apache.solr.SolrTestCaseJ4.assertQ(SolrTestCaseJ4.java:904)
	at org.apache.solr.core.TestLazyCores.check10(TestLazyCores.java:847)
	at org.apache.solr.core.TestLazyCores.testNoCommit(TestLazyCores.java:829)
	at sun.reflect.NativeMethodAccessorImpl.invoke0(Native Method)
	at sun.reflect.NativeMethodAccessorImpl.invoke(NativeMethodAccessorImpl.java:62)
	at sun.reflect.DelegatingMethodAccessorImpl.invoke(DelegatingMethodAccessorImpl.java:43)
	at java.lang.reflect.Method.invoke(Method.java:498)
	at com.carrotsearch.randomizedtesting.RandomizedRunner.invoke(RandomizedRunner.java:1737)
	at com.carrotsearch.randomizedtesting.RandomizedRunner$8.evaluate(RandomizedRunner.java:934)
	at com.carrotsearch.randomizedtesting.RandomizedRunner$9.evaluate(RandomizedRunner.java:970)
	at com.carrotsearch.randomizedtesting.RandomizedRunner$10.evaluate(RandomizedRunner.java:984)
	at com.carrotsearch.randomizedtesting.rules.SystemPropertiesRestoreRule$1.evaluate(SystemPropertiesRestoreRule.java:57)
	at org.apache.lucene.util.TestRuleSetupTeardownChained$1.evaluate(TestRuleSetupTeardownChained.java:49)
	at org.apache.lucene.util.AbstractBeforeAfterRule$1.evaluate(AbstractBeforeAfterRule.java:45)
	at org.apache.lucene.util.TestRuleThreadAndTestName$1.evaluate(TestRuleThreadAndTestName.java:48)
	at org.apache.lucene.util.TestRuleIgnoreAfterMaxFailures$1.evaluate(TestRuleIgnoreAfterMaxFailures.java:64)
	at org.apache.lucene.util.TestRuleMarkFailure$1.evaluate(TestRuleMarkFailure.java:47)
	at com.carrotsearch.randomizedtesting.rules.StatementAdapter.evaluate(StatementAdapter.java:36)
	at com.carrotsearch.randomizedtesting.ThreadLeakControl$StatementRunner.run(ThreadLeakControl.java:368)
	at com.carrotsearch.randomizedtesting.ThreadLeakControl.forkTimeoutingTask(ThreadLeakControl.java:817)
	at com.carrotsearch.randomizedtesting.ThreadLeakControl$3.evaluate(ThreadLeakControl.java:468)
	at com.carrotsearch.randomizedtesting.RandomizedRunner.runSingleTest(RandomizedRunner.java:943)
	at com.carrotsearch.randomizedtesting.RandomizedRunner$5.evaluate(RandomizedRunner.java:829)
	at com.carrotsearch.randomizedtesting.RandomizedRunner$6.evaluate(RandomizedRunner.java:879)
	at com.carrotsearch.randomizedtesting.RandomizedRunner$7.evaluate(RandomizedRunner.java:890)
	at com.carrotsearch.randomizedtesting.rules.StatementAdapter.evaluate(StatementAdapter.java:36)
	at com.carrotsearch.randomizedtesting.rules.SystemPropertiesRestoreRule$1.evaluate(SystemPropertiesRestoreRule.java:57)
	at org.apache.lucene.util.AbstractBeforeAfterRule$1.evaluate(AbstractBeforeAfterRule.java:45)
	at com.carrotsearch.randomizedtesting.rules.StatementAdapter.evaluate(StatementAdapter.java:36)
	at org.apache.lucene.util.TestRuleStoreClassName$1.evaluate(TestRuleStoreClassName.java:41)
	at com.carrotsearch.randomizedtesting.rules.NoShadowingOrOverridesOnMethodsRule$1.evaluate(NoShadowingOrOverridesOnMethodsRule.java:40)
	at com.carrotsearch.randomizedtesting.rules.NoShadowingOrOverridesOnMethodsRule$1.evaluate(NoShadowingOrOverridesOnMethodsRule.java:40)
	at com.carrotsearch.randomizedtesting.rules.StatementAdapter.evaluate(StatementAdapter.java:36)
	at com.carrotsearch.randomizedtesting.rules.StatementAdapter.evaluate(StatementAdapter.java:36)
	at com.carrotsearch.randomizedtesting.rules.StatementAdapter.evaluate(StatementAdapter.java:36)
	at org.apache.lucene.util.TestRuleAssertionsRequired$1.evaluate(TestRuleAssertionsRequired.java:53)
	at org.apache.lucene.util.TestRuleMarkFailure$1.evaluate(TestRuleMarkFailure.java:47)
	at org.apache.lucene.util.TestRuleIgnoreAfterMaxFailures$1.evaluate(TestRuleIgnoreAfterMaxFailures.java:64)
	at org.apache.lucene.util.TestRuleIgnoreTestSuites$1.evaluate(TestRuleIgnoreTestSuites.java:54)
	at com.carrotsearch.randomizedtesting.rules.StatementAdapter.evaluate(StatementAdapter.java:36)
	at com.carrotsearch.randomizedtesting.ThreadLeakControl$StatementRunner.run(ThreadLeakControl.java:368)
	at java.lang.Thread.run(Thread.java:748)
Caused by: java.lang.RuntimeException: REQUEST FAILED: xpath=//result[@numFound='10']
	xml response was: <?xml version="1.0" encoding="UTF-8"?>
<response>
<lst name="responseHeader"><int name="status">0</int><int name="QTime">1</int><lst name="params"><str name="q">*:*</str></lst></lst><result name="response" numFound="0" start="0"></result>
</response>

	request was:q=*:*
	at org.apache.solr.SolrTestCaseJ4.assertQ(SolrTestCaseJ4.java:897)
	... 41 more




Build Log:
[...truncated 12462 lines...]
   [junit4] Suite: org.apache.solr.cloud.autoscaling.sim.TestDistribStateManager
   [junit4]   2> Creating dataDir: /home/jenkins/workspace/Lucene-Solr-7.x-Linux/solr/build/solr-core/test/J2/temp/solr.cloud.autoscaling.sim.TestDistribStateManager_5A8DADF59CCD5288-001/init-core-data-001
   [junit4]   2> 664921 WARN  (SUITE-TestDistribStateManager-seed#[5A8DADF59CCD5288]-worker) [    ] o.a.s.SolrTestCaseJ4 startTrackingSearchers: numOpens=1 numCloses=1
   [junit4]   2> 664921 INFO  (SUITE-TestDistribStateManager-seed#[5A8DADF59CCD5288]-worker) [    ] o.a.s.SolrTestCaseJ4 Using PointFields (NUMERIC_POINTS_SYSPROP=true) w/NUMERIC_DOCVALUES_SYSPROP=true
   [junit4]   2> 664922 INFO  (SUITE-TestDistribStateManager-seed#[5A8DADF59CCD5288]-worker) [    ] o.a.s.SolrTestCaseJ4 Randomized ssl (true) and clientAuth (false) via: @org.apache.solr.util.RandomizeSSL(reason=, ssl=NaN, value=NaN, clientAuth=NaN)
   [junit4]   2> 664922 INFO  (SUITE-TestDistribStateManager-seed#[5A8DADF59CCD5288]-worker) [    ] o.a.s.SolrTestCaseJ4 SecureRandom sanity checks: test.solr.allowed.securerandom=null & java.security.egd=file:/dev/./urandom
   [junit4]   2> 664925 INFO  (TEST-TestDistribStateManager.testListData-seed#[5A8DADF59CCD5288]) [    ] o.a.s.SolrTestCaseJ4 ###Starting testListData
   [junit4]   2> 664926 INFO  (TEST-TestDistribStateManager.testListData-seed#[5A8DADF59CCD5288]) [    ] o.a.s.c.ZkTestServer STARTING ZK TEST SERVER
   [junit4]   2> 664926 INFO  (Thread-1005) [    ] o.a.s.c.ZkTestServer client port:0.0.0.0/0.0.0.0:0
   [junit4]   2> 664926 INFO  (Thread-1005) [    ] o.a.s.c.ZkTestServer Starting server
   [junit4]   2> 664967 ERROR (Thread-1005) [    ] o.a.z.s.ZooKeeperServer ZKShutdownHandler is not registered, so ZooKeeper server won't take any action on ERROR or SHUTDOWN server state changes
   [junit4]   2> 665026 INFO  (TEST-TestDistribStateManager.testListData-seed#[5A8DADF59CCD5288]) [    ] o.a.s.c.ZkTestServer start zk server on port:42015
   [junit4]   2> 665064 INFO  (zkConnectionManagerCallback-1093-thread-1) [    ] o.a.s.c.c.ConnectionManager zkClient has connected
   [junit4]   2> 665066 INFO  (TEST-TestDistribStateManager.testListData-seed#[5A8DADF59CCD5288]) [    ] o.a.s.c.a.s.TestDistribStateManager Using org.apache.solr.client.solrj.impl.ZkDistribStateManager
   [junit4]   2> 665071 ERROR (TEST-TestDistribStateManager.testListData-seed#[5A8DADF59CCD5288]) [    ] o.a.z.s.ZooKeeperServer ZKShutdownHandler is not registered, so ZooKeeper server won't take any action on ERROR or SHUTDOWN server state changes
   [junit4]   2> 665072 INFO  (TEST-TestDistribStateManager.testListData-seed#[5A8DADF59CCD5288]) [    ] o.a.s.c.ZkTestServer connecting to 127.0.0.1:42015 42015
   [junit4]   2> 665098 INFO  (Thread-1005) [    ] o.a.s.c.ZkTestServer connecting to 127.0.0.1:42015 42015
   [junit4]   2> 665099 INFO  (TEST-TestDistribStateManager.testListData-seed#[5A8DADF59CCD5288]) [    ] o.a.s.SolrTestCaseJ4 ###Ending testListData
   [junit4]   2> 665101 INFO  (TEST-TestDistribStateManager.testGetSetRemoveData-seed#[5A8DADF59CCD5288]) [    ] o.a.s.SolrTestCaseJ4 ###Starting testGetSetRemoveData
   [junit4]   2> 665101 INFO  (TEST-TestDistribStateManager.testGetSetRemoveData-seed#[5A8DADF59CCD5288]) [    ] o.a.s.c.ZkTestServer STARTING ZK TEST SERVER
   [junit4]   2> 665127 INFO  (Thread-1006) [    ] o.a.s.c.ZkTestServer client port:0.0.0.0/0.0.0.0:0
   [junit4]   2> 665128 INFO  (Thread-1006) [    ] o.a.s.c.ZkTestServer Starting server
   [junit4]   2> 665164 ERROR (Thread-1006) [    ] o.a.z.s.ZooKeeperServer ZKShutdownHandler is not registered, so ZooKeeper server won't take any action on ERROR or SHUTDOWN server state changes
   [junit4]   2> 665212 INFO  (TEST-TestDistribStateManager.testGetSetRemoveData-seed#[5A8DADF59CCD5288]) [    ] o.a.s.c.ZkTestServer start zk server on port:37573
   [junit4]   2> 665241 INFO  (zkConnectionManagerCallback-1095-thread-1) [    ] o.a.s.c.c.ConnectionManager zkClient has connected
   [junit4]   2> 665241 INFO  (TEST-TestDistribStateManager.testGetSetRemoveData-seed#[5A8DADF59CCD5288]) [    ] o.a.s.c.a.s.TestDistribStateManager Using org.apache.solr.client.solrj.impl.ZkDistribStateManager
   [junit4]   2> 665293 INFO  (zkConnectionManagerCallback-1097-thread-1) [    ] o.a.s.c.c.ConnectionManager zkClient has connected
   [junit4]   2> 665294 INFO  (TEST-TestDistribStateManager.testGetSetRemoveData-seed#[5A8DADF59CCD5288]) [    ] o.a.s.c.a.s.TestDistribStateManager Using org.apache.solr.client.solrj.impl.ZkDistribStateManager
   [junit4]   2> 670294 ERROR (TEST-TestDistribStateManager.testGetSetRemoveData-seed#[5A8DADF59CCD5288]) [    ] o.a.z.s.ZooKeeperServer ZKShutdownHandler is not registered, so ZooKeeper server won't take any action on ERROR or SHUTDOWN server state changes
   [junit4]   2> 670295 INFO  (TEST-TestDistribStateManager.testGetSetRemoveData-seed#[5A8DADF59CCD5288]) [    ] o.a.s.c.ZkTestServer connecting to 127.0.0.1:37573 37573
   [junit4]   2> 670422 INFO  (Thread-1006) [    ] o.a.s.c.ZkTestServer connecting to 127.0.0.1:37573 37573
   [junit4]   2> 670423 INFO  (TEST-TestDistribStateManager.testGetSetRemoveData-seed#[5A8DADF59CCD5288]) [    ] o.a.s.SolrTestCaseJ4 ###Ending testGetSetRemoveData
   [junit4]   2> NOTE: reproduce with: ant test  -Dtestcase=TestDistribStateManager -Dtests.method=testGetSetRemoveData -Dtests.seed=5A8DADF59CCD5288 -Dtests.multiplier=3 -Dtests.slow=true -Dtests.locale=hi -Dtests.timezone=Europe/Volgograd -Dtests.asserts=true -Dtests.file.encoding=ISO-8859-1
   [junit4] FAILURE 5.33s J2 | TestDistribStateManager.testGetSetRemoveData <<<
   [junit4]    > Throwable #1: java.lang.AssertionError: Node watch should have fired!
   [junit4]    > 	at __randomizedtesting.SeedInfo.seed([5A8DADF59CCD5288:7C1D42A7C8439482]:0)
   [junit4]    > 	at org.apache.solr.cloud.autoscaling.sim.TestDistribStateManager.testGetSetRemoveData(TestDistribStateManager.java:256)
   [junit4]    > 	at java.lang.Thread.run(Thread.java:748)
   [junit4]   2> 670431 INFO  (TEST-TestDistribStateManager.testHasData-seed#[5A8DADF59CCD5288]) [    ] o.a.s.SolrTestCaseJ4 ###Starting testHasData
   [junit4]   2> 670431 INFO  (TEST-TestDistribStateManager.testHasData-seed#[5A8DADF59CCD5288]) [    ] o.a.s.c.ZkTestServer STARTING ZK TEST SERVER
   [junit4]   2> 670431 INFO  (Thread-1007) [    ] o.a.s.c.ZkTestServer client port:0.0.0.0/0.0.0.0:0
   [junit4]   2> 670431 INFO  (Thread-1007) [    ] o.a.s.c.ZkTestServer Starting server
   [junit4]   2> 670440 ERROR (Thread-1007) [    ] o.a.z.s.ZooKeeperServer ZKShutdownHandler is not registered, so ZooKeeper server won't take any action on ERROR or SHUTDOWN server state changes
   [junit4]   2> 670531 INFO  (TEST-TestDistribStateManager.testHasData-seed#[5A8DADF59CCD5288]) [    ] o.a.s.c.ZkTestServer start zk server on port:33275
   [junit4]   2> 670534 INFO  (zkConnectionManagerCallback-1099-thread-1) [    ] o.a.s.c.c.ConnectionManager zkClient has connected
   [junit4]   2> 670534 INFO  (TEST-TestDistribStateManager.testHasData-seed#[5A8DADF59CCD5288]) [    ] o.a.s.c.a.s.TestDistribStateManager Using org.apache.solr.client.solrj.impl.ZkDistribStateManager
   [junit4]   2> 670536 ERROR (TEST-TestDistribStateManager.testHasData-seed#[5A8DADF59CCD5288]) [    ] o.a.z.s.ZooKeeperServer ZKShutdownHandler is not registered, so ZooKeeper server won't take any action on ERROR or SHUTDOWN server state changes
   [junit4]   2> 670536 INFO  (TEST-TestDistribStateManager.testHasData-seed#[5A8DADF59CCD5288]) [    ] o.a.s.c.ZkTestServer connecting to 127.0.0.1:33275 33275
   [junit4]   2> 670663 INFO  (Thread-1007) [    ] o.a.s.c.ZkTestServer connecting to 127.0.0.1:33275 33275
   [junit4]   2> 670664 INFO  (TEST-TestDistribStateManager.testHasData-seed#[5A8DADF59CCD5288]) [    ] o.a.s.SolrTestCaseJ4 ###Ending testHasData
   [junit4]   2> 670665 INFO  (TEST-TestDistribStateManager.testCreateMode-seed#[5A8DADF59CCD5288]) [    ] o.a.s.SolrTestCaseJ4 ###Starting testCreateMode
   [junit4]   2> 670665 INFO  (TEST-TestDistribStateManager.testCreateMode-seed#[5A8DADF59CCD5288]) [    ] o.a.s.c.a.s.TestDistribStateManager Using org.apache.solr.cloud.autoscaling.sim.SimDistribStateManager
   [junit4]   2> 670666 INFO  (TEST-TestDistribStateManager.testCreateMode-seed#[5A8DADF59CCD5288]) [    ] o.a.s.c.a.s.TestDistribStateManager Using org.apache.solr.cloud.autoscaling.sim.SimDistribStateManager
   [junit4]   2> 670666 INFO  (TEST-TestDistribStateManager.testCreateMode-seed#[5A8DADF59CCD5288]) [    ] o.a.s.SolrTestCaseJ4 ###Ending testCreateMode
   [junit4]   2> 670666 INFO  (TEST-TestDistribStateManager.testMulti-seed#[5A8DADF59CCD5288]) [    ] o.a.s.SolrTestCaseJ4 ###Starting testMulti
   [junit4]   2> 670666 INFO  (TEST-TestDistribStateManager.testMulti-seed#[5A8DADF59CCD5288]) [    ] o.a.s.c.ZkTestServer STARTING ZK TEST SERVER
   [junit4]   2> 670672 INFO  (Thread-1008) [    ] o.a.s.c.ZkTestServer client port:0.0.0.0/0.0.0.0:0
   [junit4]   2> 670672 INFO  (Thread-1008) [    ] o.a.s.c.ZkTestServer Starting server
   [junit4]   2> 670676 ERROR (Thread-1008) [    ] o.a.z.s.ZooKeeperServer ZKShutdownHandler is not registered, so ZooKeeper server won't take any action on ERROR or SHUTDOWN server state changes
   [junit4]   2> 670772 INFO  (TEST-TestDistribStateManager.testMulti-seed#[5A8DADF59CCD5288]) [    ] o.a.s.c.ZkTestServer start zk server on port:35003
   [junit4]   2> 670773 INFO  (zkConnectionManagerCallback-1101-thread-1) [    ] o.a.s.c.c.ConnectionManager zkClient has connected
   [junit4]   2> 670774 INFO  (TEST-TestDistribStateManager.testMulti-seed#[5A8DADF59CCD5288]) [    ] o.a.s.c.a.s.TestDistribStateManager Using org.apache.solr.client.solrj.impl.ZkDistribStateManager
   [junit4]   2> 670774 ERROR (TEST-TestDistribStateManager.testMulti-seed#[5A8DADF59CCD5288]) [    ] o.a.z.s.ZooKeeperServer ZKShutdownHandler is not registered, so ZooKeeper server won't take any action on ERROR or SHUTDOWN server state changes
   [junit4]   2> 670774 INFO  (TEST-TestDistribStateManager.testMulti-seed#[5A8DADF59CCD5288]) [    ] o.a.s.c.ZkTestServer connecting to 127.0.0.1:35003 35003
   [junit4]   2> 670900 INFO  (Thread-1008) [    ] o.a.s.c.ZkTestServer connecting to 127.0.0.1:35003 35003
   [junit4]   2> 670901 INFO  (TEST-TestDistribStateManager.testMulti-seed#[5A8DADF59CCD5288]) [    ] o.a.s.SolrTestCaseJ4 ###Ending testMulti
   [junit4]   2> NOTE: leaving temporary files on disk at: /home/jenkins/workspace/Lucene-Solr-7.x-Linux/solr/build/solr-core/test/J2/temp/solr.cloud.autoscaling.sim.TestDistribStateManager_5A8DADF59CCD5288-001
   [junit4]   2> Dec 20, 2017 7:16:59 PM com.carrotsearch.randomizedtesting.ThreadLeakControl checkThreadLeaks
   [junit4]   2> WARNING: Will linger awaiting termination of 1 leaked thread(s).
   [junit4]   2> NOTE: test params are: codec=Asserting(Lucene70): {}, docValues:{}, maxPointsInLeafNode=435, maxMBSortInHeap=7.015555913972772, sim=RandomSimilarity(queryNorm=true): {}, locale=hi, timezone=Europe/Volgograd
   [junit4]   2> NOTE: Linux 4.10.0-40-generic i386/Oracle Corporation 1.8.0_144 (32-bit)/cpus=8,threads=1,free=45913592,total=194502656
   [junit4]   2> NOTE: All tests run in this JVM: [StatsComponentTest, TestCloudPivotFacet, BasicDistributedZk2Test, GraphQueryTest, DirectSolrSpellCheckerTest, TestInitQParser, RecoveryZkTest, CollectionsAPIAsyncDistributedZkTest, AlternateDirectoryTest, RulesTest, SpellPossibilityIteratorTest, DistributedSpellCheckComponentTest, TestSimpleTextCodec, TestCorePropertiesReload, DefaultValueUpdateProcessorTest, OverseerStatusTest, AutoAddReplicasIntegrationTest, TestSearchPerf, TestQuerySenderListener, TestAnalyzeInfixSuggestions, LeaderElectionContextKeyTest, UniqFieldsUpdateProcessorFactoryTest, SuggesterTest, TestCloudDeleteByQuery, MergeStrategyTest, TestNRTOpen, TestQueryTypes, TestDistributedGrouping, LeaderElectionTest, BaseCdcrDistributedZkTest, UUIDFieldTest, ResponseHeaderTest, DistributedExpandComponentTest, TestDistributedMissingSort, TestManagedSchema, TestFiltering, TestConfigSetsAPIZkFailure, TestPolicyCloud, TestNumericTokenStream, WordBreakSolrSpellCheckerTest, TestGroupingSearch, RequiredFieldsTest, TestZkChroot, DeleteStatusTest, FileBasedSpellCheckerTest, TestExtendedDismaxParser, TestStandardQParsers, TestPartialUpdateDeduplication, SharedFSAutoReplicaFailoverTest, CollectionReloadTest, TestReqParamsAPI, BooleanFieldTest, QueryResultKeyTest, AddBlockUpdateTest, MigrateRouteKeyTest, TestRequestForwarding, LeaderInitiatedRecoveryOnCommitTest, ReplicaListTransformerTest, PropertiesRequestHandlerTest, TestMacros, TestUnifiedSolrHighlighter, CoreMergeIndexesAdminHandlerTest, TestDistribStateManager]
   [junit4] Completed [225/763 (1!)] on J2 in 6.76s, 5 tests, 1 failure <<< FAILURES!

[...truncated 597 lines...]
   [junit4] Suite: org.apache.solr.core.TestLazyCores
   [junit4]   2> Creating dataDir: /home/jenkins/workspace/Lucene-Solr-7.x-Linux/solr/build/solr-core/test/J1/temp/solr.core.TestLazyCores_5A8DADF59CCD5288-001/init-core-data-001
   [junit4]   2> 1575223 WARN  (SUITE-TestLazyCores-seed#[5A8DADF59CCD5288]-worker) [    ] o.a.s.SolrTestCaseJ4 startTrackingSearchers: numOpens=1 numCloses=1
   [junit4]   2> 1575224 INFO  (SUITE-TestLazyCores-seed#[5A8DADF59CCD5288]-worker) [    ] o.a.s.SolrTestCaseJ4 Using PointFields (NUMERIC_POINTS_SYSPROP=true) w/NUMERIC_DOCVALUES_SYSPROP=false
   [junit4]   2> 1575225 INFO  (SUITE-TestLazyCores-seed#[5A8DADF59CCD5288]-worker) [    ] o.a.s.SolrTestCaseJ4 Randomized ssl (false) and clientAuth (true) via: @org.apache.solr.util.RandomizeSSL(reason=, ssl=NaN, value=NaN, clientAuth=NaN)
   [junit4]   2> 1575225 INFO  (SUITE-TestLazyCores-seed#[5A8DADF59CCD5288]-worker) [    ] o.a.s.SolrTestCaseJ4 SecureRandom sanity checks: test.solr.allowed.securerandom=null & java.security.egd=file:/dev/./urandom
   [junit4]   2> 1575226 INFO  (TEST-TestLazyCores.testLazySearch-seed#[5A8DADF59CCD5288]) [    ] o.a.s.SolrTestCaseJ4 ###Starting testLazySearch
   [junit4]   2> 1575234 INFO  (TEST-TestLazyCores.testLazySearch-seed#[5A8DADF59CCD5288]) [    ] o.a.s.c.SolrXmlConfig Loading container configuration from /home/jenkins/workspace/Lucene-Solr-7.x-Linux/solr/build/solr-core/test/J1/temp/solr.core.TestLazyCores_5A8DADF59CCD5288-001/tempDir-001/solr.xml
   [junit4]   2> 1575237 INFO  (TEST-TestLazyCores.testLazySearch-seed#[5A8DADF59CCD5288]) [    ] o.a.s.c.SolrXmlConfig Configuration parameter autoReplicaFailoverWorkLoopDelay is ignored
   [junit4]   2> 1575237 INFO  (TEST-TestLazyCores.testLazySearch-seed#[5A8DADF59CCD5288]) [    ] o.a.s.c.SolrXmlConfig Configuration parameter autoReplicaFailoverBadNodeExpiration is ignored
   [junit4]   2> 1575238 INFO  (TEST-TestLazyCores.testLazySearch-seed#[5A8DADF59CCD5288]) [    ] o.a.s.c.SolrXmlConfig MBean server found: com.sun.jmx.mbeanserver.JmxMBeanServer@125cd92, but no JMX reporters were configured - adding default JMX reporter.
   [junit4]   2> 1575274 INFO  (TEST-TestLazyCores.testLazySearch-seed#[5A8DADF59CCD5288]) [    ] o.a.s.m.r.SolrJmxReporter JMX monitoring for 'solr.node' (registry 'solr.node') enabled at server: com.sun.jmx.mbeanserver.JmxMBeanServer@125cd92
   [junit4]   2> 1575291 INFO  (TEST-TestLazyCores.testLazySearch-seed#[5A8DADF59CCD5288]) [    ] o.a.s.m.r.SolrJmxReporter JMX monitoring for 'solr.jvm' (registry 'solr.jvm') enabled at server: com.sun.jmx.mbeanserver.JmxMBeanServer@125cd92
   [junit4]   2> 1575291 INFO  (TEST-TestLazyCores.testLazySearch-seed#[5A8DADF59CCD5288]) [    ] o.a.s.m.r.SolrJmxReporter JMX monitoring for 'solr.jetty' (registry 'solr.jetty') enabled at server: com.sun.jmx.mbeanserver.JmxMBeanServer@125cd92
   [junit4]   2> 1575299 INFO  (TEST-TestLazyCores.testLazySearch-seed#[5A8DADF59CCD5288]) [    ] o.a.s.c.TransientSolrCoreCacheDefault Allocating transient cache for 4 transient cores
   [junit4]   2> 1575315 INFO  (coreLoadExecutor-5609-thread-1) [    x:collection1] o.a.s.c.SolrConfig Using Lucene MatchVersion: 7.3.0
   [junit4]   2> 1575354 INFO  (coreLoadExecutor-5609-thread-2) [    x:collection2] o.a.s.c.SolrConfig Using Lucene MatchVersion: 7.3.0
   [junit4]   2> 1575356 INFO  (coreLoadExecutor-5609-thread-1) [    x:collection1] o.a.s.s.IndexSchema [collection1] Schema name=tiny
   [junit4]   2> 1575399 INFO  (coreLoadExecutor-5609-thread-1) [    x:collection1] o.a.s.s.IndexSchema Loaded schema tiny/1.1 with uniqueid field id
   [junit4]   2> 1575399 INFO  (coreLoadExecutor-5609-thread-1) [    x:collection1] o.a.s.c.CoreContainer Creating SolrCore 'collection1' using configuration from instancedir /home/jenkins/workspace/Lucene-Solr-7.x-Linux/solr/build/solr-core/test/J1/temp/solr.core.TestLazyCores_5A8DADF59CCD5288-001/tempDir-001/./collection1, trusted=true
   [junit4]   2> 1575400 INFO  (coreLoadExecutor-5609-thread-1) [    x:collection1] o.a.s.m.r.SolrJmxReporter JMX monitoring for 'solr.core.collection1' (registry 'solr.core.collection1') enabled at server: com.sun.jmx.mbeanserver.JmxMBeanServer@125cd92
   [junit4]   2> 1575400 INFO  (coreLoadExecutor-5609-thread-1) [    x:collection1] o.a.s.c.SolrCore solr.RecoveryStrategy.Builder
   [junit4]   2> 1575400 INFO  (coreLoadExecutor-5609-thread-1) [    x:collection1] o.a.s.c.SolrCore [[collection1] ] Opening new SolrCore at [/home/jenkins/workspace/Lucene-Solr-7.x-Linux/solr/build/solr-core/test/J1/temp/solr.core.TestLazyCores_5A8DADF59CCD5288-001/tempDir-001/collection1], dataDir=[/home/jenkins/workspace/Lucene-Solr-7.x-Linux/solr/build/solr-core/test/J1/temp/solr.core.TestLazyCores_5A8DADF59CCD5288-001/tempDir-001/./collection1/data/]
   [junit4]   2> 1575403 INFO  (coreLoadExecutor-5609-thread-3) [    x:collection5] o.a.s.c.SolrConfig Using Lucene MatchVersion: 7.3.0
   [junit4]   2> 1575403 INFO  (coreLoadExecutor-5609-thread-1) [    x:collection1] o.a.s.u.RandomMergePolicy RandomMergePolicy wrapping class org.apache.lucene.index.TieredMergePolicy: [TieredMergePolicy: maxMergeAtOnce=36, maxMergeAtOnceExplicit=32, maxMergedSegmentMB=10.1103515625, floorSegmentMB=1.345703125, forceMergeDeletesPctAllowed=17.320160257802893, segmentsPerTier=12.0, maxCFSSegmentSizeMB=8.796093022207999E12, noCFSRatio=0.6545314499801845
   [junit4]   2> 1575423 INFO  (coreLoadExecutor-5609-thread-2) [    x:collection2] o.a.s.s.IndexSchema [collection2] Schema name=tiny
   [junit4]   2> 1575424 INFO  (coreLoadExecutor-5609-thread-3) [    x:collection5] o.a.s.s.IndexSchema [collection5] Schema name=tiny
   [junit4]   2> 1575435 INFO  (coreLoadExecutor-5609-thread-2) [    x:collection2] o.a.s.s.IndexSchema Loaded schema tiny/1.1 with uniqueid field id
   [junit4]   2> 1575435 INFO  (coreLoadExecutor-5609-thread-2) [    x:collection2] o.a.s.c.CoreContainer Creating SolrCore 'collection2' using configuration from instancedir /home/jenkins/workspace/Lucene-Solr-7.x-Linux/solr/build/solr-core/test/J1/temp/solr.core.TestLazyCores_5A8DADF59CCD5288-001/tempDir-001/./collection2, trusted=true
   [junit4]   2> 1575435 INFO  (coreLoadExecutor-5609-thread-2) [    x:collection2] o.a.s.m.r.SolrJmxReporter JMX monitoring for 'solr.core.collection2' (registry 'solr.core.collection2') enabled at server: com.sun.jmx.mbeanserver.JmxMBeanServer@125cd92
   [junit4]   2> 1575435 INFO  (coreLoadExecutor-5609-thread-2) [    x:collection2] o.a.s.c.SolrCore solr.RecoveryStrategy.Builder
   [junit4]   2> 1575436 INFO  (coreLoadExecutor-5609-thread-2) [    x:collection2] o.a.s.c.SolrCore [[collection2] ] Opening new SolrCore at [/home/jenkins/workspace/Lucene-Solr-7.x-Linux/solr/build/solr-core/test/J1/temp/solr.core.TestLazyCores_5A8DADF59CCD5288-001/tempDir-001/collection2], dataDir=[/home/jenkins/workspace/Lucene-Solr-7.x-Linux/solr/build/solr-core/test/J1/temp/solr.core.TestLazyCores_5A8DADF59CCD5288-001/tempDir-001/./collection2/data/]
   [junit4]   2> 1575436 INFO  (coreLoadExecutor-5609-thread-3) [    x:collection5] o.a.s.s.IndexSchema Loaded schema tiny/1.1 with uniqueid field id
   [junit4]   2> 1575436 INFO  (coreLoadExecutor-5609-thread-3) [    x:collection5] o.a.s.c.CoreContainer Creating SolrCore 'collection5' using configuration from instancedir /home/jenkins/workspace/Lucene-Solr-7.x-Linux/solr/build/solr-core/test/J1/temp/solr.core.TestLazyCores_5A8DADF59CCD5288-001/tempDir-001/./collection5, trusted=true
   [junit4]   2> 1575436 INFO  (coreLoadExecutor-5609-thread-3) [    x:collection5] o.a.s.m.r.SolrJmxReporter JMX monitoring for 'solr.core.collection5' (registry 'solr.core.collection5') enabled at server: com.sun.jmx.mbeanserver.JmxMBeanServer@125cd92
   [junit4]   2> 1575436 INFO  (coreLoadExecutor-5609-thread-3) [    x:collection5] o.a.s.c.SolrCore solr.RecoveryStrategy.Builder
   [junit4]   2> 1575436 INFO  (coreLoadExecutor-5609-thread-3) [    x:collection5] o.a.s.c.SolrCore [[collection5] ] Opening new SolrCore at [/home/jenkins/workspace/Lucene-Solr-7.x-Linux/solr/build/solr-core/test/J1/temp/solr.core.TestLazyCores_5A8DADF59CCD5288-001/tempDir-001/collection5], dataDir=[/home/jenkins/workspace/Lucene-Solr-7.x-Linux/solr/build/solr-core/test/J1/temp/solr.core.TestLazyCores_5A8DADF59CCD5288-001/tempDir-001/./collection5/data/]
   [junit4]   2> 1575438 INFO  (coreLoadExecutor-5609-thread-3) [    x:collection5] o.a.s.u.RandomMergePolicy RandomMergePolicy wrapping class org.apache.lucene.index.TieredMergePolicy: [TieredMergePolicy: maxMergeAtOnce=36, maxMergeAtOnceExplicit=32, maxMergedSegmentMB=10.1103515625, floorSegmentMB=1.345703125, forceMergeDeletesPctAllowed=17.320160257802893, segmentsPerTier=12.0, maxCFSSegmentSizeMB=8.796093022207999E12, noCFSRatio=0.6545314499801845
   [junit4]   2> 1575438 INFO  (coreLoadExecutor-5609-thread-2) [    x:collection2] o.a.s.u.RandomMergePolicy RandomMergePolicy wrapping class org.apache.lucene.index.TieredMergePolicy: [TieredMergePolicy: maxMergeAtOnce=36, maxMergeAtOnceExplicit=32, maxMergedSegmentMB=10.1103515625, floorSegmentMB=1.345703125, forceMergeDeletesPctAllowed=17.320160257802893, segmentsPerTier=12.0, maxCFSSegmentSizeMB=8.796093022207999E12, noCFSRatio=0.6545314499801845
   [junit4]   2> 1575501 INFO  (coreLoadExecutor-5609-thread-1) [    x:collection1] o.a.s.u.CommitTracker Hard AutoCommit: disabled
   [junit4]   2> 1575501 INFO  (coreLoadExecutor-5609-thread-1) [    x:collection1] o.a.s.u.CommitTracker Soft AutoCommit: disabled
   [junit4]   2> 1575503 INFO  (coreLoadExecutor-5609-thread-1) [    x:collection1] o.a.s.u.RandomMergePolicy RandomMergePolicy wrapping class org.apache.lucene.index.LogByteSizeMergePolicy: [LogByteSizeMergePolicy: minMergeSize=1677721, mergeFactor=28, maxMergeSize=2147483648, maxMergeSizeForForcedMerge=9223372036854775807, calibrateSizeByDeletes=false, maxMergeDocs=2147483647, maxCFSSegmentSizeMB=8.796093022207999E12, noCFSRatio=0.0]
   [junit4]   2> 1575503 INFO  (coreLoadExecutor-5609-thread-1) [    x:collection1] o.a.s.s.SolrIndexSearcher Opening [Searcher@1f33906[collection1] main]
   [junit4]   2> 1575519 INFO  (coreLoadExecutor-5609-thread-1) [    x:collection1] o.a.s.r.ManagedResourceStorage File-based storage initialized to use dir: /home/jenkins/workspace/Lucene-Solr-7.x-Linux/solr/build/solr-core/test/J1/temp/solr.core.TestLazyCores_5A8DADF59CCD5288-001/tempDir-001/collection1/conf
   [junit4]   2> 1575519 INFO  (coreLoadExecutor-5609-thread-1) [    x:collection1] o.a.s.h.ReplicationHandler Commits will be reserved for 10000ms.
   [junit4]   2> 1575521 INFO  (searcherExecutor-5610-thread-1-processing-x:collection1) [    x:collection1] o.a.s.c.SolrCore [collection1] Registered new searcher Searcher@1f33906[collection1] main{ExitableDirectoryReader(UninvertingDirectoryReader())}
   [junit4]   2> 1575530 INFO  (coreLoadExecutor-5609-thread-3) [    x:collection5] o.a.s.u.CommitTracker Hard AutoCommit: disabled
   [junit4]   2> 1575530 INFO  (coreLoadExecutor-5609-thread-3) [    x:collection5] o.a.s.u.CommitTracker Soft AutoCommit: disabled
   [junit4]   2> 1575531 INFO  (coreLoadExecutor-5609-thread-3) [    x:collection5] o.a.s.u.RandomMergePolicy RandomMergePolicy wrapping class org.apache.lucene.index.LogByteSizeMergePolicy: [LogByteSizeMergePolicy: minMergeSize=1677721, mergeFactor=28, maxMergeSize=2147483648, maxMergeSizeForForcedMerge=9223372036854775807, calibrateSizeByDeletes=false, maxMergeDocs=2147483647, maxCFSSegmentSizeMB=8.796093022207999E12, noCFSRatio=0.0]
   [junit4]   2> 1575532 INFO  (coreLoadExecutor-5609-thread-3) [    x:collection5] o.a.s.s.SolrIndexSearcher Opening [Searcher@10c21d2[collection5] main]
   [junit4]   2> 1575532 INFO  (coreLoadExecutor-5609-thread-3) [    x:collection5] o.a.s.r.ManagedResourceStorage File-based storage initialized to use dir: /home/jenkins/workspace/Lucene-Solr-7.x-Linux/solr/build/solr-core/test/J1/temp/solr.core.TestLazyCores_5A8DADF59CCD5288-001/tempDir-001/collection5/conf
   [junit4]   2> 1575533 INFO  (coreLoadExecutor-5609-thread-3) [    x:collection5] o.a.s.h.ReplicationHandler Commits will be reserved for 10000ms.
   [junit4]   2> 1575534 INFO  (searcherExecutor-5612-thread-1-processing-x:collection5) [    x:collection5] o.a.s.c.SolrCore [collection5] Registered new searcher Searcher@10c21d2[collection5] main{ExitableDirectoryReader(UninvertingDirectoryReader())}
   [junit4]   2> 1575548 INFO  (coreLoadExecutor-5609-thread-2) [    x:collection2] o.a.s.u.CommitTracker Hard AutoCommit: disabled
   [junit4]   2> 1575548 INFO  (coreLoadExecutor-5609-thread-2) [    x:collection2] o.a.s.u.CommitTracker Soft AutoCommit: disabled
   [junit4]   2> 1575549 INFO  (coreLoadExecutor-5609-thread-2) [    x:collection2] o.a.s.u.RandomMergePolicy RandomMergePolicy wrapping class org.apache.lucene.index.LogByteSizeMergePolicy: [LogByteSizeMergePolicy: minMergeSize=1677721, mergeFactor=28, maxMergeSize=2147483648, maxMergeSizeForForcedMerge=9223372036854775807, calibrateSizeByDeletes=false, maxMergeDocs=2147483647, maxCFSSegmentSizeMB=8.796093022207999E12, noCFSRatio=0.0]
   [junit4]   2> 1575550 INFO  (coreLoadExecutor-5609-thread-2) [    x:collection2] o.a.s.s.SolrIndexSearcher Opening [Searcher@1e6b925[collection2] main]
   [junit4]   2> 1575550 INFO  (coreLoadExecutor-5609-thread-2) [    x:collection2] o.a.s.r.ManagedResourceStorage File-based storage initialized to use dir: /home/jenkins/workspace/Lucene-Solr-7.x-Linux/solr/build/solr-core/test/J1/temp/solr.core.TestLazyCores_5A8DADF59CCD5288-001/tempDir-001/collection2/conf
   [junit4]   2> 1575551 INFO  (coreLoadExecutor-5609-thread-2) [    x:collection2] o.a.s.h.ReplicationHandler Commits will be reserved for 10000ms.
   [junit4]   2> 1575552 INFO  (searcherExecutor-5611-thread-1-processing-x:collection2) [    x:collection2] o.a.s.c.SolrCore [collection2] Registered new searcher Searcher@1e6b925[collection2] main{ExitableDirectoryReader(UninvertingDirectoryReader())}
   [junit4]   2> 1575573 INFO  (TEST-TestLazyCores.testLazySearch-seed#[5A8DADF59CCD5288]) [    x:collection4] o.a.s.c.SolrConfig Using Lucene MatchVersion: 7.3.0
   [junit4]   2> 1575606 INFO  (TEST-TestLazyCores.testLazySearch-seed#[5A8DADF59CCD5288]) [    x:collection4] o.a.s.s.IndexSchema [collection4] Schema name=tiny
   [junit4]   2> 1575610 INFO  (TEST-TestLazyCores.testLazySearch-seed#[5A8DADF59CCD5288]) [    x:collection4] o.a.s.s.IndexSchema Loaded schema tiny/1.1 with uniqueid field id
   [junit4]   2> 1575610 INFO  (TEST-TestLazyCores.testLazySearch-seed#[5A8DADF59CCD5288]) [    x:collection4] o.a.s.c.CoreContainer Creating SolrCore 'collection4' using configuration from instancedir /home/jenkins/workspace/Lucene-Solr-7.x-Linux/solr/build/solr-core/test/J1/temp/solr.core.TestLazyCores_5A8DADF59CCD5288-001/tempDir-001/./collection4, trusted=true
   [junit4]   2> 1575611 INFO  (TEST-TestLazyCores.testLazySearch-seed#[5A8DADF59CCD5288]) [    x:collection4] o.a.s.m.r.SolrJmxReporter JMX monitoring for 'solr.core.collection4' (registry 'solr.core.collection4') enabled at server: com.sun.jmx.mbeanserver.JmxMBeanServer@125cd92
   [junit4]   2> 1575611 INFO  (TEST-TestLazyCores.testLazySearch-seed#[5A8DADF59CCD5288]) [    x:collection4] o.a.s.c.SolrCore solr.RecoveryStrategy.Builder
   [junit4]   2> 1575611 INFO  (TEST-TestLazyCores.testLazySearch-seed#[5A8DADF59CCD5288]) [    x:collection4] o.a.s.c.SolrCore [[collection4] ] Opening new SolrCore at [/home/jenkins/workspace/Lucene-Solr-7.x-Linux/solr/build/solr-core/test/J1/temp/solr.core.TestLazyCores_5A8DADF59CCD5288-001/tempDir-001/collection4], dataDir=[/home/jenkins/workspace/Lucene-Solr-7.x-Linux/solr/build/solr-core/test/J1/temp/solr.core.TestLazyCores_5A8DADF59CCD5288-001/tempDir-001/./collection4/data/]
   [junit4]   2> 1575615 INFO  (TEST-TestLazyCores.testLazySearch-seed#[5A8DADF59CCD5288]) [    x:collection4] o.a.s.u.RandomMergePolicy RandomMergePolicy wrapping class org.apache.lucene.index.TieredMergePolicy: [TieredMergePolicy: maxMergeAtOnce=25, maxMergeAtOnceExplicit=21, maxMergedSegmentMB=2.8134765625, floorSegmentMB=0.76171875, forceMergeDeletesPctAllowed=11.207548282096539, segmentsPerTier=24.0, maxCFSSegmentSizeMB=8.796093022207999E12, noCFSRatio=0.0
   [junit4]   2> 1575720 INFO  (TEST-TestLazyCores.testLazySearch-seed#[5A8DADF59CCD5288]) [    x:collection4] o.a.s.u.CommitTracker Hard AutoCommit: disabled
   [junit4]   2> 1575720 INFO  (TEST-TestLazyCores.testLazySearch-seed#[5A8DADF59CCD5288]) [    x:collection4] o.a.s.u.CommitTracker Soft AutoCommit: disabled
   [junit4]   2> 1575722 INFO  (TEST-TestLazyCores.testLazySearch-seed#[5A8DADF59CCD5288]) [    x:collection4] o.a.s.u.RandomMergePolicy RandomMergePolicy wrapping class org.apache.lucene.index.AlcoholicMergePolicy: [AlcoholicMergePolicy: minMergeSize=0, mergeFactor=10, maxMergeSize=1547838631, maxMergeSizeForForcedMerge=9223372036854775807, calibrateSizeByDeletes=true, maxMergeDocs=2147483647, maxCFSSegmentSizeMB=8.796093022207999E12, noCFSRatio=0.1]
   [junit4]   2> 1575723 INFO  (TEST-TestLazyCores.testLazySearch-seed#[5A8DADF59CCD5288]) [    x:collection4] o.a.s.s.SolrIndexSearcher Opening [Searcher@24afc2[collection4] main]
   [junit4]   2> 1575723 INFO  (TEST-TestLazyCores.testLazySearch-seed#[5A8DADF59CCD5288]) [    x:collection4] o.a.s.r.ManagedResourceStorage File-based storage initialized to use dir: /home/jenkins/workspace/Lucene-Solr-7.x-Linux/solr/build/solr-core/test/J1/temp/solr.core.TestLazyCores_5A8DADF59CCD5288-001/tempDir-001/collection4/conf
   [junit4]   2> 1575724 INFO  (TEST-TestLazyCores.testLazySearch-seed#[5A8DADF59CCD5288]) [    x:collection4] o.a.s.h.ReplicationHandler Commits will be reserved for 10000ms.
   [junit4]   2> 1575725 INFO  (TEST-TestLazyCores.testLazySearch-seed#[5A8DADF59CCD5288]) [    x:collection4] o.a.s.u.DirectUpdateHandler2 start commit{,optimize=false,openSearcher=true,waitSearcher=true,expungeDeletes=false,softCommit=false,prepareCommit=false}
   [junit4]   2> 1575726 INFO  (TEST-TestLazyCores.testLazySearch-seed#[5A8DADF59CCD5288]) [    x:collection4] o.a.s.u.SolrIndexWriter Calling setCommitData with IW:org.apache.solr.update.SolrIndexWriter@3f7c09 commitCommandVersion:0
   [junit4]   2> 1575731 INFO  (searcherExecutor-5622-thread-1-processing-x:collection4) [    x:collection4] o.a.s.c.SolrCore [collection4] Registered new searcher Searcher@24afc2[collection4] main{ExitableDirectoryReader(UninvertingDirectoryReader())}
   [junit4]   2> 1575761 INFO  (TEST-TestLazyCores.testLazySearch-seed#[5A8DADF59CCD5288]) [    x:collection4] o.a.s.s.SolrIndexSearcher Opening [Searcher@16d1c1f[collection4] main]
   [junit4]   2> 1575761 INFO  (TEST-TestLazyCores.testLazySearch-seed#[5A8DADF59CCD5288]) [    x:collection4] o.a.s.u.DirectUpdateHandler2 end_commit_flush
   [junit4]   2> 1575763 INFO  (searcherExecutor-5622-thread-1-processing-x:collection4) [    x:collection4] o.a.s.c.SolrCore [collection4] Registered new searcher Searcher@16d1c1f[collection4] main{ExitableDirectoryReader(UninvertingDirectoryReader(Uninverting(_0(7.3.0):c7)))}
   [junit4]   2> 1575767 INFO  (TEST-TestLazyCores.testLazySearch-seed#[5A8DADF59CCD5288]) [    x:collection4] o.a.s.c.S.Request [collection4]  webapp=null path=null params={q={!prefix+f%3Dv_t}hel&wt=xml} hits=2 status=0 QTime=4
   [junit4]   2> 1575770 INFO  (TEST-TestLazyCores.testLazySearch-seed#[5A8DADF59CCD5288]) [    x:collection4] o.a.s.c.S.Request [collection4]  webapp=null path=null params={q={!raw+f%3Dv_t}hello&wt=xml} hits=2 status=0 QTime=0
   [junit4]   2> 1575771 INFO  (TEST-TestLazyCores.testLazySearch-seed#[5A8DADF59CCD5288]) [    x:collection4] o.a.s.c.S.Request [collection4]  webapp=null path=null params={q={!raw+f%3Dv_t}Hello&wt=xml} hits=0 status=0 QTime=0
   [junit4]   2> 1575771 INFO  (TEST-TestLazyCores.testLazySearch-seed#[5A8DADF59CCD5288]) [    x:collection4] o.a.s.c.S.Request [collection4]  webapp=null path=null params={q={!raw+f%3Dv_f}1.5&wt=xml} hits=0 status=0 QTime=0
   [junit4]   2> 1575771 INFO  (TEST-TestLazyCores.testLazySearch-seed#[5A8DADF59CCD5288]) [    x:collection4] o.a.s.c.S.Request [collection1]  webapp=null path=null params={q={!raw+f%3Dv_t}hello&wt=xml} hits=0 status=0 QTime=0
   [junit4]   2> 1575771 INFO  (TEST-TestLazyCores.testLazySearch-seed#[5A8DADF59CCD5288]) [    x:collection4] o.a.s.c.CoreContainer Shutting down CoreContainer instance=25657885
   [junit4]   2> 1575772 INFO  (TEST-TestLazyCores.testLazySearch-seed#[5A8DADF59CCD5288]) [    x:collection4] o.a.s.m.SolrMetricManager Closing metric reporters for registry=solr.node, tag=null
   [junit4]   2> 1575772 INFO  (TEST-TestLazyCores.testLazySearch-seed#[5A8DADF59CCD5288]) [    x:collection4] o.a.s.m.r.SolrJmxReporter Closing reporter [org.apache.solr.metrics.reporters.SolrJmxReporter@12e7c01: rootName = null, domain = solr.node, service url = null, agent id = null] for registry solr.node / com.codahale.metrics.MetricRegistry@b35ffe
   [junit4]   2> 1575778 INFO  (TEST-TestLazyCores.testLazySearch-seed#[5A8DADF59CCD5288]) [    x:collection4] o.a.s.m.SolrMetricManager Closing metric reporters for registry=solr.jvm, tag=null
   [junit4]   2> 1575778 INFO  (TEST-TestLazyCores.testLazySearch-seed#[5A8DADF59CCD5288]) [    x:collection4] o.a.s.m.r.SolrJmxReporter Closing reporter [org.apache.solr.metrics.reporters.SolrJmxReporter@1a563a5: rootName = null, domain = solr.jvm, service url = null, agent id = null] for registry solr.jvm / com.codahale.metrics.MetricRegistry@a30fed
   [junit4]   2> 1575795 INFO  (TEST-TestLazyCores.testLazySearch-seed#[5A8DADF59CCD5288]) [    x:collection4] o.a.s.m.SolrMetricManager Closing metric reporters for registry=solr.jetty, tag=null
   [junit4]   2> 1575795 INFO  (TEST-TestLazyCores.testLazySearch-seed#[5A8DADF59CCD5288]) [    x:collection4] o.a.s.m.r.SolrJmxReporter Closing reporter [org.apache.solr.metrics.reporters.SolrJmxReporter@1e008fb: rootName = null, domain = solr.jetty, service url = null, agent id = null] for registry solr.jetty / com.codahale.metrics.MetricRegistry@1edb733
   [junit4]   2> 1575796 INFO  (coreCloseExecutor-5626-thread-1-processing-x:collection4) [    x:collection1] o.a.s.c.SolrCore [collection1]  CLOSING SolrCore org.apache.solr.core.SolrCore@fff860
   [junit4]   2> 1575796 INFO  (coreCloseExecutor-5626-thread-1-processing-x:collection4) [    x:collection1] o.a.s.m.SolrMetricManager Closing metric reporters for registry=solr.core.collection1, tag=16775264
   [junit4]   2> 1575796 INFO  (coreCloseExecutor-5626-thread-2-processing-x:collection4) [    x:collection5] o.a.s.c.SolrCore [collection5]  CLOSING SolrCore org.apache.solr.core.SolrCore@22f887
   [junit4]   2> 1575796 INFO  (coreCloseExecutor-5626-thread-1-processing-x:collection4) [    x:collection1] o.a.s.m.r.SolrJmxReporter Closing reporter [org.apache.solr.metrics.reporters.SolrJmxReporter@1c2a367: rootName = null, domain = solr.core.collection1, service url = null, agent id = null] for registry solr.core.collection1 / com.codahale.metrics.MetricRegistry@c8822a
   [junit4]   2> 1575796 INFO  (coreCloseExecutor-5626-thread-3-processing-x:collection4) [    x:collection4] o.a.s.c.SolrCore [collection4]  CLOSING SolrCore org.apache.solr.core.SolrCore@190d63a
   [junit4]   2> 1575796 INFO  (coreCloseExecutor-5626-thread-4-processing-x:collection4) [    x:collection2] o.a.s.c.SolrCore [collection2]  CLOSING SolrCore org.apache.solr.core.SolrCore@122ffdb
   [junit4]   2> 1575806 INFO  (coreCloseExecutor-5626-thread-2-processing-x:collection4) [    x:collection5] o.a.s.m.SolrMetricManager Closing metric reporters for registry=solr.core.collection5, tag=2291847
   [junit4]   2> 1575806 INFO  (coreCloseExecutor-5626-thread-2-processing-x:collection4) [    x:collection5] o.a.s.m.r.SolrJmxReporter Closing reporter [org.apache.solr.metrics.reporters.SolrJmxReporter@109b602: rootName = null, domain = solr.core.collection5, service url = null, agent id = null] for registry solr.core.collection5 / com.codahale.metrics.MetricRegistry@1a87bd3
   [junit4]   2> 1575815 INFO  (coreCloseExecutor-5626-thread-3-processing-x:collection4) [    x:collection4] o.a.s.m.SolrMetricManager Closing metric reporters for registry=solr.core.collection4, tag=26269242
   [junit4]   2> 1575815 INFO  (coreCloseExecutor-5626-thread-3-processing-x:collection4) [    x:collection4] o.a.s.m.r.SolrJmxReporter Closing reporter [org.apache.solr.metrics.reporters.SolrJmxReporter@1be8aff: rootName = null, domain = solr.core.collection4, service url = null, agent id = null] for registry solr.core.collection4 / com.codahale.metrics.MetricRegistry@1ba4f1a
   [junit4]   2> 1575825 INFO  (coreCloseExecutor-5626-thread-4-processing-x:collection4) [    x:collection2] o.a.s.m.SolrMetricManager Closing metric reporters for registry=solr.core.collection2, tag=19070939
   [junit4]   2> 1575825 INFO  (coreCloseExecutor-5626-thread-4-processing-x:collection4) [    x:collection2] o.a.s.m.r.SolrJmxReporter Closing reporter [org.apache.solr.metrics.reporters.SolrJmxReporter@637f81: rootName = null, domain = solr.core.collection2, service url = null, agent id = null] for registry solr.core.collection2 / com.codahale.metrics.MetricRegistry@9cffae
   [junit4]   2> 1575835 INFO  (TEST-TestLazyCores.testLazySearch-seed#[5A8DADF59CCD5288]) [    x:collection4] o.a.s.SolrTestCaseJ4 ###Ending testLazySearch
   [junit4]   2> 1575843 INFO  (TEST-TestLazyCores.testLazyLoad-seed#[5A8DADF59CCD5288]) [    x:collection4] o.a.s.SolrTestCaseJ4 ###Starting testLazyLoad
   [junit4]   2> 1575866 INFO  (TEST-TestLazyCores.testLazyLoad-seed#[5A8DADF59CCD5288]) [    x:collection4] o.a.s.c.SolrXmlConfig Loading container configuration from /home/jenkins/workspace/Lucene-Solr-7.x-Linux/solr/build/solr-core/test/J1/temp/solr.core.TestLazyCores_5A8DADF59CCD5288-001/tempDir-002/solr.xml
   [junit4]   2> 1575880 INFO  (TEST-TestLazyCores.testLazyLoad-seed#[5A8DADF59CCD5288]) [    x:collection4] o.a.s.c.SolrXmlConfig Configuration parameter autoReplicaFailoverWorkLoopDelay is ignored
   [junit4]   2> 1575880 INFO  (TEST-TestLazyCores.testLazyLoad-seed#[5A8DADF59CCD5288]) [    x:collection4] o.a.s.c.SolrXmlConfig Configuration parameter autoReplicaFailoverBadNodeExpiration is ignored
   [junit4]   2> 1575881 INFO  (TEST-TestLazyCores.testLazyLoad-seed#[5A8DADF59CCD5288]) [    x:collection4] o.a.s.c.SolrXmlConfig MBean server found: com.sun.jmx.mbeanserver.JmxMBeanServer@125cd92, but no JMX reporters were configured - adding default JMX reporter.
   [junit4]   2> 1575928 INFO  (TEST-TestLazyCores.testLazyLoad-seed#[5A8DADF59CCD5288]) [    x:collection4] o.a.s.m.r.SolrJmxReporter JMX monitoring for 'solr.node' (registry 'solr.node') enabled at server: com.sun.jmx.mbeanserver.JmxMBeanServer@125cd92
   [junit4]   2> 1575946 INFO  (TEST-TestLazyCores.testLazyLoad-seed#[5A8DADF59CCD5288]) [    x:collection4] o.a.s.m.r.SolrJmxReporter JMX monitoring for 'solr.jvm' (registry 'solr.jvm') enabled at server: com.sun.jmx.mbeanserver.JmxMBeanServer@125cd92
   [junit4]   2> 1575947 INFO  (TEST-TestLazyCores.testLazyLoad-seed#[5A8DADF59CCD5288]) [    x:collection4] o.a.s.m.r.SolrJmxReporter JMX monitoring for 'solr.jetty' (registry 'solr.jetty') enabled at server: com.sun.jmx.mbeanserver.JmxMBeanServer@125cd92
   [junit4]   2> 1575949 INFO  (TEST-TestLazyCores.testLazyLoad-seed#[5A8DADF59CCD5288]) [    x:collection4] o.a.s.c.TransientSolrCoreCacheDefault Allocating transient cache for 4 transient cores
   [junit4]   2> 1575962 INFO  (coreLoadExecutor-5633-thread-3-processing-x:collection4) [    x:collection5] o.a.s.c.SolrConfig Using Lucene MatchVersion: 7.3.0
   [junit4]   2> 1576059 INFO  (coreLoadExecutor-5633-thread-3-processing-x:collection4) [    x:collection5] o.a.s.s.IndexSchema [collection5] Schema name=tiny
   [junit4]   2> 1576060 INFO  (coreLoadExecutor-5633-thread-2-processing-x:collection4) [    x:collection2] o.a.s.c.SolrConfig Using Lucene MatchVersion: 7.3.0
   [junit4]   2> 1576095 INFO  (coreLoadExecutor-5633-thread-1-processing-x:collection4) [    x:collection1] o.a.s.c.SolrConfig Using Lucene MatchVersion: 7.3.0
   [junit4]   2> 1576096 INFO  (coreLoadExecutor-5633-thread-2-processing-x:collection4) [    x:collection2] o.a.s.s.IndexSchema [collection2] Schema name=tiny
   [junit4]   2> 1576096 INFO  (coreLoadExecutor-5633-thread-3-processing-x:collection4) [    x:collection5] o.a.s.s.IndexSchema Loaded schema tiny/1.1 with uniqueid field id
   [junit4]   2> 1576096 INFO  (coreLoadExecutor-5633-thread-3-processing-x:collection4) [    x:collection5] o.a.s.c.CoreContainer Creating SolrCore 'collection5' using configuration from instancedir /home/jenkins/workspace/Lucene-Solr-7.x-Linux/solr/build/solr-core/test/J1/temp/solr.core.TestLazyCores_5A8DADF59CCD5288-001/tempDir-002/./collection5, trusted=true
   [junit4]   2> 1576097 INFO  (coreLoadExecutor-5633-thread-3-processing-x:collection4) [    x:collection5] o.a.s.m.r.SolrJmxReporter JMX monitoring for 'solr.core.collection5' (registry 'solr.core.collection5') enabled at server: com.sun.jmx.mbeanserver.JmxMBeanServer@125cd92
   [junit4]   2> 1576097 INFO  (coreLoadExecutor-5633-thread-3-processing-x:collection4) [    x:collection5] o.a.s.c.SolrCore solr.RecoveryStrategy.Builder
   [junit4]   2> 1576097 INFO  (coreLoadExecutor-5633-thread-3-processing-x:collection4) [    x:collection5] o.a.s.c.SolrCore [[collection5] ] Opening new SolrCore at [/home/jenkins/workspace/Lucene-Solr-7.x-Linux/solr/build/solr-core/test/J1/temp/solr.core.TestLazyCores_5A8DADF59CCD5288-001/tempDir-002/collection5], dataDir=[/home/jenkins/workspace/Lucene-Solr-7.x-Linux/solr/build/solr-core/test/J1/temp/solr.core.TestLazyCores_5A8DADF59CCD5288-001/tempDir-002/./collection5/data/]
   [junit4]   2> 1576098 INFO  (coreLoadExecutor-5633-thread-2-processing-x:collection4) [    x:collection2] o.a.s.s.IndexSchema Loaded schema tiny/1.1 with uniqueid field id
   [junit4]   2> 1576098 INFO  (coreLoadExecutor-5633-thread-2-processing-x:collection4) [    x:collection2] o.a.s.c.CoreContainer Creating SolrCore 'collection2' using configuration from instancedir /home/jenkins/workspace/Lucene-Solr-7.x-Linux/solr/build/solr-core/test/J1/temp/solr.core.TestLazyCores_5A8DADF59CCD5288-001/tempDir-002/./collection2, trusted=true
   [junit4]   2> 1576098 INFO  (coreLoadExecutor-5633-thread-2-processing-x:collection4) [    x:collection2] o.a.s.m.r.SolrJmxReporter JMX monitoring for 'solr.core.collection2' (registry 'solr.core.collection2') enabled at server: com.sun.jmx.mbeanserver.JmxMBeanServer@125cd92
   [junit4]   2> 1576098 INFO  (coreLoadExecutor-5633-thread-2-processing-x:collection4) [    x:collection2] o.a.s.c.SolrCore solr.RecoveryStrategy.Builder
   [junit4]   2> 1576098 INFO  (coreLoadExecutor-5633-thread-2-processing-x:collection4) [    x:collection2] o.a.s.c.SolrCore [[collection2] ] Opening new SolrCore at [/home/jenkins/workspace/Lucene-Solr-7.x-Linux/solr/build/solr-core/test/J1/temp/solr.core.TestLazyCores_5A8DADF59CCD5288-001/tempDir-002/collection2], dataDir=[/home/jenkins/workspace/Lucene-Solr-7.x-Linux/solr/build/solr-core/test/J1/temp/solr.core.TestLazyCores_5A8DADF59CCD5288-001/tempDir-002/./collection2/data/]
   [junit4]   2> 1576099 INFO  (coreLoadExecutor-5633-thread-3-processing-x:collection4) [    x:collection5] o.a.s.u.RandomMergePolicy RandomMergePolicy wrapping class org.apache.lucene.index.TieredMergePolicy: [TieredMergePolicy: maxMergeAtOnce=36, maxMergeAtOnceExplicit=32, maxMergedSegmentMB=10.1103515625, floorSegmentMB=1.345703125, forceMergeDeletesPctAllowed=17.320160257802893, segmentsPerTier=12.0, maxCFSSegmentSizeMB=8.796093022207999E12, noCFSRatio=0.6545314499801845
   [junit4]   2> 1576126 INFO  (coreLoadExecutor-5633-thread-1-processing-x:collection4) [    x:collection1] o.a.s.s.IndexSchema [collection1] Schema name=tiny
   [junit4]   2> 1576128 INFO  (coreLoadExecutor-5633-thread-1-processing-x:collection4) [    x:collection1] o.a.s.s.IndexSchema Loaded schema tiny/1.1 with uniqueid field id
   [junit4]   2> 1576128 INFO  (coreLoadExecutor-5633-thread-1-processing-x:collection4) [    x:collection1] o.a.s.c.CoreContainer Creating SolrCore 'collection1' using configuration from instancedir /home/jenkins/workspace/Lucene-Solr-7.x-Linux/solr/build/solr-core/test/J1/temp/solr.core.TestLazyCores_5A8DADF59CCD5288-001/tempDir-002/./collection1, trusted=true
   [junit4]   2> 1576129 INFO  (coreLoadExecutor-5633-thread-1-processing-x:collection4) [    x:collection1] o.a.s.m.r.SolrJmxReporter JMX monitoring for 'solr.core.collection1' (registry 'solr.core.collection1') enabled at server: com.sun.jmx.mbeanserver.JmxMBeanServer@125cd92
   [junit4]   2> 1576129 INFO  (coreLoadExecutor-5633-thread-1-processing-x:collection4) [    x:collection1] o.a.s.c.SolrCore solr.RecoveryStrategy.Builder
   [junit4]   2> 1576129 INFO  (coreLoadExecutor-5633-thread-1-processing-x:collection4) [    x:collection1] o.a.s.c.SolrCore [[collection1] ] Opening new SolrCore at [/home/jenkins/workspace/Lucene-Solr-7.x-Linux/solr/build/solr-core/test/J1/temp/solr.core.TestLazyCores_5A8DADF59CCD5288-001/tempDir-002/collection1], dataDir=[/home/jenkins/workspace/Lucene-Solr-7.x-Linux/solr/build/solr-core/test/J1/temp/solr.core.TestLazyCores_5A8DADF59CCD5288-001/tempDir-002/./collection1/data/]
   [junit4]   2> 1576132 INFO  (coreLoadExecutor-5633-thread-1-processing-x:collection4) [    x:collection1] o.a.s.u.RandomMergePolicy RandomMergePolicy wrapping class org.apache.lucene.index.TieredMergePolicy: [TieredMergePolicy: maxMergeAtOnce=36, maxMergeAtOnceExplicit=32, maxMergedSegmentMB=10.1103515625, floorSegmentMB=1.345703125, forceMergeDeletesPctAllowed=17.320160257802893, segmentsPerTier=12.0, maxCFSSegmentSizeMB=8.796093022207999E12, noCFSRatio=0.6545314499801845
   [junit4]   2> 1576136 INFO  (coreLoadExecutor-5633-thread-2-processing-x:collection4) [    x:collection2] o.a.s.u.RandomMergePolicy RandomMergePolicy wrapping class org.apache.lucene.index.TieredMergePolicy: [TieredMergePolicy: maxMergeAtOnce=36, maxMergeAtOnceExplicit=32, maxMergedSegmentMB=10.1103515625, floorSegmentMB=1.345703125, forceMergeDeletesPctAllowed=17.320160257802893, segmentsPerTier=12.0, maxCFSSegmentSizeMB=8.796093022207999E12, noCFSRatio=0.6545314499801845
   [junit4]   2> 1576236 INFO  (coreLoadExecutor-5633-thread-3-processing-x:collection4) [    x:collection5] o.a.s.u.CommitTracker Hard AutoCommit: disabled
   [junit4]   2> 1576236 INFO  (coreLoadExecutor-5633-thread-3-processing-x:collection4) [    x:collection5] o.a.s.u.CommitTracker Soft AutoCommit: disabled
   [junit4]   2> 1576237 INFO  (coreLoadExecutor-5633-thread-3-processing-x:collection4) [    x:collection5] o.a.s.u.RandomMergePolicy RandomMergePolicy wrapping class org.apache.lucene.index.LogByteSizeMergePolicy: [LogByteSizeMergePolicy: minMergeSize=1677721, mergeFactor=28, maxMergeSize=2147483648, maxMergeSizeForForcedMerge=9223372036854775807, calibrateSizeByDeletes=false, maxMergeDocs=2147483647, maxCFSSegmentSizeMB=8.796093022207999E12, noCFSRatio=0.0]
   [junit4]   2> 1576237 INFO  (coreLoadExecutor-5633-thread-3-processing-x:collection4) [    x:collection5] o.a.s.s.SolrIndexSearcher Opening [Searcher@442dbb[collection5] main]
   [junit4]   2> 1576238 INFO  (coreLoadExecutor-5633-thread-3-processing-x:collection4) [    x:collection5] o.a.s.r.ManagedResourceStorage File-based storage initialized to use dir: /home/jenkins/workspace/Lucene-Solr-7.x-Linux/solr/build/solr-core/test/J1/temp/solr.core.TestLazyCores_5A8DADF59CCD5288-001/tempDir-002/collection5/conf
   [junit4]   2> 1576275 INFO  (coreLoadExecutor-5633-thread-3-processing-x:collection4) [    x:collection5] o.a.s.h.ReplicationHandler Commits will be reserved for 10000ms.
   [junit4]   2> 1576276 INFO  (searcherExecutor-5634-thread-1-processing-x:collection5) [    x:collection5] o.a.s.c.SolrCore [collection5] Registered new searcher Searcher@442dbb[collection5] main{ExitableDirectoryReader(UninvertingDirectoryReader())}
   [junit4]   2> 1576277 INFO  (coreLoadExecutor-5633-thread-2-processing-x:collection4) [    x:collection2] o.a.s.u.CommitTracker Hard AutoCommit: disabled
   [junit4]   2> 1576278 INFO  (coreLoadExecutor-5633-thread-2-processing-x:collection4) [    x:collection2] o.a.s.u.CommitTracker Soft AutoCommit: disabled
   [junit4]   2> 1576279 INFO  (coreLoadExecutor-5633-thread-1-processing-x:collection4) [    x:collection1] o.a.s.u.CommitTracker Hard AutoCommit: disabled
   [junit4]   2> 1576279 INFO  (coreLoadExecutor-5633-thread-1-processing-x:collection4) [    x:collection1] o.a.s.u.CommitTracker Soft AutoCommit: disabled
   [junit4]   2> 1576279 INFO  (coreLoadExecutor-5633-thread-2-processing-x:collection4) [    x:collection2] o.a.s.u.RandomMergePolicy RandomMergePolicy wrapping class org.apache.lucene.index.LogByteSizeMergePolicy: [LogByteSizeMergePolicy: minMergeSize=1677721, mergeFactor=28, maxMergeSize=2147483648, maxMergeSizeForForcedMerge=9223372036854775807, calibrateSizeByDeletes=false, maxMergeDocs=2147483647, maxCFSSegmentSizeMB=8.796093022207999E12, noCFSRatio=0.0]
   [junit4]   2> 1576279 INFO  (coreLoadExecutor-5633-thread-2-processing-x:collection4) [    x:collection2] o.a.s.s.SolrIndexSearcher Opening [Searcher@1e9e8b6[collection2] main]
   [junit4]   2> 1576279 INFO  (coreLoadExecutor-5633-thread-2-processing-x:collection4) [    x:collection2] o.a.s.r.ManagedResourceStorage File-based storage initialized to use dir: /home/jenkins/workspace/Lucene-Solr-7.x-Linux/solr/build/solr-core/test/J1/temp/solr.core.TestLazyCores_5A8DADF59CCD5288-001/tempDir-002/collection2/conf
   [junit4]   2> 1576280 INFO  (coreLoadExecutor-5633-thread-1-processing-x:collection4) [    x:collection1] o.a.s.u.RandomMergePolicy RandomMergePolicy wrapping class org.apache.lucene.index.LogByteSizeMergePolicy: [LogByteSizeMergePolicy: minMergeSize=1677721, mergeFactor=28, maxMergeSize=2147483648, maxMergeSizeForForcedMerge=9223372036854775807, calibrateSizeByDeletes=false, maxMergeDocs=2147483647, maxCFSSegmentSizeMB=8.796093022207999E12, noCFSRatio=0.0]
   [junit4]   2> 1576280 INFO  (coreLoadExecutor-5633-thread-1-processing-x:collection4) [    x:collection1] o.a.s.s.SolrIndexSearcher Opening [Searcher@1d7b7ec[collection1] main]
   [junit4]   2> 1576280 INFO  (coreLoadExecutor-5633-thread-2-processing-x:collection4) [    x:collection2] o.a.s.h.ReplicationHandler Commits will be reserved for 10000ms.
   [junit4]   2> 1576280 INFO  (coreLoadExecutor-5633-thread-1-processing-x:collection4) [    x:collection1] o.a.s.r.ManagedResourceStorage File-based storage initialized to use dir: /home/jenkins/workspace/Lucene-Solr-7.x-Linux/solr/build/solr-core/test/J1/temp/solr.core.TestLazyCores_5A8DADF59CCD5288-001/tempDir-002/collection1/conf
   [junit4]   2> 1576281 INFO  (coreLoadExecutor-5633-thread-1-processing-x:collection4) [    x:collection1] o.a.s.h.ReplicationHandler Commits will be reserved for 10000ms.
   [junit4]   2> 1576281 INFO  (searcherExecutor-5635-thread-1-processing-x:collection2) [    x:collection2] o.a.s.c.SolrCore [collection2] Registered new searcher Searcher@1e9e8b6[collection2] main{ExitableDirectoryReader(UninvertingDirectoryReader())}
   [junit4]   2> 1576282 INFO  (searcherExecutor-5636-thread-1-processing-x:collection1) [    x:collection1] o.a.s.c.SolrCore [collection1] Registered new searcher Searcher@1d7b7ec[collection1] main{ExitableDirectoryReader(UninvertingDirectoryReader())}
   [junit4]   2> 1576293 INFO  (TEST-TestLazyCores.testLazyLoad-seed#[5A8DADF59CCD5288]) [    x:collection4] o.a.s.c.SolrConfig Using Lucene MatchVersion: 7.3.0
   [junit4]   2> 1576353 INFO  (TEST-TestLazyCores.testLazyLoad-seed#[5A8DADF59CCD5288]) [    x:collection4] o.a.s.s.IndexSchema [collection3] Schema name=tiny
   [junit4]   2> 1576355 INFO  (TEST-TestLazyCores.testLazyLoad-seed#[5A8DADF59CCD5288]) [    x:collection4] o.a.s.s.IndexSchema Loaded schema tiny/1.1 with uniqueid field id
   [junit4]   2> 1576355 INFO  (TEST-TestLazyCores.testLazyLoad-seed#[5A8DADF59CCD5288]) [    x:collection4] o.a.s.c.CoreContainer Creating SolrCore 'collection3' using configuration from instancedir /home/jenkins/workspace/Lucene-Solr-7.x-Linux/solr/build/solr-core/test/J1/temp/solr.core.TestLazyCores_5A8DADF59CCD5288-001/tempDir-002/./collection3, trusted=true
   [junit4]   2> 1576356 INFO  (TEST-TestLazyCores.testLazyLoad-seed#[5A8DADF59CCD5288]) [    x:collection4] o.a.s.m.r.SolrJmxReporter JMX monitoring for 'solr.core.collection3' (registry 'solr.core.collection3') enabled at server: com.sun.jmx.mbeanserver.JmxMBeanServer@125cd92
   [junit4]   2> 1576356 INFO  (TEST-TestLazyCores.testLazyLoad-seed#[5A8DADF59CCD5288]) [    x:collection4] o.a.s.c.SolrCore solr.RecoveryStrategy.Builder
   [junit4]   2> 1576356 INFO  (TEST-TestLazyCores.testLazyLoad-seed#[5A8DADF59CCD5288]) [    x:collection4] o.a.s.c.SolrCore [[collection3] ] Opening new SolrCore at [/home/jenkins/workspace/Lucene-Solr-7.x-Linux/solr/build/solr-core/test/J1/temp/solr.core.TestLazyCores_5A8DADF59CCD5288-001/tempDir-002/collection3], dataDir=[/home/jenkins/workspace/Lucene-Solr-7.x-Linux/solr/build/solr-core/test/J1/temp/solr.core.TestLazyCores_5A8DADF59CCD5288-001/tempDir-002/./collection3/data/]
   [junit4]   2> 1576358 INFO  (TEST-TestLazyCores.testLazyLoad-seed#[5A8DADF59CCD5288]) [    x:collection4] o.a.s.u.RandomMergePolicy RandomMergePolicy wrapping class org.apache.lucene.index.TieredMergePolicy: [TieredMergePolicy: maxMergeAtOnce=41, maxMergeAtOnceExplicit=16, maxMergedSegmentMB=96.2216796875, floorSegmentMB=1.763671875, forceMergeDeletesPctAllowed=5.780836079464777, segmentsPerTier=19.0, maxCFSSegmentSizeMB=8.796093022207999E12, noCFSRatio=1.0
   [junit4]   2> 1576431 INFO  (TEST-TestLazyCores.testLazyLoad-seed#[5A8DADF59CCD5288]) [    x:collection4] o.a.s.u.CommitTracker Hard AutoCommit: disabled
   [junit4]   2> 1576432 INFO  (TEST-TestLazyCores.testLazyLoad-seed#[5A8DADF59CCD5288]) [    x:collection4] o.a.s.u.CommitTracker Soft AutoCommit: disabled
   [junit4]   2> 1576433 INFO  (TEST-TestLazyCores.testLazyLoad-seed#[5A8DADF59CCD5288]) [    x:collection4] o.a.s.u.RandomMergePolicy RandomMergePolicy wrapping class org.apache.lucene.index.LogByteSizeMergePolicy: [LogByteSizeMergePolicy: minMergeSize=1677721, mergeFactor=23, maxMergeSize=2147483648, maxMergeSizeForForcedMerge=9223372036854775807, calibrateSizeByDeletes=false, maxMergeDocs=2147483647, maxCFSSegmentSizeMB=8.796093022207999E12, noCFSRatio=0.4268970761361427]
   [junit4]   2> 1576433 INFO  (TEST-TestLazyCores.testLazyLoad-seed#[5A8DADF59CCD5288]) [    x:collection4] o.a.s.s.SolrIndexSearcher Opening [Searcher@1da3853[collection3] main]
   [junit4]   2> 1576433 INFO  (TEST-TestLazyCores.testLazyLoad-seed#[5A8DADF59CCD5288]) [    x:collection4] o.a.s.r.ManagedResourceStorage File-based storage initialized to use dir: /home/jenkins/workspace/Lucene-Solr-7.x-Linux/solr/build/solr-core/test/J1/temp/solr.core.TestLazyCores_5A8DADF59CCD5288-001/tempDir-002/collection3/conf
   [junit4]   2> 1576434 INFO  (TEST-TestLazyCores.testLazyLoad-seed#[5A8DADF59CCD5288]) [    x:collection4] o.a.s.h.ReplicationHandler Commits will be reserved for 10000ms.
   [junit4]   2> 1576445 INFO  (TEST-TestLazyCores.testLazyLoad-seed#[5A8DADF59CCD5288]) [    x:collection4] o.a.s.c.SolrConfig Using Lucene MatchVersion: 7.3.0
   [junit4]   2> 1576456 INFO  (searcherExecutor-5646-thread-1-processing-x:collection4) [    x:collection4] o.a.s.c.SolrCore [collection3] Registered new searcher Searcher@1da3853[collection3] main{ExitableDirectoryReader(UninvertingDirectoryReader())}
   [junit4]   2> 1576461 INFO  (TEST-TestLazyCores.testLazyLoad-seed#[5A8DADF59CCD5288]) [    x:collection4] o.a.s.s.IndexSchema [collection4] Schema name=tiny
   [junit4]   2> 1576479 INFO  (TEST-TestLazyCores.testLazyLoad-seed#[5A8DADF59CCD5288]) [    x:collection4] o.a.s.s.IndexSchema Loaded schema tiny/1.1 with uniqueid field id
   [junit4]   2> 1576479 INFO  (TEST-TestLazyCores.testLazyLoad-seed#[5A8DADF59CCD5288]) [    x:collection4] o.a.s.c.CoreContainer Creating SolrCore 'collection4' using configuration from instancedir /home/jenkins/workspace/Lucene-Solr-7.x-Linux/solr/build/solr-core/test/J1/temp/solr.core.TestLazyCores_5A8DADF59CCD5288-001/tempDir-002/./collection4, trusted=true
   [junit4]   2> 1576480 INFO  (TEST-TestLazyCores.testLazyLoad-seed#[5A8DADF59CCD5288]) [    x:collection4] o.a.s.m.r.SolrJmxReporter JMX monitoring for 'solr.core.collection4' (registry 'solr.core.collection4') enabled at server: com.sun.jmx.mbeanserver.JmxMBeanServer@125cd92
   [junit4]   2> 1576480 INFO  (TEST-TestLazyCores.testLazyLoad-seed#[5A8DADF59CCD5288]) [    x:collection4] o.a.s.c.SolrCore solr.RecoveryStrategy.Builder
   [junit4]   2> 1576480 INFO  (TEST-TestLazyCores.testLazyLoad-seed#[5A8DADF59CCD5288]) [    x:collection4] o.a.s.c.SolrCore [[collection4] ] Opening new SolrCore at [/home/jenkins/workspace/Lucene-Solr-7.x-Linux/solr/build/solr-core/test/J1/temp/solr.core.TestLazyCores_5A8DADF59CCD5288-001/tempDir-002/collection4], dataDir=[/home/jenkins/workspace/Lucene-Solr-7.x-Linux/solr/build/solr-core/test/J1/temp/solr.core.TestLazyCores_5A8DADF59CCD5288-001/tempDir-002/./collection4/data/]
   [junit4]   2> 1576485 INFO  (TEST-TestLazyCores.testLazyLoad-seed#[5A8DADF59CCD5288]) [    x:collection4] o.a.s.u.RandomMergePolicy RandomMergePolicy wrapping class org.apache.lucene.index.TieredMergePolicy: [TieredMergePolicy: maxMergeAtOnce=31, maxMergeAtOnceExplicit=39, maxMergedSegmentMB=64.9814453125, floorSegmentMB=0.51953125, forceMergeDeletesPctAllowed=27.816499439340173, segmentsPerTier=39.0, maxCFSSegmentSizeMB=8.796093022207999E12, noCFSRatio=0.0
   [junit4]   2> 1576549 INFO  (TEST-TestLazyCores.testLazyLoad-seed#[5A8DADF59CCD5288]) [    x:collection4] o.a.s.u.CommitTracker Hard AutoCommit: disabled
   [junit4]   2> 1576549 INFO  (TEST-TestLazyCores.testLazyLoad-seed#[5A8DADF59CCD5288]) [    x:collection4] o.a.s.u.CommitTracker Soft AutoCommit: disabled
   [junit4]   2> 1576561 INFO  (TEST-TestLazyCores.testLazyLoad-seed#[5A8DADF59CCD5288]) [    x:collection4] o.a.s.u.RandomMergePolicy RandomMergePolicy wrapping class org.apache.lucene.index.LogDocMergePolicy: [LogDocMergePolicy: minMergeSize=1000, mergeFactor=44, maxMergeSize=9223372036854775807, maxMergeSizeForForcedMerge=9223372036854775807, calibrateSizeByDeletes=false, maxMergeDocs=2147483647, maxCFSSegmentSizeMB=8.796093022207999E12, noCFSRatio=0.0]
   [junit4]   2> 1576562 INFO  (TEST-TestLazyCores.testLazyLoad-seed#[5A8DADF59CCD5288]) [    x:collection4] o.a.s.s.SolrIndexSearcher Opening [Searcher@16eb21e[collection4] main]
   [junit4]   2> 1576562 INFO  (TEST-TestLazyCores.testLazyLoad-seed#[5A8DADF59CCD5288]) [    x:collection4] o.a.s.r.ManagedResourceStorage File-based storage initialized to use dir: /home/jenkins/workspace/Lucene-Solr-7.x-Linux/solr/build/solr-core/test/J1/temp/solr.core.TestLazyCores_5A8DADF59CCD5288-001/tempDir-002/collection4/conf
   [junit4]   2> 1576563 INFO  (TEST-TestLazyCores.testLazyLoad-seed#[5A8DADF59CCD5288]) [    x:collection4] o.a.s.h.ReplicationHandler Commits will be reserved for 10000ms.
   [junit4]   2> 1576564 INFO  (TEST-TestLazyCores.testLazyLoad-seed#[5A8DADF59CCD5288]) [    x:collection4] o.a.s.c.CoreContainer Shutting down CoreContainer instance=15432056
   [junit4]   2> 1576564 INFO  (TEST-TestLazyCores.testLazyLoad-seed#[5A8DADF59CCD5288]) [    x:collection4] o.a.s.m.SolrMetricManager Closing metric reporters for registry=solr.node, tag=null
   [junit4]   2> 1576564 INFO  (TEST-TestLazyCores.testLazyLoad-seed#[5A8DADF59CCD5288]) [    x:collection4] o.a.s.m.r.SolrJmxReporter Closing reporter [org.apache.solr.metrics.reporters.SolrJmxReporter@1cef66a: rootName = null, domain = solr.node, service url = null, agent id = null] for registry solr.node / com.codahale.metrics.MetricRegistry@e3382d
   [junit4]   2> 1576570 INFO  (TEST-TestLazyCores.testLazyLoad-seed#[5A8DADF59CCD5288]) [    x:collection4] o.a.s.m.SolrMetricManager Closing metric reporters for registry=solr.jvm, tag=null
   [junit4]   2> 1576570 INFO  (TEST-TestLazyCores.testLazyLoad-seed#[5A8DADF59CCD5288]) [    x:collection4] o.a.s.m.r.SolrJmxReporter Closing reporter [org.apache.solr.metrics.reporters.SolrJmxReporter@615a09: rootName = null, domain = solr.jvm, service url = null, agent id = null] for registry solr.jvm / com.codahale.metrics.MetricRegistry@a30fed
   [junit4]   2> 1576571 INFO  (searcherExecutor-5650-thread-1-processing-x:collection4) [    x:collection4] o.a.s.c.SolrCore [collection4] Registered new searcher Searcher@16eb21e[collection4] main{ExitableDirectoryReader(UninvertingDirectoryReader())}
   [junit4]   2> 1576575 INFO  (TEST-TestLazyCores.testLazyLoad-seed#[5A8DADF59CCD5288]) [    x:collection4] o.a.s.m.SolrMetricManager Closing metric reporters for registry=solr.jetty, tag=null
   [junit4]   2> 1576575 INFO  (TEST-TestLazyCores.testLazyLoad-seed#[5A8DADF59CCD5288]) [    x:collection4] o.a.s.m.r.SolrJmxReporter Closing reporter [org.apache.solr.metrics.reporters.SolrJmxReporter@7588da: rootName = null, domain = solr.jetty, service url = null, agent id = null] for registry solr.jetty / com.codahale.metrics.MetricRegistry@1edb733
   [junit4]   2> 1576576 INFO  (coreCloseExecutor-5654-thread-1-processing-x:collection4) [    x:collection5] o.a.s.c.SolrCore [collection5]  CLOSING SolrCore org.apache.solr.core.SolrCore@1dd9ce5
   [junit4]   2> 1576576 INFO  (coreCloseExecutor-5654-thread-1-processing-x:collection4) [    x:collection5] o.a.s.m.SolrMetricManager Closing metric reporters for registry=solr.core.collection5, tag=31300837
   [junit4]   2> 1576576 INFO  (coreCloseExecutor-5654-thread-1-processing-x:collection4) [    x:collection5] o.a.s.m.r.SolrJmxReporter Closing reporter [org.apache.solr.metrics.reporters.SolrJmxReporter@131f58a: rootName = null, domain = solr.core.collection5, service url = null, agent id = null] for registry solr.core.collection5 / com.codahale.metrics.MetricRegistry@ae2763
   [junit4]   2> 1576580 INFO  (coreCloseExecutor-5654-thread-2-processing-x:collection4) [    x:collection1] o.a.s.c.SolrCore [collection1]  CLOSING SolrCore org.apache.solr.core.SolrCore@11bb692
   [junit4]   2> 1576583 INFO  (coreCloseExecutor-5654-thread-3-processing-x:collection4) [    x:collection4] o.a.s.c.SolrCore [collection4]  CLOSING SolrCore org.apache.solr.core.SolrCore@1d2251d
   [junit4]   2> 1576585 INFO  (coreCloseExecutor-5654-thread-4-processing-x:collection4) [    x:collection2] o.a.s.c.SolrCore [collection2]  CLOSING SolrCore org.apache.solr.core.SolrCore@30b49e
   [junit4]   2> 1576585 INFO  (coreCloseExecutor-5654-thread-4-processing-x:collection4) [    x:collection2] o.a.s.m.SolrMetricManager Closing metric reporters for registry=solr.core.collection2, tag=3191966
   [junit4]   2> 1576586 INFO  (coreCloseExecutor-5654-thread-4-processing-x:collection4) [    x:collection2] o.a.s.m.r.SolrJmxReporter Closing reporter [org.apache.solr.metrics.reporters.SolrJmxReporter@1635acf: rootName = null, domain = solr.core.collection2, service url = null, agent id = null] for registry solr.core.collection2 / com.codahale.metrics.MetricRegistry@15e4313
   [junit4]   2> 1576589 INFO  (coreCloseExecutor-5654-thread-5-processing-x:collection4) [    x:collection3] o.a.s.c.SolrCore [collection3]  CLOSING SolrCore org.apache.solr.core.SolrCore@119d664
   [junit4]   2> 1576595 INFO  (coreCloseExecutor-5654-thread-2-processing-x:collection4) [    x:collection1] o.a.s.m.SolrMetricManager Closing metric reporters for registry=solr.core.collection1, tag=18593426
   [junit4]   2> 1576595 INFO  (coreCloseExecutor-5654-thread-2-processing-x:collection4) [    x:collection1] o.a.s.m.r.SolrJmxReporter Closing reporter [org.apache.solr.metrics.reporters.SolrJmxReporter@1079da9: rootName = null, domain = solr.core.collection1, service url = null, agent id = null] for registry solr.core.collection1 / com.codahale.metrics.MetricRegistry@116eec8
   [junit4]   2> 1576604 INFO  (coreCloseExecutor-5654-thread-3-processing-x:collection4) [    x:collection4] o.a.s.m.SolrMetricManager Closing metric reporters for registry=solr.core.collection4, tag=30549277
   [junit4]   2> 1576604 INFO  (coreCloseExecutor-5654-thread-3-processing-x:collection4) [    x:collection4] o.a.s.m.r.SolrJmxReporter Closing reporter [org.apache.solr.metrics.reporters.SolrJmxReporter@146bc33: rootName = null, domain = solr.core.collection4, service url = null, agent id = null] for registry solr.core.collection4 / com.codahale.metrics.MetricRegistry@50b712
   [junit4]   2> 1576613 INFO  (coreCloseExecutor-5654-thread-5-processing-x:collection4) [    x:collection3] o.a.s.m.SolrMetricManager Closing metric reporters for registry=solr.core.collection3, tag=18470500
   [junit4]   2> 1576613 INFO  (coreCloseExecutor-5654-thread-5-processing-x:collection4) [    x:collection3] o.a.s.m.r.SolrJmxReporter Closing reporter [org.apache.solr.metrics.reporters.SolrJmxReporter@c5bb46: rootName = null, domain = solr.core.collection3, service url = null, agent id = null] for registry solr.core.collection3 / com.codahale.metrics.MetricRegistry@c86a47
   [junit4]   2> 1576662 INFO  (TEST-TestLazyCores.testLazyLoad-seed#[5A8DADF59CCD5288]) [    x:collection4] o.a.s.SolrTestCaseJ4 ###Ending testLazyLoad
   [junit4]   2> 1576664 INFO  (TEST-TestLazyCores.testCreateSame-seed#[5A8DADF59CCD5288]) [    x:collection4] o.a.s.SolrTestCaseJ4 ###Starting testCreateSame
   [junit4]   2> 1576676 INFO  (TEST-TestLazyCores.testCreateSame-seed#[5A8DADF59CCD5288]) [    x:collection4] o.a.s.c.SolrXmlConfig Loading container configuration from /home/jenkins/workspace/Lucene-Solr-7.x-Linux/solr/build/solr-core/test/J1/temp/solr.core.TestLazyCores_5A8DADF59CCD5288-001/tempDir-003/solr.xml
   [junit4]   2> 1576680 INFO  (TEST-TestLazyCores.testCreateSame-seed#[5A8DADF59CCD5288]) [    x:collection4] o.a.s.c.SolrXmlConfig Configuration parameter autoReplicaFailoverWorkLoopDelay is ignored
   [junit4]   2> 1576680 INFO  (TEST-TestLazyCores.testCreateSame-seed#[5A8DADF59CCD5288]) [    x:collection4] o.a.s.c.SolrXmlConfig Configuration parameter autoReplicaFailoverBadNodeExpiration is ignored
   [junit4]   2> 1576681 INFO  (TEST-TestLazyCores.testCreateSame-seed#[5A8DADF59CCD5288]) [    x:collection4] o.a.s.c.SolrXmlConfig MBean server found: com.sun.jmx.mbeanserver.JmxMBeanServer@125cd92, but no JMX reporters were configured - adding default JMX reporter.
   [junit4]   2> 1576724 INFO  (TEST-TestLazyCores.testCreateSame-seed#[5A8DADF59CCD5288]) [    x:collection4] o.a.s.m.r.SolrJmxReporter JMX monitoring for 'solr.node' (registry 'solr.node') enabled at server: com.sun.jmx.mbeanserver.JmxMBeanServer@125cd92
   [junit4]   2> 1576735 INFO  (TEST-TestLazyCores.testCreateSame-seed#[5A8DADF59CCD5288]) [    x:collection4] o.a.s.m.r.SolrJmxReporter JMX monitoring for 'solr.jvm' (registry 'solr.jvm') enabled at server: com.sun.jmx.mbeanserver.JmxMBeanServer@125cd92
   [junit4]   2> 1576735 INFO  (TEST-TestLazyCores.testCreateSame-seed#[5A8DADF59CCD5288]) [    x:collection4] o.a.s.m.r.SolrJmxReporter JMX monitoring for 'solr.jetty' (registry 'solr.jetty') enabled at server: com.sun.jmx.mbeanserver.JmxMBeanServer@125cd92
   [junit4]   2> 1576738 INFO  (TEST-TestLazyCores.testCreateSame-seed#[5A8DADF59CCD5288]) [    x:collection4] o.a.s.c.TransientSolrCoreCacheDefault Allocating transient cache for 4 transient cores
   [junit4]   2> 1576749 INFO  (coreLoadExecutor-5661-thread-2-processing-x:collection4) [    x:collection2] o.a.s.c.SolrConfig Using Lucene MatchVersion: 7.3.0
   [junit4]   2> 1576777 INFO  (coreLoadExecutor-5661-thread-3-processing-x:collection4) [    x:collection5] o.a.s.c.SolrConfig Using Lucene MatchVersion: 7.3.0
   [junit4]   2> 1576839 INFO  (coreLoadExecutor-5661-thread-2-processing-x:collection4) [    x:collection2] o.a.s.s.IndexSchema [collection2] Schema name=tiny
   [junit4]   2> 1576841 INFO  (coreLoadExecutor-5661-thread-1-processing-x:collection4) [    x:collection1] o.a.s.c.SolrConfig Using Lucene MatchVersion: 7.3.0
   [junit4]   2> 1576842 INFO  (coreLoadExecutor-5661-thread-2-processing-x:collection4) [    x:collection2] o.a.s.s.IndexSchema Loaded schema tiny/1.1 with uniqueid field id
   [junit4]   2> 1576842 INFO  (coreLoadExecutor-5661-thread-2-processing-x:collection4) [    x:collection2] o.a.s.c.CoreContainer Creating SolrCore 'collection2' using configuration from instancedir /home/jenkins/workspace/Lucene-Solr-7.x-Linux/solr/build/solr-core/test/J1/temp/solr.core.TestLazyCores_5A8DADF59CCD5288-001/tempDir-003/./collection2, trusted=true
   [junit4]   2> 1576842 INFO  (coreLoadExecutor-5661-thread-2-processing-x:collection4) [    x:collection2] o.a.s.m.r.SolrJmxReporter JMX monitoring for 'solr.core.collection2' (registry 'solr.core.collection2') enabled at server: com.sun.jmx.mbeanserver.JmxMBeanServer@125cd92
   [junit4]   2> 1576843 INFO  (coreLoadExecutor-5661-thread-2-processing-x:collection4) [    x:collection2] o.a.s.c.SolrCore solr.RecoveryStrategy.Builder
   [junit4]   2> 1576843 INFO  (coreLoadExecutor-5661-thread-2-processing-x:collection4) [    x:collection2] o.a.s.c.SolrCore [[collection2] ] Opening new SolrCore at [/home/jenkins/workspace/Lucene-Solr-7.x-Linux/solr/build/solr-core/test/J1/temp/solr.core.TestLazyCores_5A8DADF59CCD5288-001/tempDir-003/collection2], dataDir=[/home/jenkins/workspace/Lucene-Solr-7.x-Linux/solr/build/solr-core/test/J1/temp/solr.core.TestLazyCores_5A8DADF59CCD5288-001/tempDir-003/./collection2/data/]
   [junit4]   2> 1576865 INFO  (coreLoadExecutor-5661-thread-2-processing-x:collection4) [    x:collection2] o.a.s.u.RandomMergePolicy RandomMergePolicy wrapping class org.apache.lucene.index.TieredMergePolicy: [TieredMergePolicy: maxMergeAtOnce=36, maxMergeAtOnceExplicit=32, maxMergedSegmentMB=10.1103515625, floorSegmentMB=1.345703125, forceMergeDeletesPctAllowed=17.320160257802893, segmentsPerTier=12.0, maxCFSSegmentSizeMB=8.796093022207999E12, noCFSRatio=0.6545314499801845
   [junit4]   2> 1576868 INFO  (coreLoadExecutor-5661-thread-1-processing-x:collection4) [    x:collection1] o.a.s.s.IndexSchema [collection1] Schema name=tiny
   [junit4]   2> 1576870 INFO  (coreLoadExecutor-5661-thread-3-processing-x:collection4) [    x:collection5] o.a.s.s.IndexSchema [collection5] Schema name=tiny
   [junit4]   2> 1576888 INFO  (coreLoadExecutor-5661-thread-3-processing-x:collection4) [    x:collection5] o.a.s.s.IndexSchema Loaded schema tiny/1.1 with uniqueid field id
   [junit4]   2> 1576888 INFO  (coreLoadExecutor-5661-thread-3-processing-x:collection4) [    x:collection5] o.a.s.c.CoreContainer Creating SolrCore 'collection5' using configuration from instancedir /home/jenkins/workspace/Lucene-Solr-7.x-Linux/solr/build/solr-core/test/J1/temp/solr.core.TestLazyCores_5A8DADF59CCD5288-001/tempDir-003/./collection5, trusted=true
   [junit4]   2> 1576888 INFO  (coreLoadExecutor-5661-thread-3-processing-x:collection4) [    x:collection5] o.a.s.m.r.SolrJmxReporter JMX monitoring for 'solr.core.collection5' (registry 'solr.core.collection5') enabled at server: com.sun.jmx.mbeanserver.JmxMBeanServer@125cd92
   [junit4]   2> 1576888 INFO  (coreLoadExecutor-5661-thread-3-processing-x:collection4) [    x:collection5] o.a.s.c.SolrCore solr.RecoveryStrategy.Builder
   [junit4]   2> 1576889 INFO  (coreLoadExecutor-5661-thread-3-processing-x:collection4) [    x:collection5] o.a.s.c.SolrCore [[collection5] ] Opening new SolrCore at [/home/jenkins/workspace/Lucene-Solr-7.x-Linux/solr/build/solr-core/test/J1/temp/solr.core.TestLazyCores_5A8DADF59CCD5288-001/tempDir-003/collection5], dataDir=[/home/jenkins/workspace/Lucene-Solr-7.x-Linux/solr/build/solr-core/test/J1/temp/solr.core.TestLazyCores_5A8DADF59CCD5288-001/tempDir-003/./collection5/data/]
   [junit4]   2> 1576890 INFO  (coreLoadExecutor-5661-thread-1-processing-x:collection4) [    x:collection1] o.a.s.s.IndexSchema Loaded schema tiny/1.1 with uniqueid field id
   [junit4]   2> 1576890 INFO  (coreLoadExecutor-5661-thread-1-processing-x:collection4) [    x:collection1] o.a.s.c.CoreContainer Creating SolrCore 'collection1' using configuration from instancedir /home/jenkins/workspace/Lucene-Solr-7.x-Linux/solr/build/solr-core/test/J1/temp/solr.core.TestLazyCores_5A8DADF59CCD5288-001/tempDir-003/./collection1, trusted=true
   [junit4]   2> 1576895 INFO  (coreLoadExecutor-5661-thread-1-processing-x:collection4) [    x:collection1] o.a.s.m.r.SolrJmxReporter JMX monitoring for 'solr.core.collection1' (registry 'solr.core.collection1') enabled at server: com.sun.jmx.mbeanserver.JmxMBeanServer@125cd92
   [junit4]   2> 1576896 INFO  (coreLoadExecutor-5661-thread-1-processing-x:collection4) [    x:collection1] o.a.s.c.SolrCore solr.RecoveryStrategy.Builder
   [junit4]   2> 1576896 INFO  (coreLoadExecutor-5661-thread-1-processing-x:collection4) [    x:collection1] o.a.s.c.SolrCore [[collection1] ] Opening new SolrCore at [/home/jenkins/workspace/Lucene-Solr-7.x-Linux/solr/build/solr-core/test/J1/temp/solr.core.TestLazyCores_5A8DADF59CCD5288-001/tempDir-003/collection1], dataDir=[/home/jenkins/workspace/Lucene-Solr-7.x-Linux/solr/build/solr-core/test/J1/temp/solr.core.TestLazyCores_5A8DADF59CCD5288-001/tempDir-003/./collection1/data/]
   [junit4]   2> 1576902 INFO  (coreLoadExecutor-5661-thread-1-processing-x:collection4) [    x:collection1] o.a.s.u.RandomMergePolicy RandomMergePolicy wrapping class org.apache.lucene.index.TieredMergePolicy: [TieredMergePolicy: maxMergeAtOnce=36, maxMergeAtOnceExplicit=32, maxMergedSegmentMB=10.1103515625, floorSegmentMB=1.345703125, forceMergeDeletesPctAllowed=17.320160257802893, segmentsPerTier=12.0, maxCFSSegmentSizeMB=8.796093022207999E12, noCFSRatio=0.6545314499801845
   [junit4]   2> 1576903 INFO  (coreLoadExecutor-5661-thread-3-processing-x:collection4) [    x:collection5] o.a.s.u.RandomMergePolicy RandomMergePolicy wrapping class org.apache.lucene.index.TieredMergePolicy: [TieredMergePolicy: maxMergeAtOnce=36, maxMergeAtOnceExplicit=32, maxMergedSegmentMB=10.1103515625, floorSegmentMB=1.345703125, forceMergeDeletesPctAllowed=17.320160257802893, segmentsPerTier=12.0, maxCFSSegmentSizeMB=8.796093022207999E12, noCFSRatio=0.6545314499801845
   [junit4]   2> 1576987 INFO  (coreLoadExecutor-5661-thread-3-processing-x:collection4) [    x:collection5] o.a.s.u.CommitTracker Hard AutoCommit: disabled
   [junit4]   2> 1576987 INFO  (coreLoadExecutor-5661-thread-3-processing-x:collection4) [    x:collection5] o.a.s.u.CommitTracker Soft AutoCommit: disabled
   [junit4]   2> 1576988 INFO  (coreLoadExecutor-5661-thread-3-processing-x:collection4) [    x:collection5] o.a.s.u.RandomMergePolicy RandomMergePolicy wrapping class org.apache.lucene.index.LogByteSizeMergePolicy: [LogByteSizeMergePolicy: minMergeSize=1677721, mergeFactor=28, maxMergeSize=2147483648, maxMergeSizeForForcedMerge=9223372036854775807, calibrateSizeByDeletes=false, maxMergeDocs=2147483647, maxCFSSegmentSizeMB=8.796093022207999E12, noCFSRatio=0.0]
   [junit4]   2> 1576988 INFO  (coreLoadExecutor-5661-thread-3-processing-x:collection4) [    x:collection5] o.a.s.s.SolrIndexSearcher Opening [Searcher@d82b42[collection5] main]
   [junit4]   2> 1576989 INFO  (coreLoadExecutor-5661-thread-3-processing-x:collection4) [    x:collection5] o.a.s.r.ManagedResourceStorage File-based storage initialized to use dir: /home/jenkins/workspace/Lucene-Solr-7.x-Linux/solr/build/solr-core/test/J1/temp/solr.core.TestLazyCores_5A8DADF59CCD5288-001/tempDir-003/collection5/conf
   [junit4]   2> 1576989 INFO  (coreLoadExecutor-5661-thread-3-processing-x:collection4) [    x:collection5] o.a.s.h.ReplicationHandler Commits will be reserved for 10000ms.
   [junit4]   2> 1576992 INFO  (searcherExecutor-5663-thread-1-processing-x:collection5) [    x:collection5] o.a.s.c.SolrCore [collection5] Registered new searcher Searcher@d82b42[collection5] main{ExitableDirectoryReader(UninvertingDirectoryReader())}
   [junit4]   2> 1576999 INFO  (coreLoadExecutor-5661-thread-1-processing-x:collection4) [    x:collection1] o.a.s.u.CommitTracker Hard AutoCommit: disabled
   [junit4]   2> 1576999 INFO  (coreLoadExecutor-5661-thread-1-processing-x:collection4) [    x:collection1] o.a.s.u.CommitTracker Soft AutoCommit: disabled
   [junit4]   2> 1577000 INFO  (coreLoadExecutor-5661-thread-2-processing-x:collection4) [    x:collection2] o.a.s.u.CommitTracker Hard AutoCommit: disabled
   [junit4]   2> 1577000 INFO  (coreLoadExecutor-5661-

[...truncated too long message...]

ainer instance=32610505
   [junit4]   2> 1584350 INFO  (SUITE-TestLazyCores-seed#[5A8DADF59CCD5288]-worker) [    x:collection4] o.a.s.m.SolrMetricManager Closing metric reporters for registry=solr.node, tag=null
   [junit4]   2> 1584350 INFO  (SUITE-TestLazyCores-seed#[5A8DADF59CCD5288]-worker) [    x:collection4] o.a.s.m.SolrMetricManager Closing metric reporters for registry=solr.jvm, tag=null
   [junit4]   2> 1584350 INFO  (SUITE-TestLazyCores-seed#[5A8DADF59CCD5288]-worker) [    x:collection4] o.a.s.m.SolrMetricManager Closing metric reporters for registry=solr.jetty, tag=null
   [junit4]   2> NOTE: leaving temporary files on disk at: /home/jenkins/workspace/Lucene-Solr-7.x-Linux/solr/build/solr-core/test/J1/temp/solr.core.TestLazyCores_5A8DADF59CCD5288-001
   [junit4]   2> Dec 20, 2017 7:32:12 PM com.carrotsearch.randomizedtesting.ThreadLeakControl checkThreadLeaks
   [junit4]   2> WARNING: Will linger awaiting termination of 1 leaked thread(s).
   [junit4]   2> Dec 20, 2017 7:32:32 PM com.carrotsearch.randomizedtesting.ThreadLeakControl checkThreadLeaks
   [junit4]   2> SEVERE: 1 thread leaked from SUITE scope at org.apache.solr.core.TestLazyCores: 
   [junit4]   2>    1) Thread[id=17295, name=searcherExecutor-5861-thread-1, state=WAITING, group=TGRP-TestLazyCores]
   [junit4]   2>         at sun.misc.Unsafe.park(Native Method)
   [junit4]   2>         at java.util.concurrent.locks.LockSupport.park(LockSupport.java:175)
   [junit4]   2>         at java.util.concurrent.locks.AbstractQueuedSynchronizer$ConditionObject.await(AbstractQueuedSynchronizer.java:2039)
   [junit4]   2>         at java.util.concurrent.LinkedBlockingQueue.take(LinkedBlockingQueue.java:442)
   [junit4]   2>         at java.util.concurrent.ThreadPoolExecutor.getTask(ThreadPoolExecutor.java:1074)
   [junit4]   2>         at java.util.concurrent.ThreadPoolExecutor.runWorker(ThreadPoolExecutor.java:1134)
   [junit4]   2>         at java.util.concurrent.ThreadPoolExecutor$Worker.run(ThreadPoolExecutor.java:624)
   [junit4]   2>         at java.lang.Thread.run(Thread.java:748)
   [junit4]   2> Dec 20, 2017 7:32:32 PM com.carrotsearch.randomizedtesting.ThreadLeakControl tryToInterruptAll
   [junit4]   2> INFO: Starting to interrupt leaked threads:
   [junit4]   2>    1) Thread[id=17295, name=searcherExecutor-5861-thread-1, state=WAITING, group=TGRP-TestLazyCores]
   [junit4]   2> Dec 20, 2017 7:32:35 PM com.carrotsearch.randomizedtesting.ThreadLeakControl tryToInterruptAll
   [junit4]   2> SEVERE: There are still zombie threads that couldn't be terminated:
   [junit4]   2>    1) Thread[id=17295, name=searcherExecutor-5861-thread-1, state=WAITING, group=TGRP-TestLazyCores]
   [junit4]   2>         at sun.misc.Unsafe.park(Native Method)
   [junit4]   2>         at java.util.concurrent.locks.LockSupport.park(LockSupport.java:175)
   [junit4]   2>         at java.util.concurrent.locks.AbstractQueuedSynchronizer$ConditionObject.await(AbstractQueuedSynchronizer.java:2039)
   [junit4]   2>         at java.util.concurrent.LinkedBlockingQueue.take(LinkedBlockingQueue.java:442)
   [junit4]   2>         at java.util.concurrent.ThreadPoolExecutor.getTask(ThreadPoolExecutor.java:1074)
   [junit4]   2>         at java.util.concurrent.ThreadPoolExecutor.runWorker(ThreadPoolExecutor.java:1134)
   [junit4]   2>         at java.util.concurrent.ThreadPoolExecutor$Worker.run(ThreadPoolExecutor.java:624)
   [junit4]   2>         at java.lang.Thread.run(Thread.java:748)
   [junit4]   2> NOTE: test params are: codec=Asserting(Lucene70): {v_t=PostingsFormat(name=Asserting), id=PostingsFormat(name=Asserting), v_s=PostingsFormat(name=LuceneVarGapFixedInterval), v_f=PostingsFormat(name=Direct)}, docValues:{}, maxPointsInLeafNode=1091, maxMBSortInHeap=7.079492937425692, sim=RandomSimilarity(queryNorm=true): {}, locale=hu, timezone=Canada/Saskatchewan
   [junit4]   2> NOTE: Linux 4.10.0-40-generic i386/Oracle Corporation 1.8.0_144 (32-bit)/cpus=8,threads=2,free=63360680,total=335720448
   [junit4]   2> NOTE: All tests run in this JVM: [HdfsDirectoryTest, CollectionsAPIDistributedZkTest, TestFieldCache, BlockJoinFacetSimpleTest, MetricUtilsTest, ConcurrentDeleteAndCreateCollectionTest, JvmMetricsTest, TestFieldResource, SpellingQueryConverterTest, TestSmileRequest, ClassificationUpdateProcessorIntegrationTest, AutoScalingHandlerTest, TestPerFieldSimilarityWithDefaultOverride, TestCloudManagedSchema, DeleteLastCustomShardedReplicaTest, HttpSolrCallGetCoreTest, CdcrUpdateLogTest, AddReplicaTest, TestFieldSortValues, SchemaVersionSpecificBehaviorTest, SortSpecParsingTest, TestRTGBase, ClusterStateUpdateTest, TestNodeLostTrigger, MoveReplicaHDFSFailoverTest, TestPivotHelperCode, TestAtomicUpdateErrorCases, DocValuesMultiTest, TestNestedDocsSort, DistributedDebugComponentTest, DistributedFacetSimpleRefinementLongTailTest, TestDocSet, DeleteShardTest, DistribDocExpirationUpdateProcessorTest, TestExportWriter, TestJsonRequest, TestPayloadScoreQParserPlugin, TermVectorComponentDistributedTest, TestQuerySenderNoQuery, TestNamedUpdateProcessors, TestAnalyzedSuggestions, PreAnalyzedUpdateProcessorTest, TestSchemaVersionResource, SpellCheckCollatorWithCollapseTest, TestNoOpRegenerator, CoreSorterTest, MetricsHandlerTest, TestJavabinTupleStreamParser, TestTriggerIntegration, TestPseudoReturnFields, PolyFieldTest, LeaderFailureAfterFreshStartTest, NumericFieldsTest, ConvertedLegacyTest, TestSolrQueryParser, TestRemoteStreaming, DocumentAnalysisRequestHandlerTest, TestClassicSimilarityFactory, TestComplexPhraseLeadingWildcard, DistributedIntervalFacetingTest, BinaryUpdateRequestHandlerTest, TestReplicationHandlerBackup, TestLegacyFieldCache, TestBM25SimilarityFactory, TestFastLRUCache, SolrJmxReporterTest, PrimUtilsTest, ReplaceNodeTest, TestChildDocTransformer, TestFileDictionaryLookup, HdfsThreadLeakTest, TestOmitPositions, EnumFieldTest, SpatialHeatmapFacetsTest, DOMUtilTest, TestSolrCLIRunExample, CoreAdminRequestStatusTest, SignatureUpdateProcessorFactoryTest, TestSQLHandler, MoreLikeThisHandlerTest, InfixSuggestersTest, TestManagedStopFilterFactory, TestHalfAndHalfDocValues, ZkCLITest, SolrIndexSplitterTest, CurrencyFieldTypeTest, TestCollationField, LukeRequestHandlerTest, DistributedFacetPivotSmallTest, TestJettySolrRunner, DistributedQueryComponentOptimizationTest, SolrIndexMetricsTest, ShardSplitTest, UpdateLogTest, TestFaceting, ChaosMonkeySafeLeaderWithPullReplicasTest, CollectionTooManyReplicasTest, TestLegacyTerms, TestRuleBasedAuthorizationPlugin, QueryEqualityTest, TestConfigOverlay, TestCloudRecovery, TestRestManager, TestJmxIntegration, HdfsDirectoryFactoryTest, OpenCloseCoreStressTest, HdfsCollectionsAPIDistributedZkTest, CircularListTest, TestTolerantUpdateProcessorCloud, TestReloadDeadlock, TestMinMaxOnMultiValuedField, SynonymTokenizerTest, PathHierarchyTokenizerFactoryTest, CloudExitableDirectoryReaderTest, TestFastWriter, TestXIncludeConfig, SolrCLIZkUtilsTest, TestDynamicLoading, TestDistribIDF, OverriddenZkACLAndCredentialsProvidersTest, OverseerTest, ShardRoutingTest, TestRandomDVFaceting, TestHashPartitioner, TestRealTimeGet, TestStressReorder, TestReload, DistributedTermsComponentTest, SimpleFacetsTest, TestSolr4Spatial, SpellCheckComponentTest, SolrCmdDistributorTest, PeerSyncTest, BadIndexSchemaTest, TestSort, TestLazyCores]
   [junit4]   2> NOTE: reproduce with: ant test  -Dtestcase=TestLazyCores -Dtests.seed=5A8DADF59CCD5288 -Dtests.multiplier=3 -Dtests.slow=true -Dtests.locale=hu -Dtests.timezone=Canada/Saskatchewan -Dtests.asserts=true -Dtests.file.encoding=ISO-8859-1
   [junit4] ERROR   0.00s J1 | TestLazyCores (suite) <<<
   [junit4]    > Throwable #1: com.carrotsearch.randomizedtesting.ThreadLeakError: 1 thread leaked from SUITE scope at org.apache.solr.core.TestLazyCores: 
   [junit4]    >    1) Thread[id=17295, name=searcherExecutor-5861-thread-1, state=WAITING, group=TGRP-TestLazyCores]
   [junit4]    >         at sun.misc.Unsafe.park(Native Method)
   [junit4]    >         at java.util.concurrent.locks.LockSupport.park(LockSupport.java:175)
   [junit4]    >         at java.util.concurrent.locks.AbstractQueuedSynchronizer$ConditionObject.await(AbstractQueuedSynchronizer.java:2039)
   [junit4]    >         at java.util.concurrent.LinkedBlockingQueue.take(LinkedBlockingQueue.java:442)
   [junit4]    >         at java.util.concurrent.ThreadPoolExecutor.getTask(ThreadPoolExecutor.java:1074)
   [junit4]    >         at java.util.concurrent.ThreadPoolExecutor.runWorker(ThreadPoolExecutor.java:1134)
   [junit4]    >         at java.util.concurrent.ThreadPoolExecutor$Worker.run(ThreadPoolExecutor.java:624)
   [junit4]    >         at java.lang.Thread.run(Thread.java:748)
   [junit4]    > 	at __randomizedtesting.SeedInfo.seed([5A8DADF59CCD5288]:0)Throwable #2: com.carrotsearch.randomizedtesting.ThreadLeakError: There are still zombie threads that couldn't be terminated:
   [junit4]    >    1) Thread[id=17295, name=searcherExecutor-5861-thread-1, state=WAITING, group=TGRP-TestLazyCores]
   [junit4]    >         at sun.misc.Unsafe.park(Native Method)
   [junit4]    >         at java.util.concurrent.locks.LockSupport.park(LockSupport.java:175)
   [junit4]    >         at java.util.concurrent.locks.AbstractQueuedSynchronizer$ConditionObject.await(AbstractQueuedSynchronizer.java:2039)
   [junit4]    >         at java.util.concurrent.LinkedBlockingQueue.take(LinkedBlockingQueue.java:442)
   [junit4]    >         at java.util.concurrent.ThreadPoolExecutor.getTask(ThreadPoolExecutor.java:1074)
   [junit4]    >         at java.util.concurrent.ThreadPoolExecutor.runWorker(ThreadPoolExecutor.java:1134)
   [junit4]    >         at java.util.concurrent.ThreadPoolExecutor$Worker.run(ThreadPoolExecutor.java:624)
   [junit4]    >         at java.lang.Thread.run(Thread.java:748)
   [junit4]    > 	at __randomizedtesting.SeedInfo.seed([5A8DADF59CCD5288]:0)
   [junit4] Completed [383/763 (2!)] on J1 in 32.28s, 9 tests, 3 errors <<< FAILURES!

[...truncated 45046 lines...]

Mime
View raw message