lucene-dev mailing list archives

Site index · List index
Message view « Date » · « Thread »
Top « Date » · « Thread »
From Policeman Jenkins Server <jenk...@thetaphi.de>
Subject [JENKINS] Lucene-Solr-7.x-Windows (64bit/jdk1.8.0_144) - Build # 361 - Still Unstable!
Date Tue, 26 Dec 2017 15:31:40 GMT
Build: https://jenkins.thetaphi.de/job/Lucene-Solr-7.x-Windows/361/
Java: 64bit/jdk1.8.0_144 -XX:+UseCompressedOops -XX:+UseSerialGC

5 tests failed.
FAILED:  junit.framework.TestSuite.org.apache.solr.cloud.TestTlogReplica

Error Message:
ObjectTracker found 4 object(s) that were not released!!! [MockDirectoryWrapper, MockDirectoryWrapper, MockDirectoryWrapper, SolrCore] org.apache.solr.common.util.ObjectReleaseTracker$ObjectTrackerException: org.apache.lucene.store.MockDirectoryWrapper  at org.apache.solr.common.util.ObjectReleaseTracker.track(ObjectReleaseTracker.java:42)  at org.apache.solr.core.CachingDirectoryFactory.get(CachingDirectoryFactory.java:348)  at org.apache.solr.handler.IndexFetcher.fetchLatestIndex(IndexFetcher.java:501)  at org.apache.solr.handler.IndexFetcher.fetchLatestIndex(IndexFetcher.java:345)  at org.apache.solr.handler.ReplicationHandler.doFetch(ReplicationHandler.java:420)  at org.apache.solr.handler.ReplicationHandler.lambda$setupPolling$12(ReplicationHandler.java:1159)  at java.util.concurrent.Executors$RunnableAdapter.call(Executors.java:511)  at java.util.concurrent.FutureTask.runAndReset(FutureTask.java:308)  at java.util.concurrent.ScheduledThreadPoolExecutor$ScheduledFutureTask.access$301(ScheduledThreadPoolExecutor.java:180)  at java.util.concurrent.ScheduledThreadPoolExecutor$ScheduledFutureTask.run(ScheduledThreadPoolExecutor.java:294)  at java.util.concurrent.ThreadPoolExecutor.runWorker(ThreadPoolExecutor.java:1149)  at java.util.concurrent.ThreadPoolExecutor$Worker.run(ThreadPoolExecutor.java:624)  at java.lang.Thread.run(Thread.java:748)  org.apache.solr.common.util.ObjectReleaseTracker$ObjectTrackerException: org.apache.lucene.store.MockDirectoryWrapper  at org.apache.solr.common.util.ObjectReleaseTracker.track(ObjectReleaseTracker.java:42)  at org.apache.solr.core.CachingDirectoryFactory.get(CachingDirectoryFactory.java:348)  at org.apache.solr.update.SolrIndexWriter.create(SolrIndexWriter.java:92)  at org.apache.solr.core.SolrCore.initIndex(SolrCore.java:761)  at org.apache.solr.core.SolrCore.<init>(SolrCore.java:954)  at org.apache.solr.core.SolrCore.<init>(SolrCore.java:863)  at org.apache.solr.core.CoreContainer.createFromDescriptor(CoreContainer.java:1039)  at org.apache.solr.core.CoreContainer.create(CoreContainer.java:950)  at org.apache.solr.handler.admin.CoreAdminOperation.lambda$static$0(CoreAdminOperation.java:91)  at org.apache.solr.handler.admin.CoreAdminOperation.execute(CoreAdminOperation.java:384)  at org.apache.solr.handler.admin.CoreAdminHandler$CallInfo.call(CoreAdminHandler.java:389)  at org.apache.solr.handler.admin.CoreAdminHandler.handleRequestBody(CoreAdminHandler.java:174)  at org.apache.solr.handler.RequestHandlerBase.handleRequest(RequestHandlerBase.java:177)  at org.apache.solr.servlet.HttpSolrCall.handleAdmin(HttpSolrCall.java:736)  at org.apache.solr.servlet.HttpSolrCall.handleAdminRequest(HttpSolrCall.java:717)  at org.apache.solr.servlet.HttpSolrCall.call(HttpSolrCall.java:498)  at org.apache.solr.servlet.SolrDispatchFilter.doFilter(SolrDispatchFilter.java:382)  at org.apache.solr.servlet.SolrDispatchFilter.doFilter(SolrDispatchFilter.java:326)  at org.eclipse.jetty.servlet.ServletHandler$CachedChain.doFilter(ServletHandler.java:1759)  at org.apache.solr.client.solrj.embedded.JettySolrRunner$DebugFilter.doFilter(JettySolrRunner.java:139)  at org.eclipse.jetty.servlet.ServletHandler$CachedChain.doFilter(ServletHandler.java:1759)  at org.eclipse.jetty.servlet.ServletHandler.doHandle(ServletHandler.java:582)  at org.eclipse.jetty.server.session.SessionHandler.doHandle(SessionHandler.java:224)  at org.eclipse.jetty.server.handler.ContextHandler.doHandle(ContextHandler.java:1180)  at org.eclipse.jetty.servlet.ServletHandler.doScope(ServletHandler.java:512)  at org.eclipse.jetty.server.session.SessionHandler.doScope(SessionHandler.java:185)  at org.eclipse.jetty.server.handler.ContextHandler.doScope(ContextHandler.java:1112)  at org.eclipse.jetty.server.handler.ScopedHandler.handle(ScopedHandler.java:141)  at org.eclipse.jetty.server.handler.gzip.GzipHandler.handle(GzipHandler.java:426)  at org.eclipse.jetty.server.handler.HandlerWrapper.handle(HandlerWrapper.java:134)  at org.eclipse.jetty.server.Server.handle(Server.java:534)  at org.eclipse.jetty.server.HttpChannel.handle(HttpChannel.java:320)  at org.eclipse.jetty.server.HttpConnection.onFillable(HttpConnection.java:251)  at org.eclipse.jetty.io.AbstractConnection$ReadCallback.succeeded(AbstractConnection.java:283)  at org.eclipse.jetty.io.FillInterest.fillable(FillInterest.java:108)  at org.eclipse.jetty.io.SelectChannelEndPoint$2.run(SelectChannelEndPoint.java:93)  at org.eclipse.jetty.util.thread.strategy.ExecuteProduceConsume.executeProduceConsume(ExecuteProduceConsume.java:303)  at org.eclipse.jetty.util.thread.strategy.ExecuteProduceConsume.produceConsume(ExecuteProduceConsume.java:148)  at org.eclipse.jetty.util.thread.strategy.ExecuteProduceConsume.run(ExecuteProduceConsume.java:136)  at org.eclipse.jetty.util.thread.QueuedThreadPool.runJob(QueuedThreadPool.java:671)  at org.eclipse.jetty.util.thread.QueuedThreadPool$2.run(QueuedThreadPool.java:589)  at java.lang.Thread.run(Thread.java:748)  org.apache.solr.common.util.ObjectReleaseTracker$ObjectTrackerException: org.apache.lucene.store.MockDirectoryWrapper  at org.apache.solr.common.util.ObjectReleaseTracker.track(ObjectReleaseTracker.java:42)  at org.apache.solr.core.CachingDirectoryFactory.get(CachingDirectoryFactory.java:348)  at org.apache.solr.core.SolrCore.initSnapshotMetaDataManager(SolrCore.java:498)  at org.apache.solr.core.SolrCore.<init>(SolrCore.java:948)  at org.apache.solr.core.SolrCore.<init>(SolrCore.java:863)  at org.apache.solr.core.CoreContainer.createFromDescriptor(CoreContainer.java:1039)  at org.apache.solr.core.CoreContainer.create(CoreContainer.java:950)  at org.apache.solr.handler.admin.CoreAdminOperation.lambda$static$0(CoreAdminOperation.java:91)  at org.apache.solr.handler.admin.CoreAdminOperation.execute(CoreAdminOperation.java:384)  at org.apache.solr.handler.admin.CoreAdminHandler$CallInfo.call(CoreAdminHandler.java:389)  at org.apache.solr.handler.admin.CoreAdminHandler.handleRequestBody(CoreAdminHandler.java:174)  at org.apache.solr.handler.RequestHandlerBase.handleRequest(RequestHandlerBase.java:177)  at org.apache.solr.servlet.HttpSolrCall.handleAdmin(HttpSolrCall.java:736)  at org.apache.solr.servlet.HttpSolrCall.handleAdminRequest(HttpSolrCall.java:717)  at org.apache.solr.servlet.HttpSolrCall.call(HttpSolrCall.java:498)  at org.apache.solr.servlet.SolrDispatchFilter.doFilter(SolrDispatchFilter.java:382)  at org.apache.solr.servlet.SolrDispatchFilter.doFilter(SolrDispatchFilter.java:326)  at org.eclipse.jetty.servlet.ServletHandler$CachedChain.doFilter(ServletHandler.java:1759)  at org.apache.solr.client.solrj.embedded.JettySolrRunner$DebugFilter.doFilter(JettySolrRunner.java:139)  at org.eclipse.jetty.servlet.ServletHandler$CachedChain.doFilter(ServletHandler.java:1759)  at org.eclipse.jetty.servlet.ServletHandler.doHandle(ServletHandler.java:582)  at org.eclipse.jetty.server.session.SessionHandler.doHandle(SessionHandler.java:224)  at org.eclipse.jetty.server.handler.ContextHandler.doHandle(ContextHandler.java:1180)  at org.eclipse.jetty.servlet.ServletHandler.doScope(ServletHandler.java:512)  at org.eclipse.jetty.server.session.SessionHandler.doScope(SessionHandler.java:185)  at org.eclipse.jetty.server.handler.ContextHandler.doScope(ContextHandler.java:1112)  at org.eclipse.jetty.server.handler.ScopedHandler.handle(ScopedHandler.java:141)  at org.eclipse.jetty.server.handler.gzip.GzipHandler.handle(GzipHandler.java:426)  at org.eclipse.jetty.server.handler.HandlerWrapper.handle(HandlerWrapper.java:134)  at org.eclipse.jetty.server.Server.handle(Server.java:534)  at org.eclipse.jetty.server.HttpChannel.handle(HttpChannel.java:320)  at org.eclipse.jetty.server.HttpConnection.onFillable(HttpConnection.java:251)  at org.eclipse.jetty.io.AbstractConnection$ReadCallback.succeeded(AbstractConnection.java:283)  at org.eclipse.jetty.io.FillInterest.fillable(FillInterest.java:108)  at org.eclipse.jetty.io.SelectChannelEndPoint$2.run(SelectChannelEndPoint.java:93)  at org.eclipse.jetty.util.thread.strategy.ExecuteProduceConsume.executeProduceConsume(ExecuteProduceConsume.java:303)  at org.eclipse.jetty.util.thread.strategy.ExecuteProduceConsume.produceConsume(ExecuteProduceConsume.java:148)  at org.eclipse.jetty.util.thread.strategy.ExecuteProduceConsume.run(ExecuteProduceConsume.java:136)  at org.eclipse.jetty.util.thread.QueuedThreadPool.runJob(QueuedThreadPool.java:671)  at org.eclipse.jetty.util.thread.QueuedThreadPool$2.run(QueuedThreadPool.java:589)  at java.lang.Thread.run(Thread.java:748)  org.apache.solr.common.util.ObjectReleaseTracker$ObjectTrackerException: org.apache.solr.core.SolrCore  at org.apache.solr.common.util.ObjectReleaseTracker.track(ObjectReleaseTracker.java:42)  at org.apache.solr.core.SolrCore.<init>(SolrCore.java:1039)  at org.apache.solr.core.SolrCore.<init>(SolrCore.java:863)  at org.apache.solr.core.CoreContainer.createFromDescriptor(CoreContainer.java:1039)  at org.apache.solr.core.CoreContainer.create(CoreContainer.java:950)  at org.apache.solr.handler.admin.CoreAdminOperation.lambda$static$0(CoreAdminOperation.java:91)  at org.apache.solr.handler.admin.CoreAdminOperation.execute(CoreAdminOperation.java:384)  at org.apache.solr.handler.admin.CoreAdminHandler$CallInfo.call(CoreAdminHandler.java:389)  at org.apache.solr.handler.admin.CoreAdminHandler.handleRequestBody(CoreAdminHandler.java:174)  at org.apache.solr.handler.RequestHandlerBase.handleRequest(RequestHandlerBase.java:177)  at org.apache.solr.servlet.HttpSolrCall.handleAdmin(HttpSolrCall.java:736)  at org.apache.solr.servlet.HttpSolrCall.handleAdminRequest(HttpSolrCall.java:717)  at org.apache.solr.servlet.HttpSolrCall.call(HttpSolrCall.java:498)  at org.apache.solr.servlet.SolrDispatchFilter.doFilter(SolrDispatchFilter.java:382)  at org.apache.solr.servlet.SolrDispatchFilter.doFilter(SolrDispatchFilter.java:326)  at org.eclipse.jetty.servlet.ServletHandler$CachedChain.doFilter(ServletHandler.java:1759)  at org.apache.solr.client.solrj.embedded.JettySolrRunner$DebugFilter.doFilter(JettySolrRunner.java:139)  at org.eclipse.jetty.servlet.ServletHandler$CachedChain.doFilter(ServletHandler.java:1759)  at org.eclipse.jetty.servlet.ServletHandler.doHandle(ServletHandler.java:582)  at org.eclipse.jetty.server.session.SessionHandler.doHandle(SessionHandler.java:224)  at org.eclipse.jetty.server.handler.ContextHandler.doHandle(ContextHandler.java:1180)  at org.eclipse.jetty.servlet.ServletHandler.doScope(ServletHandler.java:512)  at org.eclipse.jetty.server.session.SessionHandler.doScope(SessionHandler.java:185)  at org.eclipse.jetty.server.handler.ContextHandler.doScope(ContextHandler.java:1112)  at org.eclipse.jetty.server.handler.ScopedHandler.handle(ScopedHandler.java:141)  at org.eclipse.jetty.server.handler.gzip.GzipHandler.handle(GzipHandler.java:426)  at org.eclipse.jetty.server.handler.HandlerWrapper.handle(HandlerWrapper.java:134)  at org.eclipse.jetty.server.Server.handle(Server.java:534)  at org.eclipse.jetty.server.HttpChannel.handle(HttpChannel.java:320)  at org.eclipse.jetty.server.HttpConnection.onFillable(HttpConnection.java:251)  at org.eclipse.jetty.io.AbstractConnection$ReadCallback.succeeded(AbstractConnection.java:283)  at org.eclipse.jetty.io.FillInterest.fillable(FillInterest.java:108)  at org.eclipse.jetty.io.SelectChannelEndPoint$2.run(SelectChannelEndPoint.java:93)  at org.eclipse.jetty.util.thread.strategy.ExecuteProduceConsume.executeProduceConsume(ExecuteProduceConsume.java:303)  at org.eclipse.jetty.util.thread.strategy.ExecuteProduceConsume.produceConsume(ExecuteProduceConsume.java:148)  at org.eclipse.jetty.util.thread.strategy.ExecuteProduceConsume.run(ExecuteProduceConsume.java:136)  at org.eclipse.jetty.util.thread.QueuedThreadPool.runJob(QueuedThreadPool.java:671)  at org.eclipse.jetty.util.thread.QueuedThreadPool$2.run(QueuedThreadPool.java:589)  at java.lang.Thread.run(Thread.java:748)  

Stack Trace:
java.lang.AssertionError: ObjectTracker found 4 object(s) that were not released!!! [MockDirectoryWrapper, MockDirectoryWrapper, MockDirectoryWrapper, SolrCore]
org.apache.solr.common.util.ObjectReleaseTracker$ObjectTrackerException: org.apache.lucene.store.MockDirectoryWrapper
	at org.apache.solr.common.util.ObjectReleaseTracker.track(ObjectReleaseTracker.java:42)
	at org.apache.solr.core.CachingDirectoryFactory.get(CachingDirectoryFactory.java:348)
	at org.apache.solr.handler.IndexFetcher.fetchLatestIndex(IndexFetcher.java:501)
	at org.apache.solr.handler.IndexFetcher.fetchLatestIndex(IndexFetcher.java:345)
	at org.apache.solr.handler.ReplicationHandler.doFetch(ReplicationHandler.java:420)
	at org.apache.solr.handler.ReplicationHandler.lambda$setupPolling$12(ReplicationHandler.java:1159)
	at java.util.concurrent.Executors$RunnableAdapter.call(Executors.java:511)
	at java.util.concurrent.FutureTask.runAndReset(FutureTask.java:308)
	at java.util.concurrent.ScheduledThreadPoolExecutor$ScheduledFutureTask.access$301(ScheduledThreadPoolExecutor.java:180)
	at java.util.concurrent.ScheduledThreadPoolExecutor$ScheduledFutureTask.run(ScheduledThreadPoolExecutor.java:294)
	at java.util.concurrent.ThreadPoolExecutor.runWorker(ThreadPoolExecutor.java:1149)
	at java.util.concurrent.ThreadPoolExecutor$Worker.run(ThreadPoolExecutor.java:624)
	at java.lang.Thread.run(Thread.java:748)

org.apache.solr.common.util.ObjectReleaseTracker$ObjectTrackerException: org.apache.lucene.store.MockDirectoryWrapper
	at org.apache.solr.common.util.ObjectReleaseTracker.track(ObjectReleaseTracker.java:42)
	at org.apache.solr.core.CachingDirectoryFactory.get(CachingDirectoryFactory.java:348)
	at org.apache.solr.update.SolrIndexWriter.create(SolrIndexWriter.java:92)
	at org.apache.solr.core.SolrCore.initIndex(SolrCore.java:761)
	at org.apache.solr.core.SolrCore.<init>(SolrCore.java:954)
	at org.apache.solr.core.SolrCore.<init>(SolrCore.java:863)
	at org.apache.solr.core.CoreContainer.createFromDescriptor(CoreContainer.java:1039)
	at org.apache.solr.core.CoreContainer.create(CoreContainer.java:950)
	at org.apache.solr.handler.admin.CoreAdminOperation.lambda$static$0(CoreAdminOperation.java:91)
	at org.apache.solr.handler.admin.CoreAdminOperation.execute(CoreAdminOperation.java:384)
	at org.apache.solr.handler.admin.CoreAdminHandler$CallInfo.call(CoreAdminHandler.java:389)
	at org.apache.solr.handler.admin.CoreAdminHandler.handleRequestBody(CoreAdminHandler.java:174)
	at org.apache.solr.handler.RequestHandlerBase.handleRequest(RequestHandlerBase.java:177)
	at org.apache.solr.servlet.HttpSolrCall.handleAdmin(HttpSolrCall.java:736)
	at org.apache.solr.servlet.HttpSolrCall.handleAdminRequest(HttpSolrCall.java:717)
	at org.apache.solr.servlet.HttpSolrCall.call(HttpSolrCall.java:498)
	at org.apache.solr.servlet.SolrDispatchFilter.doFilter(SolrDispatchFilter.java:382)
	at org.apache.solr.servlet.SolrDispatchFilter.doFilter(SolrDispatchFilter.java:326)
	at org.eclipse.jetty.servlet.ServletHandler$CachedChain.doFilter(ServletHandler.java:1759)
	at org.apache.solr.client.solrj.embedded.JettySolrRunner$DebugFilter.doFilter(JettySolrRunner.java:139)
	at org.eclipse.jetty.servlet.ServletHandler$CachedChain.doFilter(ServletHandler.java:1759)
	at org.eclipse.jetty.servlet.ServletHandler.doHandle(ServletHandler.java:582)
	at org.eclipse.jetty.server.session.SessionHandler.doHandle(SessionHandler.java:224)
	at org.eclipse.jetty.server.handler.ContextHandler.doHandle(ContextHandler.java:1180)
	at org.eclipse.jetty.servlet.ServletHandler.doScope(ServletHandler.java:512)
	at org.eclipse.jetty.server.session.SessionHandler.doScope(SessionHandler.java:185)
	at org.eclipse.jetty.server.handler.ContextHandler.doScope(ContextHandler.java:1112)
	at org.eclipse.jetty.server.handler.ScopedHandler.handle(ScopedHandler.java:141)
	at org.eclipse.jetty.server.handler.gzip.GzipHandler.handle(GzipHandler.java:426)
	at org.eclipse.jetty.server.handler.HandlerWrapper.handle(HandlerWrapper.java:134)
	at org.eclipse.jetty.server.Server.handle(Server.java:534)
	at org.eclipse.jetty.server.HttpChannel.handle(HttpChannel.java:320)
	at org.eclipse.jetty.server.HttpConnection.onFillable(HttpConnection.java:251)
	at org.eclipse.jetty.io.AbstractConnection$ReadCallback.succeeded(AbstractConnection.java:283)
	at org.eclipse.jetty.io.FillInterest.fillable(FillInterest.java:108)
	at org.eclipse.jetty.io.SelectChannelEndPoint$2.run(SelectChannelEndPoint.java:93)
	at org.eclipse.jetty.util.thread.strategy.ExecuteProduceConsume.executeProduceConsume(ExecuteProduceConsume.java:303)
	at org.eclipse.jetty.util.thread.strategy.ExecuteProduceConsume.produceConsume(ExecuteProduceConsume.java:148)
	at org.eclipse.jetty.util.thread.strategy.ExecuteProduceConsume.run(ExecuteProduceConsume.java:136)
	at org.eclipse.jetty.util.thread.QueuedThreadPool.runJob(QueuedThreadPool.java:671)
	at org.eclipse.jetty.util.thread.QueuedThreadPool$2.run(QueuedThreadPool.java:589)
	at java.lang.Thread.run(Thread.java:748)

org.apache.solr.common.util.ObjectReleaseTracker$ObjectTrackerException: org.apache.lucene.store.MockDirectoryWrapper
	at org.apache.solr.common.util.ObjectReleaseTracker.track(ObjectReleaseTracker.java:42)
	at org.apache.solr.core.CachingDirectoryFactory.get(CachingDirectoryFactory.java:348)
	at org.apache.solr.core.SolrCore.initSnapshotMetaDataManager(SolrCore.java:498)
	at org.apache.solr.core.SolrCore.<init>(SolrCore.java:948)
	at org.apache.solr.core.SolrCore.<init>(SolrCore.java:863)
	at org.apache.solr.core.CoreContainer.createFromDescriptor(CoreContainer.java:1039)
	at org.apache.solr.core.CoreContainer.create(CoreContainer.java:950)
	at org.apache.solr.handler.admin.CoreAdminOperation.lambda$static$0(CoreAdminOperation.java:91)
	at org.apache.solr.handler.admin.CoreAdminOperation.execute(CoreAdminOperation.java:384)
	at org.apache.solr.handler.admin.CoreAdminHandler$CallInfo.call(CoreAdminHandler.java:389)
	at org.apache.solr.handler.admin.CoreAdminHandler.handleRequestBody(CoreAdminHandler.java:174)
	at org.apache.solr.handler.RequestHandlerBase.handleRequest(RequestHandlerBase.java:177)
	at org.apache.solr.servlet.HttpSolrCall.handleAdmin(HttpSolrCall.java:736)
	at org.apache.solr.servlet.HttpSolrCall.handleAdminRequest(HttpSolrCall.java:717)
	at org.apache.solr.servlet.HttpSolrCall.call(HttpSolrCall.java:498)
	at org.apache.solr.servlet.SolrDispatchFilter.doFilter(SolrDispatchFilter.java:382)
	at org.apache.solr.servlet.SolrDispatchFilter.doFilter(SolrDispatchFilter.java:326)
	at org.eclipse.jetty.servlet.ServletHandler$CachedChain.doFilter(ServletHandler.java:1759)
	at org.apache.solr.client.solrj.embedded.JettySolrRunner$DebugFilter.doFilter(JettySolrRunner.java:139)
	at org.eclipse.jetty.servlet.ServletHandler$CachedChain.doFilter(ServletHandler.java:1759)
	at org.eclipse.jetty.servlet.ServletHandler.doHandle(ServletHandler.java:582)
	at org.eclipse.jetty.server.session.SessionHandler.doHandle(SessionHandler.java:224)
	at org.eclipse.jetty.server.handler.ContextHandler.doHandle(ContextHandler.java:1180)
	at org.eclipse.jetty.servlet.ServletHandler.doScope(ServletHandler.java:512)
	at org.eclipse.jetty.server.session.SessionHandler.doScope(SessionHandler.java:185)
	at org.eclipse.jetty.server.handler.ContextHandler.doScope(ContextHandler.java:1112)
	at org.eclipse.jetty.server.handler.ScopedHandler.handle(ScopedHandler.java:141)
	at org.eclipse.jetty.server.handler.gzip.GzipHandler.handle(GzipHandler.java:426)
	at org.eclipse.jetty.server.handler.HandlerWrapper.handle(HandlerWrapper.java:134)
	at org.eclipse.jetty.server.Server.handle(Server.java:534)
	at org.eclipse.jetty.server.HttpChannel.handle(HttpChannel.java:320)
	at org.eclipse.jetty.server.HttpConnection.onFillable(HttpConnection.java:251)
	at org.eclipse.jetty.io.AbstractConnection$ReadCallback.succeeded(AbstractConnection.java:283)
	at org.eclipse.jetty.io.FillInterest.fillable(FillInterest.java:108)
	at org.eclipse.jetty.io.SelectChannelEndPoint$2.run(SelectChannelEndPoint.java:93)
	at org.eclipse.jetty.util.thread.strategy.ExecuteProduceConsume.executeProduceConsume(ExecuteProduceConsume.java:303)
	at org.eclipse.jetty.util.thread.strategy.ExecuteProduceConsume.produceConsume(ExecuteProduceConsume.java:148)
	at org.eclipse.jetty.util.thread.strategy.ExecuteProduceConsume.run(ExecuteProduceConsume.java:136)
	at org.eclipse.jetty.util.thread.QueuedThreadPool.runJob(QueuedThreadPool.java:671)
	at org.eclipse.jetty.util.thread.QueuedThreadPool$2.run(QueuedThreadPool.java:589)
	at java.lang.Thread.run(Thread.java:748)

org.apache.solr.common.util.ObjectReleaseTracker$ObjectTrackerException: org.apache.solr.core.SolrCore
	at org.apache.solr.common.util.ObjectReleaseTracker.track(ObjectReleaseTracker.java:42)
	at org.apache.solr.core.SolrCore.<init>(SolrCore.java:1039)
	at org.apache.solr.core.SolrCore.<init>(SolrCore.java:863)
	at org.apache.solr.core.CoreContainer.createFromDescriptor(CoreContainer.java:1039)
	at org.apache.solr.core.CoreContainer.create(CoreContainer.java:950)
	at org.apache.solr.handler.admin.CoreAdminOperation.lambda$static$0(CoreAdminOperation.java:91)
	at org.apache.solr.handler.admin.CoreAdminOperation.execute(CoreAdminOperation.java:384)
	at org.apache.solr.handler.admin.CoreAdminHandler$CallInfo.call(CoreAdminHandler.java:389)
	at org.apache.solr.handler.admin.CoreAdminHandler.handleRequestBody(CoreAdminHandler.java:174)
	at org.apache.solr.handler.RequestHandlerBase.handleRequest(RequestHandlerBase.java:177)
	at org.apache.solr.servlet.HttpSolrCall.handleAdmin(HttpSolrCall.java:736)
	at org.apache.solr.servlet.HttpSolrCall.handleAdminRequest(HttpSolrCall.java:717)
	at org.apache.solr.servlet.HttpSolrCall.call(HttpSolrCall.java:498)
	at org.apache.solr.servlet.SolrDispatchFilter.doFilter(SolrDispatchFilter.java:382)
	at org.apache.solr.servlet.SolrDispatchFilter.doFilter(SolrDispatchFilter.java:326)
	at org.eclipse.jetty.servlet.ServletHandler$CachedChain.doFilter(ServletHandler.java:1759)
	at org.apache.solr.client.solrj.embedded.JettySolrRunner$DebugFilter.doFilter(JettySolrRunner.java:139)
	at org.eclipse.jetty.servlet.ServletHandler$CachedChain.doFilter(ServletHandler.java:1759)
	at org.eclipse.jetty.servlet.ServletHandler.doHandle(ServletHandler.java:582)
	at org.eclipse.jetty.server.session.SessionHandler.doHandle(SessionHandler.java:224)
	at org.eclipse.jetty.server.handler.ContextHandler.doHandle(ContextHandler.java:1180)
	at org.eclipse.jetty.servlet.ServletHandler.doScope(ServletHandler.java:512)
	at org.eclipse.jetty.server.session.SessionHandler.doScope(SessionHandler.java:185)
	at org.eclipse.jetty.server.handler.ContextHandler.doScope(ContextHandler.java:1112)
	at org.eclipse.jetty.server.handler.ScopedHandler.handle(ScopedHandler.java:141)
	at org.eclipse.jetty.server.handler.gzip.GzipHandler.handle(GzipHandler.java:426)
	at org.eclipse.jetty.server.handler.HandlerWrapper.handle(HandlerWrapper.java:134)
	at org.eclipse.jetty.server.Server.handle(Server.java:534)
	at org.eclipse.jetty.server.HttpChannel.handle(HttpChannel.java:320)
	at org.eclipse.jetty.server.HttpConnection.onFillable(HttpConnection.java:251)
	at org.eclipse.jetty.io.AbstractConnection$ReadCallback.succeeded(AbstractConnection.java:283)
	at org.eclipse.jetty.io.FillInterest.fillable(FillInterest.java:108)
	at org.eclipse.jetty.io.SelectChannelEndPoint$2.run(SelectChannelEndPoint.java:93)
	at org.eclipse.jetty.util.thread.strategy.ExecuteProduceConsume.executeProduceConsume(ExecuteProduceConsume.java:303)
	at org.eclipse.jetty.util.thread.strategy.ExecuteProduceConsume.produceConsume(ExecuteProduceConsume.java:148)
	at org.eclipse.jetty.util.thread.strategy.ExecuteProduceConsume.run(ExecuteProduceConsume.java:136)
	at org.eclipse.jetty.util.thread.QueuedThreadPool.runJob(QueuedThreadPool.java:671)
	at org.eclipse.jetty.util.thread.QueuedThreadPool$2.run(QueuedThreadPool.java:589)
	at java.lang.Thread.run(Thread.java:748)


	at __randomizedtesting.SeedInfo.seed([C4E9E618E9DC5BEC]:0)
	at org.junit.Assert.fail(Assert.java:93)
	at org.junit.Assert.assertTrue(Assert.java:43)
	at org.junit.Assert.assertNull(Assert.java:551)
	at org.apache.solr.SolrTestCaseJ4.teardownTestCases(SolrTestCaseJ4.java:295)
	at sun.reflect.GeneratedMethodAccessor37.invoke(Unknown Source)
	at sun.reflect.DelegatingMethodAccessorImpl.invoke(DelegatingMethodAccessorImpl.java:43)
	at java.lang.reflect.Method.invoke(Method.java:498)
	at com.carrotsearch.randomizedtesting.RandomizedRunner.invoke(RandomizedRunner.java:1737)
	at com.carrotsearch.randomizedtesting.RandomizedRunner$7.evaluate(RandomizedRunner.java:897)
	at com.carrotsearch.randomizedtesting.rules.StatementAdapter.evaluate(StatementAdapter.java:36)
	at com.carrotsearch.randomizedtesting.rules.SystemPropertiesRestoreRule$1.evaluate(SystemPropertiesRestoreRule.java:57)
	at org.apache.lucene.util.AbstractBeforeAfterRule$1.evaluate(AbstractBeforeAfterRule.java:45)
	at com.carrotsearch.randomizedtesting.rules.StatementAdapter.evaluate(StatementAdapter.java:36)
	at org.apache.lucene.util.TestRuleStoreClassName$1.evaluate(TestRuleStoreClassName.java:41)
	at com.carrotsearch.randomizedtesting.rules.NoShadowingOrOverridesOnMethodsRule$1.evaluate(NoShadowingOrOverridesOnMethodsRule.java:40)
	at com.carrotsearch.randomizedtesting.rules.NoShadowingOrOverridesOnMethodsRule$1.evaluate(NoShadowingOrOverridesOnMethodsRule.java:40)
	at com.carrotsearch.randomizedtesting.rules.StatementAdapter.evaluate(StatementAdapter.java:36)
	at com.carrotsearch.randomizedtesting.rules.StatementAdapter.evaluate(StatementAdapter.java:36)
	at com.carrotsearch.randomizedtesting.rules.StatementAdapter.evaluate(StatementAdapter.java:36)
	at org.apache.lucene.util.TestRuleAssertionsRequired$1.evaluate(TestRuleAssertionsRequired.java:53)
	at org.apache.lucene.util.TestRuleMarkFailure$1.evaluate(TestRuleMarkFailure.java:47)
	at org.apache.lucene.util.TestRuleIgnoreAfterMaxFailures$1.evaluate(TestRuleIgnoreAfterMaxFailures.java:64)
	at org.apache.lucene.util.TestRuleIgnoreTestSuites$1.evaluate(TestRuleIgnoreTestSuites.java:54)
	at com.carrotsearch.randomizedtesting.rules.StatementAdapter.evaluate(StatementAdapter.java:36)
	at com.carrotsearch.randomizedtesting.ThreadLeakControl$StatementRunner.run(ThreadLeakControl.java:368)
	at java.lang.Thread.run(Thread.java:748)


FAILED:  org.apache.solr.cloud.autoscaling.sim.TestGenericDistributedQueue.testDistributedQueueBlocking

Error Message:


Stack Trace:
java.util.concurrent.TimeoutException
	at __randomizedtesting.SeedInfo.seed([C4E9E618E9DC5BEC:81439461AD8EE798]:0)
	at java.util.concurrent.FutureTask.get(FutureTask.java:205)
	at org.apache.solr.cloud.autoscaling.sim.TestSimDistributedQueue.testDistributedQueueBlocking(TestSimDistributedQueue.java:101)
	at sun.reflect.NativeMethodAccessorImpl.invoke0(Native Method)
	at sun.reflect.NativeMethodAccessorImpl.invoke(NativeMethodAccessorImpl.java:62)
	at sun.reflect.DelegatingMethodAccessorImpl.invoke(DelegatingMethodAccessorImpl.java:43)
	at java.lang.reflect.Method.invoke(Method.java:498)
	at com.carrotsearch.randomizedtesting.RandomizedRunner.invoke(RandomizedRunner.java:1737)
	at com.carrotsearch.randomizedtesting.RandomizedRunner$8.evaluate(RandomizedRunner.java:934)
	at com.carrotsearch.randomizedtesting.RandomizedRunner$9.evaluate(RandomizedRunner.java:970)
	at com.carrotsearch.randomizedtesting.RandomizedRunner$10.evaluate(RandomizedRunner.java:984)
	at com.carrotsearch.randomizedtesting.rules.SystemPropertiesRestoreRule$1.evaluate(SystemPropertiesRestoreRule.java:57)
	at org.apache.lucene.util.TestRuleSetupTeardownChained$1.evaluate(TestRuleSetupTeardownChained.java:49)
	at org.apache.lucene.util.AbstractBeforeAfterRule$1.evaluate(AbstractBeforeAfterRule.java:45)
	at org.apache.lucene.util.TestRuleThreadAndTestName$1.evaluate(TestRuleThreadAndTestName.java:48)
	at org.apache.lucene.util.TestRuleIgnoreAfterMaxFailures$1.evaluate(TestRuleIgnoreAfterMaxFailures.java:64)
	at org.apache.lucene.util.TestRuleMarkFailure$1.evaluate(TestRuleMarkFailure.java:47)
	at com.carrotsearch.randomizedtesting.rules.StatementAdapter.evaluate(StatementAdapter.java:36)
	at com.carrotsearch.randomizedtesting.ThreadLeakControl$StatementRunner.run(ThreadLeakControl.java:368)
	at com.carrotsearch.randomizedtesting.ThreadLeakControl.forkTimeoutingTask(ThreadLeakControl.java:817)
	at com.carrotsearch.randomizedtesting.ThreadLeakControl$3.evaluate(ThreadLeakControl.java:468)
	at com.carrotsearch.randomizedtesting.RandomizedRunner.runSingleTest(RandomizedRunner.java:943)
	at com.carrotsearch.randomizedtesting.RandomizedRunner$5.evaluate(RandomizedRunner.java:829)
	at com.carrotsearch.randomizedtesting.RandomizedRunner$6.evaluate(RandomizedRunner.java:879)
	at com.carrotsearch.randomizedtesting.RandomizedRunner$7.evaluate(RandomizedRunner.java:890)
	at com.carrotsearch.randomizedtesting.rules.StatementAdapter.evaluate(StatementAdapter.java:36)
	at com.carrotsearch.randomizedtesting.rules.SystemPropertiesRestoreRule$1.evaluate(SystemPropertiesRestoreRule.java:57)
	at org.apache.lucene.util.AbstractBeforeAfterRule$1.evaluate(AbstractBeforeAfterRule.java:45)
	at com.carrotsearch.randomizedtesting.rules.StatementAdapter.evaluate(StatementAdapter.java:36)
	at org.apache.lucene.util.TestRuleStoreClassName$1.evaluate(TestRuleStoreClassName.java:41)
	at com.carrotsearch.randomizedtesting.rules.NoShadowingOrOverridesOnMethodsRule$1.evaluate(NoShadowingOrOverridesOnMethodsRule.java:40)
	at com.carrotsearch.randomizedtesting.rules.NoShadowingOrOverridesOnMethodsRule$1.evaluate(NoShadowingOrOverridesOnMethodsRule.java:40)
	at com.carrotsearch.randomizedtesting.rules.StatementAdapter.evaluate(StatementAdapter.java:36)
	at com.carrotsearch.randomizedtesting.rules.StatementAdapter.evaluate(StatementAdapter.java:36)
	at com.carrotsearch.randomizedtesting.rules.StatementAdapter.evaluate(StatementAdapter.java:36)
	at org.apache.lucene.util.TestRuleAssertionsRequired$1.evaluate(TestRuleAssertionsRequired.java:53)
	at org.apache.lucene.util.TestRuleMarkFailure$1.evaluate(TestRuleMarkFailure.java:47)
	at org.apache.lucene.util.TestRuleIgnoreAfterMaxFailures$1.evaluate(TestRuleIgnoreAfterMaxFailures.java:64)
	at org.apache.lucene.util.TestRuleIgnoreTestSuites$1.evaluate(TestRuleIgnoreTestSuites.java:54)
	at com.carrotsearch.randomizedtesting.rules.StatementAdapter.evaluate(StatementAdapter.java:36)
	at com.carrotsearch.randomizedtesting.ThreadLeakControl$StatementRunner.run(ThreadLeakControl.java:368)
	at java.lang.Thread.run(Thread.java:748)


FAILED:  junit.framework.TestSuite.org.apache.solr.cloud.autoscaling.sim.TestGenericDistributedQueue

Error Message:
1 thread leaked from SUITE scope at org.apache.solr.cloud.autoscaling.sim.TestGenericDistributedQueue:     1) Thread[id=8980, name=sdqtest--2207-thread-1, state=TIMED_WAITING, group=TGRP-TestGenericDistributedQueue]         at sun.misc.Unsafe.park(Native Method)         at java.util.concurrent.locks.LockSupport.parkNanos(LockSupport.java:215)         at java.util.concurrent.locks.AbstractQueuedSynchronizer$ConditionObject.awaitNanos(AbstractQueuedSynchronizer.java:2078)         at org.apache.solr.cloud.autoscaling.sim.GenericDistributedQueue.peek(GenericDistributedQueue.java:194)         at org.apache.solr.cloud.autoscaling.sim.GenericDistributedQueue.peek(GenericDistributedQueue.java:167)         at org.apache.solr.cloud.autoscaling.sim.TestSimDistributedQueue.lambda$testDistributedQueueBlocking$0(TestSimDistributedQueue.java:92)         at org.apache.solr.cloud.autoscaling.sim.TestSimDistributedQueue$$Lambda$598/1593314469.call(Unknown Source)         at java.util.concurrent.FutureTask.run(FutureTask.java:266)         at org.apache.solr.common.util.ExecutorUtil$MDCAwareThreadPoolExecutor.lambda$execute$0(ExecutorUtil.java:188)         at org.apache.solr.common.util.ExecutorUtil$MDCAwareThreadPoolExecutor$$Lambda$116/1786365721.run(Unknown Source)         at java.util.concurrent.ThreadPoolExecutor.runWorker(ThreadPoolExecutor.java:1149)         at java.util.concurrent.ThreadPoolExecutor$Worker.run(ThreadPoolExecutor.java:624)         at java.lang.Thread.run(Thread.java:748)

Stack Trace:
com.carrotsearch.randomizedtesting.ThreadLeakError: 1 thread leaked from SUITE scope at org.apache.solr.cloud.autoscaling.sim.TestGenericDistributedQueue: 
   1) Thread[id=8980, name=sdqtest--2207-thread-1, state=TIMED_WAITING, group=TGRP-TestGenericDistributedQueue]
        at sun.misc.Unsafe.park(Native Method)
        at java.util.concurrent.locks.LockSupport.parkNanos(LockSupport.java:215)
        at java.util.concurrent.locks.AbstractQueuedSynchronizer$ConditionObject.awaitNanos(AbstractQueuedSynchronizer.java:2078)
        at org.apache.solr.cloud.autoscaling.sim.GenericDistributedQueue.peek(GenericDistributedQueue.java:194)
        at org.apache.solr.cloud.autoscaling.sim.GenericDistributedQueue.peek(GenericDistributedQueue.java:167)
        at org.apache.solr.cloud.autoscaling.sim.TestSimDistributedQueue.lambda$testDistributedQueueBlocking$0(TestSimDistributedQueue.java:92)
        at org.apache.solr.cloud.autoscaling.sim.TestSimDistributedQueue$$Lambda$598/1593314469.call(Unknown Source)
        at java.util.concurrent.FutureTask.run(FutureTask.java:266)
        at org.apache.solr.common.util.ExecutorUtil$MDCAwareThreadPoolExecutor.lambda$execute$0(ExecutorUtil.java:188)
        at org.apache.solr.common.util.ExecutorUtil$MDCAwareThreadPoolExecutor$$Lambda$116/1786365721.run(Unknown Source)
        at java.util.concurrent.ThreadPoolExecutor.runWorker(ThreadPoolExecutor.java:1149)
        at java.util.concurrent.ThreadPoolExecutor$Worker.run(ThreadPoolExecutor.java:624)
        at java.lang.Thread.run(Thread.java:748)
	at __randomizedtesting.SeedInfo.seed([C4E9E618E9DC5BEC]:0)


FAILED:  junit.framework.TestSuite.org.apache.solr.update.processor.TimeRoutedAliasUpdateProcessorTest

Error Message:
Could not remove the following files (in the order of attempts):    C:\Users\jenkins\workspace\Lucene-Solr-7.x-Windows\solr\build\solr-core\test\J0\temp\solr.update.processor.TimeRoutedAliasUpdateProcessorTest_C4E9E618E9DC5BEC-001\tempDir-001\node2\myalias_2017-10-24_shard2_replica_n4\data\tlog: java.nio.file.DirectoryNotEmptyException: C:\Users\jenkins\workspace\Lucene-Solr-7.x-Windows\solr\build\solr-core\test\J0\temp\solr.update.processor.TimeRoutedAliasUpdateProcessorTest_C4E9E618E9DC5BEC-001\tempDir-001\node2\myalias_2017-10-24_shard2_replica_n4\data\tlog    C:\Users\jenkins\workspace\Lucene-Solr-7.x-Windows\solr\build\solr-core\test\J0\temp\solr.update.processor.TimeRoutedAliasUpdateProcessorTest_C4E9E618E9DC5BEC-001\tempDir-001\node2\myalias_2017-10-24_shard2_replica_n4\data: java.nio.file.DirectoryNotEmptyException: C:\Users\jenkins\workspace\Lucene-Solr-7.x-Windows\solr\build\solr-core\test\J0\temp\solr.update.processor.TimeRoutedAliasUpdateProcessorTest_C4E9E618E9DC5BEC-001\tempDir-001\node2\myalias_2017-10-24_shard2_replica_n4\data    C:\Users\jenkins\workspace\Lucene-Solr-7.x-Windows\solr\build\solr-core\test\J0\temp\solr.update.processor.TimeRoutedAliasUpdateProcessorTest_C4E9E618E9DC5BEC-001\tempDir-001\node2\myalias_2017-10-24_shard2_replica_n4: java.nio.file.DirectoryNotEmptyException: C:\Users\jenkins\workspace\Lucene-Solr-7.x-Windows\solr\build\solr-core\test\J0\temp\solr.update.processor.TimeRoutedAliasUpdateProcessorTest_C4E9E618E9DC5BEC-001\tempDir-001\node2\myalias_2017-10-24_shard2_replica_n4    C:\Users\jenkins\workspace\Lucene-Solr-7.x-Windows\solr\build\solr-core\test\J0\temp\solr.update.processor.TimeRoutedAliasUpdateProcessorTest_C4E9E618E9DC5BEC-001\tempDir-001\node2: java.nio.file.DirectoryNotEmptyException: C:\Users\jenkins\workspace\Lucene-Solr-7.x-Windows\solr\build\solr-core\test\J0\temp\solr.update.processor.TimeRoutedAliasUpdateProcessorTest_C4E9E618E9DC5BEC-001\tempDir-001\node2    C:\Users\jenkins\workspace\Lucene-Solr-7.x-Windows\solr\build\solr-core\test\J0\temp\solr.update.processor.TimeRoutedAliasUpdateProcessorTest_C4E9E618E9DC5BEC-001\tempDir-001: java.nio.file.DirectoryNotEmptyException: C:\Users\jenkins\workspace\Lucene-Solr-7.x-Windows\solr\build\solr-core\test\J0\temp\solr.update.processor.TimeRoutedAliasUpdateProcessorTest_C4E9E618E9DC5BEC-001\tempDir-001 

Stack Trace:
java.io.IOException: Could not remove the following files (in the order of attempts):
   C:\Users\jenkins\workspace\Lucene-Solr-7.x-Windows\solr\build\solr-core\test\J0\temp\solr.update.processor.TimeRoutedAliasUpdateProcessorTest_C4E9E618E9DC5BEC-001\tempDir-001\node2\myalias_2017-10-24_shard2_replica_n4\data\tlog: java.nio.file.DirectoryNotEmptyException: C:\Users\jenkins\workspace\Lucene-Solr-7.x-Windows\solr\build\solr-core\test\J0\temp\solr.update.processor.TimeRoutedAliasUpdateProcessorTest_C4E9E618E9DC5BEC-001\tempDir-001\node2\myalias_2017-10-24_shard2_replica_n4\data\tlog
   C:\Users\jenkins\workspace\Lucene-Solr-7.x-Windows\solr\build\solr-core\test\J0\temp\solr.update.processor.TimeRoutedAliasUpdateProcessorTest_C4E9E618E9DC5BEC-001\tempDir-001\node2\myalias_2017-10-24_shard2_replica_n4\data: java.nio.file.DirectoryNotEmptyException: C:\Users\jenkins\workspace\Lucene-Solr-7.x-Windows\solr\build\solr-core\test\J0\temp\solr.update.processor.TimeRoutedAliasUpdateProcessorTest_C4E9E618E9DC5BEC-001\tempDir-001\node2\myalias_2017-10-24_shard2_replica_n4\data
   C:\Users\jenkins\workspace\Lucene-Solr-7.x-Windows\solr\build\solr-core\test\J0\temp\solr.update.processor.TimeRoutedAliasUpdateProcessorTest_C4E9E618E9DC5BEC-001\tempDir-001\node2\myalias_2017-10-24_shard2_replica_n4: java.nio.file.DirectoryNotEmptyException: C:\Users\jenkins\workspace\Lucene-Solr-7.x-Windows\solr\build\solr-core\test\J0\temp\solr.update.processor.TimeRoutedAliasUpdateProcessorTest_C4E9E618E9DC5BEC-001\tempDir-001\node2\myalias_2017-10-24_shard2_replica_n4
   C:\Users\jenkins\workspace\Lucene-Solr-7.x-Windows\solr\build\solr-core\test\J0\temp\solr.update.processor.TimeRoutedAliasUpdateProcessorTest_C4E9E618E9DC5BEC-001\tempDir-001\node2: java.nio.file.DirectoryNotEmptyException: C:\Users\jenkins\workspace\Lucene-Solr-7.x-Windows\solr\build\solr-core\test\J0\temp\solr.update.processor.TimeRoutedAliasUpdateProcessorTest_C4E9E618E9DC5BEC-001\tempDir-001\node2
   C:\Users\jenkins\workspace\Lucene-Solr-7.x-Windows\solr\build\solr-core\test\J0\temp\solr.update.processor.TimeRoutedAliasUpdateProcessorTest_C4E9E618E9DC5BEC-001\tempDir-001: java.nio.file.DirectoryNotEmptyException: C:\Users\jenkins\workspace\Lucene-Solr-7.x-Windows\solr\build\solr-core\test\J0\temp\solr.update.processor.TimeRoutedAliasUpdateProcessorTest_C4E9E618E9DC5BEC-001\tempDir-001

	at __randomizedtesting.SeedInfo.seed([C4E9E618E9DC5BEC]:0)
	at org.apache.lucene.util.IOUtils.rm(IOUtils.java:329)
	at org.apache.lucene.util.TestRuleTemporaryFilesCleanup.afterAlways(TestRuleTemporaryFilesCleanup.java:216)
	at com.carrotsearch.randomizedtesting.rules.TestRuleAdapter$1.afterAlways(TestRuleAdapter.java:31)
	at com.carrotsearch.randomizedtesting.rules.StatementAdapter.evaluate(StatementAdapter.java:43)
	at com.carrotsearch.randomizedtesting.rules.StatementAdapter.evaluate(StatementAdapter.java:36)
	at org.apache.lucene.util.TestRuleAssertionsRequired$1.evaluate(TestRuleAssertionsRequired.java:53)
	at org.apache.lucene.util.TestRuleMarkFailure$1.evaluate(TestRuleMarkFailure.java:47)
	at org.apache.lucene.util.TestRuleIgnoreAfterMaxFailures$1.evaluate(TestRuleIgnoreAfterMaxFailures.java:64)
	at org.apache.lucene.util.TestRuleIgnoreTestSuites$1.evaluate(TestRuleIgnoreTestSuites.java:54)
	at com.carrotsearch.randomizedtesting.rules.StatementAdapter.evaluate(StatementAdapter.java:36)
	at com.carrotsearch.randomizedtesting.ThreadLeakControl$StatementRunner.run(ThreadLeakControl.java:368)
	at java.lang.Thread.run(Thread.java:748)


FAILED:  junit.framework.TestSuite.org.apache.solr.update.processor.TestOpenNLPExtractNamedEntitiesUpdateProcessorFactory

Error Message:
Could not remove the following files (in the order of attempts):    C:\Users\jenkins\workspace\Lucene-Solr-7.x-Windows\solr\build\contrib\solr-analysis-extras\test\J1\temp\solr.update.processor.TestOpenNLPExtractNamedEntitiesUpdateProcessorFactory_55665E360102B32E-001\tempDir-001\collection1\conf: java.nio.file.DirectoryNotEmptyException: C:\Users\jenkins\workspace\Lucene-Solr-7.x-Windows\solr\build\contrib\solr-analysis-extras\test\J1\temp\solr.update.processor.TestOpenNLPExtractNamedEntitiesUpdateProcessorFactory_55665E360102B32E-001\tempDir-001\collection1\conf    C:\Users\jenkins\workspace\Lucene-Solr-7.x-Windows\solr\build\contrib\solr-analysis-extras\test\J1\temp\solr.update.processor.TestOpenNLPExtractNamedEntitiesUpdateProcessorFactory_55665E360102B32E-001\tempDir-001\collection1: java.nio.file.DirectoryNotEmptyException: C:\Users\jenkins\workspace\Lucene-Solr-7.x-Windows\solr\build\contrib\solr-analysis-extras\test\J1\temp\solr.update.processor.TestOpenNLPExtractNamedEntitiesUpdateProcessorFactory_55665E360102B32E-001\tempDir-001\collection1    C:\Users\jenkins\workspace\Lucene-Solr-7.x-Windows\solr\build\contrib\solr-analysis-extras\test\J1\temp\solr.update.processor.TestOpenNLPExtractNamedEntitiesUpdateProcessorFactory_55665E360102B32E-001\tempDir-001: java.nio.file.DirectoryNotEmptyException: C:\Users\jenkins\workspace\Lucene-Solr-7.x-Windows\solr\build\contrib\solr-analysis-extras\test\J1\temp\solr.update.processor.TestOpenNLPExtractNamedEntitiesUpdateProcessorFactory_55665E360102B32E-001\tempDir-001    C:\Users\jenkins\workspace\Lucene-Solr-7.x-Windows\solr\build\contrib\solr-analysis-extras\test\J1\temp\solr.update.processor.TestOpenNLPExtractNamedEntitiesUpdateProcessorFactory_55665E360102B32E-001\tempDir-001\collection1\conf\en-test-ner-person.bin: java.nio.file.AccessDeniedException: C:\Users\jenkins\workspace\Lucene-Solr-7.x-Windows\solr\build\contrib\solr-analysis-extras\test\J1\temp\solr.update.processor.TestOpenNLPExtractNamedEntitiesUpdateProcessorFactory_55665E360102B32E-001\tempDir-001\collection1\conf\en-test-ner-person.bin    C:\Users\jenkins\workspace\Lucene-Solr-7.x-Windows\solr\build\contrib\solr-analysis-extras\test\J1\temp\solr.update.processor.TestOpenNLPExtractNamedEntitiesUpdateProcessorFactory_55665E360102B32E-001\tempDir-001\collection1\conf\en-test-sent.bin: java.nio.file.AccessDeniedException: C:\Users\jenkins\workspace\Lucene-Solr-7.x-Windows\solr\build\contrib\solr-analysis-extras\test\J1\temp\solr.update.processor.TestOpenNLPExtractNamedEntitiesUpdateProcessorFactory_55665E360102B32E-001\tempDir-001\collection1\conf\en-test-sent.bin    C:\Users\jenkins\workspace\Lucene-Solr-7.x-Windows\solr\build\contrib\solr-analysis-extras\test\J1\temp\solr.update.processor.TestOpenNLPExtractNamedEntitiesUpdateProcessorFactory_55665E360102B32E-001\tempDir-001\collection1\conf\en-test-tokenizer.bin: java.nio.file.AccessDeniedException: C:\Users\jenkins\workspace\Lucene-Solr-7.x-Windows\solr\build\contrib\solr-analysis-extras\test\J1\temp\solr.update.processor.TestOpenNLPExtractNamedEntitiesUpdateProcessorFactory_55665E360102B32E-001\tempDir-001\collection1\conf\en-test-tokenizer.bin    C:\Users\jenkins\workspace\Lucene-Solr-7.x-Windows\solr\build\contrib\solr-analysis-extras\test\J1\temp\solr.update.processor.TestOpenNLPExtractNamedEntitiesUpdateProcessorFactory_55665E360102B32E-001: java.nio.file.DirectoryNotEmptyException: C:\Users\jenkins\workspace\Lucene-Solr-7.x-Windows\solr\build\contrib\solr-analysis-extras\test\J1\temp\solr.update.processor.TestOpenNLPExtractNamedEntitiesUpdateProcessorFactory_55665E360102B32E-001 

Stack Trace:
java.io.IOException: Could not remove the following files (in the order of attempts):
   C:\Users\jenkins\workspace\Lucene-Solr-7.x-Windows\solr\build\contrib\solr-analysis-extras\test\J1\temp\solr.update.processor.TestOpenNLPExtractNamedEntitiesUpdateProcessorFactory_55665E360102B32E-001\tempDir-001\collection1\conf: java.nio.file.DirectoryNotEmptyException: C:\Users\jenkins\workspace\Lucene-Solr-7.x-Windows\solr\build\contrib\solr-analysis-extras\test\J1\temp\solr.update.processor.TestOpenNLPExtractNamedEntitiesUpdateProcessorFactory_55665E360102B32E-001\tempDir-001\collection1\conf
   C:\Users\jenkins\workspace\Lucene-Solr-7.x-Windows\solr\build\contrib\solr-analysis-extras\test\J1\temp\solr.update.processor.TestOpenNLPExtractNamedEntitiesUpdateProcessorFactory_55665E360102B32E-001\tempDir-001\collection1: java.nio.file.DirectoryNotEmptyException: C:\Users\jenkins\workspace\Lucene-Solr-7.x-Windows\solr\build\contrib\solr-analysis-extras\test\J1\temp\solr.update.processor.TestOpenNLPExtractNamedEntitiesUpdateProcessorFactory_55665E360102B32E-001\tempDir-001\collection1
   C:\Users\jenkins\workspace\Lucene-Solr-7.x-Windows\solr\build\contrib\solr-analysis-extras\test\J1\temp\solr.update.processor.TestOpenNLPExtractNamedEntitiesUpdateProcessorFactory_55665E360102B32E-001\tempDir-001: java.nio.file.DirectoryNotEmptyException: C:\Users\jenkins\workspace\Lucene-Solr-7.x-Windows\solr\build\contrib\solr-analysis-extras\test\J1\temp\solr.update.processor.TestOpenNLPExtractNamedEntitiesUpdateProcessorFactory_55665E360102B32E-001\tempDir-001
   C:\Users\jenkins\workspace\Lucene-Solr-7.x-Windows\solr\build\contrib\solr-analysis-extras\test\J1\temp\solr.update.processor.TestOpenNLPExtractNamedEntitiesUpdateProcessorFactory_55665E360102B32E-001\tempDir-001\collection1\conf\en-test-ner-person.bin: java.nio.file.AccessDeniedException: C:\Users\jenkins\workspace\Lucene-Solr-7.x-Windows\solr\build\contrib\solr-analysis-extras\test\J1\temp\solr.update.processor.TestOpenNLPExtractNamedEntitiesUpdateProcessorFactory_55665E360102B32E-001\tempDir-001\collection1\conf\en-test-ner-person.bin
   C:\Users\jenkins\workspace\Lucene-Solr-7.x-Windows\solr\build\contrib\solr-analysis-extras\test\J1\temp\solr.update.processor.TestOpenNLPExtractNamedEntitiesUpdateProcessorFactory_55665E360102B32E-001\tempDir-001\collection1\conf\en-test-sent.bin: java.nio.file.AccessDeniedException: C:\Users\jenkins\workspace\Lucene-Solr-7.x-Windows\solr\build\contrib\solr-analysis-extras\test\J1\temp\solr.update.processor.TestOpenNLPExtractNamedEntitiesUpdateProcessorFactory_55665E360102B32E-001\tempDir-001\collection1\conf\en-test-sent.bin
   C:\Users\jenkins\workspace\Lucene-Solr-7.x-Windows\solr\build\contrib\solr-analysis-extras\test\J1\temp\solr.update.processor.TestOpenNLPExtractNamedEntitiesUpdateProcessorFactory_55665E360102B32E-001\tempDir-001\collection1\conf\en-test-tokenizer.bin: java.nio.file.AccessDeniedException: C:\Users\jenkins\workspace\Lucene-Solr-7.x-Windows\solr\build\contrib\solr-analysis-extras\test\J1\temp\solr.update.processor.TestOpenNLPExtractNamedEntitiesUpdateProcessorFactory_55665E360102B32E-001\tempDir-001\collection1\conf\en-test-tokenizer.bin
   C:\Users\jenkins\workspace\Lucene-Solr-7.x-Windows\solr\build\contrib\solr-analysis-extras\test\J1\temp\solr.update.processor.TestOpenNLPExtractNamedEntitiesUpdateProcessorFactory_55665E360102B32E-001: java.nio.file.DirectoryNotEmptyException: C:\Users\jenkins\workspace\Lucene-Solr-7.x-Windows\solr\build\contrib\solr-analysis-extras\test\J1\temp\solr.update.processor.TestOpenNLPExtractNamedEntitiesUpdateProcessorFactory_55665E360102B32E-001

	at __randomizedtesting.SeedInfo.seed([55665E360102B32E]:0)
	at org.apache.lucene.util.IOUtils.rm(IOUtils.java:329)
	at org.apache.lucene.util.TestRuleTemporaryFilesCleanup.afterAlways(TestRuleTemporaryFilesCleanup.java:216)
	at com.carrotsearch.randomizedtesting.rules.TestRuleAdapter$1.afterAlways(TestRuleAdapter.java:31)
	at com.carrotsearch.randomizedtesting.rules.StatementAdapter.evaluate(StatementAdapter.java:43)
	at com.carrotsearch.randomizedtesting.rules.StatementAdapter.evaluate(StatementAdapter.java:36)
	at org.apache.lucene.util.TestRuleAssertionsRequired$1.evaluate(TestRuleAssertionsRequired.java:53)
	at org.apache.lucene.util.TestRuleMarkFailure$1.evaluate(TestRuleMarkFailure.java:47)
	at org.apache.lucene.util.TestRuleIgnoreAfterMaxFailures$1.evaluate(TestRuleIgnoreAfterMaxFailures.java:64)
	at org.apache.lucene.util.TestRuleIgnoreTestSuites$1.evaluate(TestRuleIgnoreTestSuites.java:54)
	at com.carrotsearch.randomizedtesting.rules.StatementAdapter.evaluate(StatementAdapter.java:36)
	at com.carrotsearch.randomizedtesting.ThreadLeakControl$StatementRunner.run(ThreadLeakControl.java:368)
	at java.lang.Thread.run(Thread.java:748)




Build Log:
[...truncated 12342 lines...]
   [junit4] Suite: org.apache.solr.cloud.autoscaling.sim.TestGenericDistributedQueue
   [junit4]   2> 710093 INFO  (SUITE-TestGenericDistributedQueue-seed#[C4E9E618E9DC5BEC]-worker) [    ] o.a.s.SolrTestCaseJ4 SecureRandom sanity checks: test.solr.allowed.securerandom=null & java.security.egd=file:/dev/./urandom
   [junit4]   2> Creating dataDir: C:\Users\jenkins\workspace\Lucene-Solr-7.x-Windows\solr\build\solr-core\test\J0\temp\solr.cloud.autoscaling.sim.TestGenericDistributedQueue_C4E9E618E9DC5BEC-001\init-core-data-001
   [junit4]   2> 710098 WARN  (SUITE-TestGenericDistributedQueue-seed#[C4E9E618E9DC5BEC]-worker) [    ] o.a.s.SolrTestCaseJ4 startTrackingSearchers: numOpens=7 numCloses=7
   [junit4]   2> 710098 INFO  (SUITE-TestGenericDistributedQueue-seed#[C4E9E618E9DC5BEC]-worker) [    ] o.a.s.SolrTestCaseJ4 Using PointFields (NUMERIC_POINTS_SYSPROP=true) w/NUMERIC_DOCVALUES_SYSPROP=false
   [junit4]   2> 710103 INFO  (SUITE-TestGenericDistributedQueue-seed#[C4E9E618E9DC5BEC]-worker) [    ] o.a.s.SolrTestCaseJ4 Randomized ssl (false) and clientAuth (false) via: @org.apache.solr.util.RandomizeSSL(reason=, value=NaN, ssl=NaN, clientAuth=NaN)
   [junit4]   2> 710107 INFO  (TEST-TestGenericDistributedQueue.testLocallyOffer-seed#[C4E9E618E9DC5BEC]) [    ] o.a.s.SolrTestCaseJ4 ###Starting testLocallyOffer
   [junit4]   2> 710361 INFO  (TEST-TestGenericDistributedQueue.testLocallyOffer-seed#[C4E9E618E9DC5BEC]) [    ] o.a.s.SolrTestCaseJ4 ###Ending testLocallyOffer
   [junit4]   2> 710379 INFO  (TEST-TestGenericDistributedQueue.testDistributedQueueBlocking-seed#[C4E9E618E9DC5BEC]) [    ] o.a.s.SolrTestCaseJ4 ###Starting testDistributedQueueBlocking
   [junit4]   2> 712383 INFO  (TEST-TestGenericDistributedQueue.testDistributedQueueBlocking-seed#[C4E9E618E9DC5BEC]) [    ] o.a.s.SolrTestCaseJ4 ###Ending testDistributedQueueBlocking
   [junit4]   2> NOTE: reproduce with: ant test  -Dtestcase=TestGenericDistributedQueue -Dtests.method=testDistributedQueueBlocking -Dtests.seed=C4E9E618E9DC5BEC -Dtests.slow=true -Dtests.locale=sr-CS -Dtests.timezone=America/North_Dakota/Beulah -Dtests.asserts=true -Dtests.file.encoding=ISO-8859-1
   [junit4] ERROR   2.01s J0 | TestGenericDistributedQueue.testDistributedQueueBlocking <<<
   [junit4]    > Throwable #1: java.util.concurrent.TimeoutException
   [junit4]    > 	at __randomizedtesting.SeedInfo.seed([C4E9E618E9DC5BEC:81439461AD8EE798]:0)
   [junit4]    > 	at java.util.concurrent.FutureTask.get(FutureTask.java:205)
   [junit4]    > 	at org.apache.solr.cloud.autoscaling.sim.TestSimDistributedQueue.testDistributedQueueBlocking(TestSimDistributedQueue.java:101)
   [junit4]    > 	at java.lang.Thread.run(Thread.java:748)
   [junit4]   2> 712394 INFO  (TEST-TestGenericDistributedQueue.testPeekElements-seed#[C4E9E618E9DC5BEC]) [    ] o.a.s.SolrTestCaseJ4 ###Starting testPeekElements
   [junit4]   2> 713903 INFO  (TEST-TestGenericDistributedQueue.testPeekElements-seed#[C4E9E618E9DC5BEC]) [    ] o.a.s.SolrTestCaseJ4 ###Ending testPeekElements
   [junit4]   2> 713924 INFO  (TEST-TestGenericDistributedQueue.testDistributedQueue-seed#[C4E9E618E9DC5BEC]) [    ] o.a.s.SolrTestCaseJ4 ###Starting testDistributedQueue
   [junit4]   2> 715926 INFO  (TEST-TestGenericDistributedQueue.testDistributedQueue-seed#[C4E9E618E9DC5BEC]) [    ] o.a.s.SolrTestCaseJ4 ###Ending testDistributedQueue
   [junit4]   2> NOTE: leaving temporary files on disk at: C:\Users\jenkins\workspace\Lucene-Solr-7.x-Windows\solr\build\solr-core\test\J0\temp\solr.cloud.autoscaling.sim.TestGenericDistributedQueue_C4E9E618E9DC5BEC-001
   [junit4]   2> Dec 26, 2017 2:24:58 PM com.carrotsearch.randomizedtesting.ThreadLeakControl checkThreadLeaks
   [junit4]   2> WARNING: Will linger awaiting termination of 1 leaked thread(s).
   [junit4]   2> Dec 26, 2017 2:25:18 PM com.carrotsearch.randomizedtesting.ThreadLeakControl checkThreadLeaks
   [junit4]   2> SEVERE: 1 thread leaked from SUITE scope at org.apache.solr.cloud.autoscaling.sim.TestGenericDistributedQueue: 
   [junit4]   2>    1) Thread[id=8980, name=sdqtest--2207-thread-1, state=TIMED_WAITING, group=TGRP-TestGenericDistributedQueue]
   [junit4]   2>         at sun.misc.Unsafe.park(Native Method)
   [junit4]   2>         at java.util.concurrent.locks.LockSupport.parkNanos(LockSupport.java:215)
   [junit4]   2>         at java.util.concurrent.locks.AbstractQueuedSynchronizer$ConditionObject.awaitNanos(AbstractQueuedSynchronizer.java:2078)
   [junit4]   2>         at org.apache.solr.cloud.autoscaling.sim.GenericDistributedQueue.peek(GenericDistributedQueue.java:194)
   [junit4]   2>         at org.apache.solr.cloud.autoscaling.sim.GenericDistributedQueue.peek(GenericDistributedQueue.java:167)
   [junit4]   2>         at org.apache.solr.cloud.autoscaling.sim.TestSimDistributedQueue.lambda$testDistributedQueueBlocking$0(TestSimDistributedQueue.java:92)
   [junit4]   2>         at org.apache.solr.cloud.autoscaling.sim.TestSimDistributedQueue$$Lambda$598/1593314469.call(Unknown Source)
   [junit4]   2>         at java.util.concurrent.FutureTask.run(FutureTask.java:266)
   [junit4]   2>         at org.apache.solr.common.util.ExecutorUtil$MDCAwareThreadPoolExecutor.lambda$execute$0(ExecutorUtil.java:188)
   [junit4]   2>         at org.apache.solr.common.util.ExecutorUtil$MDCAwareThreadPoolExecutor$$Lambda$116/1786365721.run(Unknown Source)
   [junit4]   2>         at java.util.concurrent.ThreadPoolExecutor.runWorker(ThreadPoolExecutor.java:1149)
   [junit4]   2>         at java.util.concurrent.ThreadPoolExecutor$Worker.run(ThreadPoolExecutor.java:624)
   [junit4]   2>         at java.lang.Thread.run(Thread.java:748)
   [junit4]   2> Dec 26, 2017 2:25:18 PM com.carrotsearch.randomizedtesting.ThreadLeakControl tryToInterruptAll
   [junit4]   2> INFO: Starting to interrupt leaked threads:
   [junit4]   2>    1) Thread[id=8980, name=sdqtest--2207-thread-1, state=TIMED_WAITING, group=TGRP-TestGenericDistributedQueue]
   [junit4]   2> Dec 26, 2017 2:25:18 PM com.carrotsearch.randomizedtesting.ThreadLeakControl tryToInterruptAll
   [junit4]   2> INFO: All leaked threads terminated.
   [junit4]   2> NOTE: test params are: codec=Asserting(Lucene70): {}, docValues:{}, maxPointsInLeafNode=1022, maxMBSortInHeap=7.483524107194743, sim=RandomSimilarity(queryNorm=true): {}, locale=sr-CS, timezone=America/North_Dakota/Beulah
   [junit4]   2> NOTE: Windows 10 10.0 amd64/Oracle Corporation 1.8.0_144 (64-bit)/cpus=3,threads=1,free=140051080,total=458878976
   [junit4]   2> NOTE: All tests run in this JVM: [TestCustomSort, CSVRequestHandlerTest, TestPivotHelperCode, TestDelegationWithHadoopAuth, HighlighterTest, UtilsToolTest, MultiTermTest, TestPHPSerializedResponseWriter, CdcrReplicationDistributedZkTest, TestWriterPerf, TestLRUStatsCache, FieldAnalysisRequestHandlerTest, TestPushWriter, CloneFieldUpdateProcessorFactoryTest, DocValuesMissingTest, ConnectionReuseTest, SecurityConfHandlerTest, TestLegacyNumericRangeQueryBuilder, TlogReplayBufferedWhileIndexingTest, HdfsDirectoryFactoryTest, TestSolrConfigHandlerCloud, CursorPagingTest, TestQuerySenderListener, SolrIndexMetricsTest, TestMiniSolrCloudClusterSSL, TestJmxIntegration, SolrCoreMetricManagerTest, NotRequiredUniqueKeyTest, ClassificationUpdateProcessorIntegrationTest, TestSolrQueryResponse, BlockDirectoryTest, TestTrieFacet, MigrateRouteKeyTest, TestLMDirichletSimilarityFactory, OutputWriterTest, HdfsThreadLeakTest, TestRealTimeGet, TestIndexingPerformance, HdfsCollectionsAPIDistributedZkTest, MetricUtilsTest, TestGraphMLResponseWriter, RAMDirectoryFactoryTest, TestExpandComponent, TestSchemaNameResource, MinimalSchemaTest, TestManagedResourceStorage, TestCollectionAPIs, TestBulkSchemaConcurrent, RulesTest, SaslZkACLProviderTest, ImplicitSnitchTest, BinaryUpdateRequestHandlerTest, AddSchemaFieldsUpdateProcessorFactoryTest, TestFieldCacheReopen, RollingRestartTest, TestRequestStatusCollectionAPI, OverseerTest, CdcrBidirectionalTest, CollectionsAPISolrJTest, TestSurroundQueryParser, TestStressRecovery, TestLegacyTerms, MoveReplicaTest, FastVectorHighlighterTest, TestConfigSetsAPIZkFailure, NoCacheHeaderTest, CollectionReloadTest, HttpTriggerListenerTest, ReturnFieldsTest, ConvertedLegacyTest, TestSolrCLIRunExample, SuggesterTest, TestDFISimilarityFactory, SpatialHeatmapFacetsTest, TestSolrCloudWithHadoopAuthPlugin, SolrCLIZkUtilsTest, TestUninvertingReader, TestLazyCores, TestUseDocValuesAsStored2, TestRuleBasedAuthorizationPlugin, MoveReplicaHDFSFailoverTest, AssignBackwardCompatibilityTest, AnalyticsQueryTest, TestGenericDistributedQueue]
   [junit4]   2> NOTE: reproduce with: ant test  -Dtestcase=TestGenericDistributedQueue -Dtests.seed=C4E9E618E9DC5BEC -Dtests.slow=true -Dtests.locale=sr-CS -Dtests.timezone=America/North_Dakota/Beulah -Dtests.asserts=true -Dtests.file.encoding=ISO-8859-1
   [junit4] ERROR   0.00s J0 | TestGenericDistributedQueue (suite) <<<
   [junit4]    > Throwable #1: com.carrotsearch.randomizedtesting.ThreadLeakError: 1 thread leaked from SUITE scope at org.apache.solr.cloud.autoscaling.sim.TestGenericDistributedQueue: 
   [junit4]    >    1) Thread[id=8980, name=sdqtest--2207-thread-1, state=TIMED_WAITING, group=TGRP-TestGenericDistributedQueue]
   [junit4]    >         at sun.misc.Unsafe.park(Native Method)
   [junit4]    >         at java.util.concurrent.locks.LockSupport.parkNanos(LockSupport.java:215)
   [junit4]    >         at java.util.concurrent.locks.AbstractQueuedSynchronizer$ConditionObject.awaitNanos(AbstractQueuedSynchronizer.java:2078)
   [junit4]    >         at org.apache.solr.cloud.autoscaling.sim.GenericDistributedQueue.peek(GenericDistributedQueue.java:194)
   [junit4]    >         at org.apache.solr.cloud.autoscaling.sim.GenericDistributedQueue.peek(GenericDistributedQueue.java:167)
   [junit4]    >         at org.apache.solr.cloud.autoscaling.sim.TestSimDistributedQueue.lambda$testDistributedQueueBlocking$0(TestSimDistributedQueue.java:92)
   [junit4]    >         at org.apache.solr.cloud.autoscaling.sim.TestSimDistributedQueue$$Lambda$598/1593314469.call(Unknown Source)
   [junit4]    >         at java.util.concurrent.FutureTask.run(FutureTask.java:266)
   [junit4]    >         at org.apache.solr.common.util.ExecutorUtil$MDCAwareThreadPoolExecutor.lambda$execute$0(ExecutorUtil.java:188)
   [junit4]    >         at org.apache.solr.common.util.ExecutorUtil$MDCAwareThreadPoolExecutor$$Lambda$116/1786365721.run(Unknown Source)
   [junit4]    >         at java.util.concurrent.ThreadPoolExecutor.runWorker(ThreadPoolExecutor.java:1149)
   [junit4]    >         at java.util.concurrent.ThreadPoolExecutor$Worker.run(ThreadPoolExecutor.java:624)
   [junit4]    >         at java.lang.Thread.run(Thread.java:748)
   [junit4]    > 	at __randomizedtesting.SeedInfo.seed([C4E9E618E9DC5BEC]:0)
   [junit4] Completed [186/764 (1!)] on J0 in 25.98s, 4 tests, 2 errors <<< FAILURES!

[...truncated 576 lines...]
   [junit4] Suite: org.apache.solr.cloud.TestTlogReplica
   [junit4]   2> 1430048 INFO  (SUITE-TestTlogReplica-seed#[C4E9E618E9DC5BEC]-worker) [    ] o.a.s.SolrTestCaseJ4 SecureRandom sanity checks: test.solr.allowed.securerandom=null & java.security.egd=file:/dev/./urandom
   [junit4]   2> Creating dataDir: C:\Users\jenkins\workspace\Lucene-Solr-7.x-Windows\solr\build\solr-core\test\J0\temp\solr.cloud.TestTlogReplica_C4E9E618E9DC5BEC-001\init-core-data-001
   [junit4]   2> 1430049 WARN  (SUITE-TestTlogReplica-seed#[C4E9E618E9DC5BEC]-worker) [    ] o.a.s.SolrTestCaseJ4 startTrackingSearchers: numOpens=1 numCloses=1
   [junit4]   2> 1430049 INFO  (SUITE-TestTlogReplica-seed#[C4E9E618E9DC5BEC]-worker) [    ] o.a.s.SolrTestCaseJ4 Using TrieFields (NUMERIC_POINTS_SYSPROP=false) w/NUMERIC_DOCVALUES_SYSPROP=true
   [junit4]   2> 1430054 INFO  (SUITE-TestTlogReplica-seed#[C4E9E618E9DC5BEC]-worker) [    ] o.a.s.SolrTestCaseJ4 Randomized ssl (false) and clientAuth (false) via: @org.apache.solr.util.RandomizeSSL(reason=, value=NaN, ssl=NaN, clientAuth=NaN)
   [junit4]   2> 1430055 INFO  (SUITE-TestTlogReplica-seed#[C4E9E618E9DC5BEC]-worker) [    ] o.a.s.c.MiniSolrCloudCluster Starting cluster of 2 servers in C:\Users\jenkins\workspace\Lucene-Solr-7.x-Windows\solr\build\solr-core\test\J0\temp\solr.cloud.TestTlogReplica_C4E9E618E9DC5BEC-001\tempDir-001
   [junit4]   2> 1430056 INFO  (SUITE-TestTlogReplica-seed#[C4E9E618E9DC5BEC]-worker) [    ] o.a.s.c.ZkTestServer STARTING ZK TEST SERVER
   [junit4]   2> 1430056 INFO  (Thread-3251) [    ] o.a.s.c.ZkTestServer client port:0.0.0.0/0.0.0.0:0
   [junit4]   2> 1430056 INFO  (Thread-3251) [    ] o.a.s.c.ZkTestServer Starting server
   [junit4]   2> 1430059 ERROR (Thread-3251) [    ] o.a.z.s.ZooKeeperServer ZKShutdownHandler is not registered, so ZooKeeper server won't take any action on ERROR or SHUTDOWN server state changes
   [junit4]   2> 1430156 INFO  (SUITE-TestTlogReplica-seed#[C4E9E618E9DC5BEC]-worker) [    ] o.a.s.c.ZkTestServer start zk server on port:55819
   [junit4]   2> 1430160 INFO  (zkConnectionManagerCallback-3235-thread-1) [    ] o.a.s.c.c.ConnectionManager zkClient has connected
   [junit4]   2> 1430165 INFO  (jetty-launcher-3232-thread-2) [    ] o.e.j.s.Server jetty-9.3.20.v20170531
   [junit4]   2> 1430167 INFO  (jetty-launcher-3232-thread-1) [    ] o.e.j.s.Server jetty-9.3.20.v20170531
   [junit4]   2> 1430167 INFO  (jetty-launcher-3232-thread-1) [    ] o.e.j.s.h.ContextHandler Started o.e.j.s.ServletContextHandler@7d6da481{/solr,null,AVAILABLE}
   [junit4]   2> 1430167 INFO  (jetty-launcher-3232-thread-2) [    ] o.e.j.s.h.ContextHandler Started o.e.j.s.ServletContextHandler@682c7eaf{/solr,null,AVAILABLE}
   [junit4]   2> 1430168 INFO  (jetty-launcher-3232-thread-2) [    ] o.e.j.s.AbstractConnector Started ServerConnector@45a9a66b{HTTP/1.1,[http/1.1]}{127.0.0.1:55824}
   [junit4]   2> 1430168 INFO  (jetty-launcher-3232-thread-1) [    ] o.e.j.s.AbstractConnector Started ServerConnector@6f600093{HTTP/1.1,[http/1.1]}{127.0.0.1:55823}
   [junit4]   2> 1430168 INFO  (jetty-launcher-3232-thread-2) [    ] o.e.j.s.Server Started @1440856ms
   [junit4]   2> 1430168 INFO  (jetty-launcher-3232-thread-1) [    ] o.e.j.s.Server Started @1440856ms
   [junit4]   2> 1430168 INFO  (jetty-launcher-3232-thread-2) [    ] o.a.s.c.s.e.JettySolrRunner Jetty properties: {hostContext=/solr, hostPort=55824}
   [junit4]   2> 1430168 INFO  (jetty-launcher-3232-thread-1) [    ] o.a.s.c.s.e.JettySolrRunner Jetty properties: {hostContext=/solr, hostPort=55823}
   [junit4]   2> 1430168 ERROR (jetty-launcher-3232-thread-1) [    ] o.a.s.u.StartupLoggingUtils Missing Java Option solr.log.dir. Logging may be missing or incomplete.
   [junit4]   2> 1430168 ERROR (jetty-launcher-3232-thread-2) [    ] o.a.s.u.StartupLoggingUtils Missing Java Option solr.log.dir. Logging may be missing or incomplete.
   [junit4]   2> 1430169 INFO  (jetty-launcher-3232-thread-1) [    ] o.a.s.s.SolrDispatchFilter  ___      _       Welcome to Apache Solr? version 7.3.0
   [junit4]   2> 1430169 INFO  (jetty-launcher-3232-thread-2) [    ] o.a.s.s.SolrDispatchFilter  ___      _       Welcome to Apache Solr? version 7.3.0
   [junit4]   2> 1430169 INFO  (jetty-launcher-3232-thread-1) [    ] o.a.s.s.SolrDispatchFilter / __| ___| |_ _   Starting in cloud mode on port null
   [junit4]   2> 1430169 INFO  (jetty-launcher-3232-thread-2) [    ] o.a.s.s.SolrDispatchFilter / __| ___| |_ _   Starting in cloud mode on port null
   [junit4]   2> 1430169 INFO  (jetty-launcher-3232-thread-1) [    ] o.a.s.s.SolrDispatchFilter \__ \/ _ \ | '_|  Install dir: null
   [junit4]   2> 1430169 INFO  (jetty-launcher-3232-thread-2) [    ] o.a.s.s.SolrDispatchFilter \__ \/ _ \ | '_|  Install dir: null
   [junit4]   2> 1430169 INFO  (jetty-launcher-3232-thread-1) [    ] o.a.s.s.SolrDispatchFilter |___/\___/_|_|    Start time: 2017-12-26T14:36:52.862Z
   [junit4]   2> 1430169 INFO  (jetty-launcher-3232-thread-2) [    ] o.a.s.s.SolrDispatchFilter |___/\___/_|_|    Start time: 2017-12-26T14:36:52.862Z
   [junit4]   2> 1430172 INFO  (zkConnectionManagerCallback-3239-thread-1) [    ] o.a.s.c.c.ConnectionManager zkClient has connected
   [junit4]   2> 1430172 INFO  (zkConnectionManagerCallback-3238-thread-1) [    ] o.a.s.c.c.ConnectionManager zkClient has connected
   [junit4]   2> 1430172 INFO  (jetty-launcher-3232-thread-2) [    ] o.a.s.s.SolrDispatchFilter solr.xml found in ZooKeeper. Loading...
   [junit4]   2> 1430172 INFO  (jetty-launcher-3232-thread-1) [    ] o.a.s.s.SolrDispatchFilter solr.xml found in ZooKeeper. Loading...
   [junit4]   2> 1430184 WARN  (NIOServerCxn.Factory:0.0.0.0/0.0.0.0:0) [    ] o.a.z.s.NIOServerCnxn caught end of stream exception
   [junit4]   2> EndOfStreamException: Unable to read additional data from client sessionid 0x160934136900002, likely client has closed socket
   [junit4]   2> 	at org.apache.zookeeper.server.NIOServerCnxn.doIO(NIOServerCnxn.java:239)
   [junit4]   2> 	at org.apache.zookeeper.server.NIOServerCnxnFactory.run(NIOServerCnxnFactory.java:203)
   [junit4]   2> 	at java.lang.Thread.run(Thread.java:748)
   [junit4]   2> 1430185 WARN  (NIOServerCxn.Factory:0.0.0.0/0.0.0.0:0) [    ] o.a.z.s.NIOServerCnxn caught end of stream exception
   [junit4]   2> EndOfStreamException: Unable to read additional data from client sessionid 0x160934136900001, likely client has closed socket
   [junit4]   2> 	at org.apache.zookeeper.server.NIOServerCnxn.doIO(NIOServerCnxn.java:239)
   [junit4]   2> 	at org.apache.zookeeper.server.NIOServerCnxnFactory.run(NIOServerCnxnFactory.java:203)
   [junit4]   2> 	at java.lang.Thread.run(Thread.java:748)
   [junit4]   2> 1430189 INFO  (jetty-launcher-3232-thread-2) [    ] o.a.s.c.ZkContainer Zookeeper client=127.0.0.1:55819/solr
   [junit4]   2> 1430189 INFO  (jetty-launcher-3232-thread-1) [    ] o.a.s.c.ZkContainer Zookeeper client=127.0.0.1:55819/solr
   [junit4]   2> 1430192 INFO  (zkConnectionManagerCallback-3245-thread-1) [    ] o.a.s.c.c.ConnectionManager zkClient has connected
   [junit4]   2> 1430192 INFO  (zkConnectionManagerCallback-3247-thread-1) [    ] o.a.s.c.c.ConnectionManager zkClient has connected
   [junit4]   2> 1430193 WARN  (NIOServerCxn.Factory:0.0.0.0/0.0.0.0:0) [    ] o.a.z.s.NIOServerCnxn caught end of stream exception
   [junit4]   2> EndOfStreamException: Unable to read additional data from client sessionid 0x160934136900003, likely client has closed socket
   [junit4]   2> 	at org.apache.zookeeper.server.NIOServerCnxn.doIO(NIOServerCnxn.java:239)
   [junit4]   2> 	at org.apache.zookeeper.server.NIOServerCnxnFactory.run(NIOServerCnxnFactory.java:203)
   [junit4]   2> 	at java.lang.Thread.run(Thread.java:748)
   [junit4]   2> 1430196 INFO  (zkConnectionManagerCallback-3249-thread-1-processing-n:127.0.0.1:55824_solr) [n:127.0.0.1:55824_solr    ] o.a.s.c.c.ConnectionManager zkClient has connected
   [junit4]   2> 1430196 INFO  (zkConnectionManagerCallback-3251-thread-1-processing-n:127.0.0.1:55823_solr) [n:127.0.0.1:55823_solr    ] o.a.s.c.c.ConnectionManager zkClient has connected
   [junit4]   2> 1430312 INFO  (jetty-launcher-3232-thread-1) [n:127.0.0.1:55823_solr    ] o.a.s.c.Overseer Overseer (id=null) closing
   [junit4]   2> 1430312 INFO  (jetty-launcher-3232-thread-2) [n:127.0.0.1:55824_solr    ] o.a.s.c.Overseer Overseer (id=null) closing
   [junit4]   2> 1430312 INFO  (jetty-launcher-3232-thread-1) [n:127.0.0.1:55823_solr    ] o.a.s.c.OverseerElectionContext I am going to be the leader 127.0.0.1:55823_solr
   [junit4]   2> 1430313 INFO  (jetty-launcher-3232-thread-2) [n:127.0.0.1:55824_solr    ] o.a.s.c.ZkController Register node as live in ZooKeeper:/live_nodes/127.0.0.1:55824_solr
   [junit4]   2> 1430314 INFO  (jetty-launcher-3232-thread-1) [n:127.0.0.1:55823_solr    ] o.a.s.c.Overseer Overseer (id=99241100099715078-127.0.0.1:55823_solr-n_0000000000) starting
   [junit4]   2> 1430314 INFO  (zkCallback-3250-thread-1-processing-n:127.0.0.1:55823_solr) [n:127.0.0.1:55823_solr    ] o.a.s.c.c.ZkStateReader Updated live nodes from ZooKeeper... (0) -> (1)
   [junit4]   2> 1430315 INFO  (zkCallback-3248-thread-1-processing-n:127.0.0.1:55824_solr) [n:127.0.0.1:55824_solr    ] o.a.s.c.c.ZkStateReader Updated live nodes from ZooKeeper... (0) -> (1)
   [junit4]   2> 1430321 INFO  (jetty-launcher-3232-thread-1) [n:127.0.0.1:55823_solr    ] o.a.s.c.ZkController Register node as live in ZooKeeper:/live_nodes/127.0.0.1:55823_solr
   [junit4]   2> 1430323 INFO  (zkCallback-3248-thread-1-processing-n:127.0.0.1:55824_solr) [n:127.0.0.1:55824_solr    ] o.a.s.c.c.ZkStateReader Updated live nodes from ZooKeeper... (1) -> (2)
   [junit4]   2> 1430323 INFO  (zkCallback-3250-thread-1-processing-n:127.0.0.1:55823_solr) [n:127.0.0.1:55823_solr    ] o.a.s.c.c.ZkStateReader Updated live nodes from ZooKeeper... (1) -> (2)
   [junit4]   2> 1430432 INFO  (jetty-launcher-3232-thread-1) [n:127.0.0.1:55823_solr    ] o.a.s.m.r.SolrJmxReporter JMX monitoring for 'solr_55823.solr.node' (registry 'solr.node') enabled at server: com.sun.jmx.mbeanserver.JmxMBeanServer@530e447b
   [junit4]   2> 1430433 INFO  (jetty-launcher-3232-thread-2) [n:127.0.0.1:55824_solr    ] o.a.s.m.r.SolrJmxReporter JMX monitoring for 'solr_55824.solr.node' (registry 'solr.node') enabled at server: com.sun.jmx.mbeanserver.JmxMBeanServer@530e447b
   [junit4]   2> 1430438 INFO  (jetty-launcher-3232-thread-1) [n:127.0.0.1:55823_solr    ] o.a.s.m.r.SolrJmxReporter JMX monitoring for 'solr_55823.solr.jvm' (registry 'solr.jvm') enabled at server: com.sun.jmx.mbeanserver.JmxMBeanServer@530e447b
   [junit4]   2> 1430438 INFO  (jetty-launcher-3232-thread-1) [n:127.0.0.1:55823_solr    ] o.a.s.m.r.SolrJmxReporter JMX monitoring for 'solr_55823.solr.jetty' (registry 'solr.jetty') enabled at server: com.sun.jmx.mbeanserver.JmxMBeanServer@530e447b
   [junit4]   2> 1430439 INFO  (jetty-launcher-3232-thread-2) [n:127.0.0.1:55824_solr    ] o.a.s.m.r.SolrJmxReporter JMX monitoring for 'solr_55824.solr.jvm' (registry 'solr.jvm') enabled at server: com.sun.jmx.mbeanserver.JmxMBeanServer@530e447b
   [junit4]   2> 1430439 INFO  (jetty-launcher-3232-thread-1) [n:127.0.0.1:55823_solr    ] o.a.s.c.CorePropertiesLocator Found 0 core definitions underneath C:\Users\jenkins\workspace\Lucene-Solr-7.x-Windows\solr\build\solr-core\test\J0\temp\solr.cloud.TestTlogReplica_C4E9E618E9DC5BEC-001\tempDir-001\node1\.
   [junit4]   2> 1430439 INFO  (jetty-launcher-3232-thread-2) [n:127.0.0.1:55824_solr    ] o.a.s.m.r.SolrJmxReporter JMX monitoring for 'solr_55824.solr.jetty' (registry 'solr.jetty') enabled at server: com.sun.jmx.mbeanserver.JmxMBeanServer@530e447b
   [junit4]   2> 1430441 INFO  (jetty-launcher-3232-thread-2) [n:127.0.0.1:55824_solr    ] o.a.s.c.CorePropertiesLocator Found 0 core definitions underneath C:\Users\jenkins\workspace\Lucene-Solr-7.x-Windows\solr\build\solr-core\test\J0\temp\solr.cloud.TestTlogReplica_C4E9E618E9DC5BEC-001\tempDir-001\node2\.
   [junit4]   2> 1430498 INFO  (zkConnectionManagerCallback-3257-thread-1) [    ] o.a.s.c.c.ConnectionManager zkClient has connected
   [junit4]   2> 1430502 INFO  (zkConnectionManagerCallback-3261-thread-1) [    ] o.a.s.c.c.ConnectionManager zkClient has connected
   [junit4]   2> 1430504 INFO  (SUITE-TestTlogReplica-seed#[C4E9E618E9DC5BEC]-worker) [    ] o.a.s.c.c.ZkStateReader Updated live nodes from ZooKeeper... (0) -> (2)
   [junit4]   2> 1430505 INFO  (SUITE-TestTlogReplica-seed#[C4E9E618E9DC5BEC]-worker) [    ] o.a.s.c.s.i.ZkClientClusterStateProvider Cluster at 127.0.0.1:55819/solr ready
   [junit4]   2> 1430510 INFO  (SUITE-TestTlogReplica-seed#[C4E9E618E9DC5BEC]-worker) [    ] o.a.s.c.TestTlogReplica Using legacyCloud?: false
   [junit4]   2> 1430511 INFO  (qtp2093636883-15035) [n:127.0.0.1:55824_solr    ] o.a.s.h.a.CollectionsHandler Invoked Collection Action :clusterprop with params val=false&name=legacyCloud&action=CLUSTERPROP&wt=javabin&version=2 and sendToOCPQueue=true
   [junit4]   2> 1430512 INFO  (qtp2093636883-15035) [n:127.0.0.1:55824_solr    ] o.a.s.s.HttpSolrCall [admin] webapp=null path=/admin/collections params={val=false&name=legacyCloud&action=CLUSTERPROP&wt=javabin&version=2} status=0 QTime=0
   [junit4]   2> 1430524 INFO  (TEST-TestTlogReplica.testAddDocs-seed#[C4E9E618E9DC5BEC]) [    ] o.a.s.SolrTestCaseJ4 ###Starting testAddDocs
   [junit4]   2> 1430525 INFO  (qtp2093636883-15044) [n:127.0.0.1:55824_solr    ] o.a.s.h.a.CollectionsHandler Invoked Collection Action :create with params pullReplicas=0&replicationFactor=0&collection.configName=conf&maxShardsPerNode=100&name=tlog_replica_test_add_docs&nrtReplicas=0&action=CREATE&numShards=1&tlogReplicas=2&wt=javabin&version=2 and sendToOCPQueue=true
   [junit4]   2> 1430528 INFO  (OverseerThreadFactory-6890-thread-1-processing-n:127.0.0.1:55823_solr) [n:127.0.0.1:55823_solr    ] o.a.s.c.CreateCollectionCmd Create collection tlog_replica_test_add_docs
   [junit4]   2> 1430637 INFO  (OverseerStateUpdate-99241100099715078-127.0.0.1:55823_solr-n_0000000000) [n:127.0.0.1:55823_solr    ] o.a.s.c.o.SliceMutator createReplica() {
   [junit4]   2>   "operation":"ADDREPLICA",
   [junit4]   2>   "collection":"tlog_replica_test_add_docs",
   [junit4]   2>   "shard":"shard1",
   [junit4]   2>   "core":"tlog_replica_test_add_docs_shard1_replica_t1",
   [junit4]   2>   "state":"down",
   [junit4]   2>   "base_url":"http://127.0.0.1:55824/solr",
   [junit4]   2>   "type":"TLOG",
   [junit4]   2>   "waitForFinalState":"false"} 
   [junit4]   2> 1430638 INFO  (OverseerStateUpdate-99241100099715078-127.0.0.1:55823_solr-n_0000000000) [n:127.0.0.1:55823_solr    ] o.a.s.c.o.SliceMutator createReplica() {
   [junit4]   2>   "operation":"ADDREPLICA",
   [junit4]   2>   "collection":"tlog_replica_test_add_docs",
   [junit4]   2>   "shard":"shard1",
   [junit4]   2>   "core":"tlog_replica_test_add_docs_shard1_replica_t2",
   [junit4]   2>   "state":"down",
   [junit4]   2>   "base_url":"http://127.0.0.1:55823/solr",
   [junit4]   2>   "type":"TLOG",
   [junit4]   2>   "waitForFinalState":"false"} 
   [junit4]   2> 1430841 INFO  (qtp2093636883-15045) [n:127.0.0.1:55824_solr    ] o.a.s.h.a.CoreAdminOperation core create command qt=/admin/cores&coreNodeName=core_node3&collection.configName=conf&newCollection=true&name=tlog_replica_test_add_docs_shard1_replica_t1&action=CREATE&numShards=1&collection=tlog_replica_test_add_docs&shard=shard1&wt=javabin&version=2&replicaType=TLOG
   [junit4]   2> 1430841 INFO  (qtp565910226-15040) [n:127.0.0.1:55823_solr    ] o.a.s.h.a.CoreAdminOperation core create command qt=/admin/cores&coreNodeName=core_node4&collection.configName=conf&newCollection=true&name=tlog_replica_test_add_docs_shard1_replica_t2&action=CREATE&numShards=1&collection=tlog_replica_test_add_docs&shard=shard1&wt=javabin&version=2&replicaType=TLOG
   [junit4]   2> 1430842 INFO  (qtp565910226-15040) [n:127.0.0.1:55823_solr    ] o.a.s.c.TransientSolrCoreCacheDefault Allocating transient cache for 2147483647 transient cores
   [junit4]   2> 1430842 INFO  (qtp2093636883-15045) [n:127.0.0.1:55824_solr    ] o.a.s.c.TransientSolrCoreCacheDefault Allocating transient cache for 2147483647 transient cores
   [junit4]   2> 1430950 INFO  (zkCallback-3248-thread-1-processing-n:127.0.0.1:55824_solr) [n:127.0.0.1:55824_solr    ] o.a.s.c.c.ZkStateReader A cluster state change: [WatchedEvent state:SyncConnected type:NodeDataChanged path:/collections/tlog_replica_test_add_docs/state.json] for collection [tlog_replica_test_add_docs] has occurred - updating... (live nodes size: [2])
   [junit4]   2> 1430950 INFO  (zkCallback-3250-thread-1-processing-n:127.0.0.1:55823_solr) [n:127.0.0.1:55823_solr    ] o.a.s.c.c.ZkStateReader A cluster state change: [WatchedEvent state:SyncConnected type:NodeDataChanged path:/collections/tlog_replica_test_add_docs/state.json] for collection [tlog_replica_test_add_docs] has occurred - updating... (live nodes size: [2])
   [junit4]   2> 1430951 INFO  (zkCallback-3250-thread-2-processing-n:127.0.0.1:55823_solr) [n:127.0.0.1:55823_solr    ] o.a.s.c.c.ZkStateReader A cluster state change: [WatchedEvent state:SyncConnected type:NodeDataChanged path:/collections/tlog_replica_test_add_docs/state.json] for collection [tlog_replica_test_add_docs] has occurred - updating... (live nodes size: [2])
   [junit4]   2> 1430951 INFO  (zkCallback-3248-thread-2-processing-n:127.0.0.1:55824_solr) [n:127.0.0.1:55824_solr    ] o.a.s.c.c.ZkStateReader A cluster state change: [WatchedEvent state:SyncConnected type:NodeDataChanged path:/collections/tlog_replica_test_add_docs/state.json] for collection [tlog_replica_test_add_docs] has occurred - updating... (live nodes size: [2])
   [junit4]   2> 1431865 INFO  (qtp2093636883-15045) [n:127.0.0.1:55824_solr c:tlog_replica_test_add_docs s:shard1 r:core_node3 x:tlog_replica_test_add_docs_shard1_replica_t1] o.a.s.c.SolrConfig Using Lucene MatchVersion: 7.3.0
   [junit4]   2> 1431868 INFO  (qtp565910226-15040) [n:127.0.0.1:55823_solr c:tlog_replica_test_add_docs s:shard1 r:core_node4 x:tlog_replica_test_add_docs_shard1_replica_t2] o.a.s.c.SolrConfig Using Lucene MatchVersion: 7.3.0
   [junit4]   2> 1431871 INFO  (qtp2093636883-15045) [n:127.0.0.1:55824_solr c:tlog_replica_test_add_docs s:shard1 r:core_node3 x:tlog_replica_test_add_docs_shard1_replica_t1] o.a.s.s.IndexSchema [tlog_replica_test_add_docs_shard1_replica_t1] Schema name=minimal
   [junit4]   2> 1431875 INFO  (qtp2093636883-15045) [n:127.0.0.1:55824_solr c:tlog_replica_test_add_docs s:shard1 r:core_node3 x:tlog_replica_test_add_docs_shard1_replica_t1] o.a.s.s.IndexSchema Loaded schema minimal/1.1 with uniqueid field id
   [junit4]   2> 1431875 INFO  (qtp2093636883-15045) [n:127.0.0.1:55824_solr c:tlog_replica_test_add_docs s:shard1 r:core_node3 x:tlog_replica_test_add_docs_shard1_replica_t1] o.a.s.c.CoreContainer Creating SolrCore 'tlog_replica_test_add_docs_shard1_replica_t1' using configuration from collection tlog_replica_test_add_docs, trusted=true
   [junit4]   2> 1431875 INFO  (qtp2093636883-15045) [n:127.0.0.1:55824_solr c:tlog_replica_test_add_docs s:shard1 r:core_node3 x:tlog_replica_test_add_docs_shard1_replica_t1] o.a.s.m.r.SolrJmxReporter JMX monitoring for 'solr_55824.solr.core.tlog_replica_test_add_docs.shard1.replica_t1' (registry 'solr.core.tlog_replica_test_add_docs.shard1.replica_t1') enabled at server: com.sun.jmx.mbeanserver.JmxMBeanServer@530e447b
   [junit4]   2> 1431876 INFO  (qtp2093636883-15045) [n:127.0.0.1:55824_solr c:tlog_replica_test_add_docs s:shard1 r:core_node3 x:tlog_replica_test_add_docs_shard1_replica_t1] o.a.s.c.SolrCore solr.RecoveryStrategy.Builder
   [junit4]   2> 1431891 INFO  (qtp2093636883-15045) [n:127.0.0.1:55824_solr c:tlog_replica_test_add_docs s:shard1 r:core_node3 x:tlog_replica_test_add_docs_shard1_replica_t1] o.a.s.c.SolrCore [[tlog_replica_test_add_docs_shard1_replica_t1] ] Opening new SolrCore at [C:\Users\jenkins\workspace\Lucene-Solr-7.x-Windows\solr\build\solr-core\test\J0\temp\solr.cloud.TestTlogReplica_C4E9E618E9DC5BEC-001\tempDir-001\node2\tlog_replica_test_add_docs_shard1_replica_t1], dataDir=[C:\Users\jenkins\workspace\Lucene-Solr-7.x-Windows\solr\build\solr-core\test\J0\temp\solr.cloud.TestTlogReplica_C4E9E618E9DC5BEC-001\tempDir-001\node2\.\tlog_replica_test_add_docs_shard1_replica_t1\data\]
   [junit4]   2> 1431895 INFO  (qtp565910226-15040) [n:127.0.0.1:55823_solr c:tlog_replica_test_add_docs s:shard1 r:core_node4 x:tlog_replica_test_add_docs_shard1_replica_t2] o.a.s.s.IndexSchema [tlog_replica_test_add_docs_shard1_replica_t2] Schema name=minimal
   [junit4]   2> 1431896 INFO  (qtp565910226-15040) [n:127.0.0.1:55823_solr c:tlog_replica_test_add_docs s:shard1 r:core_node4 x:tlog_replica_test_add_docs_shard1_replica_t2] o.a.s.s.IndexSchema Loaded schema minimal/1.1 with uniqueid field id
   [junit4]   2> 1431896 INFO  (qtp565910226-15040) [n:127.0.0.1:55823_solr c:tlog_replica_test_add_docs s:shard1 r:core_node4 x:tlog_replica_test_add_docs_shard1_replica_t2] o.a.s.c.CoreContainer Creating SolrCore 'tlog_replica_test_add_docs_shard1_replica_t2' using configuration from collection tlog_replica_test_add_docs, trusted=true
   [junit4]   2> 1431897 INFO  (qtp565910226-15040) [n:127.0.0.1:55823_solr c:tlog_replica_test_add_docs s:shard1 r:core_node4 x:tlog_replica_test_add_docs_shard1_replica_t2] o.a.s.m.r.SolrJmxReporter JMX monitoring for 'solr_55823.solr.core.tlog_replica_test_add_docs.shard1.replica_t2' (registry 'solr.core.tlog_replica_test_add_docs.shard1.replica_t2') enabled at server: com.sun.jmx.mbeanserver.JmxMBeanServer@530e447b
   [junit4]   2> 1431897 INFO  (qtp565910226-15040) [n:127.0.0.1:55823_solr c:tlog_replica_test_add_docs s:shard1 r:core_node4 x:tlog_replica_test_add_docs_shard1_replica_t2] o.a.s.c.SolrCore solr.RecoveryStrategy.Builder
   [junit4]   2> 1431897 INFO  (qtp565910226-15040) [n:127.0.0.1:55823_solr c:tlog_replica_test_add_docs s:shard1 r:core_node4 x:tlog_replica_test_add_docs_shard1_replica_t2] o.a.s.c.SolrCore [[tlog_replica_test_add_docs_shard1_replica_t2] ] Opening new SolrCore at [C:\Users\jenkins\workspace\Lucene-Solr-7.x-Windows\solr\build\solr-core\test\J0\temp\solr.cloud.TestTlogReplica_C4E9E618E9DC5BEC-001\tempDir-001\node1\tlog_replica_test_add_docs_shard1_replica_t2], dataDir=[C:\Users\jenkins\workspace\Lucene-Solr-7.x-Windows\solr\build\solr-core\test\J0\temp\solr.cloud.TestTlogReplica_C4E9E618E9DC5BEC-001\tempDir-001\node1\.\tlog_replica_test_add_docs_shard1_replica_t2\data\]
   [junit4]   2> 1432012 INFO  (qtp565910226-15040) [n:127.0.0.1:55823_solr c:tlog_replica_test_add_docs s:shard1 r:core_node4 x:tlog_replica_test_add_docs_shard1_replica_t2] o.a.s.u.UpdateHandler Using UpdateLog implementation: org.apache.solr.update.UpdateLog
   [junit4]   2> 1432012 INFO  (qtp565910226-15040) [n:127.0.0.1:55823_solr c:tlog_replica_test_add_docs s:shard1 r:core_node4 x:tlog_replica_test_add_docs_shard1_replica_t2] o.a.s.u.UpdateLog Initializing UpdateLog: dataDir=null defaultSyncLevel=FLUSH numRecordsToKeep=100 maxNumLogsToKeep=10 numVersionBuckets=65536
   [junit4]   2> 1432014 INFO  (qtp565910226-15040) [n:127.0.0.1:55823_solr c:tlog_replica_test_add_docs s:shard1 r:core_node4 x:tlog_replica_test_add_docs_shard1_replica_t2] o.a.s.u.CommitTracker Hard AutoCommit: disabled
   [junit4]   2> 1432014 INFO  (qtp565910226-15040) [n:127.0.0.1:55823_solr c:tlog_replica_test_add_docs s:shard1 r:core_node4 x:tlog_replica_test_add_docs_shard1_replica_t2] o.a.s.u.CommitTracker Soft AutoCommit: disabled
   [junit4]   2> 1432015 INFO  (qtp2093636883-15045) [n:127.0.0.1:55824_solr c:tlog_replica_test_add_docs s:shard1 r:core_node3 x:tlog_replica_test_add_docs_shard1_replica_t1] o.a.s.u.UpdateHandler Using UpdateLog implementation: org.apache.solr.update.UpdateLog
   [junit4]   2> 1432015 INFO  (qtp2093636883-15045) [n:127.0.0.1:55824_solr c:tlog_replica_test_add_docs s:shard1 r:core_node3 x:tlog_replica_test_add_docs_shard1_replica_t1] o.a.s.u.UpdateLog Initializing UpdateLog: dataDir=null defaultSyncLevel=FLUSH numRecordsToKeep=100 maxNumLogsToKeep=10 numVersionBuckets=65536
   [junit4]   2> 1432015 INFO  (qtp565910226-15040) [n:127.0.0.1:55823_solr c:tlog_replica_test_add_docs s:shard1 r:core_node4 x:tlog_replica_test_add_docs_shard1_replica_t2] o.a.s.s.SolrIndexSearcher Opening [Searcher@3ad01ccc[tlog_replica_test_add_docs_shard1_replica_t2] main]
   [junit4]   2> 1432016 INFO  (qtp2093636883-15045) [n:127.0.0.1:55824_solr c:tlog_replica_test_add_docs s:shard1 r:core_node3 x:tlog_replica_test_add_docs_shard1_replica_t1] o.a.s.u.CommitTracker Hard AutoCommit: disabled
   [junit4]   2> 1432016 INFO  (qtp2093636883-15045) [n:127.0.0.1:55824_solr c:tlog_replica_test_add_docs s:shard1 r:core_node3 x:tlog_replica_test_add_docs_shard1_replica_t1] o.a.s.u.CommitTracker Soft AutoCommit: disabled
   [junit4]   2> 1432018 INFO  (qtp565910226-15040) [n:127.0.0.1:55823_solr c:tlog_replica_test_add_docs s:shard1 r:core_node4 x:tlog_replica_test_add_docs_shard1_replica_t2] o.a.s.r.ManagedResourceStorage Configured ZooKeeperStorageIO with znodeBase: /configs/conf
   [junit4]   2> 1432018 INFO  (qtp565910226-15040) [n:127.0.0.1:55823_solr c:tlog_replica_test_add_docs s:shard1 r:core_node4 x:tlog_replica_test_add_docs_shard1_replica_t2] o.a.s.r.ManagedResourceStorage Loaded null at path _rest_managed.json using ZooKeeperStorageIO:path=/configs/conf
   [junit4]   2> 1432018 INFO  (qtp565910226-15040) [n:127.0.0.1:55823_solr c:tlog_replica_test_add_docs s:shard1 r:core_node4 x:tlog_replica_test_add_docs_shard1_replica_t2] o.a.s.h.ReplicationHandler Commits will be reserved for 10000ms.
   [junit4]   2> 1432019 INFO  (qtp565910226-15040) [n:127.0.0.1:55823_solr c:tlog_replica_test_add_docs s:shard1 r:core_node4 x:tlog_replica_test_add_docs_shard1_replica_t2] o.a.s.u.UpdateLog Could not find max version in index or recent updates, using new clock 1587857603650650112
   [junit4]   2> 1432019 INFO  (searcherExecutor-6896-thread-1-processing-n:127.0.0.1:55823_solr x:tlog_replica_test_add_docs_shard1_replica_t2 s:shard1 c:tlog_replica_test_add_docs r:core_node4) [n:127.0.0.1:55823_solr c:tlog_replica_test_add_docs s:shard1 r:core_node4 x:tlog_replica_test_add_docs_shard1_replica_t2] o.a.s.c.SolrCore [tlog_replica_test_add_docs_shard1_replica_t2] Registered new searcher Searcher@3ad01ccc[tlog_replica_test_add_docs_shard1_replica_t2] main{ExitableDirectoryReader(UninvertingDirectoryReader())}
   [junit4]   2> 1432020 INFO  (qtp2093636883-15045) [n:127.0.0.1:55824_solr c:tlog_replica_test_add_docs s:shard1 r:core_node3 x:tlog_replica_test_add_docs_shard1_replica_t1] o.a.s.s.SolrIndexSearcher Opening [Searcher@1fe0de4a[tlog_replica_test_add_docs_shard1_replica_t1] main]
   [junit4]   2> 1432022 INFO  (qtp2093636883-15045) [n:127.0.0.1:55824_solr c:tlog_replica_test_add_docs s:shard1 r:core_node3 x:tlog_replica_test_add_docs_shard1_replica_t1] o.a.s.r.ManagedResourceStorage Configured ZooKeeperStorageIO with znodeBase: /configs/conf
   [junit4]   2> 1432023 INFO  (qtp2093636883-15045) [n:127.0.0.1:55824_solr c:tlog_replica_test_add_docs s:shard1 r:core_node3 x:tlog_replica_test_add_docs_shard1_replica_t1] o.a.s.r.ManagedResourceStorage Loaded null at path _rest_managed.json using ZooKeeperStorageIO:path=/configs/conf
   [junit4]   2> 1432027 INFO  (qtp2093636883-15045) [n:127.0.0.1:55824_solr c:tlog_replica_test_add_docs s:shard1 r:core_node3 x:tlog_replica_test_add_docs_shard1_replica_t1] o.a.s.h.ReplicationHandler Commits will be reserved for 10000ms.
   [junit4]   2> 1432027 INFO  (qtp2093636883-15045) [n:127.0.0.1:55824_solr c:tlog_replica_test_add_docs s:shard1 r:core_node3 x:tlog_replica_test_add_docs_shard1_replica_t1] o.a.s.u.UpdateLog Could not find max version in index or recent updates, using new clock 1587857603659038720
   [junit4]   2> 1432029 INFO  (searcherExecutor-6895-thread-1-processing-n:127.0.0.1:55824_solr x:tlog_replica_test_add_docs_shard1_replica_t1 s:shard1 c:tlog_replica_test_add_docs r:core_node3) [n:127.0.0.1:55824_solr c:tlog_replica_test_add_docs s:shard1 r:core_node3 x:tlog_replica_test_add_docs_shard1_replica_t1] o.a.s.c.SolrCore [tlog_replica_test_add_docs_shard1_replica_t1] Registered new searcher Searcher@1fe0de4a[tlog_replica_test_add_docs_shard1_replica_t1] main{ExitableDirectoryReader(UninvertingDirectoryReader())}
   [junit4]   2> 1432033 INFO  (qtp565910226-15040) [n:127.0.0.1:55823_solr c:tlog_replica_test_add_docs s:shard1 r:core_node4 x:tlog_replica_test_add_docs_shard1_replica_t2] o.a.s.c.ShardLeaderElectionContext Enough replicas found to continue.
   [junit4]   2> 1432033 INFO  (qtp565910226-15040) [n:127.0.0.1:55823_solr c:tlog_replica_test_add_docs s:shard1 r:core_node4 x:tlog_replica_test_add_docs_shard1_replica_t2] o.a.s.c.ShardLeaderElectionContext I may be the new leader - try and sync
   [junit4]   2> 1432034 INFO  (qtp565910226-15040) [n:127.0.0.1:55823_solr c:tlog_replica_test_add_docs s:shard1 r:core_node4 x:tlog_replica_test_add_docs_shard1_replica_t2] o.a.s.c.SyncStrategy Sync replicas to http://127.0.0.1:55823/solr/tlog_replica_test_add_docs_shard1_replica_t2/
   [junit4]   2> 1432034 INFO  (qtp565910226-15040) [n:127.0.0.1:55823_solr c:tlog_replica_test_add_docs s:shard1 r:core_node4 x:tlog_replica_test_add_docs_shard1_replica_t2] o.a.s.u.PeerSync PeerSync: core=tlog_replica_test_add_docs_shard1_replica_t2 url=http://127.0.0.1:55823/solr START replicas=[http://127.0.0.1:55824/solr/tlog_replica_test_add_docs_shard1_replica_t1/] nUpdates=100
   [junit4]   2> 1432036 INFO  (qtp2093636883-15048) [n:127.0.0.1:55824_solr c:tlog_replica_test_add_docs s:shard1 r:core_node3 x:tlog_replica_test_add_docs_shard1_replica_t1] o.a.s.c.S.Request [tlog_replica_test_add_docs_shard1_replica_t1]  webapp=/solr path=/get params={distrib=false&qt=/get&fingerprint=false&getVersions=100&wt=javabin&version=2} status=0 QTime=0
   [junit4]   2> 1432135 INFO  (zkCallback-3250-thread-2-processing-n:127.0.0.1:55823_solr) [n:127.0.0.1:55823_solr    ] o.a.s.c.c.ZkStateReader A cluster state change: [WatchedEvent state:SyncConnected type:NodeDataChanged path:/collections/tlog_replica_test_add_docs/state.json] for collection [tlog_replica_test_add_docs] has occurred - updating... (live nodes size: [2])
   [junit4]   2> 1432136 INFO  (zkCallback-3250-thread-3-processing-n:127.0.0.1:55823_solr) [n:1

[...truncated too long message...]

ilterFactory, TestCloudSchemaless, TestSchemaManager, CursorMarkTest, LargeFieldTest, SortSpecParsingTest, TestAddFieldRealTimeGet, TestFieldSortValues, TestInitQParser, TestMultiWordSynonyms, TestNoOpRegenerator, TestPayloadScoreQParserPlugin, TestSolrCoreParser, TestStandardQParsers, TestStressUserVersions, DistributedFacetSimpleRefinementLongTailTest, TestMinMaxOnMultiValuedField, TestSortByMinMaxFunction, BlockJoinFacetSimpleTest, TestCloudNestedDocsSort, TestScoreJoinQPNoScore, TestScoreJoinQPScore, CloudMLTQParserTest, TestNonDefinedSimilarityFactory, TestPerFieldSimilarityWithDefaultOverride, TestDefaultStatsCache, BasicAuthStandaloneTest, PKIAuthenticationIntegrationTest, TestImpersonationWithHadoopAuth, HttpSolrCallGetCoreTest, ResponseHeaderTest, ConjunctionSolrSpellCheckerTest, TestFileDictionaryLookup, TestFreeTextSuggestions, TestFieldCacheSort, TestFieldCacheSortRandom, TestFieldCacheVsDocValues, TestFieldCacheWithThreads, TestLegacyFieldCache, TestNumericTerms32, PeerSyncWithIndexFingerprintCachingTest, TestDocBasedVersionConstraints, UpdateLogTest, AtomicUpdateProcessorFactoryTest, AtomicUpdatesTest, DocExpirationUpdateProcessorFactoryTest, IgnoreCommitOptimizeUpdateProcessorFactoryTest, ParsingFieldUpdateProcessorsTest, PreAnalyzedUpdateProcessorTest, TemplateUpdateProcessorTest, TimeRoutedAliasUpdateProcessorTest]
   [junit4]   2> NOTE: reproduce with: ant test  -Dtestcase=TimeRoutedAliasUpdateProcessorTest -Dtests.seed=C4E9E618E9DC5BEC -Dtests.slow=true -Dtests.locale=de-DE -Dtests.timezone=Canada/Saskatchewan -Dtests.asserts=true -Dtests.file.encoding=ISO-8859-1
   [junit4] ERROR   0.00s J0 | TimeRoutedAliasUpdateProcessorTest (suite) <<<
   [junit4]    > Throwable #1: java.io.IOException: Could not remove the following files (in the order of attempts):
   [junit4]    >    C:\Users\jenkins\workspace\Lucene-Solr-7.x-Windows\solr\build\solr-core\test\J0\temp\solr.update.processor.TimeRoutedAliasUpdateProcessorTest_C4E9E618E9DC5BEC-001\tempDir-001\node2\myalias_2017-10-24_shard2_replica_n4\data\tlog: java.nio.file.DirectoryNotEmptyException: C:\Users\jenkins\workspace\Lucene-Solr-7.x-Windows\solr\build\solr-core\test\J0\temp\solr.update.processor.TimeRoutedAliasUpdateProcessorTest_C4E9E618E9DC5BEC-001\tempDir-001\node2\myalias_2017-10-24_shard2_replica_n4\data\tlog
   [junit4]    >    C:\Users\jenkins\workspace\Lucene-Solr-7.x-Windows\solr\build\solr-core\test\J0\temp\solr.update.processor.TimeRoutedAliasUpdateProcessorTest_C4E9E618E9DC5BEC-001\tempDir-001\node2\myalias_2017-10-24_shard2_replica_n4\data: java.nio.file.DirectoryNotEmptyException: C:\Users\jenkins\workspace\Lucene-Solr-7.x-Windows\solr\build\solr-core\test\J0\temp\solr.update.processor.TimeRoutedAliasUpdateProcessorTest_C4E9E618E9DC5BEC-001\tempDir-001\node2\myalias_2017-10-24_shard2_replica_n4\data
   [junit4]    >    C:\Users\jenkins\workspace\Lucene-Solr-7.x-Windows\solr\build\solr-core\test\J0\temp\solr.update.processor.TimeRoutedAliasUpdateProcessorTest_C4E9E618E9DC5BEC-001\tempDir-001\node2\myalias_2017-10-24_shard2_replica_n4: java.nio.file.DirectoryNotEmptyException: C:\Users\jenkins\workspace\Lucene-Solr-7.x-Windows\solr\build\solr-core\test\J0\temp\solr.update.processor.TimeRoutedAliasUpdateProcessorTest_C4E9E618E9DC5BEC-001\tempDir-001\node2\myalias_2017-10-24_shard2_replica_n4
   [junit4]    >    C:\Users\jenkins\workspace\Lucene-Solr-7.x-Windows\solr\build\solr-core\test\J0\temp\solr.update.processor.TimeRoutedAliasUpdateProcessorTest_C4E9E618E9DC5BEC-001\tempDir-001\node2: java.nio.file.DirectoryNotEmptyException: C:\Users\jenkins\workspace\Lucene-Solr-7.x-Windows\solr\build\solr-core\test\J0\temp\solr.update.processor.TimeRoutedAliasUpdateProcessorTest_C4E9E618E9DC5BEC-001\tempDir-001\node2
   [junit4]    >    C:\Users\jenkins\workspace\Lucene-Solr-7.x-Windows\solr\build\solr-core\test\J0\temp\solr.update.processor.TimeRoutedAliasUpdateProcessorTest_C4E9E618E9DC5BEC-001\tempDir-001: java.nio.file.DirectoryNotEmptyException: C:\Users\jenkins\workspace\Lucene-Solr-7.x-Windows\solr\build\solr-core\test\J0\temp\solr.update.processor.TimeRoutedAliasUpdateProcessorTest_C4E9E618E9DC5BEC-001\tempDir-001
   [junit4]    > 	at __randomizedtesting.SeedInfo.seed([C4E9E618E9DC5BEC]:0)
   [junit4]    > 	at org.apache.lucene.util.IOUtils.rm(IOUtils.java:329)
   [junit4]    > 	at java.lang.Thread.run(Thread.java:748)
   [junit4] Completed [755/764 (3!)] on J0 in 12.79s, 2 tests, 1 error <<< FAILURES!

[...truncated 2381 lines...]
   [junit4] Suite: org.apache.solr.update.processor.TestOpenNLPExtractNamedEntitiesUpdateProcessorFactory
   [junit4]   2> log4j:WARN No appenders could be found for logger (org.apache.solr.SolrTestCaseJ4).
   [junit4]   2> log4j:WARN Please initialize the log4j system properly.
   [junit4]   2> log4j:WARN See http://logging.apache.org/log4j/1.2/faq.html#noconfig for more info.
   [junit4]   2> Creating dataDir: C:\Users\jenkins\workspace\Lucene-Solr-7.x-Windows\solr\build\contrib\solr-analysis-extras\test\J1\temp\solr.update.processor.TestOpenNLPExtractNamedEntitiesUpdateProcessorFactory_55665E360102B32E-001\init-core-data-001
   [junit4]   2> NOTE: test params are: codec=Asserting(Lucene70), sim=RandomSimilarity(queryNorm=true): {}, locale=de, timezone=Asia/Kuwait
   [junit4]   2> NOTE: Windows 10 10.0 amd64/Oracle Corporation 1.8.0_144 (64-bit)/cpus=3,threads=1,free=73054296,total=97386496
   [junit4]   2> NOTE: All tests run in this JVM: [TestOpenNLPExtractNamedEntitiesUpdateProcessorFactory]
   [junit4]   2> NOTE: reproduce with: ant test  -Dtestcase=TestOpenNLPExtractNamedEntitiesUpdateProcessorFactory -Dtests.seed=55665E360102B32E -Dtests.slow=true -Dtests.locale=de -Dtests.timezone=Asia/Kuwait -Dtests.asserts=true -Dtests.file.encoding=UTF-8
   [junit4] ERROR   0.00s J1 | TestOpenNLPExtractNamedEntitiesUpdateProcessorFactory (suite) <<<
   [junit4]    > Throwable #1: java.io.IOException: Could not remove the following files (in the order of attempts):
   [junit4]    >    C:\Users\jenkins\workspace\Lucene-Solr-7.x-Windows\solr\build\contrib\solr-analysis-extras\test\J1\temp\solr.update.processor.TestOpenNLPExtractNamedEntitiesUpdateProcessorFactory_55665E360102B32E-001\tempDir-001\collection1\conf: java.nio.file.DirectoryNotEmptyException: C:\Users\jenkins\workspace\Lucene-Solr-7.x-Windows\solr\build\contrib\solr-analysis-extras\test\J1\temp\solr.update.processor.TestOpenNLPExtractNamedEntitiesUpdateProcessorFactory_55665E360102B32E-001\tempDir-001\collection1\conf
   [junit4]    >    C:\Users\jenkins\workspace\Lucene-Solr-7.x-Windows\solr\build\contrib\solr-analysis-extras\test\J1\temp\solr.update.processor.TestOpenNLPExtractNamedEntitiesUpdateProcessorFactory_55665E360102B32E-001\tempDir-001\collection1: java.nio.file.DirectoryNotEmptyException: C:\Users\jenkins\workspace\Lucene-Solr-7.x-Windows\solr\build\contrib\solr-analysis-extras\test\J1\temp\solr.update.processor.TestOpenNLPExtractNamedEntitiesUpdateProcessorFactory_55665E360102B32E-001\tempDir-001\collection1
   [junit4]    >    C:\Users\jenkins\workspace\Lucene-Solr-7.x-Windows\solr\build\contrib\solr-analysis-extras\test\J1\temp\solr.update.processor.TestOpenNLPExtractNamedEntitiesUpdateProcessorFactory_55665E360102B32E-001\tempDir-001: java.nio.file.DirectoryNotEmptyException: C:\Users\jenkins\workspace\Lucene-Solr-7.x-Windows\solr\build\contrib\solr-analysis-extras\test\J1\temp\solr.update.processor.TestOpenNLPExtractNamedEntitiesUpdateProcessorFactory_55665E360102B32E-001\tempDir-001
   [junit4]    >    C:\Users\jenkins\workspace\Lucene-Solr-7.x-Windows\solr\build\contrib\solr-analysis-extras\test\J1\temp\solr.update.processor.TestOpenNLPExtractNamedEntitiesUpdateProcessorFactory_55665E360102B32E-001\tempDir-001\collection1\conf\en-test-ner-person.bin: java.nio.file.AccessDeniedException: C:\Users\jenkins\workspace\Lucene-Solr-7.x-Windows\solr\build\contrib\solr-analysis-extras\test\J1\temp\solr.update.processor.TestOpenNLPExtractNamedEntitiesUpdateProcessorFactory_55665E360102B32E-001\tempDir-001\collection1\conf\en-test-ner-person.bin
   [junit4]    >    C:\Users\jenkins\workspace\Lucene-Solr-7.x-Windows\solr\build\contrib\solr-analysis-extras\test\J1\temp\solr.update.processor.TestOpenNLPExtractNamedEntitiesUpdateProcessorFactory_55665E360102B32E-001\tempDir-001\collection1\conf\en-test-sent.bin: java.nio.file.AccessDeniedException: C:\Users\jenkins\workspace\Lucene-Solr-7.x-Windows\solr\build\contrib\solr-analysis-extras\test\J1\temp\solr.update.processor.TestOpenNLPExtractNamedEntitiesUpdateProcessorFactory_55665E360102B32E-001\tempDir-001\collection1\conf\en-test-sent.bin
   [junit4]    >    C:\Users\jenkins\workspace\Lucene-Solr-7.x-Windows\solr\build\contrib\solr-analysis-extras\test\J1\temp\solr.update.processor.TestOpenNLPExtractNamedEntitiesUpdateProcessorFactory_55665E360102B32E-001\tempDir-001\collection1\conf\en-test-tokenizer.bin: java.nio.file.AccessDeniedException: C:\Users\jenkins\workspace\Lucene-Solr-7.x-Windows\solr\build\contrib\solr-analysis-extras\test\J1\temp\solr.update.processor.TestOpenNLPExtractNamedEntitiesUpdateProcessorFactory_55665E360102B32E-001\tempDir-001\collection1\conf\en-test-tokenizer.bin
   [junit4]    >    C:\Users\jenkins\workspace\Lucene-Solr-7.x-Windows\solr\build\contrib\solr-analysis-extras\test\J1\temp\solr.update.processor.TestOpenNLPExtractNamedEntitiesUpdateProcessorFactory_55665E360102B32E-001: java.nio.file.DirectoryNotEmptyException: C:\Users\jenkins\workspace\Lucene-Solr-7.x-Windows\solr\build\contrib\solr-analysis-extras\test\J1\temp\solr.update.processor.TestOpenNLPExtractNamedEntitiesUpdateProcessorFactory_55665E360102B32E-001
   [junit4]    > 	at __randomizedtesting.SeedInfo.seed([55665E360102B32E]:0)
   [junit4]    > 	at org.apache.lucene.util.IOUtils.rm(IOUtils.java:329)
   [junit4]    > 	at java.lang.Thread.run(Thread.java:748)
   [junit4] Completed [1/5 (1!)] on J1 in 19.96s, 8 tests, 1 error <<< FAILURES!

[...truncated 45779 lines...]

Mime
View raw message