lucene-dev mailing list archives

Site index · List index
Message view « Date » · « Thread »
Top « Date » · « Thread »
From Policeman Jenkins Server <jenk...@thetaphi.de>
Subject [JENKINS] Lucene-Solr-7.2-Linux (64bit/jdk-9.0.1) - Build # 97 - Still Unstable!
Date Thu, 21 Dec 2017 20:37:23 GMT
Build: https://jenkins.thetaphi.de/job/Lucene-Solr-7.2-Linux/97/
Java: 64bit/jdk-9.0.1 -XX:-UseCompressedOops -XX:+UseSerialGC

4 tests failed.
FAILED:  junit.framework.TestSuite.org.apache.solr.analytics.NoFacetTest

Error Message:
Could not find collection:collection1

Stack Trace:
java.lang.AssertionError: Could not find collection:collection1
	at __randomizedtesting.SeedInfo.seed([1031165B645B3EAE]:0)
	at org.junit.Assert.fail(Assert.java:93)
	at org.junit.Assert.assertTrue(Assert.java:43)
	at org.junit.Assert.assertNotNull(Assert.java:526)
	at org.apache.solr.cloud.AbstractDistribZkTestBase.waitForRecoveriesToFinish(AbstractDistribZkTestBase.java:155)
	at org.apache.solr.analytics.SolrAnalyticsTestCase.setupCollection(SolrAnalyticsTestCase.java:63)
	at java.base/jdk.internal.reflect.NativeMethodAccessorImpl.invoke0(Native Method)
	at java.base/jdk.internal.reflect.NativeMethodAccessorImpl.invoke(NativeMethodAccessorImpl.java:62)
	at java.base/jdk.internal.reflect.DelegatingMethodAccessorImpl.invoke(DelegatingMethodAccessorImpl.java:43)
	at java.base/java.lang.reflect.Method.invoke(Method.java:564)
	at com.carrotsearch.randomizedtesting.RandomizedRunner.invoke(RandomizedRunner.java:1737)
	at com.carrotsearch.randomizedtesting.RandomizedRunner$6.evaluate(RandomizedRunner.java:874)
	at com.carrotsearch.randomizedtesting.RandomizedRunner$7.evaluate(RandomizedRunner.java:890)
	at com.carrotsearch.randomizedtesting.rules.StatementAdapter.evaluate(StatementAdapter.java:36)
	at com.carrotsearch.randomizedtesting.rules.SystemPropertiesRestoreRule$1.evaluate(SystemPropertiesRestoreRule.java:57)
	at org.apache.lucene.util.AbstractBeforeAfterRule$1.evaluate(AbstractBeforeAfterRule.java:45)
	at com.carrotsearch.randomizedtesting.rules.StatementAdapter.evaluate(StatementAdapter.java:36)
	at org.apache.lucene.util.TestRuleStoreClassName$1.evaluate(TestRuleStoreClassName.java:41)
	at com.carrotsearch.randomizedtesting.rules.NoShadowingOrOverridesOnMethodsRule$1.evaluate(NoShadowingOrOverridesOnMethodsRule.java:40)
	at com.carrotsearch.randomizedtesting.rules.NoShadowingOrOverridesOnMethodsRule$1.evaluate(NoShadowingOrOverridesOnMethodsRule.java:40)
	at com.carrotsearch.randomizedtesting.rules.StatementAdapter.evaluate(StatementAdapter.java:36)
	at com.carrotsearch.randomizedtesting.rules.StatementAdapter.evaluate(StatementAdapter.java:36)
	at org.apache.lucene.util.TestRuleAssertionsRequired$1.evaluate(TestRuleAssertionsRequired.java:53)
	at org.apache.lucene.util.TestRuleMarkFailure$1.evaluate(TestRuleMarkFailure.java:47)
	at org.apache.lucene.util.TestRuleIgnoreAfterMaxFailures$1.evaluate(TestRuleIgnoreAfterMaxFailures.java:64)
	at org.apache.lucene.util.TestRuleIgnoreTestSuites$1.evaluate(TestRuleIgnoreTestSuites.java:54)
	at com.carrotsearch.randomizedtesting.rules.StatementAdapter.evaluate(StatementAdapter.java:36)
	at com.carrotsearch.randomizedtesting.ThreadLeakControl$StatementRunner.run(ThreadLeakControl.java:368)
	at java.base/java.lang.Thread.run(Thread.java:844)


FAILED:  junit.framework.TestSuite.org.apache.solr.core.TestLazyCores

Error Message:
1 thread leaked from SUITE scope at org.apache.solr.core.TestLazyCores:     1) Thread[id=9351, name=searcherExecutor-3531-thread-1, state=WAITING, group=TGRP-TestLazyCores]         at java.base@9.0.1/jdk.internal.misc.Unsafe.park(Native Method)         at java.base@9.0.1/java.util.concurrent.locks.LockSupport.park(LockSupport.java:194)         at java.base@9.0.1/java.util.concurrent.locks.AbstractQueuedSynchronizer$ConditionObject.await(AbstractQueuedSynchronizer.java:2062)         at java.base@9.0.1/java.util.concurrent.LinkedBlockingQueue.take(LinkedBlockingQueue.java:435)         at java.base@9.0.1/java.util.concurrent.ThreadPoolExecutor.getTask(ThreadPoolExecutor.java:1092)         at java.base@9.0.1/java.util.concurrent.ThreadPoolExecutor.runWorker(ThreadPoolExecutor.java:1152)         at java.base@9.0.1/java.util.concurrent.ThreadPoolExecutor$Worker.run(ThreadPoolExecutor.java:641)         at java.base@9.0.1/java.lang.Thread.run(Thread.java:844)

Stack Trace:
com.carrotsearch.randomizedtesting.ThreadLeakError: 1 thread leaked from SUITE scope at org.apache.solr.core.TestLazyCores: 
   1) Thread[id=9351, name=searcherExecutor-3531-thread-1, state=WAITING, group=TGRP-TestLazyCores]
        at java.base@9.0.1/jdk.internal.misc.Unsafe.park(Native Method)
        at java.base@9.0.1/java.util.concurrent.locks.LockSupport.park(LockSupport.java:194)
        at java.base@9.0.1/java.util.concurrent.locks.AbstractQueuedSynchronizer$ConditionObject.await(AbstractQueuedSynchronizer.java:2062)
        at java.base@9.0.1/java.util.concurrent.LinkedBlockingQueue.take(LinkedBlockingQueue.java:435)
        at java.base@9.0.1/java.util.concurrent.ThreadPoolExecutor.getTask(ThreadPoolExecutor.java:1092)
        at java.base@9.0.1/java.util.concurrent.ThreadPoolExecutor.runWorker(ThreadPoolExecutor.java:1152)
        at java.base@9.0.1/java.util.concurrent.ThreadPoolExecutor$Worker.run(ThreadPoolExecutor.java:641)
        at java.base@9.0.1/java.lang.Thread.run(Thread.java:844)
	at __randomizedtesting.SeedInfo.seed([D37661D2001006DB]:0)


FAILED:  junit.framework.TestSuite.org.apache.solr.core.TestLazyCores

Error Message:
There are still zombie threads that couldn't be terminated:    1) Thread[id=9351, name=searcherExecutor-3531-thread-1, state=WAITING, group=TGRP-TestLazyCores]         at java.base@9.0.1/jdk.internal.misc.Unsafe.park(Native Method)         at java.base@9.0.1/java.util.concurrent.locks.LockSupport.park(LockSupport.java:194)         at java.base@9.0.1/java.util.concurrent.locks.AbstractQueuedSynchronizer$ConditionObject.await(AbstractQueuedSynchronizer.java:2062)         at java.base@9.0.1/java.util.concurrent.LinkedBlockingQueue.take(LinkedBlockingQueue.java:435)         at java.base@9.0.1/java.util.concurrent.ThreadPoolExecutor.getTask(ThreadPoolExecutor.java:1092)         at java.base@9.0.1/java.util.concurrent.ThreadPoolExecutor.runWorker(ThreadPoolExecutor.java:1152)         at java.base@9.0.1/java.util.concurrent.ThreadPoolExecutor$Worker.run(ThreadPoolExecutor.java:641)         at java.base@9.0.1/java.lang.Thread.run(Thread.java:844)

Stack Trace:
com.carrotsearch.randomizedtesting.ThreadLeakError: There are still zombie threads that couldn't be terminated:
   1) Thread[id=9351, name=searcherExecutor-3531-thread-1, state=WAITING, group=TGRP-TestLazyCores]
        at java.base@9.0.1/jdk.internal.misc.Unsafe.park(Native Method)
        at java.base@9.0.1/java.util.concurrent.locks.LockSupport.park(LockSupport.java:194)
        at java.base@9.0.1/java.util.concurrent.locks.AbstractQueuedSynchronizer$ConditionObject.await(AbstractQueuedSynchronizer.java:2062)
        at java.base@9.0.1/java.util.concurrent.LinkedBlockingQueue.take(LinkedBlockingQueue.java:435)
        at java.base@9.0.1/java.util.concurrent.ThreadPoolExecutor.getTask(ThreadPoolExecutor.java:1092)
        at java.base@9.0.1/java.util.concurrent.ThreadPoolExecutor.runWorker(ThreadPoolExecutor.java:1152)
        at java.base@9.0.1/java.util.concurrent.ThreadPoolExecutor$Worker.run(ThreadPoolExecutor.java:641)
        at java.base@9.0.1/java.lang.Thread.run(Thread.java:844)
	at __randomizedtesting.SeedInfo.seed([D37661D2001006DB]:0)


FAILED:  org.apache.solr.core.TestLazyCores.testNoCommit

Error Message:
Exception during query

Stack Trace:
java.lang.RuntimeException: Exception during query
	at __randomizedtesting.SeedInfo.seed([D37661D2001006DB:C16C003CB37657E]:0)
	at org.apache.solr.SolrTestCaseJ4.assertQ(SolrTestCaseJ4.java:901)
	at org.apache.solr.core.TestLazyCores.check10(TestLazyCores.java:847)
	at org.apache.solr.core.TestLazyCores.testNoCommit(TestLazyCores.java:829)
	at java.base/jdk.internal.reflect.NativeMethodAccessorImpl.invoke0(Native Method)
	at java.base/jdk.internal.reflect.NativeMethodAccessorImpl.invoke(NativeMethodAccessorImpl.java:62)
	at java.base/jdk.internal.reflect.DelegatingMethodAccessorImpl.invoke(DelegatingMethodAccessorImpl.java:43)
	at java.base/java.lang.reflect.Method.invoke(Method.java:564)
	at com.carrotsearch.randomizedtesting.RandomizedRunner.invoke(RandomizedRunner.java:1737)
	at com.carrotsearch.randomizedtesting.RandomizedRunner$8.evaluate(RandomizedRunner.java:934)
	at com.carrotsearch.randomizedtesting.RandomizedRunner$9.evaluate(RandomizedRunner.java:970)
	at com.carrotsearch.randomizedtesting.RandomizedRunner$10.evaluate(RandomizedRunner.java:984)
	at com.carrotsearch.randomizedtesting.rules.SystemPropertiesRestoreRule$1.evaluate(SystemPropertiesRestoreRule.java:57)
	at org.apache.lucene.util.TestRuleSetupTeardownChained$1.evaluate(TestRuleSetupTeardownChained.java:49)
	at org.apache.lucene.util.AbstractBeforeAfterRule$1.evaluate(AbstractBeforeAfterRule.java:45)
	at org.apache.lucene.util.TestRuleThreadAndTestName$1.evaluate(TestRuleThreadAndTestName.java:48)
	at org.apache.lucene.util.TestRuleIgnoreAfterMaxFailures$1.evaluate(TestRuleIgnoreAfterMaxFailures.java:64)
	at org.apache.lucene.util.TestRuleMarkFailure$1.evaluate(TestRuleMarkFailure.java:47)
	at com.carrotsearch.randomizedtesting.rules.StatementAdapter.evaluate(StatementAdapter.java:36)
	at com.carrotsearch.randomizedtesting.ThreadLeakControl$StatementRunner.run(ThreadLeakControl.java:368)
	at com.carrotsearch.randomizedtesting.ThreadLeakControl.forkTimeoutingTask(ThreadLeakControl.java:817)
	at com.carrotsearch.randomizedtesting.ThreadLeakControl$3.evaluate(ThreadLeakControl.java:468)
	at com.carrotsearch.randomizedtesting.RandomizedRunner.runSingleTest(RandomizedRunner.java:943)
	at com.carrotsearch.randomizedtesting.RandomizedRunner$5.evaluate(RandomizedRunner.java:829)
	at com.carrotsearch.randomizedtesting.RandomizedRunner$6.evaluate(RandomizedRunner.java:879)
	at com.carrotsearch.randomizedtesting.RandomizedRunner$7.evaluate(RandomizedRunner.java:890)
	at com.carrotsearch.randomizedtesting.rules.StatementAdapter.evaluate(StatementAdapter.java:36)
	at com.carrotsearch.randomizedtesting.rules.SystemPropertiesRestoreRule$1.evaluate(SystemPropertiesRestoreRule.java:57)
	at org.apache.lucene.util.AbstractBeforeAfterRule$1.evaluate(AbstractBeforeAfterRule.java:45)
	at com.carrotsearch.randomizedtesting.rules.StatementAdapter.evaluate(StatementAdapter.java:36)
	at org.apache.lucene.util.TestRuleStoreClassName$1.evaluate(TestRuleStoreClassName.java:41)
	at com.carrotsearch.randomizedtesting.rules.NoShadowingOrOverridesOnMethodsRule$1.evaluate(NoShadowingOrOverridesOnMethodsRule.java:40)
	at com.carrotsearch.randomizedtesting.rules.NoShadowingOrOverridesOnMethodsRule$1.evaluate(NoShadowingOrOverridesOnMethodsRule.java:40)
	at com.carrotsearch.randomizedtesting.rules.StatementAdapter.evaluate(StatementAdapter.java:36)
	at com.carrotsearch.randomizedtesting.rules.StatementAdapter.evaluate(StatementAdapter.java:36)
	at org.apache.lucene.util.TestRuleAssertionsRequired$1.evaluate(TestRuleAssertionsRequired.java:53)
	at org.apache.lucene.util.TestRuleMarkFailure$1.evaluate(TestRuleMarkFailure.java:47)
	at org.apache.lucene.util.TestRuleIgnoreAfterMaxFailures$1.evaluate(TestRuleIgnoreAfterMaxFailures.java:64)
	at org.apache.lucene.util.TestRuleIgnoreTestSuites$1.evaluate(TestRuleIgnoreTestSuites.java:54)
	at com.carrotsearch.randomizedtesting.rules.StatementAdapter.evaluate(StatementAdapter.java:36)
	at com.carrotsearch.randomizedtesting.ThreadLeakControl$StatementRunner.run(ThreadLeakControl.java:368)
	at java.base/java.lang.Thread.run(Thread.java:844)
Caused by: java.lang.RuntimeException: REQUEST FAILED: xpath=//result[@numFound='10']
	xml response was: <?xml version="1.0" encoding="UTF-8"?>
<response>
<lst name="responseHeader"><int name="status">0</int><int name="QTime">0</int><lst name="params"><str name="q">*:*</str></lst></lst><result name="response" numFound="0" start="0"></result>
</response>

	request was:q=*:*
	at org.apache.solr.SolrTestCaseJ4.assertQ(SolrTestCaseJ4.java:894)
	... 40 more




Build Log:
[...truncated 12295 lines...]
   [junit4] Suite: org.apache.solr.core.TestLazyCores
   [junit4]   2> Creating dataDir: /home/jenkins/workspace/Lucene-Solr-7.2-Linux/solr/build/solr-core/test/J1/temp/solr.core.TestLazyCores_D37661D2001006DB-001/init-core-data-001
   [junit4]   2> 1280714 WARN  (SUITE-TestLazyCores-seed#[D37661D2001006DB]-worker) [    ] o.a.s.SolrTestCaseJ4 startTrackingSearchers: numOpens=236 numCloses=236
   [junit4]   2> 1280714 INFO  (SUITE-TestLazyCores-seed#[D37661D2001006DB]-worker) [    ] o.a.s.SolrTestCaseJ4 Using TrieFields (NUMERIC_POINTS_SYSPROP=false) w/NUMERIC_DOCVALUES_SYSPROP=false
   [junit4]   2> 1280714 INFO  (SUITE-TestLazyCores-seed#[D37661D2001006DB]-worker) [    ] o.a.s.SolrTestCaseJ4 Randomized ssl (false) and clientAuth (true) via: @org.apache.solr.util.RandomizeSSL(reason="", ssl=0.0/0.0, value=0.0/0.0, clientAuth=0.0/0.0)
   [junit4]   2> 1280714 INFO  (SUITE-TestLazyCores-seed#[D37661D2001006DB]-worker) [    ] o.a.s.SolrTestCaseJ4 SecureRandom sanity checks: test.solr.allowed.securerandom=null & java.security.egd=file:/dev/./urandom
   [junit4]   2> 1280715 INFO  (TEST-TestLazyCores.testCreateSame-seed#[D37661D2001006DB]) [    ] o.a.s.SolrTestCaseJ4 ###Starting testCreateSame
   [junit4]   2> 1280722 INFO  (TEST-TestLazyCores.testCreateSame-seed#[D37661D2001006DB]) [    ] o.a.s.c.SolrXmlConfig Loading container configuration from /home/jenkins/workspace/Lucene-Solr-7.2-Linux/solr/build/solr-core/test/J1/temp/solr.core.TestLazyCores_D37661D2001006DB-001/tempDir-001/solr.xml
   [junit4]   2> 1280724 INFO  (TEST-TestLazyCores.testCreateSame-seed#[D37661D2001006DB]) [    ] o.a.s.c.SolrXmlConfig Configuration parameter autoReplicaFailoverWorkLoopDelay is ignored
   [junit4]   2> 1280724 INFO  (TEST-TestLazyCores.testCreateSame-seed#[D37661D2001006DB]) [    ] o.a.s.c.SolrXmlConfig Configuration parameter autoReplicaFailoverBadNodeExpiration is ignored
   [junit4]   2> 1280725 INFO  (TEST-TestLazyCores.testCreateSame-seed#[D37661D2001006DB]) [    ] o.a.s.c.SolrXmlConfig MBean server found: com.sun.jmx.mbeanserver.JmxMBeanServer@6be30524, but no JMX reporters were configured - adding default JMX reporter.
   [junit4]   2> 1280743 INFO  (TEST-TestLazyCores.testCreateSame-seed#[D37661D2001006DB]) [    ] o.a.s.m.r.SolrJmxReporter JMX monitoring for 'solr.node' (registry 'solr.node') enabled at server: com.sun.jmx.mbeanserver.JmxMBeanServer@6be30524
   [junit4]   2> 1280748 INFO  (TEST-TestLazyCores.testCreateSame-seed#[D37661D2001006DB]) [    ] o.a.s.m.r.SolrJmxReporter JMX monitoring for 'solr.jvm' (registry 'solr.jvm') enabled at server: com.sun.jmx.mbeanserver.JmxMBeanServer@6be30524
   [junit4]   2> 1280748 INFO  (TEST-TestLazyCores.testCreateSame-seed#[D37661D2001006DB]) [    ] o.a.s.m.r.SolrJmxReporter JMX monitoring for 'solr.jetty' (registry 'solr.jetty') enabled at server: com.sun.jmx.mbeanserver.JmxMBeanServer@6be30524
   [junit4]   2> 1280749 INFO  (TEST-TestLazyCores.testCreateSame-seed#[D37661D2001006DB]) [    ] o.a.s.c.TransientSolrCoreCacheDefault Allocating transient cache for 4 transient cores
   [junit4]   2> 1280760 INFO  (coreLoadExecutor-3445-thread-2) [    x:collection2] o.a.s.c.SolrConfig Using Lucene MatchVersion: 7.2.1
   [junit4]   2> 1280760 INFO  (coreLoadExecutor-3445-thread-1) [    x:collection1] o.a.s.c.SolrConfig Using Lucene MatchVersion: 7.2.1
   [junit4]   2> 1280760 INFO  (coreLoadExecutor-3445-thread-3) [    x:collection5] o.a.s.c.SolrConfig Using Lucene MatchVersion: 7.2.1
   [junit4]   2> 1280765 INFO  (coreLoadExecutor-3445-thread-2) [    x:collection2] o.a.s.s.IndexSchema [collection2] Schema name=tiny
   [junit4]   2> 1280765 INFO  (coreLoadExecutor-3445-thread-1) [    x:collection1] o.a.s.s.IndexSchema [collection1] Schema name=tiny
   [junit4]   2> 1280765 INFO  (coreLoadExecutor-3445-thread-3) [    x:collection5] o.a.s.s.IndexSchema [collection5] Schema name=tiny
   [junit4]   2> 1280767 INFO  (coreLoadExecutor-3445-thread-3) [    x:collection5] o.a.s.s.IndexSchema Loaded schema tiny/1.1 with uniqueid field id
   [junit4]   2> 1280767 INFO  (coreLoadExecutor-3445-thread-2) [    x:collection2] o.a.s.s.IndexSchema Loaded schema tiny/1.1 with uniqueid field id
   [junit4]   2> 1280767 INFO  (coreLoadExecutor-3445-thread-3) [    x:collection5] o.a.s.c.CoreContainer Creating SolrCore 'collection5' using configuration from instancedir /home/jenkins/workspace/Lucene-Solr-7.2-Linux/solr/build/solr-core/test/J1/temp/solr.core.TestLazyCores_D37661D2001006DB-001/tempDir-001/./collection5, trusted=true
   [junit4]   2> 1280767 INFO  (coreLoadExecutor-3445-thread-2) [    x:collection2] o.a.s.c.CoreContainer Creating SolrCore 'collection2' using configuration from instancedir /home/jenkins/workspace/Lucene-Solr-7.2-Linux/solr/build/solr-core/test/J1/temp/solr.core.TestLazyCores_D37661D2001006DB-001/tempDir-001/./collection2, trusted=true
   [junit4]   2> 1280767 INFO  (coreLoadExecutor-3445-thread-1) [    x:collection1] o.a.s.s.IndexSchema Loaded schema tiny/1.1 with uniqueid field id
   [junit4]   2> 1280767 INFO  (coreLoadExecutor-3445-thread-1) [    x:collection1] o.a.s.c.CoreContainer Creating SolrCore 'collection1' using configuration from instancedir /home/jenkins/workspace/Lucene-Solr-7.2-Linux/solr/build/solr-core/test/J1/temp/solr.core.TestLazyCores_D37661D2001006DB-001/tempDir-001/./collection1, trusted=true
   [junit4]   2> 1280767 INFO  (coreLoadExecutor-3445-thread-3) [    x:collection5] o.a.s.m.r.SolrJmxReporter JMX monitoring for 'solr.core.collection5' (registry 'solr.core.collection5') enabled at server: com.sun.jmx.mbeanserver.JmxMBeanServer@6be30524
   [junit4]   2> 1280767 INFO  (coreLoadExecutor-3445-thread-2) [    x:collection2] o.a.s.m.r.SolrJmxReporter JMX monitoring for 'solr.core.collection2' (registry 'solr.core.collection2') enabled at server: com.sun.jmx.mbeanserver.JmxMBeanServer@6be30524
   [junit4]   2> 1280767 INFO  (coreLoadExecutor-3445-thread-3) [    x:collection5] o.a.s.c.SolrCore solr.RecoveryStrategy.Builder
   [junit4]   2> 1280767 INFO  (coreLoadExecutor-3445-thread-2) [    x:collection2] o.a.s.c.SolrCore solr.RecoveryStrategy.Builder
   [junit4]   2> 1280767 INFO  (coreLoadExecutor-3445-thread-1) [    x:collection1] o.a.s.m.r.SolrJmxReporter JMX monitoring for 'solr.core.collection1' (registry 'solr.core.collection1') enabled at server: com.sun.jmx.mbeanserver.JmxMBeanServer@6be30524
   [junit4]   2> 1280767 INFO  (coreLoadExecutor-3445-thread-1) [    x:collection1] o.a.s.c.SolrCore solr.RecoveryStrategy.Builder
   [junit4]   2> 1280767 INFO  (coreLoadExecutor-3445-thread-3) [    x:collection5] o.a.s.c.SolrCore [[collection5] ] Opening new SolrCore at [/home/jenkins/workspace/Lucene-Solr-7.2-Linux/solr/build/solr-core/test/J1/temp/solr.core.TestLazyCores_D37661D2001006DB-001/tempDir-001/collection5], dataDir=[/home/jenkins/workspace/Lucene-Solr-7.2-Linux/solr/build/solr-core/test/J1/temp/solr.core.TestLazyCores_D37661D2001006DB-001/tempDir-001/./collection5/data/]
   [junit4]   2> 1280767 INFO  (coreLoadExecutor-3445-thread-2) [    x:collection2] o.a.s.c.SolrCore [[collection2] ] Opening new SolrCore at [/home/jenkins/workspace/Lucene-Solr-7.2-Linux/solr/build/solr-core/test/J1/temp/solr.core.TestLazyCores_D37661D2001006DB-001/tempDir-001/collection2], dataDir=[/home/jenkins/workspace/Lucene-Solr-7.2-Linux/solr/build/solr-core/test/J1/temp/solr.core.TestLazyCores_D37661D2001006DB-001/tempDir-001/./collection2/data/]
   [junit4]   2> 1280767 INFO  (coreLoadExecutor-3445-thread-1) [    x:collection1] o.a.s.c.SolrCore [[collection1] ] Opening new SolrCore at [/home/jenkins/workspace/Lucene-Solr-7.2-Linux/solr/build/solr-core/test/J1/temp/solr.core.TestLazyCores_D37661D2001006DB-001/tempDir-001/collection1], dataDir=[/home/jenkins/workspace/Lucene-Solr-7.2-Linux/solr/build/solr-core/test/J1/temp/solr.core.TestLazyCores_D37661D2001006DB-001/tempDir-001/./collection1/data/]
   [junit4]   2> 1280768 INFO  (coreLoadExecutor-3445-thread-2) [    x:collection2] o.a.s.u.RandomMergePolicy RandomMergePolicy wrapping class org.apache.lucene.index.LogByteSizeMergePolicy: [LogByteSizeMergePolicy: minMergeSize=1677721, mergeFactor=18, maxMergeSize=2147483648, maxMergeSizeForForcedMerge=9223372036854775807, calibrateSizeByDeletes=true, maxMergeDocs=2147483647, maxCFSSegmentSizeMB=8.796093022207999E12, noCFSRatio=0.5190231537679613]
   [junit4]   2> 1280768 INFO  (coreLoadExecutor-3445-thread-1) [    x:collection1] o.a.s.u.RandomMergePolicy RandomMergePolicy wrapping class org.apache.lucene.index.LogByteSizeMergePolicy: [LogByteSizeMergePolicy: minMergeSize=1677721, mergeFactor=18, maxMergeSize=2147483648, maxMergeSizeForForcedMerge=9223372036854775807, calibrateSizeByDeletes=true, maxMergeDocs=2147483647, maxCFSSegmentSizeMB=8.796093022207999E12, noCFSRatio=0.5190231537679613]
   [junit4]   2> 1280768 INFO  (coreLoadExecutor-3445-thread-3) [    x:collection5] o.a.s.u.RandomMergePolicy RandomMergePolicy wrapping class org.apache.lucene.index.LogByteSizeMergePolicy: [LogByteSizeMergePolicy: minMergeSize=1677721, mergeFactor=18, maxMergeSize=2147483648, maxMergeSizeForForcedMerge=9223372036854775807, calibrateSizeByDeletes=true, maxMergeDocs=2147483647, maxCFSSegmentSizeMB=8.796093022207999E12, noCFSRatio=0.5190231537679613]
   [junit4]   2> 1280818 INFO  (coreLoadExecutor-3445-thread-3) [    x:collection5] o.a.s.u.CommitTracker Hard AutoCommit: disabled
   [junit4]   2> 1280818 INFO  (coreLoadExecutor-3445-thread-3) [    x:collection5] o.a.s.u.CommitTracker Soft AutoCommit: disabled
   [junit4]   2> 1280819 INFO  (coreLoadExecutor-3445-thread-3) [    x:collection5] o.a.s.u.RandomMergePolicy RandomMergePolicy wrapping class org.apache.lucene.index.TieredMergePolicy: [TieredMergePolicy: maxMergeAtOnce=13, maxMergeAtOnceExplicit=32, maxMergedSegmentMB=10.1650390625, floorSegmentMB=1.517578125, forceMergeDeletesPctAllowed=5.467647686172679, segmentsPerTier=19.0, maxCFSSegmentSizeMB=8.796093022207999E12, noCFSRatio=0.5087168919390287
   [junit4]   2> 1280819 INFO  (coreLoadExecutor-3445-thread-3) [    x:collection5] o.a.s.s.SolrIndexSearcher Opening [Searcher@6088165d[collection5] main]
   [junit4]   2> 1280819 INFO  (coreLoadExecutor-3445-thread-3) [    x:collection5] o.a.s.r.ManagedResourceStorage File-based storage initialized to use dir: /home/jenkins/workspace/Lucene-Solr-7.2-Linux/solr/build/solr-core/test/J1/temp/solr.core.TestLazyCores_D37661D2001006DB-001/tempDir-001/collection5/conf
   [junit4]   2> 1280819 INFO  (coreLoadExecutor-3445-thread-3) [    x:collection5] o.a.s.h.ReplicationHandler Commits will be reserved for 10000ms.
   [junit4]   2> 1280820 INFO  (searcherExecutor-3446-thread-1-processing-x:collection5) [    x:collection5] o.a.s.c.SolrCore [collection5] Registered new searcher Searcher@6088165d[collection5] main{ExitableDirectoryReader(UninvertingDirectoryReader())}
   [junit4]   2> 1280827 INFO  (coreLoadExecutor-3445-thread-2) [    x:collection2] o.a.s.u.CommitTracker Hard AutoCommit: disabled
   [junit4]   2> 1280827 INFO  (coreLoadExecutor-3445-thread-1) [    x:collection1] o.a.s.u.CommitTracker Hard AutoCommit: disabled
   [junit4]   2> 1280827 INFO  (coreLoadExecutor-3445-thread-2) [    x:collection2] o.a.s.u.CommitTracker Soft AutoCommit: disabled
   [junit4]   2> 1280827 INFO  (coreLoadExecutor-3445-thread-1) [    x:collection1] o.a.s.u.CommitTracker Soft AutoCommit: disabled
   [junit4]   2> 1280828 INFO  (coreLoadExecutor-3445-thread-2) [    x:collection2] o.a.s.u.RandomMergePolicy RandomMergePolicy wrapping class org.apache.lucene.index.TieredMergePolicy: [TieredMergePolicy: maxMergeAtOnce=13, maxMergeAtOnceExplicit=32, maxMergedSegmentMB=10.1650390625, floorSegmentMB=1.517578125, forceMergeDeletesPctAllowed=5.467647686172679, segmentsPerTier=19.0, maxCFSSegmentSizeMB=8.796093022207999E12, noCFSRatio=0.5087168919390287
   [junit4]   2> 1280828 INFO  (coreLoadExecutor-3445-thread-1) [    x:collection1] o.a.s.u.RandomMergePolicy RandomMergePolicy wrapping class org.apache.lucene.index.TieredMergePolicy: [TieredMergePolicy: maxMergeAtOnce=13, maxMergeAtOnceExplicit=32, maxMergedSegmentMB=10.1650390625, floorSegmentMB=1.517578125, forceMergeDeletesPctAllowed=5.467647686172679, segmentsPerTier=19.0, maxCFSSegmentSizeMB=8.796093022207999E12, noCFSRatio=0.5087168919390287
   [junit4]   2> 1280828 INFO  (coreLoadExecutor-3445-thread-1) [    x:collection1] o.a.s.s.SolrIndexSearcher Opening [Searcher@1f960bbd[collection1] main]
   [junit4]   2> 1280828 INFO  (coreLoadExecutor-3445-thread-2) [    x:collection2] o.a.s.s.SolrIndexSearcher Opening [Searcher@651fe71d[collection2] main]
   [junit4]   2> 1280828 INFO  (coreLoadExecutor-3445-thread-2) [    x:collection2] o.a.s.r.ManagedResourceStorage File-based storage initialized to use dir: /home/jenkins/workspace/Lucene-Solr-7.2-Linux/solr/build/solr-core/test/J1/temp/solr.core.TestLazyCores_D37661D2001006DB-001/tempDir-001/collection2/conf
   [junit4]   2> 1280828 INFO  (coreLoadExecutor-3445-thread-1) [    x:collection1] o.a.s.r.ManagedResourceStorage File-based storage initialized to use dir: /home/jenkins/workspace/Lucene-Solr-7.2-Linux/solr/build/solr-core/test/J1/temp/solr.core.TestLazyCores_D37661D2001006DB-001/tempDir-001/collection1/conf
   [junit4]   2> 1280829 INFO  (coreLoadExecutor-3445-thread-1) [    x:collection1] o.a.s.h.ReplicationHandler Commits will be reserved for 10000ms.
   [junit4]   2> 1280829 INFO  (coreLoadExecutor-3445-thread-2) [    x:collection2] o.a.s.h.ReplicationHandler Commits will be reserved for 10000ms.
   [junit4]   2> 1280829 INFO  (searcherExecutor-3448-thread-1-processing-x:collection1) [    x:collection1] o.a.s.c.SolrCore [collection1] Registered new searcher Searcher@1f960bbd[collection1] main{ExitableDirectoryReader(UninvertingDirectoryReader())}
   [junit4]   2> 1280829 INFO  (searcherExecutor-3447-thread-1-processing-x:collection2) [    x:collection2] o.a.s.c.SolrCore [collection2] Registered new searcher Searcher@651fe71d[collection2] main{ExitableDirectoryReader(UninvertingDirectoryReader())}
   [junit4]   2> 1280833 INFO  (TEST-TestLazyCores.testCreateSame-seed#[D37661D2001006DB]) [    x:collection4] o.a.s.c.SolrConfig Using Lucene MatchVersion: 7.2.1
   [junit4]   2> 1280836 INFO  (TEST-TestLazyCores.testCreateSame-seed#[D37661D2001006DB]) [    x:collection4] o.a.s.s.IndexSchema [collection4] Schema name=tiny
   [junit4]   2> 1280837 INFO  (TEST-TestLazyCores.testCreateSame-seed#[D37661D2001006DB]) [    x:collection4] o.a.s.s.IndexSchema Loaded schema tiny/1.1 with uniqueid field id
   [junit4]   2> 1280837 INFO  (TEST-TestLazyCores.testCreateSame-seed#[D37661D2001006DB]) [    x:collection4] o.a.s.c.CoreContainer Creating SolrCore 'collection4' using configuration from instancedir /home/jenkins/workspace/Lucene-Solr-7.2-Linux/solr/build/solr-core/test/J1/temp/solr.core.TestLazyCores_D37661D2001006DB-001/tempDir-001/./collection4, trusted=true
   [junit4]   2> 1280837 INFO  (TEST-TestLazyCores.testCreateSame-seed#[D37661D2001006DB]) [    x:collection4] o.a.s.m.r.SolrJmxReporter JMX monitoring for 'solr.core.collection4' (registry 'solr.core.collection4') enabled at server: com.sun.jmx.mbeanserver.JmxMBeanServer@6be30524
   [junit4]   2> 1280837 INFO  (TEST-TestLazyCores.testCreateSame-seed#[D37661D2001006DB]) [    x:collection4] o.a.s.c.SolrCore solr.RecoveryStrategy.Builder
   [junit4]   2> 1280837 INFO  (TEST-TestLazyCores.testCreateSame-seed#[D37661D2001006DB]) [    x:collection4] o.a.s.c.SolrCore [[collection4] ] Opening new SolrCore at [/home/jenkins/workspace/Lucene-Solr-7.2-Linux/solr/build/solr-core/test/J1/temp/solr.core.TestLazyCores_D37661D2001006DB-001/tempDir-001/collection4], dataDir=[/home/jenkins/workspace/Lucene-Solr-7.2-Linux/solr/build/solr-core/test/J1/temp/solr.core.TestLazyCores_D37661D2001006DB-001/tempDir-001/./collection4/data/]
   [junit4]   2> 1280839 INFO  (TEST-TestLazyCores.testCreateSame-seed#[D37661D2001006DB]) [    x:collection4] o.a.s.u.RandomMergePolicy RandomMergePolicy wrapping class org.apache.lucene.index.TieredMergePolicy: [TieredMergePolicy: maxMergeAtOnce=26, maxMergeAtOnceExplicit=14, maxMergedSegmentMB=48.6748046875, floorSegmentMB=0.482421875, forceMergeDeletesPctAllowed=9.657119649698878, segmentsPerTier=38.0, maxCFSSegmentSizeMB=8.796093022207999E12, noCFSRatio=0.24050776995188433
   [junit4]   2> 1280886 INFO  (TEST-TestLazyCores.testCreateSame-seed#[D37661D2001006DB]) [    x:collection4] o.a.s.u.CommitTracker Hard AutoCommit: disabled
   [junit4]   2> 1280886 INFO  (TEST-TestLazyCores.testCreateSame-seed#[D37661D2001006DB]) [    x:collection4] o.a.s.u.CommitTracker Soft AutoCommit: disabled
   [junit4]   2> 1280887 INFO  (TEST-TestLazyCores.testCreateSame-seed#[D37661D2001006DB]) [    x:collection4] o.a.s.u.RandomMergePolicy RandomMergePolicy wrapping class org.apache.lucene.index.LogDocMergePolicy: [LogDocMergePolicy: minMergeSize=1000, mergeFactor=44, maxMergeSize=9223372036854775807, maxMergeSizeForForcedMerge=9223372036854775807, calibrateSizeByDeletes=false, maxMergeDocs=2147483647, maxCFSSegmentSizeMB=8.796093022207999E12, noCFSRatio=0.8327942973988406]
   [junit4]   2> 1280887 INFO  (TEST-TestLazyCores.testCreateSame-seed#[D37661D2001006DB]) [    x:collection4] o.a.s.s.SolrIndexSearcher Opening [Searcher@16fc0a27[collection4] main]
   [junit4]   2> 1280887 INFO  (TEST-TestLazyCores.testCreateSame-seed#[D37661D2001006DB]) [    x:collection4] o.a.s.r.ManagedResourceStorage File-based storage initialized to use dir: /home/jenkins/workspace/Lucene-Solr-7.2-Linux/solr/build/solr-core/test/J1/temp/solr.core.TestLazyCores_D37661D2001006DB-001/tempDir-001/collection4/conf
   [junit4]   2> 1280888 INFO  (TEST-TestLazyCores.testCreateSame-seed#[D37661D2001006DB]) [    x:collection4] o.a.s.h.ReplicationHandler Commits will be reserved for 10000ms.
   [junit4]   2> 1280888 INFO  (searcherExecutor-3459-thread-1-processing-x:collection4) [    x:collection4] o.a.s.c.SolrCore [collection4] Registered new searcher Searcher@16fc0a27[collection4] main{ExitableDirectoryReader(UninvertingDirectoryReader())}
   [junit4]   2> 1280891 INFO  (TEST-TestLazyCores.testCreateSame-seed#[D37661D2001006DB]) [    x:collection4] o.a.s.c.SolrConfig Using Lucene MatchVersion: 7.2.1
   [junit4]   2> 1280894 INFO  (TEST-TestLazyCores.testCreateSame-seed#[D37661D2001006DB]) [    x:collection4] o.a.s.s.IndexSchema [collection6] Schema name=tiny
   [junit4]   2> 1280895 INFO  (TEST-TestLazyCores.testCreateSame-seed#[D37661D2001006DB]) [    x:collection4] o.a.s.s.IndexSchema Loaded schema tiny/1.1 with uniqueid field id
   [junit4]   2> 1280895 INFO  (TEST-TestLazyCores.testCreateSame-seed#[D37661D2001006DB]) [    x:collection4] o.a.s.c.CoreContainer Creating SolrCore 'collection6' using configuration from instancedir /home/jenkins/workspace/Lucene-Solr-7.2-Linux/solr/build/solr-core/test/J1/temp/solr.core.TestLazyCores_D37661D2001006DB-001/tempDir-001/./collection6, trusted=true
   [junit4]   2> 1280896 INFO  (TEST-TestLazyCores.testCreateSame-seed#[D37661D2001006DB]) [    x:collection4] o.a.s.m.r.SolrJmxReporter JMX monitoring for 'solr.core.collection6' (registry 'solr.core.collection6') enabled at server: com.sun.jmx.mbeanserver.JmxMBeanServer@6be30524
   [junit4]   2> 1280896 INFO  (TEST-TestLazyCores.testCreateSame-seed#[D37661D2001006DB]) [    x:collection4] o.a.s.c.SolrCore solr.RecoveryStrategy.Builder
   [junit4]   2> 1280896 INFO  (TEST-TestLazyCores.testCreateSame-seed#[D37661D2001006DB]) [    x:collection4] o.a.s.c.SolrCore [[collection6] ] Opening new SolrCore at [/home/jenkins/workspace/Lucene-Solr-7.2-Linux/solr/build/solr-core/test/J1/temp/solr.core.TestLazyCores_D37661D2001006DB-001/tempDir-001/collection6], dataDir=[/home/jenkins/workspace/Lucene-Solr-7.2-Linux/solr/build/solr-core/test/J1/temp/solr.core.TestLazyCores_D37661D2001006DB-001/tempDir-001/./collection6/data/]
   [junit4]   2> 1280897 INFO  (TEST-TestLazyCores.testCreateSame-seed#[D37661D2001006DB]) [    x:collection4] o.a.s.u.RandomMergePolicy RandomMergePolicy wrapping class org.apache.lucene.index.LogByteSizeMergePolicy: [LogByteSizeMergePolicy: minMergeSize=1677721, mergeFactor=28, maxMergeSize=2147483648, maxMergeSizeForForcedMerge=9223372036854775807, calibrateSizeByDeletes=true, maxMergeDocs=2147483647, maxCFSSegmentSizeMB=8.796093022207999E12, noCFSRatio=0.0]
   [junit4]   2> 1280930 INFO  (TEST-TestLazyCores.testCreateSame-seed#[D37661D2001006DB]) [    x:collection4] o.a.s.u.CommitTracker Hard AutoCommit: disabled
   [junit4]   2> 1280930 INFO  (TEST-TestLazyCores.testCreateSame-seed#[D37661D2001006DB]) [    x:collection4] o.a.s.u.CommitTracker Soft AutoCommit: disabled
   [junit4]   2> 1280931 INFO  (TEST-TestLazyCores.testCreateSame-seed#[D37661D2001006DB]) [    x:collection4] o.a.s.u.RandomMergePolicy RandomMergePolicy wrapping class org.apache.lucene.index.AlcoholicMergePolicy: [AlcoholicMergePolicy: minMergeSize=0, mergeFactor=10, maxMergeSize=1937529127, maxMergeSizeForForcedMerge=9223372036854775807, calibrateSizeByDeletes=true, maxMergeDocs=2147483647, maxCFSSegmentSizeMB=8.796093022207999E12, noCFSRatio=0.1]
   [junit4]   2> 1280931 INFO  (TEST-TestLazyCores.testCreateSame-seed#[D37661D2001006DB]) [    x:collection4] o.a.s.s.SolrIndexSearcher Opening [Searcher@6afc3bbd[collection6] main]
   [junit4]   2> 1280931 INFO  (TEST-TestLazyCores.testCreateSame-seed#[D37661D2001006DB]) [    x:collection4] o.a.s.r.ManagedResourceStorage File-based storage initialized to use dir: /home/jenkins/workspace/Lucene-Solr-7.2-Linux/solr/build/solr-core/test/J1/temp/solr.core.TestLazyCores_D37661D2001006DB-001/tempDir-001/collection6/conf
   [junit4]   2> 1280932 INFO  (TEST-TestLazyCores.testCreateSame-seed#[D37661D2001006DB]) [    x:collection4] o.a.s.h.ReplicationHandler Commits will be reserved for 10000ms.
   [junit4]   2> 1280932 INFO  (searcherExecutor-3463-thread-1-processing-x:collection4) [    x:collection4] o.a.s.c.SolrCore [collection6] Registered new searcher Searcher@6afc3bbd[collection6] main{ExitableDirectoryReader(UninvertingDirectoryReader())}
   [junit4]   2> 1280935 INFO  (TEST-TestLazyCores.testCreateSame-seed#[D37661D2001006DB]) [    x:collection4] o.a.s.h.a.CoreAdminOperation core create command schema=schema.xml&dataDir=t12&name=collection2&action=CREATE&config=solrconfig.xml&wt=xml
   [junit4]   2> 1280935 WARN  (TEST-TestLazyCores.testCreateSame-seed#[D37661D2001006DB]) [    x:collection4] o.a.s.c.CoreContainer Creating a core with existing name is not allowed
   [junit4]   2> 1280935 INFO  (TEST-TestLazyCores.testCreateSame-seed#[D37661D2001006DB]) [    x:collection4] o.a.s.h.a.CoreAdminOperation core create command schema=schema.xml&dataDir=t14&name=collection4&action=CREATE&config=solrconfig.xml&wt=xml
   [junit4]   2> 1280935 WARN  (TEST-TestLazyCores.testCreateSame-seed#[D37661D2001006DB]) [    x:collection4] o.a.s.c.CoreContainer Creating a core with existing name is not allowed
   [junit4]   2> 1280935 INFO  (TEST-TestLazyCores.testCreateSame-seed#[D37661D2001006DB]) [    x:collection4] o.a.s.h.a.CoreAdminOperation core create command schema=schema.xml&dataDir=t15&name=collection5&action=CREATE&config=solrconfig.xml&wt=xml
   [junit4]   2> 1280935 WARN  (TEST-TestLazyCores.testCreateSame-seed#[D37661D2001006DB]) [    x:collection4] o.a.s.c.CoreContainer Creating a core with existing name is not allowed
   [junit4]   2> 1280935 INFO  (TEST-TestLazyCores.testCreateSame-seed#[D37661D2001006DB]) [    x:collection4] o.a.s.h.a.CoreAdminOperation core create command schema=schema.xml&dataDir=t16&name=collection6&action=CREATE&config=solrconfig.xml&wt=xml
   [junit4]   2> 1280935 WARN  (TEST-TestLazyCores.testCreateSame-seed#[D37661D2001006DB]) [    x:collection4] o.a.s.c.CoreContainer Creating a core with existing name is not allowed
   [junit4]   2> 1280935 INFO  (TEST-TestLazyCores.testCreateSame-seed#[D37661D2001006DB]) [    x:collection4] o.a.s.c.CoreContainer Shutting down CoreContainer instance=1713719290
   [junit4]   2> 1280935 INFO  (TEST-TestLazyCores.testCreateSame-seed#[D37661D2001006DB]) [    x:collection4] o.a.s.m.SolrMetricManager Closing metric reporters for registry=solr.node, tag=null
   [junit4]   2> 1280935 INFO  (TEST-TestLazyCores.testCreateSame-seed#[D37661D2001006DB]) [    x:collection4] o.a.s.m.r.SolrJmxReporter Closing reporter [org.apache.solr.metrics.reporters.SolrJmxReporter@6081e533: rootName = null, domain = solr.node, service url = null, agent id = null] for registry solr.node / com.codahale.metrics.MetricRegistry@6b35fa3f
   [junit4]   2> 1280938 INFO  (TEST-TestLazyCores.testCreateSame-seed#[D37661D2001006DB]) [    x:collection4] o.a.s.m.SolrMetricManager Closing metric reporters for registry=solr.jvm, tag=null
   [junit4]   2> 1280938 INFO  (TEST-TestLazyCores.testCreateSame-seed#[D37661D2001006DB]) [    x:collection4] o.a.s.m.r.SolrJmxReporter Closing reporter [org.apache.solr.metrics.reporters.SolrJmxReporter@5318445f: rootName = null, domain = solr.jvm, service url = null, agent id = null] for registry solr.jvm / com.codahale.metrics.MetricRegistry@44e477ea
   [junit4]   2> 1280940 INFO  (TEST-TestLazyCores.testCreateSame-seed#[D37661D2001006DB]) [    x:collection4] o.a.s.m.SolrMetricManager Closing metric reporters for registry=solr.jetty, tag=null
   [junit4]   2> 1280940 INFO  (TEST-TestLazyCores.testCreateSame-seed#[D37661D2001006DB]) [    x:collection4] o.a.s.m.r.SolrJmxReporter Closing reporter [org.apache.solr.metrics.reporters.SolrJmxReporter@6120e4fe: rootName = null, domain = solr.jetty, service url = null, agent id = null] for registry solr.jetty / com.codahale.metrics.MetricRegistry@2be18f1c
   [junit4]   2> 1280940 INFO  (coreCloseExecutor-3467-thread-1-processing-x:collection4) [    x:collection5] o.a.s.c.SolrCore [collection5]  CLOSING SolrCore org.apache.solr.core.SolrCore@618d2f8d
   [junit4]   2> 1280940 INFO  (coreCloseExecutor-3467-thread-2-processing-x:collection4) [    x:collection1] o.a.s.c.SolrCore [collection1]  CLOSING SolrCore org.apache.solr.core.SolrCore@7789d950
   [junit4]   2> 1280940 INFO  (coreCloseExecutor-3467-thread-3-processing-x:collection4) [    x:collection4] o.a.s.c.SolrCore [collection4]  CLOSING SolrCore org.apache.solr.core.SolrCore@6b6fe671
   [junit4]   2> 1280940 INFO  (coreCloseExecutor-3467-thread-1-processing-x:collection4) [    x:collection5] o.a.s.m.SolrMetricManager Closing metric reporters for registry=solr.core.collection5, tag=1636642701
   [junit4]   2> 1280940 INFO  (coreCloseExecutor-3467-thread-4-processing-x:collection4) [    x:collection2] o.a.s.c.SolrCore [collection2]  CLOSING SolrCore org.apache.solr.core.SolrCore@36512fb6
   [junit4]   2> 1280940 INFO  (coreCloseExecutor-3467-thread-1-processing-x:collection4) [    x:collection5] o.a.s.m.r.SolrJmxReporter Closing reporter [org.apache.solr.metrics.reporters.SolrJmxReporter@280c0618: rootName = null, domain = solr.core.collection5, service url = null, agent id = null] for registry solr.core.collection5 / com.codahale.metrics.MetricRegistry@4e94a020
   [junit4]   2> 1280940 INFO  (coreCloseExecutor-3467-thread-5-processing-x:collection4) [    x:collection6] o.a.s.c.SolrCore [collection6]  CLOSING SolrCore org.apache.solr.core.SolrCore@2934882d
   [junit4]   2> 1280944 INFO  (coreCloseExecutor-3467-thread-2-processing-x:collection4) [    x:collection1] o.a.s.m.SolrMetricManager Closing metric reporters for registry=solr.core.collection1, tag=2005522768
   [junit4]   2> 1280944 INFO  (coreCloseExecutor-3467-thread-2-processing-x:collection4) [    x:collection1] o.a.s.m.r.SolrJmxReporter Closing reporter [org.apache.solr.metrics.reporters.SolrJmxReporter@1660a8c4: rootName = null, domain = solr.core.collection1, service url = null, agent id = null] for registry solr.core.collection1 / com.codahale.metrics.MetricRegistry@423621da
   [junit4]   2> 1280948 INFO  (coreCloseExecutor-3467-thread-3-processing-x:collection4) [    x:collection4] o.a.s.m.SolrMetricManager Closing metric reporters for registry=solr.core.collection4, tag=1802495601
   [junit4]   2> 1280948 INFO  (coreCloseExecutor-3467-thread-3-processing-x:collection4) [    x:collection4] o.a.s.m.r.SolrJmxReporter Closing reporter [org.apache.solr.metrics.reporters.SolrJmxReporter@1fa34761: rootName = null, domain = solr.core.collection4, service url = null, agent id = null] for registry solr.core.collection4 / com.codahale.metrics.MetricRegistry@27a5ea96
   [junit4]   2> 1280952 INFO  (coreCloseExecutor-3467-thread-4-processing-x:collection4) [    x:collection2] o.a.s.m.SolrMetricManager Closing metric reporters for registry=solr.core.collection2, tag=911290294
   [junit4]   2> 1280952 INFO  (coreCloseExecutor-3467-thread-4-processing-x:collection4) [    x:collection2] o.a.s.m.r.SolrJmxReporter Closing reporter [org.apache.solr.metrics.reporters.SolrJmxReporter@7957a41a: rootName = null, domain = solr.core.collection2, service url = null, agent id = null] for registry solr.core.collection2 / com.codahale.metrics.MetricRegistry@10ed9518
   [junit4]   2> 1280956 INFO  (coreCloseExecutor-3467-thread-5-processing-x:collection4) [    x:collection6] o.a.s.m.SolrMetricManager Closing metric reporters for registry=solr.core.collection6, tag=691308589
   [junit4]   2> 1280956 INFO  (coreCloseExecutor-3467-thread-5-processing-x:collection4) [    x:collection6] o.a.s.m.r.SolrJmxReporter Closing reporter [org.apache.solr.metrics.reporters.SolrJmxReporter@4f119ef8: rootName = null, domain = solr.core.collection6, service url = null, agent id = null] for registry solr.core.collection6 / com.codahale.metrics.MetricRegistry@4f0860e7
   [junit4]   2> 1280960 INFO  (TEST-TestLazyCores.testCreateSame-seed#[D37661D2001006DB]) [    x:collection4] o.a.s.SolrTestCaseJ4 ###Ending testCreateSame
   [junit4]   2> 1280961 INFO  (TEST-TestLazyCores.testRace-seed#[D37661D2001006DB]) [    x:collection4] o.a.s.SolrTestCaseJ4 ###Starting testRace
   [junit4]   2> 1280968 INFO  (TEST-TestLazyCores.testRace-seed#[D37661D2001006DB]) [    x:collection4] o.a.s.c.SolrXmlConfig Loading container configuration from /home/jenkins/workspace/Lucene-Solr-7.2-Linux/solr/build/solr-core/test/J1/temp/solr.core.TestLazyCores_D37661D2001006DB-001/tempDir-002/solr.xml
   [junit4]   2> 1280969 INFO  (TEST-TestLazyCores.testRace-seed#[D37661D2001006DB]) [    x:collection4] o.a.s.c.SolrXmlConfig Configuration parameter autoReplicaFailoverWorkLoopDelay is ignored
   [junit4]   2> 1280969 INFO  (TEST-TestLazyCores.testRace-seed#[D37661D2001006DB]) [    x:collection4] o.a.s.c.SolrXmlConfig Configuration parameter autoReplicaFailoverBadNodeExpiration is ignored
   [junit4]   2> 1280970 INFO  (TEST-TestLazyCores.testRace-seed#[D37661D2001006DB]) [    x:collection4] o.a.s.c.SolrXmlConfig MBean server found: com.sun.jmx.mbeanserver.JmxMBeanServer@6be30524, but no JMX reporters were configured - adding default JMX reporter.
   [junit4]   2> 1280991 INFO  (TEST-TestLazyCores.testRace-seed#[D37661D2001006DB]) [    x:collection4] o.a.s.m.r.SolrJmxReporter JMX monitoring for 'solr.node' (registry 'solr.node') enabled at server: com.sun.jmx.mbeanserver.JmxMBeanServer@6be30524
   [junit4]   2> 1280996 INFO  (TEST-TestLazyCores.testRace-seed#[D37661D2001006DB]) [    x:collection4] o.a.s.m.r.SolrJmxReporter JMX monitoring for 'solr.jvm' (registry 'solr.jvm') enabled at server: com.sun.jmx.mbeanserver.JmxMBeanServer@6be30524
   [junit4]   2> 1280996 INFO  (TEST-TestLazyCores.testRace-seed#[D37661D2001006DB]) [    x:collection4] o.a.s.m.r.SolrJmxReporter JMX monitoring for 'solr.jetty' (registry 'solr.jetty') enabled at server: com.sun.jmx.mbeanserver.JmxMBeanServer@6be30524
   [junit4]   2> 1280997 INFO  (TEST-TestLazyCores.testRace-seed#[D37661D2001006DB]) [    x:collection4] o.a.s.c.TransientSolrCoreCacheDefault Allocating transient cache for 4 transient cores
   [junit4]   2> 1281001 INFO  (coreLoadExecutor-3474-thread-2-processing-x:collection4) [    x:collection2] o.a.s.c.SolrConfig Using Lucene MatchVersion: 7.2.1
   [junit4]   2> 1281001 INFO  (coreLoadExecutor-3474-thread-1-processing-x:collection4) [    x:collection1] o.a.s.c.SolrConfig Using Lucene MatchVersion: 7.2.1
   [junit4]   2> 1281001 INFO  (coreLoadExecutor-3474-thread-3-processing-x:collection4) [    x:collection5] o.a.s.c.SolrConfig Using Lucene MatchVersion: 7.2.1
   [junit4]   2> 1281015 INFO  (coreLoadExecutor-3474-thread-1-processing-x:collection4) [    x:collection1] o.a.s.s.IndexSchema [collection1] Schema name=tiny
   [junit4]   2> 1281015 INFO  (coreLoadExecutor-3474-thread-2-processing-x:collection4) [    x:collection2] o.a.s.s.IndexSchema [collection2] Schema name=tiny
   [junit4]   2> 1281015 INFO  (coreLoadExecutor-3474-thread-3-processing-x:collection4) [    x:collection5] o.a.s.s.IndexSchema [collection5] Schema name=tiny
   [junit4]   2> 1281016 INFO  (coreLoadExecutor-3474-thread-3-processing-x:collection4) [    x:collection5] o.a.s.s.IndexSchema Loaded schema tiny/1.1 with uniqueid field id
   [junit4]   2> 1281016 INFO  (coreLoadExecutor-3474-thread-2-processing-x:collection4) [    x:collection2] o.a.s.s.IndexSchema Loaded schema tiny/1.1 with uniqueid field id
   [junit4]   2> 1281016 INFO  (coreLoadExecutor-3474-thread-1-processing-x:collection4) [    x:collection1] o.a.s.s.IndexSchema Loaded schema tiny/1.1 with uniqueid field id
   [junit4]   2> 1281016 INFO  (coreLoadExecutor-3474-thread-2-processing-x:collection4) [    x:collection2] o.a.s.c.CoreContainer Creating SolrCore 'collection2' using configuration from instancedir /home/jenkins/workspace/Lucene-Solr-7.2-Linux/solr/build/solr-core/test/J1/temp/solr.core.TestLazyCores_D37661D2001006DB-001/tempDir-002/./collection2, trusted=true
   [junit4]   2> 1281016 INFO  (coreLoadExecutor-3474-thread-3-processing-x:collection4) [    x:collection5] o.a.s.c.CoreContainer Creating SolrCore 'collection5' using configuration from instancedir /home/jenkins/workspace/Lucene-Solr-7.2-Linux/solr/build/solr-core/test/J1/temp/solr.core.TestLazyCores_D37661D2001006DB-001/tempDir-002/./collection5, trusted=true
   [junit4]   2> 1281016 INFO  (coreLoadExecutor-3474-thread-1-processing-x:collection4) [    x:collection1] o.a.s.c.CoreContainer Creating SolrCore 'collection1' using configuration from instancedir /home/jenkins/workspace/Lucene-Solr-7.2-Linux/solr/build/solr-core/test/J1/temp/solr.core.TestLazyCores_D37661D2001006DB-001/tempDir-002/./collection1, trusted=true
   [junit4]   2> 1281016 INFO  (coreLoadExecutor-3474-thread-2-processing-x:collection4) [    x:collection2] o.a.s.m.r.SolrJmxReporter JMX monitoring for 'solr.core.collection2' (registry 'solr.core.collection2') enabled at server: com.sun.jmx.mbeanserver.JmxMBeanServer@6be30524
   [junit4]   2> 1281016 INFO  (coreLoadExecutor-3474-thread-3-processing-x:collection4) [    x:collection5] o.a.s.m.r.SolrJmxReporter JMX monitoring for 'solr.core.collection5' (registry 'solr.core.collection5') enabled at server: com.sun.jmx.mbeanserver.JmxMBeanServer@6be30524
   [junit4]   2> 1281016 INFO  (coreLoadExecutor-3474-thread-2-processing-x:collection4) [    x:collection2] o.a.s.c.SolrCore solr.RecoveryStrategy.Builder
   [junit4]   2> 1281016 INFO  (coreLoadExecutor-3474-thread-3-processing-x:collection4) [    x:collection5] o.a.s.c.SolrCore solr.RecoveryStrategy.Builder
   [junit4]   2> 1281016 INFO  (coreLoadExecutor-3474-thread-1-processing-x:collection4) [    x:collection1] o.a.s.m.r.SolrJmxReporter JMX monitoring for 'solr.core.collection1' (registry 'solr.core.collection1') enabled at server: com.sun.jmx.mbeanserver.JmxMBeanServer@6be30524
   [junit4]   2> 1281016 INFO  (coreLoadExecutor-3474-thread-3-processing-x:collection4) [    x:collection5] o.a.s.c.SolrCore [[collection5] ] Opening new SolrCore at [/home/jenkins/workspace/Lucene-Solr-7.2-Linux/solr/build/solr-core/test/J1/temp/solr.core.TestLazyCores_D37661D2001006DB-001/tempDir-002/collection5], dataDir=[/home/jenkins/workspace/Lucene-Solr-7.2-Linux/solr/build/solr-core/test/J1/temp/solr.core.TestLazyCores_D37661D2001006DB-001/tempDir-002/./collection5/data/]
   [junit4]   2> 1281016 INFO  (coreLoadExecutor-3474-thread-1-processing-x:collection4) [    x:collection1] o.a.s.c.SolrCore solr.RecoveryStrategy.Builder
   [junit4]   2> 1281016 INFO  (coreLoadExecutor-3474-thread-1-processing-x:collection4) [    x:collection1] o.a.s.c.SolrCore [[collection1] ] Opening new SolrCore at [/home/jenkins/workspace/Lucene-Solr-7.2-Linux/solr/build/solr-core/test/J1/temp/solr.core.TestLazyCores_D37661D2001006DB-001/tempDir-002/collection1], dataDir=[/home/jenkins/workspace/Lucene-Solr-7.2-Linux/solr/build/solr-core/test/J1/temp/solr.core.TestLazyCores_D37661D2001006DB-001/tempDir-002/./collection1/data/]
   [junit4]   2> 1281016 INFO  (coreLoadExecutor-3474-thread-2-processing-x:collection4) [    x:collection2] o.a.s.c.SolrCore [[collection2] ] Opening new SolrCore at [/home/jenkins/workspace/Lucene-Solr-7.2-Linux/solr/build/solr-core/test/J1/temp/solr.core.TestLazyCores_D37661D2001006DB-001/tempDir-002/collection2], dataDir=[/home/jenkins/workspace/Lucene-Solr-7.2-Linux/solr/build/solr-core/test/J1/temp/solr.core.TestLazyCores_D37661D2001006DB-001/tempDir-002/./collection2/data/]
   [junit4]   2> 1281018 INFO  (coreLoadExecutor-3474-thread-3-processing-x:collection4) [    x:collection5] o.a.s.u.RandomMergePolicy RandomMergePolicy wrapping class org.apache.lucene.index.LogByteSizeMergePolicy: [LogByteSizeMergePolicy: minMergeSize=1677721, mergeFactor=18, maxMergeSize=2147483648, maxMergeSizeForForcedMerge=9223372036854775807, calibrateSizeByDeletes=true, maxMergeDocs=2147483647, maxCFSSegmentSizeMB=8.796093022207999E12, noCFSRatio=0.5190231537679613]
   [junit4]   2> 1281018 INFO  (coreLoadExecutor-3474-thread-1-processing-x:collection4) [    x:collection1] o.a.s.u.RandomMergePolicy RandomMergePolicy wrapping class org.apache.lucene.index.LogByteSizeMergePolicy: [LogByteSizeMergePolicy: minMergeSize=1677721, mergeFactor=18, maxMergeSize=2147483648, maxMergeSizeForForcedMerge=9223372036854775807, calibrateSizeByDeletes=true, maxMergeDocs=2147483647, maxCFSSegmentSizeMB=8.796093022207999E12, noCFSRatio=0.5190231537679613]
   [junit4]   2> 1281018 INFO  (coreLoadExecutor-3474-thread-2-processing-x:collection4) [    x:collection2] o.a.s.u.RandomMergePolicy RandomMergePolicy wrapping class org.apache.lucene.index.LogByteSizeMergePolicy: [LogByteSizeMergePolicy: minMergeSize=1677721, mergeFactor=18, maxMergeSize=2147483648, maxMergeSizeForForcedMerge=9223372036854775807, calibrateSizeByDeletes=true, maxMergeDocs=2147483647, maxCFSSegmentSizeMB=8.796093022207999E12, noCFSRatio=0.5190231537679613]
   [junit4]   2> 1281055 INFO  (coreLoadExecutor-3474-thread-1-processing-x:collection4) [    x:collection1] o.a.s.u.CommitTracker Hard AutoCommit: disabled
   [junit4]   2> 1281055 INFO  (coreLoadExecutor-3474-thread-1-processing-x:collection4) [    x:collection1] o.a.s.u.CommitTracker Soft AutoCommit: disabled
   [junit4]   2> 1281056 INFO  (coreLoadExecutor-3474-thread-1-processing-x:collection4) [    x:collection1] o.a.s.u.RandomMergePolicy RandomMergePolicy wrapping class org.apache.lucene.index.TieredMergePolicy: [TieredMergePolicy: maxMergeAtOnce=13, maxMergeAtOnceExplicit=32, maxMergedSegmentMB=10.1650390625, floorSegmentMB=1.517578125, forceMergeDeletesPctAllowed=5.467647686172679, segmentsPerTier=19.0, maxCFSSegmentSizeMB=8.796093022207999E12, noCFSRatio=0.5087168919390287
   [junit4]   2> 1281056 INFO  (coreLoadExecutor-3474-thread-1-processing-x:collection4) [    x:collection1] o.a.s.s.SolrIndexSearcher Opening [Searcher@f9bc359[collection1] main]
   [junit4]   2> 1281056 INFO  (coreLoadExecutor-3474-thread-1-processing-x:collection4) [    x:collection1] o.a.s.r.ManagedResourceStorage File-based storage initialized to use dir: /home/jenkins/workspace/Lucene-Solr-7.2-Linux/solr/build/solr-core/test/J1/temp/solr.core.TestLazyCores_D37661D2001006DB-001/tempDir-002/collection1/conf
   [junit4]   2> 1281057 INFO  (coreLoadExecutor-3474-thread-1-processing-x:collection4) [    x:collection1] o.a.s.h.ReplicationHandler Commits will be reserved for 10000ms.
   [junit4]   2> 1281057 INFO  (searcherExecutor-3477-thread-1-processing-x:collection1) [    x:collection1] o.a.s.c.SolrCore [collection1] Registered new searcher Searcher@f9bc359[collection1] main{ExitableDirectoryReader(UninvertingDirectoryReader())}
   [junit4]   2> 1281060 INFO  (coreLoadExecutor-3474-thread-3-processing-x:collection4) [    x:collection5] o.a.s.u.CommitTracker Hard AutoCommit: disabled
   [junit4]   2> 1281060 INFO  (coreLoadExecutor-3474-thread-3-processing-x:collection4) [    x:collection5] o.a.s.u.CommitTracker Soft AutoCommit: disabled
   [junit4]   2> 1281061 INFO  (coreLoadExecutor-3474-thread-3-processing-x:collection4) [    x:collection5] o.a.s.u.RandomMergePolicy RandomMergePolicy wrapping class org.apache.lucene.index.TieredMergePolicy: [TieredMergePolicy: maxMergeAtOnce=13, maxMergeAtOnceExplicit=32, maxMergedSegmentMB=10.1650390625, floorSegmentMB=1.517578125, forceMergeDeletesPctAllowed=5.467647686172679, segmentsPerTier=19.0, maxCFSSegmentSizeMB=8.796093022207999E12, noCFSRatio=0.5087168919390287
   [junit4]   2> 1281061 INFO  (coreLoadExecutor-3474-thread-3-processing-x:collection4) [    x:collection5] o.a.s.s.SolrIndexSearcher Opening [Searcher@57b3ccfd[collection5] main]
   [junit4]   2> 1281061 INFO  (coreLoadExecutor-3474-thread-3-processing-x:collection4) [    x:collection5] o.a.s.r.ManagedResourceStorage File-based storage initialized to use dir: /home/jenkins/workspace/Lucene-Solr-7.2-Linux/solr/build/solr-core/test/J1/temp/solr.core.TestLazyCores_D37661D2001006DB-001/tempDir-002/collection5/conf
   [junit4]   2> 1281061 INFO  (coreLoadExecutor-3474-thread-3-processing-x:collection4) [    x:collection5] o.a.s.h.ReplicationHandler Commits will be reserved for 10000ms.
   [junit4]   2> 1281062 INFO  (searcherExecutor-3476-thread-1-processing-x:collection5) [    x:collection5] o.a.s.c.SolrCore [collection5] Registered new searcher Searcher@57b3ccfd[collection5] main{ExitableDirectoryReader(UninvertingDirectoryReader())}
   [junit4]   2> 1281063 INFO  (coreLoadExecutor-3474-thread-2-processing-x:collection4) [    x:collection2] o.a.s.u.CommitTracker Hard AutoCommit: disabled
   [junit4]   2> 1281063 INFO  (coreLoadExecutor-3474-thread-2-processing-x:collection4) [    x:collection2] o.a.s.u.CommitTracker Soft AutoCommit: disabled
   [junit4]   2> 1281064 INFO  (coreLoadExecutor-3474-thread-2-processing-x:collection4) [    x:collection2] o.a.s.u.RandomMergePolicy RandomMergePolicy wrapping class org.apache.lucene.index.TieredMergePolicy: [TieredMergePolicy: maxMergeAtOnce=13, maxMergeAtOnceExplicit=32, maxMergedSegmentMB=10.1650390625, floorSegmentMB=1.517578125, forceMergeDeletesPctAllowed=5.467647686172679, segmentsPerTier=19.0, maxCFSSegmentSizeMB=8.796093022207999E12, noCFSRatio=0.5087168919390287
   [junit4]   2> 1281064 INFO  (coreLoadExecutor-3474-thread-2-processing-x:collection4) [    x:collection2] o.a.s.s.SolrIndexSearcher Opening [Searcher@35f2cba8[collection2] main]
   [junit4]   2> 1281064 INFO  (coreLoadExecutor-3474-thread-2-processing-x:collection4) [    x:collection2] o.a.s.r.ManagedResourceStorage File-based storage initialized to use dir: /home/jenkins/workspace/Lucene-Solr-7.2-Linux/solr/build/solr-core/test/J1/temp/solr.core.TestLazyCores_D37661D2001006DB-001/tempDir-002/collection2/conf
   [junit4]   2> 1281064 INFO  (coreLoadExecutor-3474-thread-2-processing-x:collection4) [    x:collection2] o.a.s.h.ReplicationHandler Commits will be reserved for 10000ms.
   [junit4]   2> 1281065 INFO  (searcherExecutor-3475-thread-1-processing-x:collection2) [    x:collection2] o.a.s.c.SolrCore [collection2] Registered new searcher Searcher@35f2cba8[collection2] main{ExitableDirectoryReader(UninvertingDirectoryReader())}
   [junit4]   2> 1281080 INFO  (Thread-2062) [    x:collection3] o.a.s.c.SolrConfig Using Lucene MatchVersion: 7.2.1
   [junit4]   2> 1281084 INFO  (Thread-2062) [    x:collection3] o.a.s.s.IndexSchema [collection3] Schema name=tiny
   [junit4]   2> 1281085 INFO  (Thread-2062) [    x:collection3] o.a.s.s.IndexSchema Loaded schema tiny/1.1 with uniqueid field id
   [junit4]   2> 1281085 INFO  (Thread-2062) [    x:collection3] o.a.s.c.CoreContainer Creating SolrCore 'collection3' using configuration from instancedir /home/jenkins/workspace/Lucene-Solr-7.2-Linux/solr/build/solr-core/test/J1/temp/solr.core.TestLazyCores_D37661D2001006DB-001/tempDir-002/./collection3, trusted=true
   [junit4]   2> 1281085 INFO  (Thread-2062) [    x:collection3] o.a.s.m.r.SolrJmxReporter JMX monitoring for 'solr.core.collection3' (registry 'solr.core.collection3') enabled at server: com.sun.jmx.mbeanserver.JmxMBeanServer@6be30524
   [junit4]   2> 1281085 INFO  (Thread-2062) [    x:collection3] o.a.s.c.SolrCore solr.RecoveryStrategy.Builder
   [junit4]   2> 1281085 INFO  (Thread-2062) [    x:collection3] o.a.s.c.SolrCore [[collection3] ] Opening new SolrCore at [/home/jenkins/workspace/Lucene-Solr-7.2-Linux/solr/build/solr-core/test/J1/temp/solr.core.TestLazyCores_D37661D2001006DB-001/tempDir-002/collection3], dataDir=[/home/jenkins/workspace/Lucene-Solr-7.2-Linux/solr/build/solr-core/test/J1/temp/solr.core.TestLazyCores_D37661D2001006DB-001/tempDir-002/./collection3/data/]
   [junit4]   2> 1281086 INFO  (Thread-2062) [    x:collection3] o.a.s.u.RandomMergePolicy RandomMergePolicy wrapping class org.apache.lucene.index.LogByteSizeMergePolicy: [LogByteSizeMergePolicy: minMergeSize=1677721, mergeFactor=18, maxMergeSize=2147483648, maxMergeSizeForForcedMerge=9223372036854775807, calibrateSizeByDeletes=true, maxMergeDocs=2147483647, maxCFSSegmentSizeMB=8.796093022207999E12, noCFSRatio=0.5190231537679613]
   [junit4]   2> 1281135 INFO  (Thread-2062) [    x:collection3] o.a.s.u.CommitTracker Hard AutoCommit: disabled
   [junit4]   2> 1281135 INFO  (Thread-2062) [    x:collection3] o.a.s.u.CommitTracker Soft AutoCommit: disabled
   [junit4]   2> 1281136 INFO  (Thread-2062) [    x:collection3] o.a.s.u.RandomMergePolicy RandomMergePolicy wrapping class org.apache.lucene.index.TieredMergePolicy: [TieredMergePolicy: maxMergeAtOnce=13, maxMergeAtOnceExplicit=32, maxMergedSegmentMB=10.1650390625, floorSegmentMB=1.517578125, forceMergeDeletesPctAllowed=5.467647686172679, segmentsPerTier=19.0, maxCFSSegmentSizeMB=8.796093022207999E12, noCFSRatio=0.5087168919390287
   [junit4]   2> 1281136 INFO  (Thread-2062) [    x:collection3] o.a.s.s.SolrIndexSearcher Opening [Searcher@5bad67d[collection3] main]
   [junit4]   2> 1281136 INFO  (Thread-2062) [    x:collection3] o.a.s.r.ManagedResourceStorage File-based storage initialized to use dir: /home/jenkins/workspace/Lucene-Solr-7.2-Linux/solr/build/solr-core/test/J1/temp/solr.core.TestLazyCores_D37661D2001006DB-001/tempDir-002/collection3/conf
   [junit4]   2> 1281137 INFO  (Thread-2062) [    x:collection3] o.a.s.h.ReplicationHandler Commits will be reserved for 10000ms.
   [junit4]   2> 1281138 INFO  (TEST-TestLazyCores.testRace-seed#[D37661D2001006DB]) [    x:collection4] o.a.s.c.CoreContainer Shutting down CoreContainer instance=384617275
   [junit4]   2> 1281138 INFO  (TEST-TestLazyCores.testRace-seed#[D37661D2001006DB]) [    x:collection4] o.a.s.m.SolrMetricManager Closing metric reporters for registry=solr.node, tag=null
   [junit4]   2> 1281138 INFO  (searcherExecutor-3487-thread-1-processing-x:collection3) [    x:collection3] o.a.s.c.SolrCore [collection3] Registered new searcher Searcher@5bad67d[collection3] main{ExitableDirectoryReader(UninvertingDirectoryReader())}
   [junit4]   2> 1281138 INFO  (TEST-TestLazyCores.testRace-seed#[D37661D2001006DB]) [    x:collection4] o.a.s.m.r.SolrJmxReporter Closing reporter [org.apache.solr.metrics.reporters.SolrJmxReporter@4effb41e: rootName = null, domain = solr.node, service url = null, agent id = null] for registry solr.node / com.codahale.metrics.MetricRegistry@4d67cf95
   [junit4]   2> 1281142 INFO  (TEST-TestLazyCores.testRace-seed#[D37661D2001006DB]) [    x:collection4] o.a.s.m.SolrMetricManager Closing metric reporters for registry=solr.jvm, tag=null
   [junit4]   2> 1281142 INFO  (TEST-TestLazyCores.testRace-seed#[D37661D2001006DB]) [    x:collection4] o.a.s.m.r.SolrJmxReporter Closing reporter [org.apache.solr.metrics.reporters.SolrJmxReporter@2922b3ce: rootName = null, domain = solr.jvm, service url = null, agent id = null] for registry solr.jvm / com.codahale.metrics.MetricRegistry@44e477ea
   [junit4]   2> 1281144 INFO  (TEST-TestLazyCores.testRace-seed#[D37661D2001006DB]) [    x:collection4] o.a.s.m.SolrMetricManager Closing metric reporters for registry=solr.jetty, tag=null
   [junit4]   2> 1281144 INFO  (TEST-TestLazyCores.testRace-seed#[D37661D2001006DB]) [    x:collection4] o.a.s.m.r.SolrJmxReporter Closing reporter [org.apache.solr.metrics.reporters.SolrJmxReporter@6f714113: rootName = null, domain = solr.jetty, service url = null, agent id = null] for registry solr.jetty / com.codahale.metrics.MetricRegistry@2be18f1c
   [junit4]   2> 1281145 INFO  (coreCloseExecutor-3491-thread-1-processing-x:collection4) [    x:collection1] o.a.s.c.SolrCore [collection1]  CLOSING SolrCore org.apache.solr.core.SolrCore@3e306b36
   [junit4]   2> 1281145 INFO  (coreCloseExecutor-3491-thread-2-processing-x:collection4) [    x:collection5] o.a.s.c.SolrCore [collection5]  CLOSING SolrCore org.apache.solr.core.SolrCore@36d769f
   [junit4]   2> 1281145 INFO  (coreCloseExecutor-3491-thread-1-processing-x:collection4) [    x:collection1] o.a.s.m.SolrMetricManager Closing metric reporters for registry=solr.core.collection1, tag=1043360566
   [junit4]   2> 1281145 INFO  (coreCloseExecutor-3491-thread-3-processing-x:collection4) [    x:collection2] o.a.s.c.SolrCore [collection2]  CLOSING SolrCore org.apache.solr.core.SolrCore@5a00a725
   [junit4]   2> 1281145 INFO  (coreCloseExecutor-3491-thread-1-processing-x:collection4) [    x:collection1] o.a.s.m.r.SolrJmxReporter Closing reporter [org.apache.solr.metrics.reporters.SolrJmxReporter@15fa04f3: rootName = null, domain = solr.core.collection1, service url = null, agent id = null] for registry solr.core.collection1 / com.codahale.metrics.MetricRegistry@7a5fb144
   [junit4]   2> 1281145 INFO  (coreCloseExecutor-3491-thread-4-processing-x:collection4) [    x:collection3] o.a.s.c.SolrCore [collection3]  CLOSING SolrCore org.apache.solr.core.SolrCore@4517419
   [junit4]   2> 1281149 INFO  (coreCloseExecutor-3491-thread-2-processing-x:collection4) [    x:collection5] o.a.s.m.SolrMetricManager Closing metric reporters for registry=solr.core.collection5, tag=57505439
   [junit4]   2> 1281149 INFO  (coreCloseExecutor-3491-thread-2-processing-x:collection4) [    x:collection5] o.a.s.m.r.SolrJmxReporter Closing reporter [org.apache.solr.metrics.reporters.SolrJmxReporter@3f075517: rootName = null, domain = solr.core.collection5, service url = null, agent id = null] for registry solr.core.collection5 / com.codahale.metrics.MetricRegistry@4d5f86cc
   [junit4]   2> 1281153 INFO  (coreCloseExecutor-3491-thread-3-processing-x:collection4) [    x:collection2] o.a.s.m.SolrMetricManager Closing metric reporters for registry=solr.core.collection2, tag=1509992229
   [junit4]   2> 1281153 INFO  (coreCloseExecutor-3491-thread-3-processing-x:collection4) [    x:collection2] o.a.s.m.r.SolrJmxReporter Closing reporter [org.apache.solr.metrics.reporters.SolrJmxReporter@196a166e: rootName = null, domain = solr.core.collection2, service url = null, agent id = null] for registry solr.core.collection2 / com.codahale.metrics.MetricRegistry@224a1d86
   [junit4]   2> 1281156 INFO  (coreCloseExecutor-3491-thread-4-processing-x:collection4) [    x:collection3] o.a.s.m.SolrMetricManager Closing metric reporters for registry=solr.core.collection3, tag=72447001
   [junit4]   2> 1281156 INFO  (coreCloseExecutor-3491-thread-4-processing-x:collection4) [    x:collection3] o.a.s.m.r.SolrJmxReporter Closing reporter [org.apache.solr.metrics.reporters.SolrJmxReporter@364efb57: rootName = null, domain = solr.core.collection3, service url = null, agent id = null] for registry solr.core.collection3 / com.codahale.metrics.MetricRegistry@595712f5
   [junit4]   2> 1281161 INFO  (TEST-TestLazyCores.testRace-seed#[D37661D2001006DB]) [    x:collection4] o.a.s.SolrTestCaseJ4 ###Ending testRace
   [junit4]   2> 1281162 INFO  (TEST-TestLazyCores.testNoCommit-seed#[D37661D2001006DB]) [    x:collection4] o.a.s.SolrTestCaseJ4 ###Starting testNoCommit
   [junit4]   2> 1281169 INFO  (TEST-TestLazyCores.testNoCommit-seed#[D37661D2001006DB]) [    x:collection4] o.a.s.c.SolrXmlConfig Loading container configuration from /home/jenkins/workspace/Lucene-Solr-7.2-Linux/solr/build/solr-core/test/J1/temp/solr.core.TestLazyCores_D37661D2001006DB-001/tempDir-003/solr.xml
   [junit4]   2> 1281170 INFO  (TEST-TestLazyCores.testNoCommit-seed#[D37661D2001006DB]) [    x:collection4] o.a.s.c.SolrXmlConfig Configuration parameter autoReplicaFailoverWorkLoopDelay is ignored
   [junit4]   2> 1281170 INFO  (TEST-TestLazyCores.testNoCommit-seed#[D37661D2001006DB]) [    x:collection4] o.a.s.c.SolrXmlConfig Configuration parameter autoReplicaFailoverBadNodeExpiration is ignored
   [junit4]   2> 1281171 INFO  (TEST-TestLazyCores.testNoCommit-seed#[D37661D2001006DB]) [    x:collection4] o.a.s.c.SolrXmlConfig MBean server found: com.sun.jmx.mbeanserver.JmxMBeanServer@6be30524, but no JMX reporters were configured - adding default JMX reporter.
   [junit4]   2> 1281185 INFO  (TEST-TestLazyCores.testNoCommit-seed#[D37661D2001006DB]) [    x:collection4] o.a.s.m.r.SolrJmxReporter JMX monitoring for 'solr.node' (registry 'solr.node') enabled at server: com.sun.jmx.mbeanserver.JmxMBeanServer@6be30524
   [junit4]   2> 1281198 INFO  (TEST-TestLazyCores.testNoCommit-seed#[D37661D2001006DB]) [    x:collection4] o.a.s.m.r.SolrJmxReporter JMX monitoring for 'solr.jvm' (registry 'solr.jvm') enabled at server: com.sun.jmx.mbeanserver.JmxMBeanServer@6be30524
   [junit4]   2> 1281199 INFO  (TEST-TestLazyCores.testNoCommit-seed#[D37661D2001006DB]) [    x:collection4] o.a.s.m.r.SolrJmxReporter JMX monitoring for 'solr.jetty' (registry 'solr.jetty') enabled at server: com.sun.jmx.mbeanserver.JmxMBeanServer@6be30524
   [junit4]   2> 1281200 INFO  (TEST-TestLazyCores.testNoCommit-seed#[D37661D2001006DB]) [    x:collection4] o.a.s.c.TransientSolrCoreCacheDefault Allocating transient cache for 4 transient cores
   [junit4]   2> 1281204 INFO  (coreLoadExecutor-3498-thread-2-processing-x:collection4) [    x:collection2] o.a.s.c.SolrConfig Using Lucene MatchVersion: 7.2.1
   [junit4]   2> 1281204 INFO  (coreLoadExecutor-3498-thread-1-processing-x:collection4) [    x:collection1] o.a.s.c.SolrConfig Using Lucene MatchVersion: 7.2.1
   [junit4]   2> 1281204 INFO  (coreLoadExecutor-3498-thread-3-processing-x:collection4) [    x:collection5] o.a.s.c.SolrConfig Using Lucene MatchVersion: 7.2.1
   [junit4]   2> 1281209 INFO  (coreLoadExecutor-3498-thread-1-processing-x:collection4) [    x:collection1] o.a.s.s.IndexSchema [collection1] Schema name=tiny
   [junit4]   2> 1281209 INFO  (coreLoadExecutor-3498-thread-2-processing-x:collection4) [    x:collection2] o.a.s.s.IndexSchema [collection2] Schema name=tiny
   [junit4]   2> 1281209 INFO  (coreLoadExecutor-3498-thread-3-processing-x:collection4) [    x:collection5] o.a.s.s.IndexSchema [collection5] Schema name=tiny
   [junit4]   2> 1281219 INFO  (coreLoadExecutor-3498-thread-1-processing-x:collection4) [    x:collection1] o.a.s.s.IndexSchema Loaded schema tiny/1.1 with uniqueid field id
   [junit4]   2> 1281219 INFO  (coreLoadExecutor-3498-thread-1-processing-x:collection4) [    x:collection1] o.a.s.c.CoreContainer Creating SolrCore 'collection1' using configuration from instancedir /home/jenkins/workspace/Lucene-Solr-7.2-Linux/solr/build/solr-core/test/J1/temp/solr.core.TestLazyCores_D37661D2001006DB-001/tempDir-003/./collection1, trusted=true
   [junit4]   2> 1281219 INFO  (coreLoadExecutor-3498-thread-3-processing-x:collection4) [    x:collection5] o.a.s.s.IndexSchema Loaded schema tiny/1.1 with uniqueid field id
   [junit4]   2> 1281219 INFO  (coreLoadExecutor-3498-thread-3-processing-x:collection4) [    x:collection5] o.a.s.c.CoreContainer Creating SolrCore 'collection5' using configuration from instancedir /home/jenkins/workspace/Lucene-Solr-7.2-Linux/solr/build/solr-core/test/J1/temp/solr.core.TestLazyCores_D37661D2001006DB-001/tempDir-003/./collection5, trusted=true
   [junit4]   2> 1281219 INFO  (coreLoadExecutor-3498-thread-2-processing-x:collection4) [    x:collection2] o.a.s.s.IndexSchema Loaded schema tiny/1.1 with uniqueid field id
   [junit4]   2> 1281219 INFO  (coreLoadExecutor-3498-thread-2-processing-x:collection4) [    x:collection2] o.a.s.c.CoreContainer Creating SolrCore 'collection2' using configuration from instancedir /home/jenkins/workspace/Lucene-Solr-7.2-Linux/solr/build/solr-core/test/J1/temp/solr.core.TestLazyCores_D37661D2001006DB-001/tempDir-003/./collection2, trusted=true
   [junit4]   2> 1281219 INFO  (coreLoadExecutor-3498-thread-1-processing-x:collection4) [    x:collection1] o.a.s.m.r.SolrJmxReporter JMX monitoring for 'solr.core.collection1' (registry 'solr.core.collection1') enabled at server: com.sun.jmx.mbeanserver.JmxMBeanServer@6be30524
   [junit4]   2> 1281219 INFO  (coreLoadExecutor-3498-thread-3-processing-x:collection4) [    x:collection5] o.a.s.m.r.SolrJmxReporter JMX monitoring for 'solr.core.collection5' (registry 'solr.core.collection5') enabled at server: com.sun.jmx.mbeanserver.JmxMBeanServer@6be30524
   [junit4]   2> 1281219 INFO  (coreLoadExecutor-3498-thread-2-processing-x:collection4) [    x:collection2] o.a.s.m.r.SolrJmxReporter JMX monitoring for 'solr.core.collection2' (registry 'solr.core.collection2') enabled at server: com.sun.jmx.mbeanserver.JmxMBeanServer@6be30524
   [junit4]   2> 1281219 INFO  (coreLoadExecutor-3498-thread-1-processing-x:collection4) [    x:collection1] o.a.s.c.SolrCore solr.RecoveryStrategy.Builder
   [junit4]   2> 1281220 INFO  (coreLoadExecutor-3498-thread-3-processing-x:collection4) [    x:collection5] o.a.s.c.SolrCore solr.RecoveryStrategy.Builder
   [junit4]   2> 1281220 INFO  (coreLoadExecutor-3498-thread-2-processing-x:collection4) [    x:collection2] o.a.s.c.SolrCore solr.RecoveryStrategy.Builder
   [junit4]   2> 1281220 INFO  (coreLoadExecutor-3498-thread-1-processing-x:collection4) [    x:collection1] o.a.s.c.SolrCore [[collection1] ] Opening new SolrCore at [/home/jenkins/workspace/Lucene-Solr-7.2-Linux/solr/build/solr-core/test/J1/temp/solr.core.TestLazyCores_D37661D2001006DB-001/tempDir-003/collection1], dataDir=[/home/jenkins/workspace/Lucene-Solr-7.2-Linux/solr/build/solr-core/test/J1/temp/solr.core.TestLazyCores_D37661D2001006DB-001/tempDir-003/./collection1/data/]
   [junit4]   2> 1281220 INFO  (coreLoadExecutor-3498-thread-2-processing-x:collection4) [    x:collection2] o.a.s.c.SolrCore [[collection2] ] Opening new SolrCore at [/home/jenkins/workspace/Lucene-Solr-7.2-Linux/solr/build/solr-core/test/J1/temp/solr.core.TestLazyCores_D37661D2001006DB-001/tempDir-003/collection2], dataDir=[/home/jenkins/workspace/Lucene-Solr-7.2-Linux/solr/build/solr-core/test/J1/temp/solr.core.TestLazyCores_D37661D2001006DB-001/tempDir-003/./collection2/data/]
   [junit4]   2> 1281220 INFO  (coreLoadExecutor-3498-thread-3-processing-x:collection4) [    x:collection5] o.a.s.c.SolrCore [[collection5] ] Opening new SolrCore at [/home/jenkins/workspace/Lucene-Solr-7.2-Linux/solr/build/solr-core/test/J1/temp/solr.core.TestLazyCores_D37661D2001006DB-001/tempDir-003/collection5], dataDir=[/home/jenkins/workspace/Lucene-Solr-7.2-Linux/solr/build/solr-core/test/J1/temp/solr.core.TestLazyCores_D37661D2001006DB-001/tempDir-003/./collection5/data/]
   [junit4]   2> 1281221 INFO  (coreLoadExecutor-3498-thread-2-processing-x:collection4) [    x:collection2] o.a.s.u.RandomMergePolicy RandomMergePolicy wrapping class org.apache.lucene.index.LogByteSizeMergePolicy: [LogByteSizeMergePolicy: minMergeSize=1677721, mergeFactor=18, maxMergeSize=2147483648, maxMergeSizeForForcedMerge=9223372036854775807, calibrateSizeByDeletes=true, maxMergeDocs=2147483647, maxCFSSegmentSizeMB=8.796093022207999E12, noCFSRatio=0.5190231537679613]
   [junit4]   2> 1281221 INFO  (coreLoadExecutor-3498-thread-1-processing-x:collection4) [    x:collection1] o.a.s.u.RandomMergePolicy RandomMergePolicy wrapping class org.apache.lucene.index.LogByteSizeMergePolicy: [LogByteSizeMergePolicy: minMergeSize=1677721, mergeFactor=18, maxMergeSize=2147483648, maxMergeSizeForForcedMerge=9223372036854775807, calibrateSizeByDeletes=true, maxMergeDocs=2147483647, maxCFSSegmentSizeMB=8.796093022207999E12, noCFSRatio=0.5190231537679613]
   [junit4]   2> 1281221 INFO  (coreLoadExecutor-3498-thread-3-processing-x:collection4) [    x:collection5] o.a.s.u.RandomMergePolicy RandomMergePolicy wrapping class org.apache.lucene.index.LogByteSizeMergePolicy: [LogByteSizeMergePolicy: minMergeSize=1677721, mergeFactor=18, maxMergeSize=2147483648, maxMergeSizeForForcedMerge=9223372036854775807, calibrateSizeByDeletes=true, maxMergeDocs=2147483647, maxCFSSegmentSizeMB=8.796093022207999E12, noCFSRatio=0.5190231537679613]
   [junit4]   2> 1281256 INFO  (coreLoadExecutor-3498-thread-1-processing-x:collection4) [    x:collection1] o.a.s.u.CommitTracker Hard AutoCommit: disabled
   [junit4]   2> 1281256 INFO  (coreLoadExecutor-3498-thread-1-processing-x:collection4) [    x:collection1] o.a.s.u.CommitTracker Soft AutoCommit: disabled
   [junit4]   2> 1281256 INFO  (coreLoadExecutor-3498-thread-2-processing-x:collection4) [    x:collection2] o.a.s.u.CommitTracker Hard AutoCommit: disabled
   [junit4]   2> 1281256 INFO  (coreLoadExecutor-3498-thread-2-processing-x:collection4) [    x:collection2] o.a.s.u.CommitTracker Soft AutoCommit: disabled
   [junit4]   2> 1281257 INFO  (coreLoadExecutor-3498-thread-1-processing-x:collection4) [    x:collection1] o.a.s.u.RandomMergePolicy RandomMergePolicy wrapping class org.apache.lucene.index.TieredMergePolicy: [TieredMergePolicy: maxMergeAtOnce=13, maxMergeAtOnceExplicit=32, maxMergedSegmentMB=10.1650390625, floorSegmentMB=1.517578125, forceMergeDeletesPctAllowed=5.467647686172679, segmentsPerTier=19.0, maxCFSSegmentSizeMB=8.796093022207999E12, noCFSRatio=0.5087168919390287
   [junit4]   2> 1281257 INFO  (coreLoadExecutor-3498-thread-2-processing-x:collection4) [    x:collection2] o.a.s.u.RandomMergePolicy RandomMergePolicy wrapping class org.apache.lucene.index.TieredMergePolicy: [TieredMergePolicy: maxMergeAtOnce=13, maxMergeAtOnceExplicit=32, maxMergedSegmentMB=10.1650390625, floorSegmentMB=1.517578125, forceMergeDeletesPctAllowed=5.467647686172679, segmentsPerTier=19.0, maxCFSSegmentSizeMB=8.796093022207999E12, noCFSRatio=0.5087168919390287
   [junit4]   2> 1281257 INFO  (coreLoadExecutor-3498-thread-2-processing-x:collection4) [    x:collection2] o.a.s.s.SolrIndexSearcher Opening [Searcher@5051b6ae[collection2] main]
   [junit4]   2> 1281257 INFO  (coreLoadExecutor-3498-thread-1-processing-x:collection4) [    x:collection1] o.a.s.s.SolrIndexSearcher Opening [Searcher@c3ba544[collection1] main]
   [junit4]   2> 1281257 INFO  (coreLoadExecutor-3498-thread-2-processing-x:collection4) [    x:collection2] o.a.s.r.ManagedResourceStorage File-based storage initialized to use dir: /home/jenkins/workspace/Lucene-Solr-7.2-Linux/solr/build/solr-core/test/J1/temp/solr.core.TestLazyCores_D37661D2001006DB-001/tempDir-003/collection2/conf
   [junit4]   2> 1281257 INFO  (coreLoadExecutor-3498-thread-1-processing-x:collection4) [    x:collection1] o.a.s.r.ManagedResourceStorage File-based storage initialized to use dir: /home/jenkins/workspace/Lucene-Solr-7.2-Linux/solr/build/solr-core/test/J1/temp/solr.core.TestLazyCores_D37661D2001006DB-001/tempDir-003/collection1/conf
   [junit4]   2> 1281258 INFO  (coreLoadExecutor-3498-thread-2-processing-x:collection4) [    x:collection2] o.a.s.h.ReplicationHandler Commits will be reserved for 10000ms.
   [junit4]   2> 1281258 INFO  (coreLoadExecutor-3498-thread-1-processing-x:collection4) [    x:collection1] o.a.s.h.ReplicationHandler Commits will be reserved for 10000ms.
   [junit4]   2> 1281258 INFO  (searcherExecutor-3499-thread-1-processing-x:collection1) [    x:collection1] o.a.s.c.SolrCore [collection1] Registered new searcher Searcher@c3ba544[collection1] main{ExitableDirectoryReader(UninvertingDirectoryReader())}
   [junit4]   2> 1281258 INFO  (searcherExecutor-3501-thread-1-processing-x:collection2) [    x:collection2] o.a.s.c.SolrCore [collection2] Registered new searcher Searcher@5051b6ae[collection2] main{ExitableDirectoryReader(UninvertingDirectoryReader())}
   [junit4]   2> 1281267 INFO  (coreLoadExecutor-3498-thread-3-processing-x:collection4) [    x:collection5] o.a.s.u.CommitTracker Hard AutoCommit: disabled
   [junit4]   2> 1281267 INFO  (coreLoadExecutor-3498-thread-3-processing-x:collection4) [    x:collection5] o.a.s.u.CommitTracker Soft AutoCommit: disabled
   [junit4]   2> 1281268 INFO  (coreLoadExecutor-3498-thread-3-processing-x:collection4) [    x:collection5] o.a.s.u.RandomMergePolicy RandomMergePolicy wrapping class org.apache.lucene.index.TieredMergePolicy: [TieredMergePolicy: maxMergeAtOnce=13, maxMergeAtOnceExplicit=32, maxMergedSegmentMB=10.1650390625, floorSegmentMB=1.517578125, forceMergeDeletesPctAllowed=5.467647686172679, segmentsPerTier=19.0, maxCFSSegmentSizeMB=8.796093022207999E12, noCFSRatio=0.5087168919390287
   [junit4]   2> 1281268 INFO  (coreLoadExecutor-3498-thread-3-processing-x:collection4) [    x:collection5] o.a.s.s.SolrIndexSearcher Opening [Searcher@1e92134[collection5] main]
   [junit4]   2> 1281268 INFO  (coreLoadExecutor-3498-thread-3-processing-x:collection4) [    x:collection5] o.a.s.r.ManagedResourceStorage File-based storage initialized to use dir: /home/jenkins/workspace/Lucene-Solr-7.2-Linux/solr/build/solr-core/test/J1/temp/solr.core.TestLazyCores_D37661D2001006DB-001/tempDir-003/collection5/conf
   [junit4]   2> 1281268 INFO  (coreLoadExecutor-3498-thread-3-processing-x:collection4) [    x:collection5] o.a.s.h.ReplicationHandler Commits will be reserved for 10000ms.
   [junit4]   2> 1281269 INFO  (searcherExecutor-3500-thread-1-processing-x:collection5) [    x:collection5] o.a.s.c.SolrCore [collection5] Registered new searcher Searcher@1e92134[collection5] main{ExitableDirectoryReader(UninvertingDirectoryReader())}
   [junit4]   2> 1281273 INFO  (TEST-TestLazyCores.testNoCommit-seed#[D37661D2001006DB]) [    x:collection4] o.a.s.c.SolrConfig Using Lucene MatchVersion: 7.2.1
   [junit4]   2> 1281287 INFO  (TEST-TestLazyCores.testNoCommit-seed#[D37661D2001006DB]) [    x:collection4] o.a.s.s.IndexSchema [collection3] Schema name=tiny
   [junit4]   2> 1281288 INFO  (TEST-TestLazyCores.testNoCommit-seed#[D37661D2001006DB]) [    x:collection4] o.a.s.s.IndexSchema Loaded schema tiny/1.1 with uniqueid field id
   [junit4]   2> 1281288 INFO  (TEST-TestLazyCores.testNoCommit-seed#[D37661D2001006DB]) [    x:collection4] o.a.s.c.CoreContainer Creating SolrCore 'collection3' using configuration from instancedir /home/jenkins/workspace/Lucene-Solr-7.2-Linux/solr/build/solr-core/test/J1/temp/solr.core.TestLazyCores_D37661D2001006DB-001/tempDir-003/./collection3, trusted=true
   [junit4]   2> 1281288 INFO  (TEST-TestLazyCores.testNoCommit-seed#[D37661D2001006DB]) [    x:collection4] o.a.s.m.r.SolrJmxReporter JMX monitoring for 'solr.core.collection3' (registry 'solr.core.collection3') enabled at server: com.sun.jmx.mbeanserver.JmxMBeanServer@6be30524
   [junit4]   2> 1281288 INFO  (TEST-TestLazyCores.testNoCommit-seed#[D37661D2001006DB]) [    x:collection4] o.a.s.c.SolrCore solr.RecoveryStrategy.Builder
   [junit4]   2> 1281288 INFO  (TEST-TestLazyCores.testNoCommit-seed#[D37661D2001006DB]) [    x:collection4] o.a.s.c.SolrCore [[collection3] ] Opening new SolrCore at [/home/jenkins/workspace/Lucene-Solr-7.2-Linux/solr/build/solr-core/test/J1/temp/solr.core.TestLazyCores_D37661D2001006DB-001/tempDir-003/collection3], dataDir=[/home/jenkins/workspace/Lucene-Solr-7.2-Linux/solr/build/solr-core/test/J1/temp/solr.core.TestLazyCores_D37661D2001006DB-001/tempDir-003/./collection3/data/]
   [junit4]   2> 1281290 INFO  (TEST-TestLazyCores.testNoCommit-seed#[D37661D2001006DB]) [    x:collection4] o.a.s.u.RandomMergePolicy RandomMergePolicy wrapping class org.apache.lucene.index.TieredMergePolicy: [TieredMergePolicy: maxMergeAtOnce=31, maxMergeAtOnceExplicit=31, maxMergedSegmentMB=4.5107421875, floorSegmentMB=1.0361328125, forceMergeDeletesPctAllowed=21.897475991402054, segmentsPerTier=31.0, maxCFSSegmentSizeMB=8.796093022207999E12, noCFSRatio=0.4449135236394852
   [junit4]   2> 1281340 INFO  (TEST-TestLazyCores.testNoCommit-seed#[D37661D2001006DB]) [    x:collection4] o.a.s.u.CommitTracker Hard AutoCommit: disabled
   [junit4]   2> 1281340 INFO  (TEST-TestLazyCores.testNoCommit-seed#[D37661D2001006DB]) [    x:collection4] o.a.s.u.CommitTracker Soft AutoCommit: disabled
   [junit4]   2> 1281341 INFO  (TEST-TestLazyCores.testNoCommit-seed#[D37661D2001006DB]) [    x:collection4] o.a.s.u.RandomMergePolicy RandomMergePolicy wrapping class org.apache.lucene.index.TieredMergePolicy: [TieredMergePolicy: maxMergeAtOnce=44, maxMergeAtOnceExplicit=39, maxMergedSegmentMB=5.65234375, floorSegmentMB=1.0048828125, forceMergeDeletesPctAllowed=14.882061997285998, segmentsPerTier=35.0, maxCFSSegmentSizeMB=1.9228515625, noCFSRatio=0.6150734711406899
   [junit4]   2> 1281342 INFO  (TEST-TestLazyCores.testNoCommit-seed#[D37661D2001006DB]) [    x:collection4] o.a.s.s.SolrIndexSearcher Opening [Searcher@402e21f9[collection3] main]
   [junit4]   2> 1281342 INFO  (TEST-TestLazyCores.testNoCommit-seed#[D37661D2001006DB]) [    x:collection4] o.a.s.r.ManagedResourceStorage File-based storage initialized to use dir: /home/jenkins/workspace/Lucene-Solr-7.2-Linux/solr/build/solr-core/test/J1/temp/solr.core.TestLazyCores_D37661D2001006DB-001/tempDir-003/collection3/conf
   [junit4]   2> 1281342 INFO  (TEST-TestLazyCores.testNoCommit-seed#[D37661D2001006DB]) [    x:collection4] o.a.s.h.ReplicationHandler Commits will be reserved for 10000ms.
   [junit4]   2> 1281343 INFO  (searcherExecutor-3511-thread-1-processing-x:collection4) [    x:collection4] o.a.s.c.SolrCore [collection3] Registered new searcher Searcher@402e21f9[collection3] main{ExitableDirectoryReader(UninvertingDirectoryReader())}
   [junit4]   2> 1281346 INFO  (TEST-TestLazyCores.testNoCommit-seed#[D37661D2001006DB]) [    x:collection4] o.a.s.c.SolrConfig Using Lucene MatchVersion: 7.2.1
   [junit4]   2> 1281349 INFO  (TEST-TestLazyCores.testNoCommit-seed#[D37661D2001006DB]) [    x:collection4] o.a.s.s.IndexSchema [collection6] Schema name=tiny
   [junit4]   2> 1281350 INFO  (TEST-TestLazyCores.testNoCommit-seed#[D37661D2001006DB]) [    x:collection4] o.a.s.s.IndexSchema Loaded schema tiny/1.1 with uniqueid field id
   [junit4]   2> 1281350 INFO  (TEST-TestLazyCores.testNoCommit-seed#[D37661D2001006DB]) [    x:collection4] o.a.s.c.CoreContainer Creating SolrCore 'collection6' using configuration from instancedir /home/jenkins/workspace/Lucene-Solr-7.2-Linux/solr/build/solr-core/test/J1/temp/solr.core.TestLazyCores_D37661D2001006DB-001/tempDir-003/./collection6, trusted=true
   [junit4]   2> 1281350 INFO  (TEST-TestLazyCores.testNoCommit-seed#[D37661D2001006DB]) [    x:collection4] o.a.s.m.r.SolrJmxReporter JMX monitoring for 'solr.core.collection6' (registry 'solr.core.collection6') enabled at server: com.sun.jmx.mbeanserver.JmxMBeanServer@6be30524
   [junit4]   2> 1281351 INFO  (TEST-TestLazyCores.testNoCommit-seed#[D37661D2001006DB]) [    x:collection4] o.a.s.c.SolrCore solr.RecoveryStrategy.Builder
   [junit4]   2> 1281351 INFO  (TEST-TestLazyCores.testNoCommit-seed#[D37661D2001006DB]) [    x:collection4] o.a.s.c.SolrCore [[collection6] ] Opening new SolrCore at [/home/jenkins/workspace/Lucene-Solr-7.2-Linux/solr/build/solr-core/test/J1/temp/solr.core.TestLazyCores_D37661D2001006DB-001/tempDir-003/collection6], dataDir=[/home/jenkins/workspace/Lucene-Solr-7.2-Linux/solr/build/solr-core/test/J1/temp/solr.core.TestLazyCores_D37661D2001006DB-001/tempDir-003/./collection6/data/]
   [junit4]   2> 1281352 INFO  (TEST-TestLazyCores.testNoCommit-seed#[D37661D2001006DB]) [    x:collection4] o.a.s.u.RandomMergePolicy RandomMergePolicy wrapping class org.apache.lucene.index.TieredMergePolicy: [TieredMergePolicy: maxMergeAtOnce=11, maxMergeAtOnceExplicit=49, maxMergedSegmentMB=98.7724609375, floorSegmentMB=1.2373046875, forceMergeDeletesPctAllowed=19.20335169063357, segmentsPerTier=23.0, maxCFSSegmentSizeMB=8.796093022207999E12, noCFSRatio=0.5704796735523335
   [junit4]   2> 1281402 INFO  (TEST-TestLazyCores.testNoCommit-seed#[D37661D2001006DB]) [    x:collection4] o.a.s.u.CommitTracker Hard AutoCommit: disabled
   [junit4]   2> 1281402 INFO  (TEST-TestLazyCores.testNoCommit-seed#[D37661D2001006DB]) [    x:collection4] o.a.s.u.CommitTracker Soft AutoCommit: disabled
   [junit4]   2> 1281403 INFO  (TEST-TestLazyCores.testNoCommit-seed#[D37661D2001006DB]) [    x:collection4] o.a.s.u.RandomMergePolicy RandomMergePolicy wrapping class org.apache.lucene.index.TieredMergePolicy: [TieredMergePolicy: maxMergeAtOnce=6, maxMergeAtOnceExplicit=9, maxMergedSegmentMB=2.259765625, floorSegmentMB=1.96484375, forceMergeDeletesPctAllowed=15.68982306259954, segmentsPerTier=17.0, maxCFSSegmentSizeMB=8.796093022207999E12, noCFSRatio=0.5622578242162327
   [junit4]   2> 1281403 INFO  (TEST-TestLazyCores.testNoCommit-seed#[D37661D2001006DB]) [    x:collection4] o.a.s.s.SolrIndexSearcher Opening [Searcher@345ef4b8[collection6] main]
   [junit4]   2> 1281403 INFO  (TEST-TestLazyCores.testNoCommit-seed#[D37661D2001006DB]) [    x:collection4] o.a.s.r.ManagedResourceStorage File-based storage initialized to use dir: /home/jenkins/workspace/Lucene-Solr-7.2-Linux/solr/build/solr-core/test/J1/temp/solr.core.TestLazyCores_D37661D2001006DB-001/tempDir-003/collection6/conf
   [junit4]   2> 1281404 INFO  (TEST-TestLazyCores.testNoCommit-seed#[D37661D2001006DB]) [    x:collection4] o.a.s.h.ReplicationHandler Commits will be reserved for 10000ms.
   [junit4]   2> 1281404 INFO  (searcherExecutor-3515-thread-1-processing-x:collection4) [    x:collection4] o.a.s.c.SolrCore [collection6] Registered new searcher Searcher@345ef4b8[collection6] main{ExitableDirectoryReader(UninvertingDirectoryReader())}
   [junit4]   2> 1281417 INFO  (TEST-TestLazyCores.testNoCommit-seed#[D37661D2001006DB]) [    x:collection4] o.a.s.c.SolrConfig Using Lucene MatchVersion: 7.2.1
   [junit4]   2> 1281420 INFO  (TEST-TestLazyCores.testNoCommit-seed#[D37661D2001006DB]) [    x:collection4] o.a.s.s.IndexSchema [collection7] Schema name=tiny
   [junit4]   2> 1281421 INFO  (TEST-TestLazyCores.testNoCommit-seed#[D37661D2001006DB]) [    x:collection4] o.a.s.s.IndexSchema Loaded schema tiny/1.1 with uniqueid field id
   [junit4]   2> 1281421 INFO  (TEST-TestLazyCores.testNoCommit-seed#[D37661D2001006DB]) [    x:collection4] o.a.s.c.CoreContainer Creating SolrCore 'collection7' using configuration from instancedir /home/jenkins/workspace/Lucene-Solr-7.2-Linux/solr/build/solr-core/test/J1/temp/solr.core.TestLazyCores_D37661D2001006DB-001/tempDir-003/./collection7, trusted=true
   [junit4]   2> 1281422 INFO  (TEST-TestLazyCores.testNoCommit-seed#[D37661D2001006DB]) [    x:collection4] o.a.s.m.r.SolrJmxReporter JMX monitoring for 'solr.core.collection7' (registry 'solr.core.collection7') enabled at server: com.sun.jmx.mbeanserver.JmxMBeanServer@6be30524
   [junit4]   2> 1281422 INFO  (TEST-TestLazyCores.testNoCommit-seed#[D37661D2001006DB]) [    x:collection4] o.a.s.c.SolrCore solr.RecoveryStrategy.Builder
   [junit4]   2> 1281422 INFO  (TEST-TestLazyCores.testNoCommit-seed#[D37661D2001006DB]) [    x:collection4] o.a.s.c.SolrCore [[collection7] ] Opening new SolrCore at [/home/jenkins/workspace/Lucene-Solr-7.2-Linux/solr/build/solr-core/test/J1/temp/solr.core.TestLazyCores_D37661D2001006DB-001/tempDir-003/collection7], dataDir=[/home/jenkins/workspace/Lucene-Solr-7.2-Linux/solr/build/solr-core/test/J1/temp/solr.core.TestLazyCores_D37661D2001006DB-001/tempDir-003/./collection7/data/]
   [junit4]   2> 1281423 INFO  (TEST-TestLazyCores.testNoCommit-seed#[D37661D2001006DB]) [    x:collection4] o.a.s.u.RandomMergePolicy RandomMergePolicy wrapping class org.apache.lucene.index.TieredMergePolicy: [TieredMergePolicy: maxMergeAtOnce=34, maxMergeAtOnceExplicit=21, maxMergedSegmentMB=53.0400390625, floorSegmentMB=1.5712890625, forceMergeDeletesPctAllowed=4.9950825898844675, segmentsPerTier=14.0, maxCFSSegmentSizeMB=8.796093022207999E12, noCFSRatio=1.0
   [junit4]   2> 1281469 INFO  (TEST-TestLazyCores.testNoCommit-seed#[D37661D2001006DB]) [    x:collection4] o.a.s.u.CommitTracker Hard AutoCommit: disabled
   [junit4]   2> 1281469 INFO  (TEST-TestLazyCores.testNoCommit-seed#[D37661D2001006DB]) [    x:collection4] o.a.s.u.CommitTracker Soft AutoCommit: disabled
   [junit4]   2> 1281470 INFO  (TEST-TestLazyCores.testNoCommit-seed#[D37661D2001006DB]) [    x:collection4] o.a.s.u.RandomMergePolicy RandomMergePolicy wrapping class org.apache.lucene.index.TieredMergePolicy: [TieredMergePolicy: maxMergeAtOnce=49, maxMergeAtOnceExplicit=17, maxMergedSegmentMB=75.291015625, floorSegmentMB=1.9658203125, forceMergeDeletesPctAllowed=5.131426926445201, segmentsPerTier=13.0, maxCFSSegmentSizeMB=8.796093022207999E12, noCFSRatio=0.0
   [junit4]   2> 1281470 INFO  (TEST-TestLazyCores.testNoCommit-seed#[D37661D2001006DB]) [    x:collection4] o.a.s.s.SolrIndexSearcher Opening [Searcher@29b5d230[collection7] main]
   [junit4]   2> 1281470 INFO  (TEST-TestLazyCores.testNoCommit-seed#[D37661D2001006DB]) [    x:collection4] o.a.s.r.ManagedResourceStorage File-based storage initialized to use dir: /home/jenkins/workspace/Lucene-Solr-7.2-Linux/solr/build/solr-core/test/J1/temp/solr.core.TestLazyCores_D37661D2001006DB-001/tempDir-003/collection7/conf
   [junit4]   2> 1281471 INFO  (TEST-TestLazyCores.testNoCo

[...truncated too long message...]

1 thread leaked from SUITE scope at org.apache.solr.core.TestLazyCores: 
   [junit4]   2>    1) Thread[id=9351, name=searcherExecutor-3531-thread-1, state=WAITING, group=TGRP-TestLazyCores]
   [junit4]   2>         at java.base@9.0.1/jdk.internal.misc.Unsafe.park(Native Method)
   [junit4]   2>         at java.base@9.0.1/java.util.concurrent.locks.LockSupport.park(LockSupport.java:194)
   [junit4]   2>         at java.base@9.0.1/java.util.concurrent.locks.AbstractQueuedSynchronizer$ConditionObject.await(AbstractQueuedSynchronizer.java:2062)
   [junit4]   2>         at java.base@9.0.1/java.util.concurrent.LinkedBlockingQueue.take(LinkedBlockingQueue.java:435)
   [junit4]   2>         at java.base@9.0.1/java.util.concurrent.ThreadPoolExecutor.getTask(ThreadPoolExecutor.java:1092)
   [junit4]   2>         at java.base@9.0.1/java.util.concurrent.ThreadPoolExecutor.runWorker(ThreadPoolExecutor.java:1152)
   [junit4]   2>         at java.base@9.0.1/java.util.concurrent.ThreadPoolExecutor$Worker.run(ThreadPoolExecutor.java:641)
   [junit4]   2>         at java.base@9.0.1/java.lang.Thread.run(Thread.java:844)
   [junit4]   2> Dec 21, 2017 8:10:29 PM com.carrotsearch.randomizedtesting.ThreadLeakControl tryToInterruptAll
   [junit4]   2> INFO: Starting to interrupt leaked threads:
   [junit4]   2>    1) Thread[id=9351, name=searcherExecutor-3531-thread-1, state=WAITING, group=TGRP-TestLazyCores]
   [junit4]   2> Dec 21, 2017 8:10:32 PM com.carrotsearch.randomizedtesting.ThreadLeakControl tryToInterruptAll
   [junit4]   2> SEVERE: There are still zombie threads that couldn't be terminated:
   [junit4]   2>    1) Thread[id=9351, name=searcherExecutor-3531-thread-1, state=WAITING, group=TGRP-TestLazyCores]
   [junit4]   2>         at java.base@9.0.1/jdk.internal.misc.Unsafe.park(Native Method)
   [junit4]   2>         at java.base@9.0.1/java.util.concurrent.locks.LockSupport.park(LockSupport.java:194)
   [junit4]   2>         at java.base@9.0.1/java.util.concurrent.locks.AbstractQueuedSynchronizer$ConditionObject.await(AbstractQueuedSynchronizer.java:2062)
   [junit4]   2>         at java.base@9.0.1/java.util.concurrent.LinkedBlockingQueue.take(LinkedBlockingQueue.java:435)
   [junit4]   2>         at java.base@9.0.1/java.util.concurrent.ThreadPoolExecutor.getTask(ThreadPoolExecutor.java:1092)
   [junit4]   2>         at java.base@9.0.1/java.util.concurrent.ThreadPoolExecutor.runWorker(ThreadPoolExecutor.java:1152)
   [junit4]   2>         at java.base@9.0.1/java.util.concurrent.ThreadPoolExecutor$Worker.run(ThreadPoolExecutor.java:641)
   [junit4]   2>         at java.base@9.0.1/java.lang.Thread.run(Thread.java:844)
   [junit4]   2> NOTE: test params are: codec=Asserting(Lucene70): {v_t=FSTOrd50, id=FSTOrd50, v_s=PostingsFormat(name=MockRandom), v_f=BlockTreeOrds(blocksize=128)}, docValues:{}, maxPointsInLeafNode=1726, maxMBSortInHeap=5.283771252586267, sim=RandomSimilarity(queryNorm=false): {}, locale=en-CX, timezone=Etc/GMT+12
   [junit4]   2> NOTE: Linux 4.10.0-40-generic amd64/Oracle Corporation 9.0.1 (64-bit)/cpus=8,threads=2,free=138827992,total=518979584
   [junit4]   2> NOTE: All tests run in this JVM: [TestSolrQueryResponse, ExitableDirectoryReaderTest, DebugComponentTest, TestSubQueryTransformerCrossCore, ImplicitSnitchTest, ZkCLITest, HdfsBasicDistributedZk2Test, TestJsonRequest, SolrCoreMetricManagerTest, TestNestedDocsSort, AtomicUpdateProcessorFactoryTest, MBeansHandlerTest, ClusterStateUpdateTest, TestDocSet, BJQParserTest, HdfsRecoverLeaseTest, TestAtomicUpdateErrorCases, SampleTest, LeaderFailureAfterFreshStartTest, CdcrUpdateLogTest, InfoHandlerTest, MoreLikeThisHandlerTest, TestSimpleTrackingShardHandler, HdfsDirectoryTest, SynonymTokenizerTest, TestStreamBody, TestFieldCacheSortRandom, CircularListTest, TestSolrCLIRunExample, TestMaxTokenLenTokenizer, CollectionTooManyReplicasTest, TestQuerySenderNoQuery, PreAnalyzedFieldManagedSchemaCloudTest, HdfsAutoAddReplicasIntegrationTest, TestDocumentBuilder, SolrJmxReporterCloudTest, PolyFieldTest, ZkSolrClientTest, CollectionsAPIDistributedZkTest, PingRequestHandlerTest, TestJettySolrRunner, TestUseDocValuesAsStored2, TestAuthenticationFramework, TestCloudRecovery, ShowFileRequestHandlerTest, DocValuesMultiTest, TestClassicSimilarityFactory, TestStressUserVersions, OpenExchangeRatesOrgProviderTest, SubstringBytesRefFilterTest, DOMUtilTest, ConfigureRecoveryStrategyTest, PreAnalyzedFieldTest, TestCopyFieldCollectionResource, TestLockTree, ShardSplitTest, DirectUpdateHandlerTest, TestCustomDocTransformer, TestPayloadCheckQParserPlugin, ChangedSchemaMergeTest, SolrIndexMetricsTest, LegacyCloudClusterPropTest, TestXIncludeConfig, TestRandomFlRTGCloud, TestPrepRecovery, TestManagedSynonymGraphFilterFactory, PKIAuthenticationIntegrationTest, TestXmlQParserPlugin, TestSizeLimitedDistributedMap, TestBackupRepositoryFactory, SecurityConfHandlerTest, TestNumericRangeQuery32, TestCollapseQParserPlugin, SolrIndexSplitterTest, OpenCloseCoreStressTest, TestSolrConfigHandlerCloud, TestLazyCores]
   [junit4]   2> NOTE: reproduce with: ant test  -Dtestcase=TestLazyCores -Dtests.seed=D37661D2001006DB -Dtests.multiplier=3 -Dtests.slow=true -Dtests.locale=en-CX -Dtests.timezone=Etc/GMT+12 -Dtests.asserts=true -Dtests.file.encoding=ISO-8859-1
   [junit4] ERROR   0.00s J1 | TestLazyCores (suite) <<<
   [junit4]    > Throwable #1: com.carrotsearch.randomizedtesting.ThreadLeakError: 1 thread leaked from SUITE scope at org.apache.solr.core.TestLazyCores: 
   [junit4]    >    1) Thread[id=9351, name=searcherExecutor-3531-thread-1, state=WAITING, group=TGRP-TestLazyCores]
   [junit4]    >         at java.base@9.0.1/jdk.internal.misc.Unsafe.park(Native Method)
   [junit4]    >         at java.base@9.0.1/java.util.concurrent.locks.LockSupport.park(LockSupport.java:194)
   [junit4]    >         at java.base@9.0.1/java.util.concurrent.locks.AbstractQueuedSynchronizer$ConditionObject.await(AbstractQueuedSynchronizer.java:2062)
   [junit4]    >         at java.base@9.0.1/java.util.concurrent.LinkedBlockingQueue.take(LinkedBlockingQueue.java:435)
   [junit4]    >         at java.base@9.0.1/java.util.concurrent.ThreadPoolExecutor.getTask(ThreadPoolExecutor.java:1092)
   [junit4]    >         at java.base@9.0.1/java.util.concurrent.ThreadPoolExecutor.runWorker(ThreadPoolExecutor.java:1152)
   [junit4]    >         at java.base@9.0.1/java.util.concurrent.ThreadPoolExecutor$Worker.run(ThreadPoolExecutor.java:641)
   [junit4]    >         at java.base@9.0.1/java.lang.Thread.run(Thread.java:844)
   [junit4]    > 	at __randomizedtesting.SeedInfo.seed([D37661D2001006DB]:0)Throwable #2: com.carrotsearch.randomizedtesting.ThreadLeakError: There are still zombie threads that couldn't be terminated:
   [junit4]    >    1) Thread[id=9351, name=searcherExecutor-3531-thread-1, state=WAITING, group=TGRP-TestLazyCores]
   [junit4]    >         at java.base@9.0.1/jdk.internal.misc.Unsafe.park(Native Method)
   [junit4]    >         at java.base@9.0.1/java.util.concurrent.locks.LockSupport.park(LockSupport.java:194)
   [junit4]    >         at java.base@9.0.1/java.util.concurrent.locks.AbstractQueuedSynchronizer$ConditionObject.await(AbstractQueuedSynchronizer.java:2062)
   [junit4]    >         at java.base@9.0.1/java.util.concurrent.LinkedBlockingQueue.take(LinkedBlockingQueue.java:435)
   [junit4]    >         at java.base@9.0.1/java.util.concurrent.ThreadPoolExecutor.getTask(ThreadPoolExecutor.java:1092)
   [junit4]    >         at java.base@9.0.1/java.util.concurrent.ThreadPoolExecutor.runWorker(ThreadPoolExecutor.java:1152)
   [junit4]    >         at java.base@9.0.1/java.util.concurrent.ThreadPoolExecutor$Worker.run(ThreadPoolExecutor.java:641)
   [junit4]    >         at java.base@9.0.1/java.lang.Thread.run(Thread.java:844)
   [junit4]    > 	at __randomizedtesting.SeedInfo.seed([D37661D2001006DB]:0)
   [junit4] Completed [212/751 (1!)] on J1 in 30.21s, 9 tests, 3 errors <<< FAILURES!

[...truncated 4667 lines...]
   [junit4] Suite: org.apache.solr.analytics.NoFacetTest
   [junit4]   2> Creating dataDir: /home/jenkins/workspace/Lucene-Solr-7.2-Linux/solr/build/contrib/solr-analytics/test/J1/temp/solr.analytics.NoFacetTest_1031165B645B3EAE-001/init-core-data-001
   [junit4]   2> NOTE: test params are: codec=Asserting(Lucene70): {}, docValues:{}, maxPointsInLeafNode=1235, maxMBSortInHeap=6.250970802017099, sim=RandomSimilarity(queryNorm=true): {}, locale=yo-BJ, timezone=US/Arizona
   [junit4]   2> NOTE: Linux 4.10.0-40-generic amd64/Oracle Corporation 9.0.1 (64-bit)/cpus=8,threads=1,free=455062704,total=518979584
   [junit4]   2> NOTE: All tests run in this JVM: [DoubleFieldsTest, OrFunctionTest, NoFacetTest]
   [junit4]   2> NOTE: reproduce with: ant test  -Dtestcase=NoFacetTest -Dtests.seed=1031165B645B3EAE -Dtests.multiplier=3 -Dtests.slow=true -Dtests.locale=yo-BJ -Dtests.timezone=US/Arizona -Dtests.asserts=true -Dtests.file.encoding=UTF-8
   [junit4] ERROR   0.00s J1 | NoFacetTest (suite) <<<
   [junit4]    > Throwable #1: java.lang.AssertionError: Could not find collection:collection1
   [junit4]    > 	at __randomizedtesting.SeedInfo.seed([1031165B645B3EAE]:0)
   [junit4]    > 	at org.apache.solr.cloud.AbstractDistribZkTestBase.waitForRecoveriesToFinish(AbstractDistribZkTestBase.java:155)
   [junit4]    > 	at org.apache.solr.analytics.SolrAnalyticsTestCase.setupCollection(SolrAnalyticsTestCase.java:63)
   [junit4]    > 	at java.base/jdk.internal.reflect.NativeMethodAccessorImpl.invoke0(Native Method)
   [junit4]    > 	at java.base/jdk.internal.reflect.NativeMethodAccessorImpl.invoke(NativeMethodAccessorImpl.java:62)
   [junit4]    > 	at java.base/jdk.internal.reflect.DelegatingMethodAccessorImpl.invoke(DelegatingMethodAccessorImpl.java:43)
   [junit4]    > 	at java.base/java.lang.reflect.Method.invoke(Method.java:564)
   [junit4]    > 	at java.base/java.lang.Thread.run(Thread.java:844)
   [junit4] Completed [49/78 (1!)] on J1 in 42.98s, 0 tests, 1 failure <<< FAILURES!

[...truncated 37183 lines...]

Mime
View raw message