lucene-dev mailing list archives

Site index · List index
Message view « Date » · « Thread »
Top « Date » · « Thread »
From Policeman Jenkins Server <jenk...@thetaphi.de>
Subject [JENKINS] Lucene-Solr-7.2-Linux (64bit/jdk-9.0.1) - Build # 111 - Still Unstable!
Date Sun, 24 Dec 2017 18:29:46 GMT
Build: https://jenkins.thetaphi.de/job/Lucene-Solr-7.2-Linux/111/
Java: 64bit/jdk-9.0.1 -XX:-UseCompressedOops -XX:+UseParallelGC

8 tests failed.
FAILED:  org.apache.solr.cloud.TestPullReplica.testCreateDelete {seed=[7B25CB77D3D0A255:60353A3B25205A65]}

Error Message:
Could not find collection : pull_replica_test_create_delete

Stack Trace:
org.apache.solr.common.SolrException: Could not find collection : pull_replica_test_create_delete
	at __randomizedtesting.SeedInfo.seed([7B25CB77D3D0A255:60353A3B25205A65]:0)
	at org.apache.solr.common.cloud.ClusterState.getCollection(ClusterState.java:111)
	at org.apache.solr.cloud.SolrCloudTestCase.getCollectionState(SolrCloudTestCase.java:247)
	at org.apache.solr.cloud.TestPullReplica.testCreateDelete(TestPullReplica.java:161)
	at java.base/jdk.internal.reflect.NativeMethodAccessorImpl.invoke0(Native Method)
	at java.base/jdk.internal.reflect.NativeMethodAccessorImpl.invoke(NativeMethodAccessorImpl.java:62)
	at java.base/jdk.internal.reflect.DelegatingMethodAccessorImpl.invoke(DelegatingMethodAccessorImpl.java:43)
	at java.base/java.lang.reflect.Method.invoke(Method.java:564)
	at com.carrotsearch.randomizedtesting.RandomizedRunner.invoke(RandomizedRunner.java:1737)
	at com.carrotsearch.randomizedtesting.RandomizedRunner$8.evaluate(RandomizedRunner.java:934)
	at com.carrotsearch.randomizedtesting.RandomizedRunner$9.evaluate(RandomizedRunner.java:970)
	at com.carrotsearch.randomizedtesting.RandomizedRunner$10.evaluate(RandomizedRunner.java:984)
	at com.carrotsearch.randomizedtesting.rules.SystemPropertiesRestoreRule$1.evaluate(SystemPropertiesRestoreRule.java:57)
	at org.apache.lucene.util.TestRuleSetupTeardownChained$1.evaluate(TestRuleSetupTeardownChained.java:49)
	at org.apache.lucene.util.AbstractBeforeAfterRule$1.evaluate(AbstractBeforeAfterRule.java:45)
	at org.apache.lucene.util.TestRuleThreadAndTestName$1.evaluate(TestRuleThreadAndTestName.java:48)
	at org.apache.lucene.util.TestRuleIgnoreAfterMaxFailures$1.evaluate(TestRuleIgnoreAfterMaxFailures.java:64)
	at org.apache.lucene.util.TestRuleMarkFailure$1.evaluate(TestRuleMarkFailure.java:47)
	at com.carrotsearch.randomizedtesting.rules.StatementAdapter.evaluate(StatementAdapter.java:36)
	at com.carrotsearch.randomizedtesting.ThreadLeakControl$StatementRunner.run(ThreadLeakControl.java:368)
	at com.carrotsearch.randomizedtesting.ThreadLeakControl.forkTimeoutingTask(ThreadLeakControl.java:817)
	at com.carrotsearch.randomizedtesting.ThreadLeakControl$3.evaluate(ThreadLeakControl.java:468)
	at com.carrotsearch.randomizedtesting.RandomizedRunner.runSingleTest(RandomizedRunner.java:943)
	at com.carrotsearch.randomizedtesting.RandomizedRunner$5.evaluate(RandomizedRunner.java:829)
	at com.carrotsearch.randomizedtesting.RandomizedRunner$6.evaluate(RandomizedRunner.java:879)
	at com.carrotsearch.randomizedtesting.RandomizedRunner$7.evaluate(RandomizedRunner.java:890)
	at com.carrotsearch.randomizedtesting.rules.StatementAdapter.evaluate(StatementAdapter.java:36)
	at com.carrotsearch.randomizedtesting.rules.SystemPropertiesRestoreRule$1.evaluate(SystemPropertiesRestoreRule.java:57)
	at org.apache.lucene.util.AbstractBeforeAfterRule$1.evaluate(AbstractBeforeAfterRule.java:45)
	at com.carrotsearch.randomizedtesting.rules.StatementAdapter.evaluate(StatementAdapter.java:36)
	at org.apache.lucene.util.TestRuleStoreClassName$1.evaluate(TestRuleStoreClassName.java:41)
	at com.carrotsearch.randomizedtesting.rules.NoShadowingOrOverridesOnMethodsRule$1.evaluate(NoShadowingOrOverridesOnMethodsRule.java:40)
	at com.carrotsearch.randomizedtesting.rules.NoShadowingOrOverridesOnMethodsRule$1.evaluate(NoShadowingOrOverridesOnMethodsRule.java:40)
	at com.carrotsearch.randomizedtesting.rules.StatementAdapter.evaluate(StatementAdapter.java:36)
	at com.carrotsearch.randomizedtesting.rules.StatementAdapter.evaluate(StatementAdapter.java:36)
	at org.apache.lucene.util.TestRuleAssertionsRequired$1.evaluate(TestRuleAssertionsRequired.java:53)
	at org.apache.lucene.util.TestRuleMarkFailure$1.evaluate(TestRuleMarkFailure.java:47)
	at org.apache.lucene.util.TestRuleIgnoreAfterMaxFailures$1.evaluate(TestRuleIgnoreAfterMaxFailures.java:64)
	at org.apache.lucene.util.TestRuleIgnoreTestSuites$1.evaluate(TestRuleIgnoreTestSuites.java:54)
	at com.carrotsearch.randomizedtesting.rules.StatementAdapter.evaluate(StatementAdapter.java:36)
	at com.carrotsearch.randomizedtesting.ThreadLeakControl$StatementRunner.run(ThreadLeakControl.java:368)
	at java.base/java.lang.Thread.run(Thread.java:844)


FAILED:  org.apache.solr.cloud.TestPullReplica.testCreateDelete {seed=[7B25CB77D3D0A255:D46386C711E29149]}

Error Message:
Error from server at https://127.0.0.1:37005/solr: Could not fully create collection: pull_replica_test_create_delete

Stack Trace:
org.apache.solr.client.solrj.impl.HttpSolrClient$RemoteSolrException: Error from server at https://127.0.0.1:37005/solr: Could not fully create collection: pull_replica_test_create_delete
	at __randomizedtesting.SeedInfo.seed([7B25CB77D3D0A255:D46386C711E29149]:0)
	at org.apache.solr.client.solrj.impl.HttpSolrClient.executeMethod(HttpSolrClient.java:643)
	at org.apache.solr.client.solrj.impl.HttpSolrClient.request(HttpSolrClient.java:255)
	at org.apache.solr.client.solrj.impl.HttpSolrClient.request(HttpSolrClient.java:244)
	at org.apache.solr.client.solrj.impl.LBHttpSolrClient.doRequest(LBHttpSolrClient.java:483)
	at org.apache.solr.client.solrj.impl.LBHttpSolrClient.request(LBHttpSolrClient.java:413)
	at org.apache.solr.client.solrj.impl.CloudSolrClient.sendRequest(CloudSolrClient.java:1103)
	at org.apache.solr.client.solrj.impl.CloudSolrClient.requestWithRetryOnStaleState(CloudSolrClient.java:883)
	at org.apache.solr.client.solrj.impl.CloudSolrClient.request(CloudSolrClient.java:816)
	at org.apache.solr.client.solrj.SolrRequest.process(SolrRequest.java:194)
	at org.apache.solr.client.solrj.SolrRequest.process(SolrRequest.java:211)
	at org.apache.solr.cloud.TestPullReplica.testCreateDelete(TestPullReplica.java:129)
	at java.base/jdk.internal.reflect.NativeMethodAccessorImpl.invoke0(Native Method)
	at java.base/jdk.internal.reflect.NativeMethodAccessorImpl.invoke(NativeMethodAccessorImpl.java:62)
	at java.base/jdk.internal.reflect.DelegatingMethodAccessorImpl.invoke(DelegatingMethodAccessorImpl.java:43)
	at java.base/java.lang.reflect.Method.invoke(Method.java:564)
	at com.carrotsearch.randomizedtesting.RandomizedRunner.invoke(RandomizedRunner.java:1737)
	at com.carrotsearch.randomizedtesting.RandomizedRunner$8.evaluate(RandomizedRunner.java:934)
	at com.carrotsearch.randomizedtesting.RandomizedRunner$9.evaluate(RandomizedRunner.java:970)
	at com.carrotsearch.randomizedtesting.RandomizedRunner$10.evaluate(RandomizedRunner.java:984)
	at com.carrotsearch.randomizedtesting.rules.SystemPropertiesRestoreRule$1.evaluate(SystemPropertiesRestoreRule.java:57)
	at org.apache.lucene.util.TestRuleSetupTeardownChained$1.evaluate(TestRuleSetupTeardownChained.java:49)
	at org.apache.lucene.util.AbstractBeforeAfterRule$1.evaluate(AbstractBeforeAfterRule.java:45)
	at org.apache.lucene.util.TestRuleThreadAndTestName$1.evaluate(TestRuleThreadAndTestName.java:48)
	at org.apache.lucene.util.TestRuleIgnoreAfterMaxFailures$1.evaluate(TestRuleIgnoreAfterMaxFailures.java:64)
	at org.apache.lucene.util.TestRuleMarkFailure$1.evaluate(TestRuleMarkFailure.java:47)
	at com.carrotsearch.randomizedtesting.rules.StatementAdapter.evaluate(StatementAdapter.java:36)
	at com.carrotsearch.randomizedtesting.ThreadLeakControl$StatementRunner.run(ThreadLeakControl.java:368)
	at com.carrotsearch.randomizedtesting.ThreadLeakControl.forkTimeoutingTask(ThreadLeakControl.java:817)
	at com.carrotsearch.randomizedtesting.ThreadLeakControl$3.evaluate(ThreadLeakControl.java:468)
	at com.carrotsearch.randomizedtesting.RandomizedRunner.runSingleTest(RandomizedRunner.java:943)
	at com.carrotsearch.randomizedtesting.RandomizedRunner$5.evaluate(RandomizedRunner.java:829)
	at com.carrotsearch.randomizedtesting.RandomizedRunner$6.evaluate(RandomizedRunner.java:879)
	at com.carrotsearch.randomizedtesting.RandomizedRunner$7.evaluate(RandomizedRunner.java:890)
	at com.carrotsearch.randomizedtesting.rules.StatementAdapter.evaluate(StatementAdapter.java:36)
	at com.carrotsearch.randomizedtesting.rules.SystemPropertiesRestoreRule$1.evaluate(SystemPropertiesRestoreRule.java:57)
	at org.apache.lucene.util.AbstractBeforeAfterRule$1.evaluate(AbstractBeforeAfterRule.java:45)
	at com.carrotsearch.randomizedtesting.rules.StatementAdapter.evaluate(StatementAdapter.java:36)
	at org.apache.lucene.util.TestRuleStoreClassName$1.evaluate(TestRuleStoreClassName.java:41)
	at com.carrotsearch.randomizedtesting.rules.NoShadowingOrOverridesOnMethodsRule$1.evaluate(NoShadowingOrOverridesOnMethodsRule.java:40)
	at com.carrotsearch.randomizedtesting.rules.NoShadowingOrOverridesOnMethodsRule$1.evaluate(NoShadowingOrOverridesOnMethodsRule.java:40)
	at com.carrotsearch.randomizedtesting.rules.StatementAdapter.evaluate(StatementAdapter.java:36)
	at com.carrotsearch.randomizedtesting.rules.StatementAdapter.evaluate(StatementAdapter.java:36)
	at org.apache.lucene.util.TestRuleAssertionsRequired$1.evaluate(TestRuleAssertionsRequired.java:53)
	at org.apache.lucene.util.TestRuleMarkFailure$1.evaluate(TestRuleMarkFailure.java:47)
	at org.apache.lucene.util.TestRuleIgnoreAfterMaxFailures$1.evaluate(TestRuleIgnoreAfterMaxFailures.java:64)
	at org.apache.lucene.util.TestRuleIgnoreTestSuites$1.evaluate(TestRuleIgnoreTestSuites.java:54)
	at com.carrotsearch.randomizedtesting.rules.StatementAdapter.evaluate(StatementAdapter.java:36)
	at com.carrotsearch.randomizedtesting.ThreadLeakControl$StatementRunner.run(ThreadLeakControl.java:368)
	at java.base/java.lang.Thread.run(Thread.java:844)


FAILED:  org.apache.solr.cloud.TestPullReplica.testRealTimeGet

Error Message:
Error from server at https://127.0.0.1:37005/solr: create the collection time out:180s

Stack Trace:
org.apache.solr.client.solrj.impl.HttpSolrClient$RemoteSolrException: Error from server at https://127.0.0.1:37005/solr: create the collection time out:180s
	at org.apache.solr.client.solrj.impl.HttpSolrClient.executeMethod(HttpSolrClient.java:643)
	at org.apache.solr.client.solrj.impl.HttpSolrClient.request(HttpSolrClient.java:255)
	at org.apache.solr.client.solrj.impl.HttpSolrClient.request(HttpSolrClient.java:244)
	at org.apache.solr.client.solrj.impl.LBHttpSolrClient.doRequest(LBHttpSolrClient.java:483)
	at org.apache.solr.client.solrj.impl.LBHttpSolrClient.request(LBHttpSolrClient.java:413)
	at org.apache.solr.client.solrj.impl.CloudSolrClient.sendRequest(CloudSolrClient.java:1103)
	at org.apache.solr.client.solrj.impl.CloudSolrClient.requestWithRetryOnStaleState(CloudSolrClient.java:883)
	at org.apache.solr.client.solrj.impl.CloudSolrClient.request(CloudSolrClient.java:816)
	at org.apache.solr.client.solrj.SolrRequest.process(SolrRequest.java:194)
	at org.apache.solr.client.solrj.SolrRequest.process(SolrRequest.java:211)
	at org.apache.solr.cloud.TestPullReplica.testRealTimeGet(TestPullReplica.java:327)
	at java.base/jdk.internal.reflect.NativeMethodAccessorImpl.invoke0(Native Method)
	at java.base/jdk.internal.reflect.NativeMethodAccessorImpl.invoke(NativeMethodAccessorImpl.java:62)
	at java.base/jdk.internal.reflect.DelegatingMethodAccessorImpl.invoke(DelegatingMethodAccessorImpl.java:43)
	at java.base/java.lang.reflect.Method.invoke(Method.java:564)
	at com.carrotsearch.randomizedtesting.RandomizedRunner.invoke(RandomizedRunner.java:1737)
	at com.carrotsearch.randomizedtesting.RandomizedRunner$8.evaluate(RandomizedRunner.java:934)
	at com.carrotsearch.randomizedtesting.RandomizedRunner$9.evaluate(RandomizedRunner.java:970)
	at com.carrotsearch.randomizedtesting.RandomizedRunner$10.evaluate(RandomizedRunner.java:984)
	at com.carrotsearch.randomizedtesting.rules.SystemPropertiesRestoreRule$1.evaluate(SystemPropertiesRestoreRule.java:57)
	at org.apache.lucene.util.TestRuleSetupTeardownChained$1.evaluate(TestRuleSetupTeardownChained.java:49)
	at org.apache.lucene.util.AbstractBeforeAfterRule$1.evaluate(AbstractBeforeAfterRule.java:45)
	at org.apache.lucene.util.TestRuleThreadAndTestName$1.evaluate(TestRuleThreadAndTestName.java:48)
	at org.apache.lucene.util.TestRuleIgnoreAfterMaxFailures$1.evaluate(TestRuleIgnoreAfterMaxFailures.java:64)
	at org.apache.lucene.util.TestRuleMarkFailure$1.evaluate(TestRuleMarkFailure.java:47)
	at com.carrotsearch.randomizedtesting.rules.StatementAdapter.evaluate(StatementAdapter.java:36)
	at com.carrotsearch.randomizedtesting.ThreadLeakControl$StatementRunner.run(ThreadLeakControl.java:368)
	at com.carrotsearch.randomizedtesting.ThreadLeakControl.forkTimeoutingTask(ThreadLeakControl.java:817)
	at com.carrotsearch.randomizedtesting.ThreadLeakControl$3.evaluate(ThreadLeakControl.java:468)
	at com.carrotsearch.randomizedtesting.RandomizedRunner.runSingleTest(RandomizedRunner.java:943)
	at com.carrotsearch.randomizedtesting.RandomizedRunner$5.evaluate(RandomizedRunner.java:829)
	at com.carrotsearch.randomizedtesting.RandomizedRunner$6.evaluate(RandomizedRunner.java:879)
	at com.carrotsearch.randomizedtesting.RandomizedRunner$7.evaluate(RandomizedRunner.java:890)
	at com.carrotsearch.randomizedtesting.rules.StatementAdapter.evaluate(StatementAdapter.java:36)
	at com.carrotsearch.randomizedtesting.rules.SystemPropertiesRestoreRule$1.evaluate(SystemPropertiesRestoreRule.java:57)
	at org.apache.lucene.util.AbstractBeforeAfterRule$1.evaluate(AbstractBeforeAfterRule.java:45)
	at com.carrotsearch.randomizedtesting.rules.StatementAdapter.evaluate(StatementAdapter.java:36)
	at org.apache.lucene.util.TestRuleStoreClassName$1.evaluate(TestRuleStoreClassName.java:41)
	at com.carrotsearch.randomizedtesting.rules.NoShadowingOrOverridesOnMethodsRule$1.evaluate(NoShadowingOrOverridesOnMethodsRule.java:40)
	at com.carrotsearch.randomizedtesting.rules.NoShadowingOrOverridesOnMethodsRule$1.evaluate(NoShadowingOrOverridesOnMethodsRule.java:40)
	at com.carrotsearch.randomizedtesting.rules.StatementAdapter.evaluate(StatementAdapter.java:36)
	at com.carrotsearch.randomizedtesting.rules.StatementAdapter.evaluate(StatementAdapter.java:36)
	at org.apache.lucene.util.TestRuleAssertionsRequired$1.evaluate(TestRuleAssertionsRequired.java:53)
	at org.apache.lucene.util.TestRuleMarkFailure$1.evaluate(TestRuleMarkFailure.java:47)
	at org.apache.lucene.util.TestRuleIgnoreAfterMaxFailures$1.evaluate(TestRuleIgnoreAfterMaxFailures.java:64)
	at org.apache.lucene.util.TestRuleIgnoreTestSuites$1.evaluate(TestRuleIgnoreTestSuites.java:54)
	at com.carrotsearch.randomizedtesting.rules.StatementAdapter.evaluate(StatementAdapter.java:36)
	at com.carrotsearch.randomizedtesting.ThreadLeakControl$StatementRunner.run(ThreadLeakControl.java:368)
	at java.base/java.lang.Thread.run(Thread.java:844)


FAILED:  org.apache.solr.cloud.TestPullReplica.testKillPullReplica

Error Message:
Error from server at https://127.0.0.1:37005/solr: Could not fully create collection: pull_replica_test_kill_pull_replica

Stack Trace:
org.apache.solr.client.solrj.impl.HttpSolrClient$RemoteSolrException: Error from server at https://127.0.0.1:37005/solr: Could not fully create collection: pull_replica_test_kill_pull_replica
	at __randomizedtesting.SeedInfo.seed([7B25CB77D3D0A255:F7D4D7E27361436D]:0)
	at org.apache.solr.client.solrj.impl.HttpSolrClient.executeMethod(HttpSolrClient.java:643)
	at org.apache.solr.client.solrj.impl.HttpSolrClient.request(HttpSolrClient.java:255)
	at org.apache.solr.client.solrj.impl.HttpSolrClient.request(HttpSolrClient.java:244)
	at org.apache.solr.client.solrj.impl.LBHttpSolrClient.doRequest(LBHttpSolrClient.java:483)
	at org.apache.solr.client.solrj.impl.LBHttpSolrClient.request(LBHttpSolrClient.java:413)
	at org.apache.solr.client.solrj.impl.CloudSolrClient.sendRequest(CloudSolrClient.java:1103)
	at org.apache.solr.client.solrj.impl.CloudSolrClient.requestWithRetryOnStaleState(CloudSolrClient.java:883)
	at org.apache.solr.client.solrj.impl.CloudSolrClient.request(CloudSolrClient.java:816)
	at org.apache.solr.client.solrj.SolrRequest.process(SolrRequest.java:194)
	at org.apache.solr.client.solrj.SolrRequest.process(SolrRequest.java:211)
	at org.apache.solr.cloud.TestPullReplica.testKillPullReplica(TestPullReplica.java:463)
	at java.base/jdk.internal.reflect.NativeMethodAccessorImpl.invoke0(Native Method)
	at java.base/jdk.internal.reflect.NativeMethodAccessorImpl.invoke(NativeMethodAccessorImpl.java:62)
	at java.base/jdk.internal.reflect.DelegatingMethodAccessorImpl.invoke(DelegatingMethodAccessorImpl.java:43)
	at java.base/java.lang.reflect.Method.invoke(Method.java:564)
	at com.carrotsearch.randomizedtesting.RandomizedRunner.invoke(RandomizedRunner.java:1737)
	at com.carrotsearch.randomizedtesting.RandomizedRunner$8.evaluate(RandomizedRunner.java:934)
	at com.carrotsearch.randomizedtesting.RandomizedRunner$9.evaluate(RandomizedRunner.java:970)
	at com.carrotsearch.randomizedtesting.RandomizedRunner$10.evaluate(RandomizedRunner.java:984)
	at com.carrotsearch.randomizedtesting.rules.SystemPropertiesRestoreRule$1.evaluate(SystemPropertiesRestoreRule.java:57)
	at org.apache.lucene.util.TestRuleSetupTeardownChained$1.evaluate(TestRuleSetupTeardownChained.java:49)
	at org.apache.lucene.util.AbstractBeforeAfterRule$1.evaluate(AbstractBeforeAfterRule.java:45)
	at org.apache.lucene.util.TestRuleThreadAndTestName$1.evaluate(TestRuleThreadAndTestName.java:48)
	at org.apache.lucene.util.TestRuleIgnoreAfterMaxFailures$1.evaluate(TestRuleIgnoreAfterMaxFailures.java:64)
	at org.apache.lucene.util.TestRuleMarkFailure$1.evaluate(TestRuleMarkFailure.java:47)
	at com.carrotsearch.randomizedtesting.rules.StatementAdapter.evaluate(StatementAdapter.java:36)
	at com.carrotsearch.randomizedtesting.ThreadLeakControl$StatementRunner.run(ThreadLeakControl.java:368)
	at com.carrotsearch.randomizedtesting.ThreadLeakControl.forkTimeoutingTask(ThreadLeakControl.java:817)
	at com.carrotsearch.randomizedtesting.ThreadLeakControl$3.evaluate(ThreadLeakControl.java:468)
	at com.carrotsearch.randomizedtesting.RandomizedRunner.runSingleTest(RandomizedRunner.java:943)
	at com.carrotsearch.randomizedtesting.RandomizedRunner$5.evaluate(RandomizedRunner.java:829)
	at com.carrotsearch.randomizedtesting.RandomizedRunner$6.evaluate(RandomizedRunner.java:879)
	at com.carrotsearch.randomizedtesting.RandomizedRunner$7.evaluate(RandomizedRunner.java:890)
	at com.carrotsearch.randomizedtesting.rules.StatementAdapter.evaluate(StatementAdapter.java:36)
	at com.carrotsearch.randomizedtesting.rules.SystemPropertiesRestoreRule$1.evaluate(SystemPropertiesRestoreRule.java:57)
	at org.apache.lucene.util.AbstractBeforeAfterRule$1.evaluate(AbstractBeforeAfterRule.java:45)
	at com.carrotsearch.randomizedtesting.rules.StatementAdapter.evaluate(StatementAdapter.java:36)
	at org.apache.lucene.util.TestRuleStoreClassName$1.evaluate(TestRuleStoreClassName.java:41)
	at com.carrotsearch.randomizedtesting.rules.NoShadowingOrOverridesOnMethodsRule$1.evaluate(NoShadowingOrOverridesOnMethodsRule.java:40)
	at com.carrotsearch.randomizedtesting.rules.NoShadowingOrOverridesOnMethodsRule$1.evaluate(NoShadowingOrOverridesOnMethodsRule.java:40)
	at com.carrotsearch.randomizedtesting.rules.StatementAdapter.evaluate(StatementAdapter.java:36)
	at com.carrotsearch.randomizedtesting.rules.StatementAdapter.evaluate(StatementAdapter.java:36)
	at org.apache.lucene.util.TestRuleAssertionsRequired$1.evaluate(TestRuleAssertionsRequired.java:53)
	at org.apache.lucene.util.TestRuleMarkFailure$1.evaluate(TestRuleMarkFailure.java:47)
	at org.apache.lucene.util.TestRuleIgnoreAfterMaxFailures$1.evaluate(TestRuleIgnoreAfterMaxFailures.java:64)
	at org.apache.lucene.util.TestRuleIgnoreTestSuites$1.evaluate(TestRuleIgnoreTestSuites.java:54)
	at com.carrotsearch.randomizedtesting.rules.StatementAdapter.evaluate(StatementAdapter.java:36)
	at com.carrotsearch.randomizedtesting.ThreadLeakControl$StatementRunner.run(ThreadLeakControl.java:368)
	at java.base/java.lang.Thread.run(Thread.java:844)


FAILED:  org.apache.solr.cloud.TestPullReplica.testAddDocs

Error Message:
Error from server at https://127.0.0.1:37005/solr: Could not fully create collection: pull_replica_test_add_docs

Stack Trace:
org.apache.solr.client.solrj.impl.HttpSolrClient$RemoteSolrException: Error from server at https://127.0.0.1:37005/solr: Could not fully create collection: pull_replica_test_add_docs
	at __randomizedtesting.SeedInfo.seed([7B25CB77D3D0A255:9BAED071309E50B8]:0)
	at org.apache.solr.client.solrj.impl.HttpSolrClient.executeMethod(HttpSolrClient.java:643)
	at org.apache.solr.client.solrj.impl.HttpSolrClient.request(HttpSolrClient.java:255)
	at org.apache.solr.client.solrj.impl.HttpSolrClient.request(HttpSolrClient.java:244)
	at org.apache.solr.client.solrj.impl.LBHttpSolrClient.doRequest(LBHttpSolrClient.java:483)
	at org.apache.solr.client.solrj.impl.LBHttpSolrClient.request(LBHttpSolrClient.java:413)
	at org.apache.solr.client.solrj.impl.CloudSolrClient.sendRequest(CloudSolrClient.java:1103)
	at org.apache.solr.client.solrj.impl.CloudSolrClient.requestWithRetryOnStaleState(CloudSolrClient.java:883)
	at org.apache.solr.client.solrj.impl.CloudSolrClient.request(CloudSolrClient.java:816)
	at org.apache.solr.client.solrj.SolrRequest.process(SolrRequest.java:194)
	at org.apache.solr.client.solrj.SolrRequest.process(SolrRequest.java:211)
	at org.apache.solr.cloud.TestPullReplica.testAddDocs(TestPullReplica.java:219)
	at java.base/jdk.internal.reflect.NativeMethodAccessorImpl.invoke0(Native Method)
	at java.base/jdk.internal.reflect.NativeMethodAccessorImpl.invoke(NativeMethodAccessorImpl.java:62)
	at java.base/jdk.internal.reflect.DelegatingMethodAccessorImpl.invoke(DelegatingMethodAccessorImpl.java:43)
	at java.base/java.lang.reflect.Method.invoke(Method.java:564)
	at com.carrotsearch.randomizedtesting.RandomizedRunner.invoke(RandomizedRunner.java:1737)
	at com.carrotsearch.randomizedtesting.RandomizedRunner$8.evaluate(RandomizedRunner.java:934)
	at com.carrotsearch.randomizedtesting.RandomizedRunner$9.evaluate(RandomizedRunner.java:970)
	at com.carrotsearch.randomizedtesting.RandomizedRunner$10.evaluate(RandomizedRunner.java:984)
	at com.carrotsearch.randomizedtesting.rules.SystemPropertiesRestoreRule$1.evaluate(SystemPropertiesRestoreRule.java:57)
	at org.apache.lucene.util.TestRuleSetupTeardownChained$1.evaluate(TestRuleSetupTeardownChained.java:49)
	at org.apache.lucene.util.AbstractBeforeAfterRule$1.evaluate(AbstractBeforeAfterRule.java:45)
	at org.apache.lucene.util.TestRuleThreadAndTestName$1.evaluate(TestRuleThreadAndTestName.java:48)
	at org.apache.lucene.util.TestRuleIgnoreAfterMaxFailures$1.evaluate(TestRuleIgnoreAfterMaxFailures.java:64)
	at org.apache.lucene.util.TestRuleMarkFailure$1.evaluate(TestRuleMarkFailure.java:47)
	at com.carrotsearch.randomizedtesting.rules.StatementAdapter.evaluate(StatementAdapter.java:36)
	at com.carrotsearch.randomizedtesting.ThreadLeakControl$StatementRunner.run(ThreadLeakControl.java:368)
	at com.carrotsearch.randomizedtesting.ThreadLeakControl.forkTimeoutingTask(ThreadLeakControl.java:817)
	at com.carrotsearch.randomizedtesting.ThreadLeakControl$3.evaluate(ThreadLeakControl.java:468)
	at com.carrotsearch.randomizedtesting.RandomizedRunner.runSingleTest(RandomizedRunner.java:943)
	at com.carrotsearch.randomizedtesting.RandomizedRunner$5.evaluate(RandomizedRunner.java:829)
	at com.carrotsearch.randomizedtesting.RandomizedRunner$6.evaluate(RandomizedRunner.java:879)
	at com.carrotsearch.randomizedtesting.RandomizedRunner$7.evaluate(RandomizedRunner.java:890)
	at com.carrotsearch.randomizedtesting.rules.StatementAdapter.evaluate(StatementAdapter.java:36)
	at com.carrotsearch.randomizedtesting.rules.SystemPropertiesRestoreRule$1.evaluate(SystemPropertiesRestoreRule.java:57)
	at org.apache.lucene.util.AbstractBeforeAfterRule$1.evaluate(AbstractBeforeAfterRule.java:45)
	at com.carrotsearch.randomizedtesting.rules.StatementAdapter.evaluate(StatementAdapter.java:36)
	at org.apache.lucene.util.TestRuleStoreClassName$1.evaluate(TestRuleStoreClassName.java:41)
	at com.carrotsearch.randomizedtesting.rules.NoShadowingOrOverridesOnMethodsRule$1.evaluate(NoShadowingOrOverridesOnMethodsRule.java:40)
	at com.carrotsearch.randomizedtesting.rules.NoShadowingOrOverridesOnMethodsRule$1.evaluate(NoShadowingOrOverridesOnMethodsRule.java:40)
	at com.carrotsearch.randomizedtesting.rules.StatementAdapter.evaluate(StatementAdapter.java:36)
	at com.carrotsearch.randomizedtesting.rules.StatementAdapter.evaluate(StatementAdapter.java:36)
	at org.apache.lucene.util.TestRuleAssertionsRequired$1.evaluate(TestRuleAssertionsRequired.java:53)
	at org.apache.lucene.util.TestRuleMarkFailure$1.evaluate(TestRuleMarkFailure.java:47)
	at org.apache.lucene.util.TestRuleIgnoreAfterMaxFailures$1.evaluate(TestRuleIgnoreAfterMaxFailures.java:64)
	at org.apache.lucene.util.TestRuleIgnoreTestSuites$1.evaluate(TestRuleIgnoreTestSuites.java:54)
	at com.carrotsearch.randomizedtesting.rules.StatementAdapter.evaluate(StatementAdapter.java:36)
	at com.carrotsearch.randomizedtesting.ThreadLeakControl$StatementRunner.run(ThreadLeakControl.java:368)
	at java.base/java.lang.Thread.run(Thread.java:844)


FAILED:  org.apache.solr.cloud.TestPullReplica.testRemoveAllWriterReplicas

Error Message:
Error from server at https://127.0.0.1:37005/solr: Could not fully create collection: pull_replica_test_remove_all_writer_replicas

Stack Trace:
org.apache.solr.client.solrj.impl.HttpSolrClient$RemoteSolrException: Error from server at https://127.0.0.1:37005/solr: Could not fully create collection: pull_replica_test_remove_all_writer_replicas
	at __randomizedtesting.SeedInfo.seed([7B25CB77D3D0A255:E82B574CC72E4BFC]:0)
	at org.apache.solr.client.solrj.impl.HttpSolrClient.executeMethod(HttpSolrClient.java:643)
	at org.apache.solr.client.solrj.impl.HttpSolrClient.request(HttpSolrClient.java:255)
	at org.apache.solr.client.solrj.impl.HttpSolrClient.request(HttpSolrClient.java:244)
	at org.apache.solr.client.solrj.impl.LBHttpSolrClient.doRequest(LBHttpSolrClient.java:483)
	at org.apache.solr.client.solrj.impl.LBHttpSolrClient.request(LBHttpSolrClient.java:413)
	at org.apache.solr.client.solrj.impl.CloudSolrClient.sendRequest(CloudSolrClient.java:1103)
	at org.apache.solr.client.solrj.impl.CloudSolrClient.requestWithRetryOnStaleState(CloudSolrClient.java:883)
	at org.apache.solr.client.solrj.impl.CloudSolrClient.request(CloudSolrClient.java:816)
	at org.apache.solr.client.solrj.SolrRequest.process(SolrRequest.java:194)
	at org.apache.solr.client.solrj.SolrRequest.process(SolrRequest.java:211)
	at org.apache.solr.cloud.TestPullReplica.doTestNoLeader(TestPullReplica.java:371)
	at org.apache.solr.cloud.TestPullReplica.testRemoveAllWriterReplicas(TestPullReplica.java:285)
	at java.base/jdk.internal.reflect.NativeMethodAccessorImpl.invoke0(Native Method)
	at java.base/jdk.internal.reflect.NativeMethodAccessorImpl.invoke(NativeMethodAccessorImpl.java:62)
	at java.base/jdk.internal.reflect.DelegatingMethodAccessorImpl.invoke(DelegatingMethodAccessorImpl.java:43)
	at java.base/java.lang.reflect.Method.invoke(Method.java:564)
	at com.carrotsearch.randomizedtesting.RandomizedRunner.invoke(RandomizedRunner.java:1737)
	at com.carrotsearch.randomizedtesting.RandomizedRunner$8.evaluate(RandomizedRunner.java:934)
	at com.carrotsearch.randomizedtesting.RandomizedRunner$9.evaluate(RandomizedRunner.java:970)
	at com.carrotsearch.randomizedtesting.RandomizedRunner$10.evaluate(RandomizedRunner.java:984)
	at com.carrotsearch.randomizedtesting.rules.SystemPropertiesRestoreRule$1.evaluate(SystemPropertiesRestoreRule.java:57)
	at org.apache.lucene.util.TestRuleSetupTeardownChained$1.evaluate(TestRuleSetupTeardownChained.java:49)
	at org.apache.lucene.util.AbstractBeforeAfterRule$1.evaluate(AbstractBeforeAfterRule.java:45)
	at org.apache.lucene.util.TestRuleThreadAndTestName$1.evaluate(TestRuleThreadAndTestName.java:48)
	at org.apache.lucene.util.TestRuleIgnoreAfterMaxFailures$1.evaluate(TestRuleIgnoreAfterMaxFailures.java:64)
	at org.apache.lucene.util.TestRuleMarkFailure$1.evaluate(TestRuleMarkFailure.java:47)
	at com.carrotsearch.randomizedtesting.rules.StatementAdapter.evaluate(StatementAdapter.java:36)
	at com.carrotsearch.randomizedtesting.ThreadLeakControl$StatementRunner.run(ThreadLeakControl.java:368)
	at com.carrotsearch.randomizedtesting.ThreadLeakControl.forkTimeoutingTask(ThreadLeakControl.java:817)
	at com.carrotsearch.randomizedtesting.ThreadLeakControl$3.evaluate(ThreadLeakControl.java:468)
	at com.carrotsearch.randomizedtesting.RandomizedRunner.runSingleTest(RandomizedRunner.java:943)
	at com.carrotsearch.randomizedtesting.RandomizedRunner$5.evaluate(RandomizedRunner.java:829)
	at com.carrotsearch.randomizedtesting.RandomizedRunner$6.evaluate(RandomizedRunner.java:879)
	at com.carrotsearch.randomizedtesting.RandomizedRunner$7.evaluate(RandomizedRunner.java:890)
	at com.carrotsearch.randomizedtesting.rules.StatementAdapter.evaluate(StatementAdapter.java:36)
	at com.carrotsearch.randomizedtesting.rules.SystemPropertiesRestoreRule$1.evaluate(SystemPropertiesRestoreRule.java:57)
	at org.apache.lucene.util.AbstractBeforeAfterRule$1.evaluate(AbstractBeforeAfterRule.java:45)
	at com.carrotsearch.randomizedtesting.rules.StatementAdapter.evaluate(StatementAdapter.java:36)
	at org.apache.lucene.util.TestRuleStoreClassName$1.evaluate(TestRuleStoreClassName.java:41)
	at com.carrotsearch.randomizedtesting.rules.NoShadowingOrOverridesOnMethodsRule$1.evaluate(NoShadowingOrOverridesOnMethodsRule.java:40)
	at com.carrotsearch.randomizedtesting.rules.NoShadowingOrOverridesOnMethodsRule$1.evaluate(NoShadowingOrOverridesOnMethodsRule.java:40)
	at com.carrotsearch.randomizedtesting.rules.StatementAdapter.evaluate(StatementAdapter.java:36)
	at com.carrotsearch.randomizedtesting.rules.StatementAdapter.evaluate(StatementAdapter.java:36)
	at org.apache.lucene.util.TestRuleAssertionsRequired$1.evaluate(TestRuleAssertionsRequired.java:53)
	at org.apache.lucene.util.TestRuleMarkFailure$1.evaluate(TestRuleMarkFailure.java:47)
	at org.apache.lucene.util.TestRuleIgnoreAfterMaxFailures$1.evaluate(TestRuleIgnoreAfterMaxFailures.java:64)
	at org.apache.lucene.util.TestRuleIgnoreTestSuites$1.evaluate(TestRuleIgnoreTestSuites.java:54)
	at com.carrotsearch.randomizedtesting.rules.StatementAdapter.evaluate(StatementAdapter.java:36)
	at com.carrotsearch.randomizedtesting.ThreadLeakControl$StatementRunner.run(ThreadLeakControl.java:368)
	at java.base/java.lang.Thread.run(Thread.java:844)


FAILED:  org.apache.solr.cloud.TestPullReplica.testKillLeader

Error Message:
Error from server at https://127.0.0.1:37005/solr: Could not fully create collection: pull_replica_test_kill_leader

Stack Trace:
org.apache.solr.client.solrj.impl.HttpSolrClient$RemoteSolrException: Error from server at https://127.0.0.1:37005/solr: Could not fully create collection: pull_replica_test_kill_leader
	at __randomizedtesting.SeedInfo.seed([7B25CB77D3D0A255:32333FC3B16B3603]:0)
	at org.apache.solr.client.solrj.impl.HttpSolrClient.executeMethod(HttpSolrClient.java:643)
	at org.apache.solr.client.solrj.impl.HttpSolrClient.request(HttpSolrClient.java:255)
	at org.apache.solr.client.solrj.impl.HttpSolrClient.request(HttpSolrClient.java:244)
	at org.apache.solr.client.solrj.impl.LBHttpSolrClient.doRequest(LBHttpSolrClient.java:483)
	at org.apache.solr.client.solrj.impl.LBHttpSolrClient.request(LBHttpSolrClient.java:413)
	at org.apache.solr.client.solrj.impl.CloudSolrClient.sendRequest(CloudSolrClient.java:1103)
	at org.apache.solr.client.solrj.impl.CloudSolrClient.requestWithRetryOnStaleState(CloudSolrClient.java:883)
	at org.apache.solr.client.solrj.impl.CloudSolrClient.request(CloudSolrClient.java:816)
	at org.apache.solr.client.solrj.SolrRequest.process(SolrRequest.java:194)
	at org.apache.solr.client.solrj.SolrRequest.process(SolrRequest.java:211)
	at org.apache.solr.cloud.TestPullReplica.doTestNoLeader(TestPullReplica.java:371)
	at org.apache.solr.cloud.TestPullReplica.testKillLeader(TestPullReplica.java:289)
	at java.base/jdk.internal.reflect.NativeMethodAccessorImpl.invoke0(Native Method)
	at java.base/jdk.internal.reflect.NativeMethodAccessorImpl.invoke(NativeMethodAccessorImpl.java:62)
	at java.base/jdk.internal.reflect.DelegatingMethodAccessorImpl.invoke(DelegatingMethodAccessorImpl.java:43)
	at java.base/java.lang.reflect.Method.invoke(Method.java:564)
	at com.carrotsearch.randomizedtesting.RandomizedRunner.invoke(RandomizedRunner.java:1737)
	at com.carrotsearch.randomizedtesting.RandomizedRunner$8.evaluate(RandomizedRunner.java:934)
	at com.carrotsearch.randomizedtesting.RandomizedRunner$9.evaluate(RandomizedRunner.java:970)
	at com.carrotsearch.randomizedtesting.RandomizedRunner$10.evaluate(RandomizedRunner.java:984)
	at com.carrotsearch.randomizedtesting.rules.SystemPropertiesRestoreRule$1.evaluate(SystemPropertiesRestoreRule.java:57)
	at org.apache.lucene.util.TestRuleSetupTeardownChained$1.evaluate(TestRuleSetupTeardownChained.java:49)
	at org.apache.lucene.util.AbstractBeforeAfterRule$1.evaluate(AbstractBeforeAfterRule.java:45)
	at org.apache.lucene.util.TestRuleThreadAndTestName$1.evaluate(TestRuleThreadAndTestName.java:48)
	at org.apache.lucene.util.TestRuleIgnoreAfterMaxFailures$1.evaluate(TestRuleIgnoreAfterMaxFailures.java:64)
	at org.apache.lucene.util.TestRuleMarkFailure$1.evaluate(TestRuleMarkFailure.java:47)
	at com.carrotsearch.randomizedtesting.rules.StatementAdapter.evaluate(StatementAdapter.java:36)
	at com.carrotsearch.randomizedtesting.ThreadLeakControl$StatementRunner.run(ThreadLeakControl.java:368)
	at com.carrotsearch.randomizedtesting.ThreadLeakControl.forkTimeoutingTask(ThreadLeakControl.java:817)
	at com.carrotsearch.randomizedtesting.ThreadLeakControl$3.evaluate(ThreadLeakControl.java:468)
	at com.carrotsearch.randomizedtesting.RandomizedRunner.runSingleTest(RandomizedRunner.java:943)
	at com.carrotsearch.randomizedtesting.RandomizedRunner$5.evaluate(RandomizedRunner.java:829)
	at com.carrotsearch.randomizedtesting.RandomizedRunner$6.evaluate(RandomizedRunner.java:879)
	at com.carrotsearch.randomizedtesting.RandomizedRunner$7.evaluate(RandomizedRunner.java:890)
	at com.carrotsearch.randomizedtesting.rules.StatementAdapter.evaluate(StatementAdapter.java:36)
	at com.carrotsearch.randomizedtesting.rules.SystemPropertiesRestoreRule$1.evaluate(SystemPropertiesRestoreRule.java:57)
	at org.apache.lucene.util.AbstractBeforeAfterRule$1.evaluate(AbstractBeforeAfterRule.java:45)
	at com.carrotsearch.randomizedtesting.rules.StatementAdapter.evaluate(StatementAdapter.java:36)
	at org.apache.lucene.util.TestRuleStoreClassName$1.evaluate(TestRuleStoreClassName.java:41)
	at com.carrotsearch.randomizedtesting.rules.NoShadowingOrOverridesOnMethodsRule$1.evaluate(NoShadowingOrOverridesOnMethodsRule.java:40)
	at com.carrotsearch.randomizedtesting.rules.NoShadowingOrOverridesOnMethodsRule$1.evaluate(NoShadowingOrOverridesOnMethodsRule.java:40)
	at com.carrotsearch.randomizedtesting.rules.StatementAdapter.evaluate(StatementAdapter.java:36)
	at com.carrotsearch.randomizedtesting.rules.StatementAdapter.evaluate(StatementAdapter.java:36)
	at org.apache.lucene.util.TestRuleAssertionsRequired$1.evaluate(TestRuleAssertionsRequired.java:53)
	at org.apache.lucene.util.TestRuleMarkFailure$1.evaluate(TestRuleMarkFailure.java:47)
	at org.apache.lucene.util.TestRuleIgnoreAfterMaxFailures$1.evaluate(TestRuleIgnoreAfterMaxFailures.java:64)
	at org.apache.lucene.util.TestRuleIgnoreTestSuites$1.evaluate(TestRuleIgnoreTestSuites.java:54)
	at com.carrotsearch.randomizedtesting.rules.StatementAdapter.evaluate(StatementAdapter.java:36)
	at com.carrotsearch.randomizedtesting.ThreadLeakControl$StatementRunner.run(ThreadLeakControl.java:368)
	at java.base/java.lang.Thread.run(Thread.java:844)


FAILED:  org.apache.solr.cloud.TestPullReplica.testAddRemovePullReplica

Error Message:
Error from server at https://127.0.0.1:37005/solr: Could not fully create collection: pull_replica_test_add_remove_pull_replica

Stack Trace:
org.apache.solr.client.solrj.impl.HttpSolrClient$RemoteSolrException: Error from server at https://127.0.0.1:37005/solr: Could not fully create collection: pull_replica_test_add_remove_pull_replica
	at __randomizedtesting.SeedInfo.seed([7B25CB77D3D0A255:8187C62CB67B1D1]:0)
	at org.apache.solr.client.solrj.impl.HttpSolrClient.executeMethod(HttpSolrClient.java:643)
	at org.apache.solr.client.solrj.impl.HttpSolrClient.request(HttpSolrClient.java:255)
	at org.apache.solr.client.solrj.impl.HttpSolrClient.request(HttpSolrClient.java:244)
	at org.apache.solr.client.solrj.impl.LBHttpSolrClient.doRequest(LBHttpSolrClient.java:483)
	at org.apache.solr.client.solrj.impl.LBHttpSolrClient.request(LBHttpSolrClient.java:413)
	at org.apache.solr.client.solrj.impl.CloudSolrClient.sendRequest(CloudSolrClient.java:1103)
	at org.apache.solr.client.solrj.impl.CloudSolrClient.requestWithRetryOnStaleState(CloudSolrClient.java:883)
	at org.apache.solr.client.solrj.impl.CloudSolrClient.request(CloudSolrClient.java:816)
	at org.apache.solr.client.solrj.SolrRequest.process(SolrRequest.java:194)
	at org.apache.solr.client.solrj.SolrRequest.process(SolrRequest.java:211)
	at org.apache.solr.cloud.TestPullReplica.testAddRemovePullReplica(TestPullReplica.java:263)
	at java.base/jdk.internal.reflect.NativeMethodAccessorImpl.invoke0(Native Method)
	at java.base/jdk.internal.reflect.NativeMethodAccessorImpl.invoke(NativeMethodAccessorImpl.java:62)
	at java.base/jdk.internal.reflect.DelegatingMethodAccessorImpl.invoke(DelegatingMethodAccessorImpl.java:43)
	at java.base/java.lang.reflect.Method.invoke(Method.java:564)
	at com.carrotsearch.randomizedtesting.RandomizedRunner.invoke(RandomizedRunner.java:1737)
	at com.carrotsearch.randomizedtesting.RandomizedRunner$8.evaluate(RandomizedRunner.java:934)
	at com.carrotsearch.randomizedtesting.RandomizedRunner$9.evaluate(RandomizedRunner.java:970)
	at com.carrotsearch.randomizedtesting.RandomizedRunner$10.evaluate(RandomizedRunner.java:984)
	at com.carrotsearch.randomizedtesting.rules.SystemPropertiesRestoreRule$1.evaluate(SystemPropertiesRestoreRule.java:57)
	at org.apache.lucene.util.TestRuleSetupTeardownChained$1.evaluate(TestRuleSetupTeardownChained.java:49)
	at org.apache.lucene.util.AbstractBeforeAfterRule$1.evaluate(AbstractBeforeAfterRule.java:45)
	at org.apache.lucene.util.TestRuleThreadAndTestName$1.evaluate(TestRuleThreadAndTestName.java:48)
	at org.apache.lucene.util.TestRuleIgnoreAfterMaxFailures$1.evaluate(TestRuleIgnoreAfterMaxFailures.java:64)
	at org.apache.lucene.util.TestRuleMarkFailure$1.evaluate(TestRuleMarkFailure.java:47)
	at com.carrotsearch.randomizedtesting.rules.StatementAdapter.evaluate(StatementAdapter.java:36)
	at com.carrotsearch.randomizedtesting.ThreadLeakControl$StatementRunner.run(ThreadLeakControl.java:368)
	at com.carrotsearch.randomizedtesting.ThreadLeakControl.forkTimeoutingTask(ThreadLeakControl.java:817)
	at com.carrotsearch.randomizedtesting.ThreadLeakControl$3.evaluate(ThreadLeakControl.java:468)
	at com.carrotsearch.randomizedtesting.RandomizedRunner.runSingleTest(RandomizedRunner.java:943)
	at com.carrotsearch.randomizedtesting.RandomizedRunner$5.evaluate(RandomizedRunner.java:829)
	at com.carrotsearch.randomizedtesting.RandomizedRunner$6.evaluate(RandomizedRunner.java:879)
	at com.carrotsearch.randomizedtesting.RandomizedRunner$7.evaluate(RandomizedRunner.java:890)
	at com.carrotsearch.randomizedtesting.rules.StatementAdapter.evaluate(StatementAdapter.java:36)
	at com.carrotsearch.randomizedtesting.rules.SystemPropertiesRestoreRule$1.evaluate(SystemPropertiesRestoreRule.java:57)
	at org.apache.lucene.util.AbstractBeforeAfterRule$1.evaluate(AbstractBeforeAfterRule.java:45)
	at com.carrotsearch.randomizedtesting.rules.StatementAdapter.evaluate(StatementAdapter.java:36)
	at org.apache.lucene.util.TestRuleStoreClassName$1.evaluate(TestRuleStoreClassName.java:41)
	at com.carrotsearch.randomizedtesting.rules.NoShadowingOrOverridesOnMethodsRule$1.evaluate(NoShadowingOrOverridesOnMethodsRule.java:40)
	at com.carrotsearch.randomizedtesting.rules.NoShadowingOrOverridesOnMethodsRule$1.evaluate(NoShadowingOrOverridesOnMethodsRule.java:40)
	at com.carrotsearch.randomizedtesting.rules.StatementAdapter.evaluate(StatementAdapter.java:36)
	at com.carrotsearch.randomizedtesting.rules.StatementAdapter.evaluate(StatementAdapter.java:36)
	at org.apache.lucene.util.TestRuleAssertionsRequired$1.evaluate(TestRuleAssertionsRequired.java:53)
	at org.apache.lucene.util.TestRuleMarkFailure$1.evaluate(TestRuleMarkFailure.java:47)
	at org.apache.lucene.util.TestRuleIgnoreAfterMaxFailures$1.evaluate(TestRuleIgnoreAfterMaxFailures.java:64)
	at org.apache.lucene.util.TestRuleIgnoreTestSuites$1.evaluate(TestRuleIgnoreTestSuites.java:54)
	at com.carrotsearch.randomizedtesting.rules.StatementAdapter.evaluate(StatementAdapter.java:36)
	at com.carrotsearch.randomizedtesting.ThreadLeakControl$StatementRunner.run(ThreadLeakControl.java:368)
	at java.base/java.lang.Thread.run(Thread.java:844)




Build Log:
[...truncated 11968 lines...]
   [junit4] Suite: org.apache.solr.cloud.TestPullReplica
   [junit4]   2> Creating dataDir: /home/jenkins/workspace/Lucene-Solr-7.2-Linux/solr/build/solr-core/test/J2/temp/solr.cloud.TestPullReplica_7B25CB77D3D0A255-001/init-core-data-001
   [junit4]   2> 81883 WARN  (SUITE-TestPullReplica-seed#[7B25CB77D3D0A255]-worker) [    ] o.a.s.SolrTestCaseJ4 startTrackingSearchers: numOpens=4 numCloses=4
   [junit4]   2> 81883 INFO  (SUITE-TestPullReplica-seed#[7B25CB77D3D0A255]-worker) [    ] o.a.s.SolrTestCaseJ4 Using PointFields (NUMERIC_POINTS_SYSPROP=true) w/NUMERIC_DOCVALUES_SYSPROP=true
   [junit4]   2> 81884 INFO  (SUITE-TestPullReplica-seed#[7B25CB77D3D0A255]-worker) [    ] o.a.s.SolrTestCaseJ4 Randomized ssl (true) and clientAuth (false) via: @org.apache.solr.util.RandomizeSSL(reason="", ssl=0.0/0.0, value=0.0/0.0, clientAuth=0.0/0.0)
   [junit4]   2> 81884 INFO  (SUITE-TestPullReplica-seed#[7B25CB77D3D0A255]-worker) [    ] o.a.s.SolrTestCaseJ4 SecureRandom sanity checks: test.solr.allowed.securerandom=null & java.security.egd=file:/dev/./urandom
   [junit4]   2> 81886 INFO  (SUITE-TestPullReplica-seed#[7B25CB77D3D0A255]-worker) [    ] o.a.s.c.MiniSolrCloudCluster Starting cluster of 2 servers in /home/jenkins/workspace/Lucene-Solr-7.2-Linux/solr/build/solr-core/test/J2/temp/solr.cloud.TestPullReplica_7B25CB77D3D0A255-001/tempDir-001
   [junit4]   2> 81886 INFO  (SUITE-TestPullReplica-seed#[7B25CB77D3D0A255]-worker) [    ] o.a.s.c.ZkTestServer STARTING ZK TEST SERVER
   [junit4]   2> 81886 INFO  (Thread-94) [    ] o.a.s.c.ZkTestServer client port:0.0.0.0/0.0.0.0:0
   [junit4]   2> 81886 INFO  (Thread-94) [    ] o.a.s.c.ZkTestServer Starting server
   [junit4]   2> 81887 ERROR (Thread-94) [    ] o.a.z.s.ZooKeeperServer ZKShutdownHandler is not registered, so ZooKeeper server won't take any action on ERROR or SHUTDOWN server state changes
   [junit4]   2> 81986 INFO  (SUITE-TestPullReplica-seed#[7B25CB77D3D0A255]-worker) [    ] o.a.s.c.ZkTestServer start zk server on port:36513
   [junit4]   2> 81990 INFO  (zkConnectionManagerCallback-108-thread-1) [    ] o.a.s.c.c.ConnectionManager zkClient has connected
   [junit4]   2> 82046 INFO  (jetty-launcher-105-thread-1) [    ] o.e.j.s.Server jetty-9.3.20.v20170531
   [junit4]   2> 82046 INFO  (jetty-launcher-105-thread-2) [    ] o.e.j.s.Server jetty-9.3.20.v20170531
   [junit4]   2> 82047 INFO  (jetty-launcher-105-thread-1) [    ] o.e.j.s.h.ContextHandler Started o.e.j.s.ServletContextHandler@6aa7b75a{/solr,null,AVAILABLE}
   [junit4]   2> 82047 INFO  (jetty-launcher-105-thread-2) [    ] o.e.j.s.h.ContextHandler Started o.e.j.s.ServletContextHandler@77c2dd33{/solr,null,AVAILABLE}
   [junit4]   2> 82062 INFO  (jetty-launcher-105-thread-1) [    ] o.e.j.s.AbstractConnector Started ServerConnector@5d12a666{SSL,[ssl, http/1.1]}{127.0.0.1:45439}
   [junit4]   2> 82062 INFO  (jetty-launcher-105-thread-2) [    ] o.e.j.s.AbstractConnector Started ServerConnector@2bcac0ef{SSL,[ssl, http/1.1]}{127.0.0.1:37005}
   [junit4]   2> 82062 INFO  (jetty-launcher-105-thread-1) [    ] o.e.j.s.Server Started @83877ms
   [junit4]   2> 82062 INFO  (jetty-launcher-105-thread-2) [    ] o.e.j.s.Server Started @83877ms
   [junit4]   2> 82062 INFO  (jetty-launcher-105-thread-2) [    ] o.a.s.c.s.e.JettySolrRunner Jetty properties: {hostContext=/solr, hostPort=37005}
   [junit4]   2> 82062 INFO  (jetty-launcher-105-thread-1) [    ] o.a.s.c.s.e.JettySolrRunner Jetty properties: {hostContext=/solr, hostPort=45439}
   [junit4]   2> 82063 ERROR (jetty-launcher-105-thread-2) [    ] o.a.s.u.StartupLoggingUtils Missing Java Option solr.log.dir. Logging may be missing or incomplete.
   [junit4]   2> 82063 ERROR (jetty-launcher-105-thread-1) [    ] o.a.s.u.StartupLoggingUtils Missing Java Option solr.log.dir. Logging may be missing or incomplete.
   [junit4]   2> 82063 INFO  (jetty-launcher-105-thread-1) [    ] o.a.s.s.SolrDispatchFilter  ___      _       Welcome to Apache Solr? version 7.2.1
   [junit4]   2> 82063 INFO  (jetty-launcher-105-thread-2) [    ] o.a.s.s.SolrDispatchFilter  ___      _       Welcome to Apache Solr? version 7.2.1
   [junit4]   2> 82063 INFO  (jetty-launcher-105-thread-1) [    ] o.a.s.s.SolrDispatchFilter / __| ___| |_ _   Starting in cloud mode on port null
   [junit4]   2> 82063 INFO  (jetty-launcher-105-thread-1) [    ] o.a.s.s.SolrDispatchFilter \__ \/ _ \ | '_|  Install dir: null
   [junit4]   2> 82063 INFO  (jetty-launcher-105-thread-2) [    ] o.a.s.s.SolrDispatchFilter / __| ___| |_ _   Starting in cloud mode on port null
   [junit4]   2> 82063 INFO  (jetty-launcher-105-thread-2) [    ] o.a.s.s.SolrDispatchFilter \__ \/ _ \ | '_|  Install dir: null
   [junit4]   2> 82063 INFO  (jetty-launcher-105-thread-1) [    ] o.a.s.s.SolrDispatchFilter |___/\___/_|_|    Start time: 2017-12-24T17:27:31.926266Z
   [junit4]   2> 82063 INFO  (jetty-launcher-105-thread-2) [    ] o.a.s.s.SolrDispatchFilter |___/\___/_|_|    Start time: 2017-12-24T17:27:31.926293Z
   [junit4]   2> 82064 INFO  (zkConnectionManagerCallback-112-thread-1) [    ] o.a.s.c.c.ConnectionManager zkClient has connected
   [junit4]   2> 82064 INFO  (zkConnectionManagerCallback-111-thread-1) [    ] o.a.s.c.c.ConnectionManager zkClient has connected
   [junit4]   2> 82065 INFO  (jetty-launcher-105-thread-1) [    ] o.a.s.s.SolrDispatchFilter solr.xml found in ZooKeeper. Loading...
   [junit4]   2> 82065 INFO  (jetty-launcher-105-thread-2) [    ] o.a.s.s.SolrDispatchFilter solr.xml found in ZooKeeper. Loading...
   [junit4]   2> 82070 INFO  (jetty-launcher-105-thread-1) [    ] o.a.s.c.ZkContainer Zookeeper client=127.0.0.1:36513/solr
   [junit4]   2> 82070 INFO  (jetty-launcher-105-thread-2) [    ] o.a.s.c.ZkContainer Zookeeper client=127.0.0.1:36513/solr
   [junit4]   2> 82074 INFO  (zkConnectionManagerCallback-118-thread-1) [    ] o.a.s.c.c.ConnectionManager zkClient has connected
   [junit4]   2> 82074 INFO  (zkConnectionManagerCallback-120-thread-1) [    ] o.a.s.c.c.ConnectionManager zkClient has connected
   [junit4]   2> 82082 INFO  (zkConnectionManagerCallback-122-thread-1-processing-n:127.0.0.1:45439_solr) [n:127.0.0.1:45439_solr    ] o.a.s.c.c.ConnectionManager zkClient has connected
   [junit4]   2> 82082 INFO  (zkConnectionManagerCallback-124-thread-1-processing-n:127.0.0.1:37005_solr) [n:127.0.0.1:37005_solr    ] o.a.s.c.c.ConnectionManager zkClient has connected
   [junit4]   2> 82127 INFO  (jetty-launcher-105-thread-2) [n:127.0.0.1:37005_solr    ] o.a.s.c.Overseer Overseer (id=null) closing
   [junit4]   2> 82127 INFO  (jetty-launcher-105-thread-1) [n:127.0.0.1:45439_solr    ] o.a.s.c.Overseer Overseer (id=null) closing
   [junit4]   2> 82127 INFO  (jetty-launcher-105-thread-1) [n:127.0.0.1:45439_solr    ] o.a.s.c.OverseerElectionContext I am going to be the leader 127.0.0.1:45439_solr
   [junit4]   2> 82128 INFO  (jetty-launcher-105-thread-2) [n:127.0.0.1:37005_solr    ] o.a.s.c.ZkController Register node as live in ZooKeeper:/live_nodes/127.0.0.1:37005_solr
   [junit4]   2> 82128 INFO  (jetty-launcher-105-thread-1) [n:127.0.0.1:45439_solr    ] o.a.s.c.Overseer Overseer (id=99230446501888005-127.0.0.1:45439_solr-n_0000000000) starting
   [junit4]   2> 82133 INFO  (zkCallback-121-thread-1-processing-n:127.0.0.1:45439_solr) [n:127.0.0.1:45439_solr    ] o.a.s.c.c.ZkStateReader Updated live nodes from ZooKeeper... (0) -> (1)
   [junit4]   2> 82134 INFO  (zkCallback-123-thread-1-processing-n:127.0.0.1:37005_solr) [n:127.0.0.1:37005_solr    ] o.a.s.c.c.ZkStateReader Updated live nodes from ZooKeeper... (0) -> (1)
   [junit4]   2> 82141 INFO  (jetty-launcher-105-thread-1) [n:127.0.0.1:45439_solr    ] o.a.s.c.ZkController Register node as live in ZooKeeper:/live_nodes/127.0.0.1:45439_solr
   [junit4]   2> 82142 INFO  (zkCallback-123-thread-1-processing-n:127.0.0.1:37005_solr) [n:127.0.0.1:37005_solr    ] o.a.s.c.c.ZkStateReader Updated live nodes from ZooKeeper... (1) -> (2)
   [junit4]   2> 82142 INFO  (zkCallback-121-thread-1-processing-n:127.0.0.1:45439_solr) [n:127.0.0.1:45439_solr    ] o.a.s.c.c.ZkStateReader Updated live nodes from ZooKeeper... (1) -> (2)
   [junit4]   2> 82167 INFO  (jetty-launcher-105-thread-2) [n:127.0.0.1:37005_solr    ] o.a.s.m.r.SolrJmxReporter JMX monitoring for 'solr_37005.solr.node' (registry 'solr.node') enabled at server: com.sun.jmx.mbeanserver.JmxMBeanServer@3ba49a7e
   [junit4]   2> 82173 INFO  (jetty-launcher-105-thread-2) [n:127.0.0.1:37005_solr    ] o.a.s.m.r.SolrJmxReporter JMX monitoring for 'solr_37005.solr.jvm' (registry 'solr.jvm') enabled at server: com.sun.jmx.mbeanserver.JmxMBeanServer@3ba49a7e
   [junit4]   2> 82174 INFO  (jetty-launcher-105-thread-2) [n:127.0.0.1:37005_solr    ] o.a.s.m.r.SolrJmxReporter JMX monitoring for 'solr_37005.solr.jetty' (registry 'solr.jetty') enabled at server: com.sun.jmx.mbeanserver.JmxMBeanServer@3ba49a7e
   [junit4]   2> 82174 INFO  (jetty-launcher-105-thread-2) [n:127.0.0.1:37005_solr    ] o.a.s.c.CorePropertiesLocator Found 0 core definitions underneath /home/jenkins/workspace/Lucene-Solr-7.2-Linux/solr/build/solr-core/test/J2/temp/solr.cloud.TestPullReplica_7B25CB77D3D0A255-001/tempDir-001/node2/.
   [junit4]   2> 82179 INFO  (jetty-launcher-105-thread-1) [n:127.0.0.1:45439_solr    ] o.a.s.m.r.SolrJmxReporter JMX monitoring for 'solr_45439.solr.node' (registry 'solr.node') enabled at server: com.sun.jmx.mbeanserver.JmxMBeanServer@3ba49a7e
   [junit4]   2> 82188 INFO  (jetty-launcher-105-thread-1) [n:127.0.0.1:45439_solr    ] o.a.s.m.r.SolrJmxReporter JMX monitoring for 'solr_45439.solr.jvm' (registry 'solr.jvm') enabled at server: com.sun.jmx.mbeanserver.JmxMBeanServer@3ba49a7e
   [junit4]   2> 82188 INFO  (jetty-launcher-105-thread-1) [n:127.0.0.1:45439_solr    ] o.a.s.m.r.SolrJmxReporter JMX monitoring for 'solr_45439.solr.jetty' (registry 'solr.jetty') enabled at server: com.sun.jmx.mbeanserver.JmxMBeanServer@3ba49a7e
   [junit4]   2> 82189 INFO  (jetty-launcher-105-thread-1) [n:127.0.0.1:45439_solr    ] o.a.s.c.CorePropertiesLocator Found 0 core definitions underneath /home/jenkins/workspace/Lucene-Solr-7.2-Linux/solr/build/solr-core/test/J2/temp/solr.cloud.TestPullReplica_7B25CB77D3D0A255-001/tempDir-001/node1/.
   [junit4]   2> 82205 INFO  (zkConnectionManagerCallback-129-thread-1) [    ] o.a.s.c.c.ConnectionManager zkClient has connected
   [junit4]   2> 82208 INFO  (zkConnectionManagerCallback-133-thread-1) [    ] o.a.s.c.c.ConnectionManager zkClient has connected
   [junit4]   2> 82209 INFO  (SUITE-TestPullReplica-seed#[7B25CB77D3D0A255]-worker) [    ] o.a.s.c.c.ZkStateReader Updated live nodes from ZooKeeper... (0) -> (2)
   [junit4]   2> 82209 INFO  (SUITE-TestPullReplica-seed#[7B25CB77D3D0A255]-worker) [    ] o.a.s.c.s.i.ZkClientClusterStateProvider Cluster at 127.0.0.1:36513/solr ready
   [junit4]   2> 82210 INFO  (SUITE-TestPullReplica-seed#[7B25CB77D3D0A255]-worker) [    ] o.a.s.c.TestPullReplica Using legacyCloud?: false
   [junit4]   2> 82251 INFO  (qtp1600651-679) [n:127.0.0.1:37005_solr    ] o.a.s.h.a.CollectionsHandler Invoked Collection Action :clusterprop with params val=false&name=legacyCloud&action=CLUSTERPROP&wt=javabin&version=2 and sendToOCPQueue=true
   [junit4]   2> 82252 INFO  (qtp1600651-679) [n:127.0.0.1:37005_solr    ] o.a.s.s.HttpSolrCall [admin] webapp=null path=/admin/collections params={val=false&name=legacyCloud&action=CLUSTERPROP&wt=javabin&version=2} status=0 QTime=1
   [junit4]   2> 82262 INFO  (TEST-TestPullReplica.testRealTimeGet-seed#[7B25CB77D3D0A255]) [    ] o.a.s.SolrTestCaseJ4 ###Starting testRealTimeGet
   [junit4]   2> 82264 INFO  (qtp1600651-680) [n:127.0.0.1:37005_solr    ] o.a.s.h.a.CollectionsHandler Invoked Collection Action :create with params pullReplicas=1&replicationFactor=1&collection.configName=conf&maxShardsPerNode=100&name=pull_replica_test_real_time_get&nrtReplicas=1&action=CREATE&numShards=1&tlogReplicas=0&wt=javabin&version=2 and sendToOCPQueue=true
   [junit4]   2> 82270 INFO  (OverseerThreadFactory-183-thread-1-processing-n:127.0.0.1:45439_solr) [n:127.0.0.1:45439_solr    ] o.a.s.c.CreateCollectionCmd Create collection pull_replica_test_real_time_get
   [junit4]   2> 82375 INFO  (OverseerStateUpdate-99230446501888005-127.0.0.1:45439_solr-n_0000000000) [n:127.0.0.1:45439_solr    ] o.a.s.c.o.SliceMutator createReplica() {
   [junit4]   2>   "operation":"ADDREPLICA",
   [junit4]   2>   "collection":"pull_replica_test_real_time_get",
   [junit4]   2>   "shard":"shard1",
   [junit4]   2>   "core":"pull_replica_test_real_time_get_shard1_replica_n1",
   [junit4]   2>   "state":"down",
   [junit4]   2>   "base_url":"https://127.0.0.1:45439/solr",
   [junit4]   2>   "type":"NRT",
   [junit4]   2>   "waitForFinalState":"false"} 
   [junit4]   2> 82376 INFO  (OverseerStateUpdate-99230446501888005-127.0.0.1:45439_solr-n_0000000000) [n:127.0.0.1:45439_solr    ] o.a.s.c.o.SliceMutator createReplica() {
   [junit4]   2>   "operation":"ADDREPLICA",
   [junit4]   2>   "collection":"pull_replica_test_real_time_get",
   [junit4]   2>   "shard":"shard1",
   [junit4]   2>   "core":"pull_replica_test_real_time_get_shard1_replica_p2",
   [junit4]   2>   "state":"down",
   [junit4]   2>   "base_url":"https://127.0.0.1:37005/solr",
   [junit4]   2>   "type":"PULL",
   [junit4]   2>   "waitForFinalState":"false"} 
   [junit4]   2> 82590 INFO  (qtp1600651-671) [n:127.0.0.1:37005_solr    ] o.a.s.h.a.CoreAdminOperation core create command qt=/admin/cores&coreNodeName=core_node4&collection.configName=conf&newCollection=true&name=pull_replica_test_real_time_get_shard1_replica_p2&action=CREATE&numShards=1&collection=pull_replica_test_real_time_get&shard=shard1&wt=javabin&version=2&replicaType=PULL
   [junit4]   2> 82590 INFO  (qtp1600651-671) [n:127.0.0.1:37005_solr    ] o.a.s.c.TransientSolrCoreCacheDefault Allocating transient cache for 2147483647 transient cores
   [junit4]   2> 82597 INFO  (qtp1458797372-674) [n:127.0.0.1:45439_solr    ] o.a.s.h.a.CoreAdminOperation core create command qt=/admin/cores&coreNodeName=core_node3&collection.configName=conf&newCollection=true&name=pull_replica_test_real_time_get_shard1_replica_n1&action=CREATE&numShards=1&collection=pull_replica_test_real_time_get&shard=shard1&wt=javabin&version=2&replicaType=NRT
   [junit4]   2> 82597 INFO  (qtp1458797372-674) [n:127.0.0.1:45439_solr    ] o.a.s.c.TransientSolrCoreCacheDefault Allocating transient cache for 2147483647 transient cores
   [junit4]   2> 82700 INFO  (zkCallback-123-thread-1-processing-n:127.0.0.1:37005_solr) [n:127.0.0.1:37005_solr    ] o.a.s.c.c.ZkStateReader A cluster state change: [WatchedEvent state:SyncConnected type:NodeDataChanged path:/collections/pull_replica_test_real_time_get/state.json] for collection [pull_replica_test_real_time_get] has occurred - updating... (live nodes size: [2])
   [junit4]   2> 82700 INFO  (zkCallback-121-thread-1-processing-n:127.0.0.1:45439_solr) [n:127.0.0.1:45439_solr    ] o.a.s.c.c.ZkStateReader A cluster state change: [WatchedEvent state:SyncConnected type:NodeDataChanged path:/collections/pull_replica_test_real_time_get/state.json] for collection [pull_replica_test_real_time_get] has occurred - updating... (live nodes size: [2])
   [junit4]   2> 82700 INFO  (zkCallback-123-thread-2-processing-n:127.0.0.1:37005_solr) [n:127.0.0.1:37005_solr    ] o.a.s.c.c.ZkStateReader A cluster state change: [WatchedEvent state:SyncConnected type:NodeDataChanged path:/collections/pull_replica_test_real_time_get/state.json] for collection [pull_replica_test_real_time_get] has occurred - updating... (live nodes size: [2])
   [junit4]   2> 82700 INFO  (zkCallback-121-thread-2-processing-n:127.0.0.1:45439_solr) [n:127.0.0.1:45439_solr    ] o.a.s.c.c.ZkStateReader A cluster state change: [WatchedEvent state:SyncConnected type:NodeDataChanged path:/collections/pull_replica_test_real_time_get/state.json] for collection [pull_replica_test_real_time_get] has occurred - updating... (live nodes size: [2])
   [junit4]   2> 83598 INFO  (qtp1600651-671) [n:127.0.0.1:37005_solr c:pull_replica_test_real_time_get s:shard1 r:core_node4 x:pull_replica_test_real_time_get_shard1_replica_p2] o.a.s.c.SolrConfig Using Lucene MatchVersion: 7.2.1
   [junit4]   2> 83602 INFO  (qtp1600651-671) [n:127.0.0.1:37005_solr c:pull_replica_test_real_time_get s:shard1 r:core_node4 x:pull_replica_test_real_time_get_shard1_replica_p2] o.a.s.s.IndexSchema [pull_replica_test_real_time_get_shard1_replica_p2] Schema name=minimal
   [junit4]   2> 83610 INFO  (qtp1600651-671) [n:127.0.0.1:37005_solr c:pull_replica_test_real_time_get s:shard1 r:core_node4 x:pull_replica_test_real_time_get_shard1_replica_p2] o.a.s.s.IndexSchema Loaded schema minimal/1.1 with uniqueid field id
   [junit4]   2> 83610 INFO  (qtp1600651-671) [n:127.0.0.1:37005_solr c:pull_replica_test_real_time_get s:shard1 r:core_node4 x:pull_replica_test_real_time_get_shard1_replica_p2] o.a.s.c.CoreContainer Creating SolrCore 'pull_replica_test_real_time_get_shard1_replica_p2' using configuration from collection pull_replica_test_real_time_get, trusted=true
   [junit4]   2> 83610 INFO  (qtp1458797372-674) [n:127.0.0.1:45439_solr c:pull_replica_test_real_time_get s:shard1 r:core_node3 x:pull_replica_test_real_time_get_shard1_replica_n1] o.a.s.c.SolrConfig Using Lucene MatchVersion: 7.2.1
   [junit4]   2> 83610 INFO  (qtp1600651-671) [n:127.0.0.1:37005_solr c:pull_replica_test_real_time_get s:shard1 r:core_node4 x:pull_replica_test_real_time_get_shard1_replica_p2] o.a.s.m.r.SolrJmxReporter JMX monitoring for 'solr_37005.solr.core.pull_replica_test_real_time_get.shard1.replica_p2' (registry 'solr.core.pull_replica_test_real_time_get.shard1.replica_p2') enabled at server: com.sun.jmx.mbeanserver.JmxMBeanServer@3ba49a7e
   [junit4]   2> 83610 INFO  (qtp1600651-671) [n:127.0.0.1:37005_solr c:pull_replica_test_real_time_get s:shard1 r:core_node4 x:pull_replica_test_real_time_get_shard1_replica_p2] o.a.s.c.SolrCore solr.RecoveryStrategy.Builder
   [junit4]   2> 83610 INFO  (qtp1600651-671) [n:127.0.0.1:37005_solr c:pull_replica_test_real_time_get s:shard1 r:core_node4 x:pull_replica_test_real_time_get_shard1_replica_p2] o.a.s.c.SolrCore [[pull_replica_test_real_time_get_shard1_replica_p2] ] Opening new SolrCore at [/home/jenkins/workspace/Lucene-Solr-7.2-Linux/solr/build/solr-core/test/J2/temp/solr.cloud.TestPullReplica_7B25CB77D3D0A255-001/tempDir-001/node2/pull_replica_test_real_time_get_shard1_replica_p2], dataDir=[/home/jenkins/workspace/Lucene-Solr-7.2-Linux/solr/build/solr-core/test/J2/temp/solr.cloud.TestPullReplica_7B25CB77D3D0A255-001/tempDir-001/node2/./pull_replica_test_real_time_get_shard1_replica_p2/data/]
   [junit4]   2> 83615 INFO  (qtp1458797372-674) [n:127.0.0.1:45439_solr c:pull_replica_test_real_time_get s:shard1 r:core_node3 x:pull_replica_test_real_time_get_shard1_replica_n1] o.a.s.s.IndexSchema [pull_replica_test_real_time_get_shard1_replica_n1] Schema name=minimal
   [junit4]   2> 83616 INFO  (qtp1458797372-674) [n:127.0.0.1:45439_solr c:pull_replica_test_real_time_get s:shard1 r:core_node3 x:pull_replica_test_real_time_get_shard1_replica_n1] o.a.s.s.IndexSchema Loaded schema minimal/1.1 with uniqueid field id
   [junit4]   2> 83616 INFO  (qtp1458797372-674) [n:127.0.0.1:45439_solr c:pull_replica_test_real_time_get s:shard1 r:core_node3 x:pull_replica_test_real_time_get_shard1_replica_n1] o.a.s.c.CoreContainer Creating SolrCore 'pull_replica_test_real_time_get_shard1_replica_n1' using configuration from collection pull_replica_test_real_time_get, trusted=true
   [junit4]   2> 83616 INFO  (qtp1458797372-674) [n:127.0.0.1:45439_solr c:pull_replica_test_real_time_get s:shard1 r:core_node3 x:pull_replica_test_real_time_get_shard1_replica_n1] o.a.s.m.r.SolrJmxReporter JMX monitoring for 'solr_45439.solr.core.pull_replica_test_real_time_get.shard1.replica_n1' (registry 'solr.core.pull_replica_test_real_time_get.shard1.replica_n1') enabled at server: com.sun.jmx.mbeanserver.JmxMBeanServer@3ba49a7e
   [junit4]   2> 83616 INFO  (qtp1458797372-674) [n:127.0.0.1:45439_solr c:pull_replica_test_real_time_get s:shard1 r:core_node3 x:pull_replica_test_real_time_get_shard1_replica_n1] o.a.s.c.SolrCore solr.RecoveryStrategy.Builder
   [junit4]   2> 83616 INFO  (qtp1458797372-674) [n:127.0.0.1:45439_solr c:pull_replica_test_real_time_get s:shard1 r:core_node3 x:pull_replica_test_real_time_get_shard1_replica_n1] o.a.s.c.SolrCore [[pull_replica_test_real_time_get_shard1_replica_n1] ] Opening new SolrCore at [/home/jenkins/workspace/Lucene-Solr-7.2-Linux/solr/build/solr-core/test/J2/temp/solr.cloud.TestPullReplica_7B25CB77D3D0A255-001/tempDir-001/node1/pull_replica_test_real_time_get_shard1_replica_n1], dataDir=[/home/jenkins/workspace/Lucene-Solr-7.2-Linux/solr/build/solr-core/test/J2/temp/solr.cloud.TestPullReplica_7B25CB77D3D0A255-001/tempDir-001/node1/./pull_replica_test_real_time_get_shard1_replica_n1/data/]
   [junit4]   2> 83649 INFO  (qtp1458797372-674) [n:127.0.0.1:45439_solr c:pull_replica_test_real_time_get s:shard1 r:core_node3 x:pull_replica_test_real_time_get_shard1_replica_n1] o.a.s.u.UpdateHandler Using UpdateLog implementation: org.apache.solr.update.UpdateLog
   [junit4]   2> 83649 INFO  (qtp1458797372-674) [n:127.0.0.1:45439_solr c:pull_replica_test_real_time_get s:shard1 r:core_node3 x:pull_replica_test_real_time_get_shard1_replica_n1] o.a.s.u.UpdateLog Initializing UpdateLog: dataDir=null defaultSyncLevel=FLUSH numRecordsToKeep=100 maxNumLogsToKeep=10 numVersionBuckets=65536
   [junit4]   2> 83650 INFO  (qtp1458797372-674) [n:127.0.0.1:45439_solr c:pull_replica_test_real_time_get s:shard1 r:core_node3 x:pull_replica_test_real_time_get_shard1_replica_n1] o.a.s.u.CommitTracker Hard AutoCommit: disabled
   [junit4]   2> 83650 INFO  (qtp1458797372-674) [n:127.0.0.1:45439_solr c:pull_replica_test_real_time_get s:shard1 r:core_node3 x:pull_replica_test_real_time_get_shard1_replica_n1] o.a.s.u.CommitTracker Soft AutoCommit: disabled
   [junit4]   2> 83651 INFO  (qtp1458797372-674) [n:127.0.0.1:45439_solr c:pull_replica_test_real_time_get s:shard1 r:core_node3 x:pull_replica_test_real_time_get_shard1_replica_n1] o.a.s.s.SolrIndexSearcher Opening [Searcher@2aac082d[pull_replica_test_real_time_get_shard1_replica_n1] main]
   [junit4]   2> 83652 INFO  (qtp1600651-671) [n:127.0.0.1:37005_solr c:pull_replica_test_real_time_get s:shard1 r:core_node4 x:pull_replica_test_real_time_get_shard1_replica_p2] o.a.s.u.CommitTracker Hard AutoCommit: disabled
   [junit4]   2> 83652 INFO  (qtp1600651-671) [n:127.0.0.1:37005_solr c:pull_replica_test_real_time_get s:shard1 r:core_node4 x:pull_replica_test_real_time_get_shard1_replica_p2] o.a.s.u.CommitTracker Soft AutoCommit: disabled
   [junit4]   2> 83652 INFO  (qtp1458797372-674) [n:127.0.0.1:45439_solr c:pull_replica_test_real_time_get s:shard1 r:core_node3 x:pull_replica_test_real_time_get_shard1_replica_n1] o.a.s.r.ManagedResourceStorage Configured ZooKeeperStorageIO with znodeBase: /configs/conf
   [junit4]   2> 83652 INFO  (qtp1458797372-674) [n:127.0.0.1:45439_solr c:pull_replica_test_real_time_get s:shard1 r:core_node3 x:pull_replica_test_real_time_get_shard1_replica_n1] o.a.s.r.ManagedResourceStorage Loaded null at path _rest_managed.json using ZooKeeperStorageIO:path=/configs/conf
   [junit4]   2> 83652 INFO  (qtp1458797372-674) [n:127.0.0.1:45439_solr c:pull_replica_test_real_time_get s:shard1 r:core_node3 x:pull_replica_test_real_time_get_shard1_replica_n1] o.a.s.h.ReplicationHandler Commits will be reserved for 10000ms.
   [junit4]   2> 83653 INFO  (qtp1600651-671) [n:127.0.0.1:37005_solr c:pull_replica_test_real_time_get s:shard1 r:core_node4 x:pull_replica_test_real_time_get_shard1_replica_p2] o.a.s.s.SolrIndexSearcher Opening [Searcher@607bd0ec[pull_replica_test_real_time_get_shard1_replica_p2] main]
   [junit4]   2> 83653 INFO  (searcherExecutor-189-thread-1-processing-n:127.0.0.1:45439_solr x:pull_replica_test_real_time_get_shard1_replica_n1 s:shard1 c:pull_replica_test_real_time_get r:core_node3) [n:127.0.0.1:45439_solr c:pull_replica_test_real_time_get s:shard1 r:core_node3 x:pull_replica_test_real_time_get_shard1_replica_n1] o.a.s.c.SolrCore [pull_replica_test_real_time_get_shard1_replica_n1] Registered new searcher Searcher@2aac082d[pull_replica_test_real_time_get_shard1_replica_n1] main{ExitableDirectoryReader(UninvertingDirectoryReader())}
   [junit4]   2> 83653 INFO  (qtp1458797372-674) [n:127.0.0.1:45439_solr c:pull_replica_test_real_time_get s:shard1 r:core_node3 x:pull_replica_test_real_time_get_shard1_replica_n1] o.a.s.u.UpdateLog Could not find max version in index or recent updates, using new clock 1587687145881993216
   [junit4]   2> 83654 INFO  (qtp1600651-671) [n:127.0.0.1:37005_solr c:pull_replica_test_real_time_get s:shard1 r:core_node4 x:pull_replica_test_real_time_get_shard1_replica_p2] o.a.s.r.ManagedResourceStorage Configured ZooKeeperStorageIO with znodeBase: /configs/conf
   [junit4]   2> 83654 INFO  (qtp1600651-671) [n:127.0.0.1:37005_solr c:pull_replica_test_real_time_get s:shard1 r:core_node4 x:pull_replica_test_real_time_get_shard1_replica_p2] o.a.s.r.ManagedResourceStorage Loaded null at path _rest_managed.json using ZooKeeperStorageIO:path=/configs/conf
   [junit4]   2> 83654 INFO  (qtp1600651-671) [n:127.0.0.1:37005_solr c:pull_replica_test_real_time_get s:shard1 r:core_node4 x:pull_replica_test_real_time_get_shard1_replica_p2] o.a.s.h.ReplicationHandler Commits will be reserved for 10000ms.
   [junit4]   2> 83655 INFO  (qtp1600651-671) [n:127.0.0.1:37005_solr c:pull_replica_test_real_time_get s:shard1 r:core_node4 x:pull_replica_test_real_time_get_shard1_replica_p2] o.a.s.c.ZkController pull_replica_test_real_time_get_shard1_replica_p2 starting background replication from leader
   [junit4]   2> 83655 INFO  (qtp1600651-671) [n:127.0.0.1:37005_solr c:pull_replica_test_real_time_get s:shard1 r:core_node4 x:pull_replica_test_real_time_get_shard1_replica_p2] o.a.s.c.ReplicateFromLeader Will start replication from leader with poll interval: 00:00:03
   [junit4]   2> 83655 INFO  (searcherExecutor-188-thread-1-processing-n:127.0.0.1:37005_solr x:pull_replica_test_real_time_get_shard1_replica_p2 s:shard1 c:pull_replica_test_real_time_get r:core_node4) [n:127.0.0.1:37005_solr c:pull_replica_test_real_time_get s:shard1 r:core_node4 x:pull_replica_test_real_time_get_shard1_replica_p2] o.a.s.c.SolrCore [pull_replica_test_real_time_get_shard1_replica_p2] Registered new searcher Searcher@607bd0ec[pull_replica_test_real_time_get_shard1_replica_p2] main{ExitableDirectoryReader(UninvertingDirectoryReader())}
   [junit4]   2> 83656 INFO  (qtp1600651-671) [n:127.0.0.1:37005_solr c:pull_replica_test_real_time_get s:shard1 r:core_node4 x:pull_replica_test_real_time_get_shard1_replica_p2] o.a.s.h.ReplicationHandler Poll scheduled at an interval of 3000ms
   [junit4]   2> 83656 INFO  (qtp1600651-671) [n:127.0.0.1:37005_solr c:pull_replica_test_real_time_get s:shard1 r:core_node4 x:pull_replica_test_real_time_get_shard1_replica_p2] o.a.s.h.ReplicationHandler Commits will be reserved for 10000ms.
   [junit4]   2> 83657 INFO  (qtp1458797372-674) [n:127.0.0.1:45439_solr c:pull_replica_test_real_time_get s:shard1 r:core_node3 x:pull_replica_test_real_time_get_shard1_replica_n1] o.a.s.c.ShardLeaderElectionContext Enough replicas found to continue.
   [junit4]   2> 83657 INFO  (qtp1458797372-674) [n:127.0.0.1:45439_solr c:pull_replica_test_real_time_get s:shard1 r:core_node3 x:pull_replica_test_real_time_get_shard1_replica_n1] o.a.s.c.ShardLeaderElectionContext I may be the new leader - try and sync
   [junit4]   2> 83657 INFO  (qtp1458797372-674) [n:127.0.0.1:45439_solr c:pull_replica_test_real_time_get s:shard1 r:core_node3 x:pull_replica_test_real_time_get_shard1_replica_n1] o.a.s.c.SyncStrategy Sync replicas to https://127.0.0.1:45439/solr/pull_replica_test_real_time_get_shard1_replica_n1/
   [junit4]   2> 83657 INFO  (qtp1458797372-674) [n:127.0.0.1:45439_solr c:pull_replica_test_real_time_get s:shard1 r:core_node3 x:pull_replica_test_real_time_get_shard1_replica_n1] o.a.s.c.SyncStrategy Sync Success - now sync replicas to me
   [junit4]   2> 83657 INFO  (qtp1458797372-674) [n:127.0.0.1:45439_solr c:pull_replica_test_real_time_get s:shard1 r:core_node3 x:pull_replica_test_real_time_get_shard1_replica_n1] o.a.s.c.SyncStrategy https://127.0.0.1:45439/solr/pull_replica_test_real_time_get_shard1_replica_n1/ has no replicas
   [junit4]   2> 83657 INFO  (qtp1458797372-674) [n:127.0.0.1:45439_solr c:pull_replica_test_real_time_get s:shard1 r:core_node3 x:pull_replica_test_real_time_get_shard1_replica_n1] o.a.s.c.ShardLeaderElectionContext Found all replicas participating in election, clear LIR
   [junit4]   2> 83658 INFO  (qtp1458797372-674) [n:127.0.0.1:45439_solr c:pull_replica_test_real_time_get s:shard1 r:core_node3 x:pull_replica_test_real_time_get_shard1_replica_n1] o.a.s.c.ShardLeaderElectionContext I am the new leader: https://127.0.0.1:45439/solr/pull_replica_test_real_time_get_shard1_replica_n1/ shard1
   [junit4]   2> 87665 ERROR (indexFetcher-198-thread-1) [n:127.0.0.1:37005_solr c:pull_replica_test_real_time_get s:shard1 r:core_node4 x:pull_replica_test_real_time_get_shard1_replica_p2] o.a.s.h.ReplicationHandler Index fetch failed :org.apache.solr.common.SolrException: No registered leader was found after waiting for 4000ms , collection: pull_replica_test_real_time_get slice: shard1 saw state=DocCollection(pull_replica_test_real_time_get//collections/pull_replica_test_real_time_get/state.json/2)={
   [junit4]   2>   "pullReplicas":"1",
   [junit4]   2>   "replicationFactor":"1",
   [junit4]   2>   "shards":{"shard1":{
   [junit4]   2>       "range":"80000000-7fffffff",
   [junit4]   2>       "state":"active",
   [junit4]   2>       "replicas":{
   [junit4]   2>         "core_node3":{
   [junit4]   2>           "core":"pull_replica_test_real_time_get_shard1_replica_n1",
   [junit4]   2>           "base_url":"https://127.0.0.1:45439/solr",
   [junit4]   2>           "node_name":"127.0.0.1:45439_solr",
   [junit4]   2>           "state":"down",
   [junit4]   2>           "type":"NRT"},
   [junit4]   2>         "core_node4":{
   [junit4]   2>           "core":"pull_replica_test_real_time_get_shard1_replica_p2",
   [junit4]   2>           "base_url":"https://127.0.0.1:37005/solr",
   [junit4]   2>           "node_name":"127.0.0.1:37005_solr",
   [junit4]   2>           "state":"down",
   [junit4]   2>           "type":"PULL"}}}},
   [junit4]   2>   "router":{"name":"compositeId"},
   [junit4]   2>   "maxShardsPerNode":"100",
   [junit4]   2>   "autoAddReplicas":"false",
   [junit4]   2>   "nrtReplicas":"1",
   [junit4]   2>   "tlogReplicas":"0"} with live_nodes=[127.0.0.1:37005_solr, 127.0.0.1:45439_solr]
   [junit4]   2> 	at org.apache.solr.common.cloud.ZkStateReader.getLeaderRetry(ZkStateReader.java:772)
   [junit4]   2> 	at org.apache.solr.common.cloud.ZkStateReader.getLeaderRetry(ZkStateReader.java:756)
   [junit4]   2> 	at org.apache.solr.handler.IndexFetcher.getLeaderReplica(IndexFetcher.java:684)
   [junit4]   2> 	at org.apache.solr.handler.IndexFetcher.fetchLatestIndex(IndexFetcher.java:380)
   [junit4]   2> 	at org.apache.solr.handler.IndexFetcher.fetchLatestIndex(IndexFetcher.java:345)
   [junit4]   2> 	at org.apache.solr.handler.ReplicationHandler.doFetch(ReplicationHandler.java:420)
   [junit4]   2> 	at org.apache.solr.handler.ReplicationHandler.lambda$setupPolling$12(ReplicationHandler.java:1159)
   [junit4]   2> 	at java.base/java.util.concurrent.Executors$RunnableAdapter.call(Executors.java:514)
   [junit4]   2> 	at java.base/java.util.concurrent.FutureTask.runAndReset(FutureTask.java:305)
   [junit4]   2> 	at java.base/java.util.concurrent.ScheduledThreadPoolExecutor$ScheduledFutureTask.run(ScheduledThreadPoolExecutor.java:300)
   [junit4]   2> 	at java.base/java.util.concurrent.ThreadPoolExecutor.runWorker(ThreadPoolExecutor.java:1167)
   [junit4]   2> 	at java.base/java.util.concurrent.ThreadPoolExecutor$Worker.run(ThreadPoolExecutor.java:641)
   [junit4]   2> 	at java.base/java.lang.Thread.run(Thread.java:844)
   [junit4]   2> 
   [junit4]   2> 87666 INFO  (indexFetcher-198-thread-1) [n:127.0.0.1:37005_solr c:pull_replica_test_real_time_get s:shard1 r:core_node4 x:pull_replica_test_real_time_get_shard1_replica_p2] o.a.s.h.IndexFetcher Last replication failed, so I'll force replication
   [junit4]   2> 91673 ERROR (indexFetcher-198-thread-1) [n:127.0.0.1:37005_solr c:pull_replica_test_real_time_get s:shard1 r:core_node4 x:pull_replica_test_real_time_get_shard1_replica_p2] o.a.s.h.ReplicationHandler Index fetch failed :org.apache.solr.common.SolrException: No registered leader was found after waiting for 4000ms , collection: pull_replica_test_real_time_get slice: shard1 saw state=DocCollection(pull_replica_test_real_time_get//collections/pull_replica_test_real_time_get/state.json/2)={
   [junit4]   2>   "pullReplicas":"1",
   [junit4]   2>   "replicationFactor":"1",
   [junit4]   2>   "shards":{"shard1":{
   [junit4]   2>       "range":"80000000-7fffffff",
   [junit4]   2>       "state":"active",
   [junit4]   2>       "replicas":{
   [junit4]   2>         "core_node3":{
   [junit4]   2>           "core":"pull_replica_test_real_time_get_shard1_replica_n1",
   [junit4]   2>           "base_url":"https://127.0.0.1:45439/solr",
   [junit4]   2>           "node_name":"127.0.0.1:45439_solr",
   [junit4]   2>           "state":"down",
   [junit4]   2>           "type":"NRT"},
   [junit4]   2>         "core_node4":{
   [junit4]   2>           "core":"pull_replica_test_real_time_get_shard1_replica_p2",
   [junit4]   2>           "base_url":"https://127.0.0.1:37005/solr",
   [junit4]   2>           "node_name":"127.0.0.1:37005_solr",
   [junit4]   2>           "state":"down",
   [junit4]   2>           "type":"PULL"}}}},
   [junit4]   2>   "router":{"name":"compositeId"},
   [junit4]   2>   "maxShardsPerNode":"100",
   [junit4]   2>   "autoAddReplicas":"false",
   [junit4]   2>   "nrtReplicas":"1",
   [junit4]   2>   "tlogReplicas":"0"} with live_nodes=[127.0.0.1:37005_solr, 127.0.0.1:45439_solr]
   [junit4]   2> 	at org.apache.solr.common.cloud.ZkStateReader.getLeaderRetry(ZkStateReader.java:772)
   [junit4]   2> 	at org.apache.solr.common.cloud.ZkStateReader.getLeaderRetry(ZkStateReader.java:756)
   [junit4]   2> 	at org.apache.solr.handler.IndexFetcher.getLeaderReplica(IndexFetcher.java:684)
   [junit4]   2> 	at org.apache.solr.handler.IndexFetcher.fetchLatestIndex(IndexFetcher.java:380)
   [junit4]   2> 	at org.apache.solr.handler.IndexFetcher.fetchLatestIndex(IndexFetcher.java:345)
   [junit4]   2> 	at org.apache.solr.handler.ReplicationHandler.doFetch(ReplicationHandler.java:420)
   [junit4]   2> 	at org.apache.solr.handler.ReplicationHandler.lambda$setupPolling$12(ReplicationHandler.java:1159)
   [junit4]   2> 	at java.base/java.util.concurrent.Executors$RunnableAdapter.call(Executors.java:514)
   [junit4]   2> 	at java.base/java.util.concurrent.FutureTask.runAndReset(FutureTask.java:305)
   [junit4]   2> 	at java.base/java.util.concurrent.ScheduledThreadPoolExecutor$ScheduledFutureTask.run(ScheduledThreadPoolExecutor.java:300)
   [junit4]   2> 	at java.base/java.util.concurrent.ThreadPoolExecutor.runWorker(ThreadPoolExecutor.java:1167)
   [junit4]   2> 	at java.base/java.util.concurrent.ThreadPoolExecutor$Worker.run(ThreadPoolExecutor.java:641)
   [junit4]   2> 	at java.base/java.lang.Thread.run(Thread.java:844)
   [junit4]   2> 
   [junit4]   2> 91673 INFO  (indexFetcher-198-thread-1) [n:127.0.0.1:37005_solr c:pull_replica_test_real_time_get s:shard1 r:core_node4 x:pull_replica_test_real_time_get_shard1_replica_p2] o.a.s.h.IndexFetcher Last replication failed, so I'll force replication
   [junit4]   2> 95681 ERROR (indexFetcher-198-thread-1) [n:127.0.0.1:37005_solr c:pull_replica_test_real_time_get s:shard1 r:core_node4 x:pull_replica_test_real_time_get_shard1_replica_p2] o.a.s.h.ReplicationHandler Index fetch failed :org.apache.solr.common.SolrException: No registered leader was found after waiting for 4000ms , collection: pull_replica_test_real_time_get slice: shard1 saw state=DocCollection(pull_replica_test_real_time_get//collections/pull_replica_test_real_time_get/state.json/2)={
   [junit4]   2>   "pullReplicas":"1",
   [junit4]   2>   "replicationFactor":"1",
   [junit4]   2>   "shards":{"shard1":{
   [junit4]   2>       "range":"80000000-7fffffff",
   [junit4]   2>       "state":"active",
   [junit4]   2>       "replicas":{
   [junit4]   2>         "core_node3":{
   [junit4]   2>           "core":"pull_replica_test_real_time_get_shard1_replica_n1",
   [junit4]   2>           "base_url":"https://127.0.0.1:45439/solr",
   [junit4]   2>           "node_name":"127.0.0.1:45439_solr",
   [junit4]   2>           "state":"down",
   [junit4]   2>           "type":"NRT"},
   [junit4]   2>         "core_node4":{
   [junit4]   2>           "core":"pull_replica_test_real_time_get_shard1_replica_p2",
   [junit4]   2>           "base_url":"https://127.0.0.1:37005/solr",
   [junit4]   2>           "node_name":"127.0.0.1:37005_solr",
   [junit4]   2>           "state":"down",
   [junit4]   2>           "type":"PULL"}}}},
   [junit4]   2>   "router":{"name":"compositeId"},
   [junit4]   2>   "maxShardsPerNode":"100",
   [junit4]   2>   "autoAddReplicas":"false",
   [junit4]   2>   "nrtReplicas":"1",
   [junit4]   2>   "tlogReplicas":"0"} with live_nodes=[127.0.0.1:37005_solr, 127.0.0.1:45439_solr]
   [junit4]   2> 	at org.apache.solr.common.cloud.ZkStateReader.getLeaderRetry(ZkStateReader.java:772)
   [junit4]   2> 	at org.apache.solr.common.cloud.ZkStateReader.getLeaderRetry(ZkStateReader.java:756)
   [junit4]   2> 	at org.apache.solr.handler.IndexFetcher.getLeaderReplica(IndexFetcher.java:684)
   [junit4]   2> 	at org.apache.solr.handler.IndexFetcher.fetchLatestIndex(IndexFetcher.java:380)
   [junit4]   2> 	at org.apache.solr.handler.IndexFetcher.fetchLatestIndex(IndexFetcher.java:345)
   [junit4]   2> 	at org.apache.solr.handler.ReplicationHandler.doFetch(ReplicationHandler.java:420)
   [junit4]   2> 	at org.apache.solr.handler.ReplicationHandler.lambda$setupPolling$12(ReplicationHandler.java:1159)
   [junit4]   2> 	at java.base/java.util.concurrent.Executors$RunnableAdapter.call(Executors.java:514)
   [junit4]   2> 	at java.base/java.util.concurrent.FutureTask.runAndReset(FutureTask.java:305)
   [junit4]   2> 	at java.base/java.util.concurrent.ScheduledThreadPoolExecutor$ScheduledFutureTask.run(ScheduledThreadPoolExecutor.java:300)
   [junit4]   2> 	at java.base/java.util.concurrent.ThreadPoolExecutor.runWorker(ThreadPoolExecutor.java:1167)
   [junit4]   2> 	at java.base/java.util.concurrent.ThreadPoolExecutor$Worker.run(ThreadPoolExecutor.java:641)
   [junit4]   2> 	at java.base/java.lang.Thread.run(Thread.java:844)
   [junit4]   2> 
   [junit4]   2> 95682 INFO  (indexFetcher-198-thread-1) [n:127.0.0.1:37005_solr c:pull_replica_test_real_time_get s:shard1 r:core_node4 x:pull_replica_test_real_time_get_shard1_replica_p2] o.a.s.h.IndexFetcher Last replication failed, so I'll force replication
   [junit4]   2> 99690 ERROR (indexFetcher-198-thread-1) [n:127.0.0.1:37005_solr c:pull_replica_test_real_time_get s:shard1 r:core_node4 x:pull_replica_test_real_time_get_shard1_replica_p2] o.a.s.h.ReplicationHandler Index fetch failed :org.apache.solr.common.SolrException: No registered leader was found after waiting for 4000ms , collection: pull_replica_test_real_time_get slice: shard1 saw state=DocCollection(pull_replica_test_real_time_get//collections/pull_replica_test_real_time_get/state.json/2)={
   [junit4]   2>   "pullReplicas":"1",
   [junit4]   2>   "replicationFactor":"1",
   [junit4]   2>   "shards":{"shard1":{
   [junit4]   2>       "range":"80000000-7fffffff",
   [junit4]   2>       "state":"active",
   [junit4]   2>       "replicas":{
   [junit4]   2>         "core_node3":{
   [junit4]   2>           "core":"pull_replica_test_real_time_get_shard1_replica_n1",
   [junit4]   2>           "base_url":"https://127.0.0.1:45439/solr",
   [junit4]   2>           "node_name":"127.0.0.1:45439_solr",
   [junit4]   2>           "state":"down",
   [junit4]   2>           "type":"NRT"},
   [junit4]   2>         "core_node4":{
   [junit4]   2>           "core":"pull_replica_test_real_time_get_shard1_replica_p2",
   [junit4]   2>           "base_url":"https://127.0.0.1:37005/solr",
   [junit4]   2>           "node_name":"127.0.0.1:37005_solr",
   [junit4]   2>           "state":"down",
   [junit4]   2>           "type":"PULL"}}}},
   [junit4]   2>   "router":{"name":"compositeId"},
   [junit4]   2>   "maxShardsPerNode":"100",
   [junit4]   2>   "autoAddReplicas":"false",
   [junit4]   2>   "nrtReplicas":"1",
   [junit4]   2>   "tlogReplicas":"0"} with live_nodes=[127.0.0.1:37005_solr, 127.0.0.1:45439_solr]
   [junit4]   2> 	at org.apache.solr.common.cloud.ZkStateReader.getLeaderRetry(ZkStateReader.java:772)
   [junit4]   2> 	at org.apache.solr.common.cloud.ZkStateReader.getLeaderRetry(ZkStateReader.java:756)
   [junit4]   2> 	at org.apache.solr.handler.IndexFetcher.getLeaderReplica(IndexFetcher.java:684)
   [junit4]   2> 	at org.apache.solr.handler.IndexFetcher.fetchLatestIndex(IndexFetcher.java:380)
   [junit4]   2> 	at org.apache.solr.handler.IndexFetcher.fetchLatestIndex(IndexFetcher.java:345)
   [junit4]   2> 	at org.apache.solr.handler.ReplicationHandler.doFetch(ReplicationHandler.java:420)
   [junit4]   2> 	at org.apache.solr.handler.ReplicationHandler.lambda$setupPolling$12(ReplicationHandler.java:1159)
   [junit4]   2> 	at java.base/java.util.concurrent.Executors$RunnableAdapter.call(Executors.java:514)
   [junit4]   2> 	at java.base/java.util.concurrent.FutureTask.runAndReset(FutureTask.java:305)
   [junit4]   2> 	at java.base/java.util.concurrent.ScheduledThreadPoolExecutor$ScheduledFutureTask.run(ScheduledThreadPoolExecutor.java:300)
   [junit4]   2> 	at java.base/java.util.concurrent.ThreadPoolExecutor.runWorker(ThreadPoolExecutor.java:1167)
   [junit4]   2> 	at java.base/java.util.concurrent.ThreadPoolExecutor$Worker.run(ThreadPoolExecutor.java:641)
   [junit4]   2> 	at java.base/java.lang.Thread.run(Thread.java:844)
   [junit4]   2> 
   [junit4]   2> 99691 INFO  (indexFetcher-198-thread-1) [n:127.0.0.1:37005_solr c:pull_replica_test_real_time_get s:shard1 r:core_node4 x:pull_replica_test_real_time_get_shard1_replica_p2] o.a.s.h.IndexFetcher Last replication failed, so I'll force replication
   [junit4]   2> 103700 ERROR (indexFetcher-198-thread-1) [n:127.0.0.1:37005_solr c:pull_replica_test_real_time_get s:shard1 r:core_node4 x:pull_replica_test_real_time_get_shard1_replica_p2] o.a.s.h.ReplicationHandler Index fetch failed :org.apache.solr.common.SolrException: No registered leader was found after waiting for 4000ms , collection: pull_replica_test_real_time_get slice: shard1 saw state=DocCollection(pull_replica_test_real_time_get//collections/pull_replica_test_real_time_get/state.json/2)={
   [junit4]   2>   "pullReplicas":"1",
   [junit4]   2>   "replicationFactor":"1",
   [junit4]   2>   "shards":{"shard1":{
   [junit4]   2>       "range":"80000000-7fffffff",
   [junit4]   2>       "state":"active",
   [junit4]   2>       "replicas":{
   [junit4]   2>         "core_node3":{
   [junit4]   2>           "core":"pull_replica_test_real_time_get_shard1_replica_n1",
   [junit4]   2>           "base_url":"https://127.0.0.1:45439/solr",
   [junit4]   2>           "node_name":"127.0.0.1:45439_solr",
   [junit4]   2>           "state":"down",
   [junit4]   2>           "type":"NRT"},
   [junit4]   2>         "core_node4":{
   [junit4]   2>           "core":"pull_replica_test_real_time_get_shard1_replica_p2",
   [junit4]   2>           "base_url":"https://127.0.0.1:37005/solr",
   [junit4]   2>           "node_name":"127.0.0.1:37005_solr",
   [junit4]   2>           "state":"down",
   [junit4]   2>           "type":"PULL"}}}},
   [junit4]   2>   "router":{"name":"compositeId"},
   [junit4]   2>   "maxShardsPerNode":"100",
   [junit4]   2>   "autoAddReplicas":"false",
   [junit4]   2>   "nrtReplicas":"1",
   [junit4]   2>   "tlogReplicas":"0"} with live_nodes=[127.0.0.1:37005_solr, 127.0.0.1:45439_solr]
   [junit4]   2> 	at org.apache.solr.common.cloud.ZkStateReader.getLeaderRetry(ZkStateReader.java:772)
   [junit4]   2> 	at org.apache.solr.common.cloud.ZkStateReader.getLeaderRetry(ZkStateReader.java:756)
   [junit4]   2> 	at org.apache.solr.handler.IndexFetcher.getLeaderReplica(IndexFetcher.java:684)
   [junit4]   2> 	at org.apache.solr.handler.IndexFetcher.fetchLatestIndex(IndexFetcher.java:380)
   [junit4]   2> 	at org.apache.solr.handler.IndexFetcher.fetchLatestIndex(IndexFetcher.java:345)
   [junit4]   2> 	at org.apache.solr.handler.ReplicationHandler.doFetch(ReplicationHandler.java:420)
   [junit4]   2> 	at org.apache.solr.handler.ReplicationHandler.lambda$setupPolling$12(ReplicationHandler.java:1159)
   [junit4]   2> 	at java.base/java.util.concurrent.Executors$RunnableAdapter.call(Executors.java:514)
   [junit4]   2> 	at java.base/java.util.concurrent.FutureTask.runAndReset(FutureTask.java:305)
   [junit4]   2> 	at java.base/java.util.concurrent.ScheduledThreadPoolExecutor$ScheduledFutureTask.run(ScheduledThreadPoolExecutor.java:300)
   [junit4]   2> 	at java.base/java.util.concurrent.ThreadPoolExecutor.runWorker(ThreadPoolExecutor.java:1167)
   [junit4]   2> 	at java.base/java.util.concurrent.ThreadPoolExecutor$Worker.run(ThreadPoolExecutor.java:641)
   [junit4]   2> 	at java.base/java.lang.Thread.run(Thread.java:844)
   [junit4]   2> 
   [junit4]   2> 103700 INFO  (indexFetcher-198-thread-1) [n:127.0.0.1:37005_solr c:pull_replica_test_real_time_get s:shard1 r:core_node4 x:pull_replica_test_real_time_get_shard1_replica_p2] o.a.s.h.IndexFetcher Last replication failed, so I'll force replication
   [junit4]   2> 107709 ERROR (indexFetcher-198-thread-1) [n:127.0.0.1:37005_solr c:pull_replica_test_real_time_get s:shard1 r:core_node4 x:pull_replica_test_real_time_get_shard1_replica_p2] o.a.s.h.ReplicationHandler Index fetch failed :org.apache.solr.common.SolrException: No registered leader was found after waiting for 4000ms , collection: pull_replica_test_real_time_get slice: shard1 saw state=DocCollection(pull_replica_test_real_time_get//collections/pull_replica_test_real_time_get/state.json/2)={
   [junit4]   2>   "pullReplicas":"1",
   [junit4]   2>   "replicationFactor":"1",
   [junit4]   2>   "shards":{"shard1":{
   [junit4]   2>       "range":"80000000-7fffffff",
   [junit4]   2>       "state":"active",
   [junit4]   2>       "replicas":{
   [junit4]   2>         "core_node3":{
   [junit4]   2>           "core":"pull_replica_test_real_time_get_shard1_replica_n1",
   [junit4]   2>           "base_url":"https://127.0.0.1:45439/solr",
   [junit4]   2>           "node_name":"127.0.0.1:45439_solr",
   [junit4]   2>           "state":"down",
   [junit4]   2>           "type":"NRT"},
   [junit4]   2>         "core_node4":{
   [junit4]   2>           "core":"pull_replica_test_real_time_get_shard1_replica_p2",
   [junit4]   2>           "base_url":"https://127.0.0.1:37005/solr",
   [junit4]   2>           "node_name":"127.0.0.1:37005_solr",
   [junit4]   2>           "state":"down",
   [junit4]   2>           "type":"PULL"}}}},
   [junit4]   2>   "router":{"name":"compositeId"},
   [junit4]   2>   "maxShardsPerNode":"100",
   [junit4]   2>   "autoAddReplicas":"false",
   [junit4]   2>   "nrtReplicas":"1",
   [junit4]   2>   "tlogReplicas":"0"} with live_nodes=[127.0.0.1:37005_solr, 127.0.0.1:45439_solr]
   [junit4]   2> 	at org.apache.solr.common.cloud.ZkStateReader.getLeaderRetry(ZkStateReader.java:772)
   [junit4]   2> 	at org.apache.solr.common.cloud.ZkStateReader.getLeaderRetry(ZkStateReader.java:756)
   [junit4]   2> 	at org.apache.solr.handler.IndexFetcher.getLeaderReplica(IndexFetcher.java:684)
   [junit4]   2> 	at org.apache.solr.handler.IndexFetcher.fetchLatestIndex(IndexFetcher.java:380)
   [junit4]   2> 	at org.apache.solr.handler.IndexFetcher.fetchLatestIndex(IndexFetcher.java:345)
   [junit4]   2> 	at org.apache.solr.handler.ReplicationHandler.doFetch(ReplicationHandler.java:420)
   [junit4]   2> 	at org.apache.solr.handler.ReplicationHandler.lambda$setupPolling$12(ReplicationHandler.java:1159)
   [junit4]   2> 	at java.base/java.util.concurrent.Executors$RunnableAdapter.call(Executors.java:514)
   [junit4]   2> 	at java.base/java.util.concurrent.FutureTask.runAndReset(FutureTask.java:305)
   [junit4]   2> 	at java.base/java.util.concurrent.ScheduledThreadPoolExecutor$ScheduledFutureTask.run(ScheduledThreadPoolExecutor.java:300)
   [junit4]   2> 	at java.base/java.util.concurrent.ThreadPoolExecutor.runWorker(ThreadPoolExecutor.java:1167)
   [junit4]   2> 	at java.base/java.util.concurrent.ThreadPoolExecutor$Worker.run(ThreadPoolExecutor.java:641)
   [junit4]   2> 	at java.base/java.lang.Thread.run(Thread.java:844)
   [junit4]   2> 
   [jun

[...truncated too long message...]

ver.handler.HandlerWrapper.handle(HandlerWrapper.java:134)
   [junit4]   2> 	at org.eclipse.jetty.server.Server.handle(Server.java:534)
   [junit4]   2> 	at org.eclipse.jetty.server.HttpChannel.handle(HttpChannel.java:320)
   [junit4]   2> 	at org.eclipse.jetty.server.HttpConnection.onFillable(HttpConnection.java:251)
   [junit4]   2> 	at org.eclipse.jetty.io.AbstractConnection$ReadCallback.succeeded(AbstractConnection.java:283)
   [junit4]   2> 	at org.eclipse.jetty.io.FillInterest.fillable(FillInterest.java:108)
   [junit4]   2> 	at org.eclipse.jetty.io.ssl.SslConnection.onFillable(SslConnection.java:251)
   [junit4]   2> 	at org.eclipse.jetty.io.AbstractConnection$ReadCallback.succeeded(AbstractConnection.java:283)
   [junit4]   2> 	at org.eclipse.jetty.io.FillInterest.fillable(FillInterest.java:108)
   [junit4]   2> 	at org.eclipse.jetty.io.SelectChannelEndPoint$2.run(SelectChannelEndPoint.java:93)
   [junit4]   2> 	at org.eclipse.jetty.util.thread.strategy.ExecuteProduceConsume.executeProduceConsume(ExecuteProduceConsume.java:303)
   [junit4]   2> 	at org.eclipse.jetty.util.thread.strategy.ExecuteProduceConsume.produceConsume(ExecuteProduceConsume.java:148)
   [junit4]   2> 	at org.eclipse.jetty.util.thread.strategy.ExecuteProduceConsume.run(ExecuteProduceConsume.java:136)
   [junit4]   2> 	at org.eclipse.jetty.util.thread.QueuedThreadPool.runJob(QueuedThreadPool.java:671)
   [junit4]   2> 	at org.eclipse.jetty.util.thread.QueuedThreadPool$2.run(QueuedThreadPool.java:589)
   [junit4]   2> 	at java.base/java.lang.Thread.run(Thread.java:844)
   [junit4]   2> 683050 INFO  (jetty-closer-106-thread-2) [    ] o.e.j.s.h.ContextHandler Stopped o.e.j.s.ServletContextHandler@6aa7b75a{/solr,null,UNAVAILABLE}
   [junit4]   2> 683051 ERROR (qtp1458797372-674) [n:127.0.0.1:45439_solr c:pull_replica_test_real_time_get s:shard1 r:core_node3 x:pull_replica_test_real_time_get_shard1_replica_n1] o.a.s.c.ZkContainer :org.apache.solr.common.SolrException: Error getting leader from zk for shard shard1
   [junit4]   2> 	at org.apache.solr.cloud.ZkController.getLeader(ZkController.java:1207)
   [junit4]   2> 	at org.apache.solr.cloud.ZkController.register(ZkController.java:1079)
   [junit4]   2> 	at org.apache.solr.cloud.ZkController.register(ZkController.java:1014)
   [junit4]   2> 	at org.apache.solr.core.ZkContainer.lambda$registerInZk$0(ZkContainer.java:181)
   [junit4]   2> 	at org.apache.solr.core.ZkContainer.registerInZk(ZkContainer.java:208)
   [junit4]   2> 	at org.apache.solr.core.CoreContainer.registerCore(CoreContainer.java:886)
   [junit4]   2> 	at org.apache.solr.core.CoreContainer.createFromDescriptor(CoreContainer.java:1047)
   [junit4]   2> 	at org.apache.solr.core.CoreContainer.create(CoreContainer.java:948)
   [junit4]   2> 	at org.apache.solr.handler.admin.CoreAdminOperation.lambda$static$0(CoreAdminOperation.java:91)
   [junit4]   2> 	at org.apache.solr.handler.admin.CoreAdminOperation.execute(CoreAdminOperation.java:384)
   [junit4]   2> 	at org.apache.solr.handler.admin.CoreAdminHandler$CallInfo.call(CoreAdminHandler.java:389)
   [junit4]   2> 	at org.apache.solr.handler.admin.CoreAdminHandler.handleRequestBody(CoreAdminHandler.java:174)
   [junit4]   2> 	at org.apache.solr.handler.RequestHandlerBase.handleRequest(RequestHandlerBase.java:177)
   [junit4]   2> 	at org.apache.solr.servlet.HttpSolrCall.handleAdmin(HttpSolrCall.java:735)
   [junit4]   2> 	at org.apache.solr.servlet.HttpSolrCall.handleAdminRequest(HttpSolrCall.java:716)
   [junit4]   2> 	at org.apache.solr.servlet.HttpSolrCall.call(HttpSolrCall.java:497)
   [junit4]   2> 	at org.apache.solr.servlet.SolrDispatchFilter.doFilter(SolrDispatchFilter.java:382)
   [junit4]   2> 	at org.apache.solr.servlet.SolrDispatchFilter.doFilter(SolrDispatchFilter.java:326)
   [junit4]   2> 	at org.eclipse.jetty.servlet.ServletHandler$CachedChain.doFilter(ServletHandler.java:1759)
   [junit4]   2> 	at org.apache.solr.client.solrj.embedded.JettySolrRunner$DebugFilter.doFilter(JettySolrRunner.java:139)
   [junit4]   2> 	at org.eclipse.jetty.servlet.ServletHandler$CachedChain.doFilter(ServletHandler.java:1759)
   [junit4]   2> 	at org.eclipse.jetty.servlet.ServletHandler.doHandle(ServletHandler.java:582)
   [junit4]   2> 	at org.eclipse.jetty.server.session.SessionHandler.doHandle(SessionHandler.java:224)
   [junit4]   2> 	at org.eclipse.jetty.server.handler.ContextHandler.doHandle(ContextHandler.java:1180)
   [junit4]   2> 	at org.eclipse.jetty.servlet.ServletHandler.doScope(ServletHandler.java:512)
   [junit4]   2> 	at org.eclipse.jetty.server.session.SessionHandler.doScope(SessionHandler.java:185)
   [junit4]   2> 	at org.eclipse.jetty.server.handler.ContextHandler.doScope(ContextHandler.java:1112)
   [junit4]   2> 	at org.eclipse.jetty.server.handler.ScopedHandler.handle(ScopedHandler.java:141)
   [junit4]   2> 	at org.eclipse.jetty.server.handler.gzip.GzipHandler.handle(GzipHandler.java:426)
   [junit4]   2> 	at org.eclipse.jetty.server.handler.HandlerWrapper.handle(HandlerWrapper.java:134)
   [junit4]   2> 	at org.eclipse.jetty.server.Server.handle(Server.java:534)
   [junit4]   2> 	at org.eclipse.jetty.server.HttpChannel.handle(HttpChannel.java:320)
   [junit4]   2> 	at org.eclipse.jetty.server.HttpConnection.onFillable(HttpConnection.java:251)
   [junit4]   2> 	at org.eclipse.jetty.io.AbstractConnection$ReadCallback.succeeded(AbstractConnection.java:283)
   [junit4]   2> 	at org.eclipse.jetty.io.FillInterest.fillable(FillInterest.java:108)
   [junit4]   2> 	at org.eclipse.jetty.io.ssl.SslConnection.onFillable(SslConnection.java:251)
   [junit4]   2> 	at org.eclipse.jetty.io.AbstractConnection$ReadCallback.succeeded(AbstractConnection.java:283)
   [junit4]   2> 	at org.eclipse.jetty.io.FillInterest.fillable(FillInterest.java:108)
   [junit4]   2> 	at org.eclipse.jetty.io.SelectChannelEndPoint$2.run(SelectChannelEndPoint.java:93)
   [junit4]   2> 	at org.eclipse.jetty.util.thread.strategy.ExecuteProduceConsume.executeProduceConsume(ExecuteProduceConsume.java:303)
   [junit4]   2> 	at org.eclipse.jetty.util.thread.strategy.ExecuteProduceConsume.produceConsume(ExecuteProduceConsume.java:148)
   [junit4]   2> 	at org.eclipse.jetty.util.thread.strategy.ExecuteProduceConsume.run(ExecuteProduceConsume.java:136)
   [junit4]   2> 	at org.eclipse.jetty.util.thread.QueuedThreadPool.runJob(QueuedThreadPool.java:671)
   [junit4]   2> 	at org.eclipse.jetty.util.thread.QueuedThreadPool$2.run(QueuedThreadPool.java:589)
   [junit4]   2> 	at java.base/java.lang.Thread.run(Thread.java:844)
   [junit4]   2> Caused by: org.apache.solr.common.SolrException: No registered leader was found after waiting for 1220000ms , collection: pull_replica_test_real_time_get slice: shard1 saw state=null with live_nodes=[]
   [junit4]   2> 	at org.apache.solr.common.cloud.ZkStateReader.getLeaderRetry(ZkStateReader.java:772)
   [junit4]   2> 	at org.apache.solr.common.cloud.ZkStateReader.getLeaderUrl(ZkStateReader.java:737)
   [junit4]   2> 	at org.apache.solr.cloud.ZkController.getLeader(ZkController.java:1178)
   [junit4]   2> 	... 44 more
   [junit4]   2> 
   [junit4]   2> 683061 INFO  (qtp1458797372-674) [n:127.0.0.1:45439_solr c:pull_replica_test_real_time_get s:shard1 r:core_node3 x:pull_replica_test_real_time_get_shard1_replica_n1] o.a.s.s.HttpSolrCall [admin] webapp=null path=/admin/cores params={qt=/admin/cores&coreNodeName=core_node3&collection.configName=conf&newCollection=true&name=pull_replica_test_real_time_get_shard1_replica_n1&action=CREATE&numShards=1&collection=pull_replica_test_real_time_get&shard=shard1&wt=javabin&version=2&replicaType=NRT} status=0 QTime=600464
   [junit4]   2> 683062 ERROR (SUITE-TestPullReplica-seed#[7B25CB77D3D0A255]-worker) [    ] o.a.z.s.ZooKeeperServer ZKShutdownHandler is not registered, so ZooKeeper server won't take any action on ERROR or SHUTDOWN server state changes
   [junit4]   2> 683062 INFO  (SUITE-TestPullReplica-seed#[7B25CB77D3D0A255]-worker) [    ] o.a.s.c.ZkTestServer connecting to 127.0.0.1:36513 36513
   [junit4]   2> 688470 INFO  (Thread-94) [    ] o.a.s.c.ZkTestServer connecting to 127.0.0.1:36513 36513
   [junit4]   2> 688471 WARN  (Thread-94) [    ] o.a.s.c.ZkTestServer Watch limit violations: 
   [junit4]   2> Maximum concurrent create/delete watches above limit:
   [junit4]   2> 
   [junit4]   2> 	3	/solr/aliases.json
   [junit4]   2> 	2	/solr/security.json
   [junit4]   2> 	2	/solr/configs/conf
   [junit4]   2> 
   [junit4]   2> Maximum concurrent data watches above limit:
   [junit4]   2> 
   [junit4]   2> 	6	/solr/collections/pull_replica_test_real_time_get/state.json
   [junit4]   2> 	3	/solr/clusterstate.json
   [junit4]   2> 	3	/solr/clusterprops.json
   [junit4]   2> 
   [junit4]   2> Maximum concurrent children watches above limit:
   [junit4]   2> 
   [junit4]   2> 	3	/solr/live_nodes
   [junit4]   2> 	3	/solr/collections
   [junit4]   2> 
   [junit4]   2> NOTE: leaving temporary files on disk at: /home/jenkins/workspace/Lucene-Solr-7.2-Linux/solr/build/solr-core/test/J2/temp/solr.cloud.TestPullReplica_7B25CB77D3D0A255-001
   [junit4]   2> NOTE: test params are: codec=FastCompressingStoredFields(storedFieldsFormat=CompressingStoredFieldsFormat(compressionMode=FAST, chunkSize=16345, maxDocsPerChunk=214, blockSize=809), termVectorsFormat=CompressingTermVectorsFormat(compressionMode=FAST, chunkSize=16345, blockSize=809)), sim=RandomSimilarity(queryNorm=false): {}, locale=th, timezone=Australia/North
   [junit4]   2> NOTE: Linux 4.10.0-40-generic amd64/Oracle Corporation 9.0.1 (64-bit)/cpus=8,threads=1,free=319854400,total=529006592
   [junit4]   2> NOTE: All tests run in this JVM: [TestReloadDeadlock, DistributedDebugComponentTest, TestFuzzyAnalyzedSuggestions, RecoveryAfterSoftCommitTest, IndexBasedSpellCheckerTest, SegmentsInfoRequestHandlerTest, TestLeaderInitiatedRecoveryThread, TestPullReplica]
   [junit4] Completed [126/751 (1!)] on J2 in 606.60s, 10 tests, 8 errors, 1 skipped <<< FAILURES!

[...truncated 42333 lines...]

Mime
View raw message