lucene-dev mailing list archives

Site index · List index
Message view « Date » · « Thread »
Top « Date » · « Thread »
From Policeman Jenkins Server <jenk...@thetaphi.de>
Subject [JENKINS] Lucene-Solr-7.2-Windows (64bit/jdk1.8.0_144) - Build # 20 - Still Unstable!
Date Sun, 17 Dec 2017 21:24:06 GMT
Build: https://jenkins.thetaphi.de/job/Lucene-Solr-7.2-Windows/20/
Java: 64bit/jdk1.8.0_144 -XX:+UseCompressedOops -XX:+UseConcMarkSweepGC

2 tests failed.
FAILED:  junit.framework.TestSuite.org.apache.solr.core.TestNRTOpen

Error Message:
Could not remove the following files (in the order of attempts):    C:\Users\jenkins\workspace\Lucene-Solr-7.2-Windows\solr\build\solr-core\test\J0\temp\solr.core.TestNRTOpen_890592012B790583-001\init-core-data-001: java.nio.file.AccessDeniedException: C:\Users\jenkins\workspace\Lucene-Solr-7.2-Windows\solr\build\solr-core\test\J0\temp\solr.core.TestNRTOpen_890592012B790583-001\init-core-data-001    C:\Users\jenkins\workspace\Lucene-Solr-7.2-Windows\solr\build\solr-core\test\J0\temp\solr.core.TestNRTOpen_890592012B790583-001: java.nio.file.DirectoryNotEmptyException: C:\Users\jenkins\workspace\Lucene-Solr-7.2-Windows\solr\build\solr-core\test\J0\temp\solr.core.TestNRTOpen_890592012B790583-001 

Stack Trace:
java.io.IOException: Could not remove the following files (in the order of attempts):
   C:\Users\jenkins\workspace\Lucene-Solr-7.2-Windows\solr\build\solr-core\test\J0\temp\solr.core.TestNRTOpen_890592012B790583-001\init-core-data-001: java.nio.file.AccessDeniedException: C:\Users\jenkins\workspace\Lucene-Solr-7.2-Windows\solr\build\solr-core\test\J0\temp\solr.core.TestNRTOpen_890592012B790583-001\init-core-data-001
   C:\Users\jenkins\workspace\Lucene-Solr-7.2-Windows\solr\build\solr-core\test\J0\temp\solr.core.TestNRTOpen_890592012B790583-001: java.nio.file.DirectoryNotEmptyException: C:\Users\jenkins\workspace\Lucene-Solr-7.2-Windows\solr\build\solr-core\test\J0\temp\solr.core.TestNRTOpen_890592012B790583-001

	at __randomizedtesting.SeedInfo.seed([890592012B790583]:0)
	at org.apache.lucene.util.IOUtils.rm(IOUtils.java:329)
	at org.apache.lucene.util.TestRuleTemporaryFilesCleanup.afterAlways(TestRuleTemporaryFilesCleanup.java:216)
	at com.carrotsearch.randomizedtesting.rules.TestRuleAdapter$1.afterAlways(TestRuleAdapter.java:31)
	at com.carrotsearch.randomizedtesting.rules.StatementAdapter.evaluate(StatementAdapter.java:43)
	at com.carrotsearch.randomizedtesting.rules.StatementAdapter.evaluate(StatementAdapter.java:36)
	at org.apache.lucene.util.TestRuleAssertionsRequired$1.evaluate(TestRuleAssertionsRequired.java:53)
	at org.apache.lucene.util.TestRuleMarkFailure$1.evaluate(TestRuleMarkFailure.java:47)
	at org.apache.lucene.util.TestRuleIgnoreAfterMaxFailures$1.evaluate(TestRuleIgnoreAfterMaxFailures.java:64)
	at org.apache.lucene.util.TestRuleIgnoreTestSuites$1.evaluate(TestRuleIgnoreTestSuites.java:54)
	at com.carrotsearch.randomizedtesting.rules.StatementAdapter.evaluate(StatementAdapter.java:36)
	at com.carrotsearch.randomizedtesting.ThreadLeakControl$StatementRunner.run(ThreadLeakControl.java:368)
	at java.lang.Thread.run(Thread.java:748)


FAILED:  junit.framework.TestSuite.org.apache.solr.handler.CSVRequestHandlerTest

Error Message:
Could not remove the following files (in the order of attempts):    C:\Users\jenkins\workspace\Lucene-Solr-7.2-Windows\solr\build\solr-core\test\J1\temp\solr.handler.CSVRequestHandlerTest_890592012B790583-001\init-core-data-001: java.nio.file.DirectoryNotEmptyException: C:\Users\jenkins\workspace\Lucene-Solr-7.2-Windows\solr\build\solr-core\test\J1\temp\solr.handler.CSVRequestHandlerTest_890592012B790583-001\init-core-data-001    C:\Users\jenkins\workspace\Lucene-Solr-7.2-Windows\solr\build\solr-core\test\J1\temp\solr.handler.CSVRequestHandlerTest_890592012B790583-001\init-core-data-001\spellcheckerFQCN: java.nio.file.AccessDeniedException: C:\Users\jenkins\workspace\Lucene-Solr-7.2-Windows\solr\build\solr-core\test\J1\temp\solr.handler.CSVRequestHandlerTest_890592012B790583-001\init-core-data-001\spellcheckerFQCN    C:\Users\jenkins\workspace\Lucene-Solr-7.2-Windows\solr\build\solr-core\test\J1\temp\solr.handler.CSVRequestHandlerTest_890592012B790583-001: java.nio.file.DirectoryNotEmptyException: C:\Users\jenkins\workspace\Lucene-Solr-7.2-Windows\solr\build\solr-core\test\J1\temp\solr.handler.CSVRequestHandlerTest_890592012B790583-001 

Stack Trace:
java.io.IOException: Could not remove the following files (in the order of attempts):
   C:\Users\jenkins\workspace\Lucene-Solr-7.2-Windows\solr\build\solr-core\test\J1\temp\solr.handler.CSVRequestHandlerTest_890592012B790583-001\init-core-data-001: java.nio.file.DirectoryNotEmptyException: C:\Users\jenkins\workspace\Lucene-Solr-7.2-Windows\solr\build\solr-core\test\J1\temp\solr.handler.CSVRequestHandlerTest_890592012B790583-001\init-core-data-001
   C:\Users\jenkins\workspace\Lucene-Solr-7.2-Windows\solr\build\solr-core\test\J1\temp\solr.handler.CSVRequestHandlerTest_890592012B790583-001\init-core-data-001\spellcheckerFQCN: java.nio.file.AccessDeniedException: C:\Users\jenkins\workspace\Lucene-Solr-7.2-Windows\solr\build\solr-core\test\J1\temp\solr.handler.CSVRequestHandlerTest_890592012B790583-001\init-core-data-001\spellcheckerFQCN
   C:\Users\jenkins\workspace\Lucene-Solr-7.2-Windows\solr\build\solr-core\test\J1\temp\solr.handler.CSVRequestHandlerTest_890592012B790583-001: java.nio.file.DirectoryNotEmptyException: C:\Users\jenkins\workspace\Lucene-Solr-7.2-Windows\solr\build\solr-core\test\J1\temp\solr.handler.CSVRequestHandlerTest_890592012B790583-001

	at __randomizedtesting.SeedInfo.seed([890592012B790583]:0)
	at org.apache.lucene.util.IOUtils.rm(IOUtils.java:329)
	at org.apache.lucene.util.TestRuleTemporaryFilesCleanup.afterAlways(TestRuleTemporaryFilesCleanup.java:216)
	at com.carrotsearch.randomizedtesting.rules.TestRuleAdapter$1.afterAlways(TestRuleAdapter.java:31)
	at com.carrotsearch.randomizedtesting.rules.StatementAdapter.evaluate(StatementAdapter.java:43)
	at com.carrotsearch.randomizedtesting.rules.StatementAdapter.evaluate(StatementAdapter.java:36)
	at org.apache.lucene.util.TestRuleAssertionsRequired$1.evaluate(TestRuleAssertionsRequired.java:53)
	at org.apache.lucene.util.TestRuleMarkFailure$1.evaluate(TestRuleMarkFailure.java:47)
	at org.apache.lucene.util.TestRuleIgnoreAfterMaxFailures$1.evaluate(TestRuleIgnoreAfterMaxFailures.java:64)
	at org.apache.lucene.util.TestRuleIgnoreTestSuites$1.evaluate(TestRuleIgnoreTestSuites.java:54)
	at com.carrotsearch.randomizedtesting.rules.StatementAdapter.evaluate(StatementAdapter.java:36)
	at com.carrotsearch.randomizedtesting.ThreadLeakControl$StatementRunner.run(ThreadLeakControl.java:368)
	at java.lang.Thread.run(Thread.java:748)




Build Log:
[...truncated 13021 lines...]
   [junit4] Suite: org.apache.solr.handler.CSVRequestHandlerTest
   [junit4]   2> 2490670 INFO  (SUITE-CSVRequestHandlerTest-seed#[890592012B790583]-worker) [    ] o.a.s.SolrTestCaseJ4 SecureRandom sanity checks: test.solr.allowed.securerandom=null & java.security.egd=file:/dev/./urandom
   [junit4]   2> Creating dataDir: C:\Users\jenkins\workspace\Lucene-Solr-7.2-Windows\solr\build\solr-core\test\J1\temp\solr.handler.CSVRequestHandlerTest_890592012B790583-001\init-core-data-001
   [junit4]   2> 2490671 WARN  (SUITE-CSVRequestHandlerTest-seed#[890592012B790583]-worker) [    ] o.a.s.SolrTestCaseJ4 startTrackingSearchers: numOpens=1 numCloses=1
   [junit4]   2> 2490672 INFO  (SUITE-CSVRequestHandlerTest-seed#[890592012B790583]-worker) [    ] o.a.s.SolrTestCaseJ4 Using PointFields (NUMERIC_POINTS_SYSPROP=true) w/NUMERIC_DOCVALUES_SYSPROP=false
   [junit4]   2> 2490677 INFO  (SUITE-CSVRequestHandlerTest-seed#[890592012B790583]-worker) [    ] o.a.s.SolrTestCaseJ4 Randomized ssl (true) and clientAuth (false) via: @org.apache.solr.util.RandomizeSSL(reason=, value=NaN, ssl=NaN, clientAuth=NaN)
   [junit4]   2> 2490679 INFO  (SUITE-CSVRequestHandlerTest-seed#[890592012B790583]-worker) [    ] o.a.s.SolrTestCaseJ4 ####initCore
   [junit4]   2> 2490680 INFO  (SUITE-CSVRequestHandlerTest-seed#[890592012B790583]-worker) [    ] o.a.s.c.SolrResourceLoader [null] Added 2 libs to classloader, from paths: [/C:/Users/jenkins/workspace/Lucene-Solr-7.2-Windows/solr/core/src/test-files/solr/collection1/lib, /C:/Users/jenkins/workspace/Lucene-Solr-7.2-Windows/solr/core/src/test-files/solr/collection1/lib/classes]
   [junit4]   2> 2490747 INFO  (SUITE-CSVRequestHandlerTest-seed#[890592012B790583]-worker) [    ] o.a.s.c.SolrConfig Using Lucene MatchVersion: 7.2.0
   [junit4]   2> 2490772 INFO  (SUITE-CSVRequestHandlerTest-seed#[890592012B790583]-worker) [    ] o.a.s.s.IndexSchema [null] Schema name=test
   [junit4]   2> 2490868 INFO  (SUITE-CSVRequestHandlerTest-seed#[890592012B790583]-worker) [    ] o.a.s.s.IndexSchema Loaded schema test/1.0 with uniqueid field id
   [junit4]   2> 2491019 INFO  (SUITE-CSVRequestHandlerTest-seed#[890592012B790583]-worker) [    ] o.a.s.m.r.SolrJmxReporter JMX monitoring for 'solr.node' (registry 'solr.node') enabled at server: com.sun.jmx.mbeanserver.JmxMBeanServer@6e45c3b3
   [junit4]   2> 2491027 INFO  (SUITE-CSVRequestHandlerTest-seed#[890592012B790583]-worker) [    ] o.a.s.m.r.SolrJmxReporter JMX monitoring for 'solr.jvm' (registry 'solr.jvm') enabled at server: com.sun.jmx.mbeanserver.JmxMBeanServer@6e45c3b3
   [junit4]   2> 2491028 INFO  (SUITE-CSVRequestHandlerTest-seed#[890592012B790583]-worker) [    ] o.a.s.m.r.SolrJmxReporter JMX monitoring for 'solr.jetty' (registry 'solr.jetty') enabled at server: com.sun.jmx.mbeanserver.JmxMBeanServer@6e45c3b3
   [junit4]   2> 2491030 INFO  (coreLoadExecutor-9987-thread-1) [    ] o.a.s.c.TransientSolrCoreCacheDefault Allocating transient cache for 2147483647 transient cores
   [junit4]   2> 2491031 INFO  (coreLoadExecutor-9987-thread-1) [    x:collection1] o.a.s.c.SolrResourceLoader [null] Added 2 libs to classloader, from paths: [/C:/Users/jenkins/workspace/Lucene-Solr-7.2-Windows/solr/core/src/test-files/solr/collection1/lib, /C:/Users/jenkins/workspace/Lucene-Solr-7.2-Windows/solr/core/src/test-files/solr/collection1/lib/classes]
   [junit4]   2> 2491210 INFO  (coreLoadExecutor-9987-thread-1) [    x:collection1] o.a.s.c.SolrConfig Using Lucene MatchVersion: 7.2.0
   [junit4]   2> 2491233 INFO  (coreLoadExecutor-9987-thread-1) [    x:collection1] o.a.s.s.IndexSchema [collection1] Schema name=test
   [junit4]   2> 2491344 INFO  (coreLoadExecutor-9987-thread-1) [    x:collection1] o.a.s.s.IndexSchema Loaded schema test/1.0 with uniqueid field id
   [junit4]   2> 2491364 INFO  (coreLoadExecutor-9987-thread-1) [    x:collection1] o.a.s.c.CoreContainer Creating SolrCore 'collection1' using configuration from instancedir C:\Users\jenkins\workspace\Lucene-Solr-7.2-Windows\solr\core\src\test-files\solr\collection1, trusted=true
   [junit4]   2> 2491365 INFO  (coreLoadExecutor-9987-thread-1) [    x:collection1] o.a.s.m.r.SolrJmxReporter JMX monitoring for 'solr.core.collection1' (registry 'solr.core.collection1') enabled at server: com.sun.jmx.mbeanserver.JmxMBeanServer@6e45c3b3
   [junit4]   2> 2491365 INFO  (coreLoadExecutor-9987-thread-1) [    x:collection1] o.a.s.c.SolrCore solr.RecoveryStrategy.Builder
   [junit4]   2> 2491366 INFO  (coreLoadExecutor-9987-thread-1) [    x:collection1] o.a.s.c.SolrCore [[collection1] ] Opening new SolrCore at [C:\Users\jenkins\workspace\Lucene-Solr-7.2-Windows\solr\core\src\test-files\solr\collection1], dataDir=[C:\Users\jenkins\workspace\Lucene-Solr-7.2-Windows\solr\build\solr-core\test\J1\temp\solr.handler.CSVRequestHandlerTest_890592012B790583-001\init-core-data-001\]
   [junit4]   2> 2491368 INFO  (coreLoadExecutor-9987-thread-1) [    x:collection1] o.a.s.u.RandomMergePolicy RandomMergePolicy wrapping class org.apache.lucene.index.LogByteSizeMergePolicy: [LogByteSizeMergePolicy: minMergeSize=1677721, mergeFactor=30, maxMergeSize=2147483648, maxMergeSizeForForcedMerge=9223372036854775807, calibrateSizeByDeletes=false, maxMergeDocs=2147483647, maxCFSSegmentSizeMB=8.796093022207999E12, noCFSRatio=0.0]
   [junit4]   2> 2491511 INFO  (coreLoadExecutor-9987-thread-1) [    x:collection1] o.a.s.u.UpdateHandler Using UpdateLog implementation: org.apache.solr.update.UpdateLog
   [junit4]   2> 2491511 INFO  (coreLoadExecutor-9987-thread-1) [    x:collection1] o.a.s.u.UpdateLog Initializing UpdateLog: dataDir= defaultSyncLevel=FLUSH numRecordsToKeep=100 maxNumLogsToKeep=10 numVersionBuckets=65536
   [junit4]   2> 2491512 INFO  (coreLoadExecutor-9987-thread-1) [    x:collection1] o.a.s.u.CommitTracker Hard AutoCommit: disabled
   [junit4]   2> 2491512 INFO  (coreLoadExecutor-9987-thread-1) [    x:collection1] o.a.s.u.CommitTracker Soft AutoCommit: disabled
   [junit4]   2> 2491514 INFO  (coreLoadExecutor-9987-thread-1) [    x:collection1] o.a.s.u.RandomMergePolicy RandomMergePolicy wrapping class org.apache.lucene.index.AlcoholicMergePolicy: [AlcoholicMergePolicy: minMergeSize=0, mergeFactor=10, maxMergeSize=363925417, maxMergeSizeForForcedMerge=9223372036854775807, calibrateSizeByDeletes=true, maxMergeDocs=2147483647, maxCFSSegmentSizeMB=8.796093022207999E12, noCFSRatio=0.1]
   [junit4]   2> 2491516 INFO  (coreLoadExecutor-9987-thread-1) [    x:collection1] o.a.s.s.SolrIndexSearcher Opening [Searcher@93e3de9[collection1] main]
   [junit4]   2> 2491517 INFO  (coreLoadExecutor-9987-thread-1) [    x:collection1] o.a.s.h.c.SpellCheckComponent Initializing spell checkers
   [junit4]   2> 2491533 INFO  (coreLoadExecutor-9987-thread-1) [    x:collection1] o.a.s.s.DirectSolrSpellChecker init: {name=direct,classname=DirectSolrSpellChecker,field=lowerfilt,minQueryLength=3}
   [junit4]   2> 2491585 INFO  (coreLoadExecutor-9987-thread-1) [    x:collection1] o.a.s.h.ReplicationHandler Commits will be reserved for 10000ms.
   [junit4]   2> 2491585 INFO  (searcherExecutor-9988-thread-1-processing-x:collection1) [    x:collection1] o.a.s.h.c.SpellCheckComponent Loading spell index for spellchecker: default
   [junit4]   2> 2491585 INFO  (coreLoadExecutor-9987-thread-1) [    x:collection1] o.a.s.u.UpdateLog Could not find max version in index or recent updates, using new clock 1587065073702010880
   [junit4]   2> 2491586 INFO  (searcherExecutor-9988-thread-1-processing-x:collection1) [    x:collection1] o.a.s.h.c.SpellCheckComponent Loading spell index for spellchecker: direct
   [junit4]   2> 2491587 INFO  (searcherExecutor-9988-thread-1-processing-x:collection1) [    x:collection1] o.a.s.h.c.SpellCheckComponent Loading spell index for spellchecker: wordbreak
   [junit4]   2> 2491587 INFO  (searcherExecutor-9988-thread-1-processing-x:collection1) [    x:collection1] o.a.s.h.c.SpellCheckComponent Loading spell index for spellchecker: multipleFields
   [junit4]   2> 2491587 INFO  (searcherExecutor-9988-thread-1-processing-x:collection1) [    x:collection1] o.a.s.h.c.SpellCheckComponent Loading spell index for spellchecker: jarowinkler
   [junit4]   2> 2491589 INFO  (SUITE-CSVRequestHandlerTest-seed#[890592012B790583]-worker) [    ] o.a.s.SolrTestCaseJ4 ####initCore end
   [junit4]   2> 2491592 INFO  (searcherExecutor-9988-thread-1-processing-x:collection1) [    x:collection1] o.a.s.h.c.SpellCheckComponent Loading spell index for spellchecker: external
   [junit4]   2> 2491600 INFO  (TEST-CSVRequestHandlerTest.testCommitWithin-seed#[890592012B790583]) [    ] o.a.s.SolrTestCaseJ4 ###Starting testCommitWithin
   [junit4]   2> 2491601 INFO  (TEST-CSVRequestHandlerTest.testCommitWithin-seed#[890592012B790583]) [    ] o.a.s.SolrTestCaseJ4 ###Ending testCommitWithin
   [junit4]   2> 2491601 INFO  (SUITE-CSVRequestHandlerTest-seed#[890592012B790583]-worker) [    ] o.a.s.SolrTestCaseJ4 ###deleteCore
   [junit4]   2> 2491601 INFO  (SUITE-CSVRequestHandlerTest-seed#[890592012B790583]-worker) [    ] o.a.s.c.CoreContainer Shutting down CoreContainer instance=1001277324
   [junit4]   2> 2491602 INFO  (SUITE-CSVRequestHandlerTest-seed#[890592012B790583]-worker) [    ] o.a.s.m.SolrMetricManager Closing metric reporters for registry=solr.node, tag=null
   [junit4]   2> 2491602 INFO  (SUITE-CSVRequestHandlerTest-seed#[890592012B790583]-worker) [    ] o.a.s.m.r.SolrJmxReporter Closing reporter [org.apache.solr.metrics.reporters.SolrJmxReporter@1f51265e: rootName = null, domain = solr.node, service url = null, agent id = null] for registry solr.node / com.codahale.metrics.MetricRegistry@57069a66
   [junit4]   2> 2491605 INFO  (SUITE-CSVRequestHandlerTest-seed#[890592012B790583]-worker) [    ] o.a.s.m.SolrMetricManager Closing metric reporters for registry=solr.jvm, tag=null
   [junit4]   2> 2491605 INFO  (SUITE-CSVRequestHandlerTest-seed#[890592012B790583]-worker) [    ] o.a.s.m.r.SolrJmxReporter Closing reporter [org.apache.solr.metrics.reporters.SolrJmxReporter@61053234: rootName = null, domain = solr.jvm, service url = null, agent id = null] for registry solr.jvm / com.codahale.metrics.MetricRegistry@22a26bde
   [junit4]   2> 2491607 INFO  (searcherExecutor-9988-thread-1-processing-x:collection1) [    x:collection1] o.a.s.h.c.SpellCheckComponent Loading spell index for spellchecker: freq
   [junit4]   2> 2491608 INFO  (searcherExecutor-9988-thread-1-processing-x:collection1) [    x:collection1] o.a.s.h.c.SpellCheckComponent Loading spell index for spellchecker: fqcn
   [junit4]   2> 2491608 INFO  (SUITE-CSVRequestHandlerTest-seed#[890592012B790583]-worker) [    ] o.a.s.m.SolrMetricManager Closing metric reporters for registry=solr.jetty, tag=null
   [junit4]   2> 2491608 INFO  (SUITE-CSVRequestHandlerTest-seed#[890592012B790583]-worker) [    ] o.a.s.m.r.SolrJmxReporter Closing reporter [org.apache.solr.metrics.reporters.SolrJmxReporter@459ca910: rootName = null, domain = solr.jetty, service url = null, agent id = null] for registry solr.jetty / com.codahale.metrics.MetricRegistry@27183934
   [junit4]   2> 2491610 INFO  (searcherExecutor-9988-thread-1-processing-x:collection1) [    x:collection1] o.a.s.h.c.SpellCheckComponent Loading spell index for spellchecker: perDict
   [junit4]   2> 2491610 INFO  (coreCloseExecutor-9993-thread-1) [    x:collection1] o.a.s.c.SolrCore [collection1]  CLOSING SolrCore org.apache.solr.core.SolrCore@3822f993
   [junit4]   2> 2491610 INFO  (coreCloseExecutor-9993-thread-1) [    x:collection1] o.a.s.m.SolrMetricManager Closing metric reporters for registry=solr.core.collection1, tag=941816211
   [junit4]   2> 2491610 INFO  (coreCloseExecutor-9993-thread-1) [    x:collection1] o.a.s.m.r.SolrJmxReporter Closing reporter [org.apache.solr.metrics.reporters.SolrJmxReporter@34d0156: rootName = null, domain = solr.core.collection1, service url = null, agent id = null] for registry solr.core.collection1 / com.codahale.metrics.MetricRegistry@1021c907
   [junit4]   2> 2491611 INFO  (searcherExecutor-9988-thread-1-processing-x:collection1) [    x:collection1] o.a.s.c.SolrCore [collection1] Registered new searcher Searcher@93e3de9[collection1] main{ExitableDirectoryReader(UninvertingDirectoryReader())}
   [junit4]   2> 2491621 INFO  (SUITE-CSVRequestHandlerTest-seed#[890592012B790583]-worker) [    ] o.a.s.SolrTestCaseJ4 ------------------------------------------------------- Done waiting for tracked resources to be released
   [junit4]   2> NOTE: test params are: codec=Asserting(Lucene70): {}, docValues:{}, maxPointsInLeafNode=798, maxMBSortInHeap=7.429288488747055, sim=RandomSimilarity(queryNorm=true): {}, locale=sq, timezone=US/Indiana-Starke
   [junit4]   2> NOTE: Windows 10 10.0 amd64/Oracle Corporation 1.8.0_144 (64-bit)/cpus=3,threads=1,free=189053248,total=518979584
   [junit4]   2> NOTE: All tests run in this JVM: [DistributedMLTComponentTest, BasicDistributedZk2Test, TestSubQueryTransformerCrossCore, TestGeoJSONResponseWriter, TestFaceting, TestManagedSchemaThreadSafety, HLLUtilTest, SOLR749Test, CdcrReplicationHandlerTest, TestMacros, ShardSplitTest, TestSchemaManager, QueryResultKeyTest, UpdateRequestProcessorFactoryTest, DistributedFacetPivotLongTailTest, TestLockTree, ExitableDirectoryReaderTest, HdfsAutoAddReplicasIntegrationTest, TestSolrCloudWithHadoopAuthPlugin, BlockJoinFacetDistribTest, TestStressCloudBlindAtomicUpdates, TestXmlQParser, CollectionsAPIAsyncDistributedZkTest, TestObjectReleaseTracker, TestCloudNestedDocsSort, TestStressVersions, MultiThreadedOCPTest, TestTolerantUpdateProcessorCloud, LeaderInitiatedRecoveryOnCommitTest, HdfsDirectoryTest, SortSpecParsingTest, OutOfBoxZkACLAndCredentialsProvidersTest, TestCollectionsAPIViaSolrCloudCluster, BasicZkTest, RestartWhileUpdatingTest, TestValueSourceCache, TestNumericRangeQuery64, SearchHandlerTest, TestSolr4Spatial2, TestNumericTerms32, TestDocTermOrds, LoggingHandlerTest, TestDistributedMissingSort, TestRestManager, ExternalFileFieldSortTest, TestExceedMaxTermLength, TestHttpShardHandlerFactory, TestRuleBasedAuthorizationPlugin, TestPolicyCloud, TestBlobHandler, TestSolrIndexConfig, BasicFunctionalityTest, TermVectorComponentDistributedTest, PolyFieldTest, TestFileDictionaryLookup, TestCollationFieldDocValues, SoftAutoCommitTest, SolrCloudExampleTest, TestReplicationHandlerBackup, TestRestoreCore, TestDynamicLoading, TestRandomFaceting, SystemInfoHandlerTest, TestSolrQueryParser, LeaderElectionIntegrationTest, TestEmbeddedSolrServerConstructors, TestJettySolrRunner, BlockJoinFacetSimpleTest, TestFieldCacheReopen, TestInitQParser, MetricsConfigTest, TestLuceneIndexBackCompat, ConcurrentDeleteAndCreateCollectionTest, TestCoreContainer, ShufflingReplicaListTransformerTest, TestClusterStateMutator, TestTrackingShardHandlerFactory, DocValuesTest, TestMultiWordSynonyms, TestDelegationWithHadoopAuth, PeerSyncTest, ZkSolrClientTest, CloudExitableDirectoryReaderTest, SolrGraphiteReporterTest, TestInfoStreamLogging, TestReRankQParserPlugin, UtilsToolTest, TestCorePropertiesReload, TestSchemaVersionResource, TestSimpleQParserPlugin, ReplaceNodeTest, BitVectorTest, FullSolrCloudDistribCmdsTest, MBeansHandlerTest, TestZkChroot, TestSkipOverseerOperations, DistributedQueueTest, ConnectionManagerTest, TestCopyFieldCollectionResource, TestFieldCacheWithThreads, TestBadConfig, NodeAddedTriggerTest, SegmentsInfoRequestHandlerTest, TestExclusionRuleCollectionAccess, TestPayloadScoreQParserPlugin, DistributedQueryComponentCustomSortTest, TestFieldCacheSortRandom, FieldMutatingUpdateProcessorTest, BlobRepositoryCloudTest, PluginInfoTest, InfoHandlerTest, TestHighFrequencyDictionaryFactory, PropertiesRequestHandlerTest, ComputePlanActionTest, HdfsNNFailoverTest, UpdateParamsTest, TestExactSharedStatsCache, UpdateLogTest, TestLegacyNumericUtils, CopyFieldTest, TestSSLRandomization, DebugComponentTest, TestAuthorizationFramework, TestStressLucene, TestPerFieldSimilarity, TestStreamBody, HttpPartitionTest, CustomCollectionTest, TestAnalyzeInfixSuggestions, TestFieldResource, TestDocSet, TestShortCircuitedRequests, TestElisionMultitermQuery, TestDynamicFieldResource, TestSystemIdResolver, ShardRoutingCustomTest, TestSuggestSpellingConverter, OpenCloseCoreStressTest, MetricUtilsTest, SimpleMLTQParserTest, DeleteStatusTest, CacheHeaderTest, DistribDocExpirationUpdateProcessorTest, TestStressUserVersions, EchoParamsTest, TermsComponentTest, TestRandomCollapseQParserPlugin, TestRTGBase, TestConfigSetsAPIExclusivity, AutoAddReplicasPlanActionTest, OverseerCollectionConfigSetProcessorTest, TestRebalanceLeaders, AtomicUpdatesTest, HdfsChaosMonkeySafeLeaderTest, TestRetrieveFieldsOptimizer, NumberUtilsTest, SmileWriterTest, TestExtendedDismaxParser, AddSchemaFieldsUpdateProcessorFactoryTest, ZkNodePropsTest, MoreLikeThisHandlerTest, AnalysisAfterCoreReloadTest, ChangedSchemaMergeTest, DocumentBuilderTest, TestQueryTypes, AssignTest, TestLRUCache, TestSQLHandlerNonCloud, SolrIndexSplitterTest, TestReload, TestSolrCLIRunExample, TestClusterProperties, PreAnalyzedUpdateProcessorTest, TestGroupingSearch, TestOverriddenPrefixQueryForCustomFieldType, TestSolrFieldCacheBean, DeleteLastCustomShardedReplicaTest, TestSolrConfigHandlerConcurrent, TestSort, TestFastOutputStream, SimpleFacetsTest, TestCollationField, HttpSolrCallGetCoreTest, TestUniqueKeyFieldResource, DistributedIntervalFacetingTest, ChaosMonkeySafeLeaderTest, UnloadDistributedZkTest, CollectionsAPIDistributedZkTest, SyncSliceTest, OverseerTest, TestReplicationHandler, ClusterStateUpdateTest, TestRandomDVFaceting, TestDistributedSearch, TestDistributedGrouping, TestRealTimeGet, DistributedTermsComponentTest, SolrCoreTest, SpellCheckComponentTest, SolrCmdDistributorTest, ConvertedLegacyTest, TestFiltering, TestFunctionQuery, TestIndexSearcher, SimplePostToolTest, TestCoreDiscovery, CoreAdminHandlerTest, TestCSVLoader, SchemaVersionSpecificBehaviorTest, TestWordDelimiterFilterFactory, StatelessScriptUpdateProcessorFactoryTest, DocValuesMultiTest, DistanceFunctionTest, XsltUpdateRequestHandlerTest, TestQueryUtils, DirectSolrSpellCheckerTest, DocumentAnalysisRequestHandlerTest, FileBasedSpellCheckerTest, PathHierarchyTokenizerFactoryTest, RequiredFieldsTest, RegexBoostProcessorTest, TestJmxIntegration, UniqFieldsUpdateProcessorFactoryTest, JsonLoaderTest, TestPHPSerializedResponseWriter, CSVRequestHandlerTest]
   [junit4]   2> NOTE: reproduce with: ant test  -Dtestcase=CSVRequestHandlerTest -Dtests.seed=890592012B790583 -Dtests.slow=true -Dtests.locale=sq -Dtests.timezone=US/Indiana-Starke -Dtests.asserts=true -Dtests.file.encoding=Cp1252
   [junit4] ERROR   0.00s J1 | CSVRequestHandlerTest (suite) <<<
   [junit4]    > Throwable #1: java.io.IOException: Could not remove the following files (in the order of attempts):
   [junit4]    >    C:\Users\jenkins\workspace\Lucene-Solr-7.2-Windows\solr\build\solr-core\test\J1\temp\solr.handler.CSVRequestHandlerTest_890592012B790583-001\init-core-data-001: java.nio.file.DirectoryNotEmptyException: C:\Users\jenkins\workspace\Lucene-Solr-7.2-Windows\solr\build\solr-core\test\J1\temp\solr.handler.CSVRequestHandlerTest_890592012B790583-001\init-core-data-001
   [junit4]    >    C:\Users\jenkins\workspace\Lucene-Solr-7.2-Windows\solr\build\solr-core\test\J1\temp\solr.handler.CSVRequestHandlerTest_890592012B790583-001\init-core-data-001\spellcheckerFQCN: java.nio.file.AccessDeniedException: C:\Users\jenkins\workspace\Lucene-Solr-7.2-Windows\solr\build\solr-core\test\J1\temp\solr.handler.CSVRequestHandlerTest_890592012B790583-001\init-core-data-001\spellcheckerFQCN
   [junit4]    >    C:\Users\jenkins\workspace\Lucene-Solr-7.2-Windows\solr\build\solr-core\test\J1\temp\solr.handler.CSVRequestHandlerTest_890592012B790583-001: java.nio.file.DirectoryNotEmptyException: C:\Users\jenkins\workspace\Lucene-Solr-7.2-Windows\solr\build\solr-core\test\J1\temp\solr.handler.CSVRequestHandlerTest_890592012B790583-001
   [junit4]    > 	at __randomizedtesting.SeedInfo.seed([890592012B790583]:0)
   [junit4]    > 	at org.apache.lucene.util.IOUtils.rm(IOUtils.java:329)
   [junit4]    > 	at java.lang.Thread.run(Thread.java:748)
   [junit4] Completed [447/751 (1!)] on J1 in 1.00s, 1 test, 1 error <<< FAILURES!

[...truncated 518 lines...]
   [junit4] Suite: org.apache.solr.core.TestNRTOpen
   [junit4]   2> 3440700 INFO  (SUITE-TestNRTOpen-seed#[890592012B790583]-worker) [    ] o.a.s.SolrTestCaseJ4 SecureRandom sanity checks: test.solr.allowed.securerandom=null & java.security.egd=file:/dev/./urandom
   [junit4]   2> Creating dataDir: C:\Users\jenkins\workspace\Lucene-Solr-7.2-Windows\solr\build\solr-core\test\J0\temp\solr.core.TestNRTOpen_890592012B790583-001\init-core-data-001
   [junit4]   2> 3440700 WARN  (SUITE-TestNRTOpen-seed#[890592012B790583]-worker) [    ] o.a.s.SolrTestCaseJ4 startTrackingSearchers: numOpens=3 numCloses=3
   [junit4]   2> 3440700 INFO  (SUITE-TestNRTOpen-seed#[890592012B790583]-worker) [    ] o.a.s.SolrTestCaseJ4 Using PointFields (NUMERIC_POINTS_SYSPROP=true) w/NUMERIC_DOCVALUES_SYSPROP=false
   [junit4]   2> 3440700 INFO  (SUITE-TestNRTOpen-seed#[890592012B790583]-worker) [    ] o.a.s.SolrTestCaseJ4 Randomized ssl (false) and clientAuth (false) via: @org.apache.solr.util.RandomizeSSL(reason=, value=NaN, ssl=NaN, clientAuth=NaN)
   [junit4]   2> 3440714 INFO  (SUITE-TestNRTOpen-seed#[890592012B790583]-worker) [    ] o.a.s.SolrTestCaseJ4 ####initCore
   [junit4]   2> 3440714 INFO  (SUITE-TestNRTOpen-seed#[890592012B790583]-worker) [    ] o.a.s.c.SolrResourceLoader [null] Added 2 libs to classloader, from paths: [/C:/Users/jenkins/workspace/Lucene-Solr-7.2-Windows/solr/core/src/test-files/solr/collection1/lib, /C:/Users/jenkins/workspace/Lucene-Solr-7.2-Windows/solr/core/src/test-files/solr/collection1/lib/classes]
   [junit4]   2> 3440774 INFO  (SUITE-TestNRTOpen-seed#[890592012B790583]-worker) [    ] o.a.s.c.SolrConfig Using Lucene MatchVersion: 7.2.0
   [junit4]   2> 3440781 INFO  (SUITE-TestNRTOpen-seed#[890592012B790583]-worker) [    ] o.a.s.s.IndexSchema [null] Schema name=minimal
   [junit4]   2> 3440785 WARN  (SUITE-TestNRTOpen-seed#[890592012B790583]-worker) [    ] o.a.s.s.IndexSchema no uniqueKey specified in schema.
   [junit4]   2> 3440786 INFO  (SUITE-TestNRTOpen-seed#[890592012B790583]-worker) [    ] o.a.s.s.IndexSchema Loaded schema minimal/1.1 with uniqueid field null
   [junit4]   2> 3440885 INFO  (SUITE-TestNRTOpen-seed#[890592012B790583]-worker) [    ] o.a.s.m.r.SolrJmxReporter JMX monitoring for 'solr.node' (registry 'solr.node') enabled at server: com.sun.jmx.mbeanserver.JmxMBeanServer@6c960313
   [junit4]   2> 3440892 INFO  (SUITE-TestNRTOpen-seed#[890592012B790583]-worker) [    ] o.a.s.m.r.SolrJmxReporter JMX monitoring for 'solr.jvm' (registry 'solr.jvm') enabled at server: com.sun.jmx.mbeanserver.JmxMBeanServer@6c960313
   [junit4]   2> 3440893 INFO  (SUITE-TestNRTOpen-seed#[890592012B790583]-worker) [    ] o.a.s.m.r.SolrJmxReporter JMX monitoring for 'solr.jetty' (registry 'solr.jetty') enabled at server: com.sun.jmx.mbeanserver.JmxMBeanServer@6c960313
   [junit4]   2> 3440894 INFO  (coreLoadExecutor-10667-thread-1) [    ] o.a.s.c.TransientSolrCoreCacheDefault Allocating transient cache for 2147483647 transient cores
   [junit4]   2> 3440895 INFO  (coreLoadExecutor-10667-thread-1) [    x:collection1] o.a.s.c.SolrResourceLoader [null] Added 2 libs to classloader, from paths: [/C:/Users/jenkins/workspace/Lucene-Solr-7.2-Windows/solr/core/src/test-files/solr/collection1/lib, /C:/Users/jenkins/workspace/Lucene-Solr-7.2-Windows/solr/core/src/test-files/solr/collection1/lib/classes]
   [junit4]   2> 3440957 INFO  (coreLoadExecutor-10667-thread-1) [    x:collection1] o.a.s.c.SolrConfig Using Lucene MatchVersion: 7.2.0
   [junit4]   2> 3440964 INFO  (coreLoadExecutor-10667-thread-1) [    x:collection1] o.a.s.s.IndexSchema [collection1] Schema name=minimal
   [junit4]   2> 3440967 WARN  (coreLoadExecutor-10667-thread-1) [    x:collection1] o.a.s.s.IndexSchema no uniqueKey specified in schema.
   [junit4]   2> 3440967 INFO  (coreLoadExecutor-10667-thread-1) [    x:collection1] o.a.s.s.IndexSchema Loaded schema minimal/1.1 with uniqueid field null
   [junit4]   2> 3440968 INFO  (coreLoadExecutor-10667-thread-1) [    x:collection1] o.a.s.c.CoreContainer Creating SolrCore 'collection1' using configuration from instancedir C:\Users\jenkins\workspace\Lucene-Solr-7.2-Windows\solr\core\src\test-files\solr\collection1, trusted=true
   [junit4]   2> 3440968 INFO  (coreLoadExecutor-10667-thread-1) [    x:collection1] o.a.s.m.r.SolrJmxReporter JMX monitoring for 'solr.core.collection1' (registry 'solr.core.collection1') enabled at server: com.sun.jmx.mbeanserver.JmxMBeanServer@6c960313
   [junit4]   2> 3440968 INFO  (coreLoadExecutor-10667-thread-1) [    x:collection1] o.a.s.c.SolrCore solr.RecoveryStrategy.Builder
   [junit4]   2> 3440968 INFO  (coreLoadExecutor-10667-thread-1) [    x:collection1] o.a.s.c.SolrCore [[collection1] ] Opening new SolrCore at [C:\Users\jenkins\workspace\Lucene-Solr-7.2-Windows\solr\core\src\test-files\solr\collection1], dataDir=[C:\Users\jenkins\workspace\Lucene-Solr-7.2-Windows\solr\build\solr-core\test\J0\temp\solr.core.TestNRTOpen_890592012B790583-001\init-core-data-001\]
   [junit4]   2> 3441075 INFO  (coreLoadExecutor-10667-thread-1) [    x:collection1] o.a.s.u.CommitTracker Hard AutoCommit: disabled
   [junit4]   2> 3441075 INFO  (coreLoadExecutor-10667-thread-1) [    x:collection1] o.a.s.u.CommitTracker Soft AutoCommit: disabled
   [junit4]   2> 3441077 INFO  (coreLoadExecutor-10667-thread-1) [    x:collection1] o.a.s.s.SolrIndexSearcher Opening [Searcher@60701984[collection1] main]
   [junit4]   2> 3441077 WARN  (coreLoadExecutor-10667-thread-1) [    x:collection1] o.a.s.r.ManagedResourceStorage Cannot write to config directory C:\Users\jenkins\workspace\Lucene-Solr-7.2-Windows\solr\core\src\test-files\solr\collection1\conf; switching to use InMemory storage instead.
   [junit4]   2> 3441078 INFO  (coreLoadExecutor-10667-thread-1) [    x:collection1] o.a.s.h.ReplicationHandler Commits will be reserved for 10000ms.
   [junit4]   2> 3441079 INFO  (searcherExecutor-10668-thread-1-processing-x:collection1) [    x:collection1] o.a.s.c.SolrCore [collection1] Registered new searcher Searcher@60701984[collection1] main{ExitableDirectoryReader(UninvertingDirectoryReader())}
   [junit4]   2> 3441079 INFO  (SUITE-TestNRTOpen-seed#[890592012B790583]-worker) [    ] o.a.s.SolrTestCaseJ4 ####initCore end
   [junit4]   2> 3441086 INFO  (SUITE-TestNRTOpen-seed#[890592012B790583]-worker) [    ] o.a.s.u.p.LogUpdateProcessorFactory [collection1]  webapp=null path=null params={}{add=[(null)]} 0 6
   [junit4]   2> 3441091 INFO  (SUITE-TestNRTOpen-seed#[890592012B790583]-worker) [    ] o.a.s.u.DirectUpdateHandler2 start commit{,optimize=false,openSearcher=true,waitSearcher=true,expungeDeletes=false,softCommit=false,prepareCommit=false}
   [junit4]   2> 3441091 INFO  (SUITE-TestNRTOpen-seed#[890592012B790583]-worker) [    ] o.a.s.u.SolrIndexWriter Calling setCommitData with IW:org.apache.solr.update.SolrIndexWriter@5c90bf91 commitCommandVersion:0
   [junit4]   2> 3441153 INFO  (SUITE-TestNRTOpen-seed#[890592012B790583]-worker) [    ] o.a.s.s.SolrIndexSearcher Opening [Searcher@5a6c9355[collection1] main]
   [junit4]   2> 3441153 INFO  (SUITE-TestNRTOpen-seed#[890592012B790583]-worker) [    ] o.a.s.u.DirectUpdateHandler2 end_commit_flush
   [junit4]   2> 3441153 INFO  (searcherExecutor-10668-thread-1) [    ] o.a.s.c.SolrCore [collection1] Registered new searcher Searcher@5a6c9355[collection1] main{ExitableDirectoryReader(UninvertingDirectoryReader(Uninverting(_0(7.2.0):C1)))}
   [junit4]   2> 3441155 INFO  (SUITE-TestNRTOpen-seed#[890592012B790583]-worker) [    ] o.a.s.u.p.LogUpdateProcessorFactory [collection1]  webapp=null path=null params={}{commit=} 0 63
   [junit4]   2> 3441155 INFO  (SUITE-TestNRTOpen-seed#[890592012B790583]-worker) [    ] o.a.s.SolrTestCaseJ4 ###deleteCore
   [junit4]   2> 3441155 INFO  (SUITE-TestNRTOpen-seed#[890592012B790583]-worker) [    ] o.a.s.c.CoreContainer Shutting down CoreContainer instance=1430305497
   [junit4]   2> 3441155 INFO  (SUITE-TestNRTOpen-seed#[890592012B790583]-worker) [    ] o.a.s.m.SolrMetricManager Closing metric reporters for registry=solr.node, tag=null
   [junit4]   2> 3441156 INFO  (SUITE-TestNRTOpen-seed#[890592012B790583]-worker) [    ] o.a.s.m.r.SolrJmxReporter Closing reporter [org.apache.solr.metrics.reporters.SolrJmxReporter@454f0cc7: rootName = null, domain = solr.node, service url = null, agent id = null] for registry solr.node / com.codahale.metrics.MetricRegistry@53c14f0e
   [junit4]   2> 3441159 INFO  (SUITE-TestNRTOpen-seed#[890592012B790583]-worker) [    ] o.a.s.m.SolrMetricManager Closing metric reporters for registry=solr.jvm, tag=null
   [junit4]   2> 3441159 INFO  (SUITE-TestNRTOpen-seed#[890592012B790583]-worker) [    ] o.a.s.m.r.SolrJmxReporter Closing reporter [org.apache.solr.metrics.reporters.SolrJmxReporter@190a4ab6: rootName = null, domain = solr.jvm, service url = null, agent id = null] for registry solr.jvm / com.codahale.metrics.MetricRegistry@749e0cf0
   [junit4]   2> 3441163 INFO  (SUITE-TestNRTOpen-seed#[890592012B790583]-worker) [    ] o.a.s.m.SolrMetricManager Closing metric reporters for registry=solr.jetty, tag=null
   [junit4]   2> 3441163 INFO  (SUITE-TestNRTOpen-seed#[890592012B790583]-worker) [    ] o.a.s.m.r.SolrJmxReporter Closing reporter [org.apache.solr.metrics.reporters.SolrJmxReporter@3bb88d59: rootName = null, domain = solr.jetty, service url = null, agent id = null] for registry solr.jetty / com.codahale.metrics.MetricRegistry@a2f6799
   [junit4]   2> 3441164 INFO  (coreCloseExecutor-10672-thread-1) [    x:collection1] o.a.s.c.SolrCore [collection1]  CLOSING SolrCore org.apache.solr.core.SolrCore@5ea91596
   [junit4]   2> 3441164 INFO  (coreCloseExecutor-10672-thread-1) [    x:collection1] o.a.s.m.SolrMetricManager Closing metric reporters for registry=solr.core.collection1, tag=1588139414
   [junit4]   2> 3441164 INFO  (coreCloseExecutor-10672-thread-1) [    x:collection1] o.a.s.m.r.SolrJmxReporter Closing reporter [org.apache.solr.metrics.reporters.SolrJmxReporter@5a0a6f10: rootName = null, domain = solr.core.collection1, service url = null, agent id = null] for registry solr.core.collection1 / com.codahale.metrics.MetricRegistry@570f73e8
   [junit4]   2> 3441171 INFO  (SUITE-TestNRTOpen-seed#[890592012B790583]-worker) [    ] o.a.s.SolrTestCaseJ4 ####initCore
   [junit4]   2> 3441172 INFO  (SUITE-TestNRTOpen-seed#[890592012B790583]-worker) [    ] o.a.s.c.SolrResourceLoader [null] Added 2 libs to classloader, from paths: [/C:/Users/jenkins/workspace/Lucene-Solr-7.2-Windows/solr/core/src/test-files/solr/collection1/lib, /C:/Users/jenkins/workspace/Lucene-Solr-7.2-Windows/solr/core/src/test-files/solr/collection1/lib/classes]
   [junit4]   2> 3441211 INFO  (SUITE-TestNRTOpen-seed#[890592012B790583]-worker) [    ] o.a.s.c.SolrConfig Using Lucene MatchVersion: 7.2.0
   [junit4]   2> 3441217 INFO  (SUITE-TestNRTOpen-seed#[890592012B790583]-worker) [    ] o.a.s.s.IndexSchema [null] Schema name=minimal
   [junit4]   2> 3441220 WARN  (SUITE-TestNRTOpen-seed#[890592012B790583]-worker) [    ] o.a.s.s.IndexSchema no uniqueKey specified in schema.
   [junit4]   2> 3441220 INFO  (SUITE-TestNRTOpen-seed#[890592012B790583]-worker) [    ] o.a.s.s.IndexSchema Loaded schema minimal/1.1 with uniqueid field null
   [junit4]   2> 3441317 INFO  (SUITE-TestNRTOpen-seed#[890592012B790583]-worker) [    ] o.a.s.m.r.SolrJmxReporter JMX monitoring for 'solr.node' (registry 'solr.node') enabled at server: com.sun.jmx.mbeanserver.JmxMBeanServer@6c960313
   [junit4]   2> 3441325 INFO  (SUITE-TestNRTOpen-seed#[890592012B790583]-worker) [    ] o.a.s.m.r.SolrJmxReporter JMX monitoring for 'solr.jvm' (registry 'solr.jvm') enabled at server: com.sun.jmx.mbeanserver.JmxMBeanServer@6c960313
   [junit4]   2> 3441325 INFO  (SUITE-TestNRTOpen-seed#[890592012B790583]-worker) [    ] o.a.s.m.r.SolrJmxReporter JMX monitoring for 'solr.jetty' (registry 'solr.jetty') enabled at server: com.sun.jmx.mbeanserver.JmxMBeanServer@6c960313
   [junit4]   2> 3441327 INFO  (coreLoadExecutor-10679-thread-1) [    ] o.a.s.c.TransientSolrCoreCacheDefault Allocating transient cache for 2147483647 transient cores
   [junit4]   2> 3441328 INFO  (coreLoadExecutor-10679-thread-1) [    x:collection1] o.a.s.c.SolrResourceLoader [null] Added 2 libs to classloader, from paths: [/C:/Users/jenkins/workspace/Lucene-Solr-7.2-Windows/solr/core/src/test-files/solr/collection1/lib, /C:/Users/jenkins/workspace/Lucene-Solr-7.2-Windows/solr/core/src/test-files/solr/collection1/lib/classes]
   [junit4]   2> 3441412 INFO  (coreLoadExecutor-10679-thread-1) [    x:collection1] o.a.s.c.SolrConfig Using Lucene MatchVersion: 7.2.0
   [junit4]   2> 3441419 INFO  (coreLoadExecutor-10679-thread-1) [    x:collection1] o.a.s.s.IndexSchema [collection1] Schema name=minimal
   [junit4]   2> 3441423 WARN  (coreLoadExecutor-10679-thread-1) [    x:collection1] o.a.s.s.IndexSchema no uniqueKey specified in schema.
   [junit4]   2> 3441423 INFO  (coreLoadExecutor-10679-thread-1) [    x:collection1] o.a.s.s.IndexSchema Loaded schema minimal/1.1 with uniqueid field null
   [junit4]   2> 3441423 INFO  (coreLoadExecutor-10679-thread-1) [    x:collection1] o.a.s.c.CoreContainer Creating SolrCore 'collection1' using configuration from instancedir C:\Users\jenkins\workspace\Lucene-Solr-7.2-Windows\solr\core\src\test-files\solr\collection1, trusted=true
   [junit4]   2> 3441423 INFO  (coreLoadExecutor-10679-thread-1) [    x:collection1] o.a.s.m.r.SolrJmxReporter JMX monitoring for 'solr.core.collection1' (registry 'solr.core.collection1') enabled at server: com.sun.jmx.mbeanserver.JmxMBeanServer@6c960313
   [junit4]   2> 3441423 INFO  (coreLoadExecutor-10679-thread-1) [    x:collection1] o.a.s.c.SolrCore solr.RecoveryStrategy.Builder
   [junit4]   2> 3441423 INFO  (coreLoadExecutor-10679-thread-1) [    x:collection1] o.a.s.c.SolrCore [[collection1] ] Opening new SolrCore at [C:\Users\jenkins\workspace\Lucene-Solr-7.2-Windows\solr\core\src\test-files\solr\collection1], dataDir=[C:\Users\jenkins\workspace\Lucene-Solr-7.2-Windows\solr\build\solr-core\test\J0\temp\solr.core.TestNRTOpen_890592012B790583-001\init-core-data-001\]
   [junit4]   2> 3441518 INFO  (coreLoadExecutor-10679-thread-1) [    x:collection1] o.a.s.u.CommitTracker Hard AutoCommit: disabled
   [junit4]   2> 3441518 INFO  (coreLoadExecutor-10679-thread-1) [    x:collection1] o.a.s.u.CommitTracker Soft AutoCommit: disabled
   [junit4]   2> 3441524 INFO  (coreLoadExecutor-10679-thread-1) [    x:collection1] o.a.s.s.SolrIndexSearcher Opening [Searcher@423dc94e[collection1] main]
   [junit4]   2> 3441525 WARN  (coreLoadExecutor-10679-thread-1) [    x:collection1] o.a.s.r.ManagedResourceStorage Cannot write to config directory C:\Users\jenkins\workspace\Lucene-Solr-7.2-Windows\solr\core\src\test-files\solr\collection1\conf; switching to use InMemory storage instead.
   [junit4]   2> 3441526 INFO  (coreLoadExecutor-10679-thread-1) [    x:collection1] o.a.s.h.ReplicationHandler Commits will be reserved for 10000ms.
   [junit4]   2> 3441527 INFO  (searcherExecutor-10680-thread-1-processing-x:collection1) [    x:collection1] o.a.s.c.SolrCore [collection1] Registered new searcher Searcher@423dc94e[collection1] main{ExitableDirectoryReader(UninvertingDirectoryReader(Uninverting(_0(7.2.0):C1)))}
   [junit4]   2> 3441528 INFO  (SUITE-TestNRTOpen-seed#[890592012B790583]-worker) [    ] o.a.s.SolrTestCaseJ4 ####initCore end
   [junit4]   2> 3441531 INFO  (TEST-TestNRTOpen.testSharedCores-seed#[890592012B790583]) [    ] o.a.s.SolrTestCaseJ4 ###Starting testSharedCores
   [junit4]   2> 3441531 INFO  (TEST-TestNRTOpen.testSharedCores-seed#[890592012B790583]) [    ] o.a.s.u.DirectUpdateHandler2 [collection1] REMOVING ALL DOCUMENTS FROM INDEX
   [junit4]   2> 3441532 INFO  (TEST-TestNRTOpen.testSharedCores-seed#[890592012B790583]) [    ] o.a.s.u.p.LogUpdateProcessorFactory [collection1]  webapp=null path=null params={}{deleteByQuery=*:*} 0 0
   [junit4]   2> 3441532 INFO  (TEST-TestNRTOpen.testSharedCores-seed#[890592012B790583]) [    ] o.a.s.u.p.LogUpdateProcessorFactory [collection1]  webapp=null path=null params={}{add=[(null)]} 0 0
   [junit4]   2> 3441532 INFO  (TEST-TestNRTOpen.testSharedCores-seed#[890592012B790583]) [    ] o.a.s.u.DirectUpdateHandler2 start commit{,optimize=false,openSearcher=true,waitSearcher=true,expungeDeletes=false,softCommit=false,prepareCommit=false}
   [junit4]   2> 3441532 INFO  (TEST-TestNRTOpen.testSharedCores-seed#[890592012B790583]) [    ] o.a.s.u.SolrIndexWriter Calling setCommitData with IW:org.apache.solr.update.SolrIndexWriter@7c8296e1 commitCommandVersion:0
   [junit4]   2> 3441594 INFO  (TEST-TestNRTOpen.testSharedCores-seed#[890592012B790583]) [    ] o.a.s.s.SolrIndexSearcher Opening [Searcher@699183cb[collection1] main]
   [junit4]   2> 3441594 INFO  (TEST-TestNRTOpen.testSharedCores-seed#[890592012B790583]) [    ] o.a.s.u.DirectUpdateHandler2 end_commit_flush
   [junit4]   2> 3441594 INFO  (searcherExecutor-10680-thread-1) [    ] o.a.s.c.SolrCore [collection1] Registered new searcher Searcher@699183cb[collection1] main{ExitableDirectoryReader(UninvertingDirectoryReader(Uninverting(_1(7.2.0):C1)))}
   [junit4]   2> 3441597 INFO  (TEST-TestNRTOpen.testSharedCores-seed#[890592012B790583]) [    ] o.a.s.u.p.LogUpdateProcessorFactory [collection1]  webapp=null path=null params={}{commit=} 0 63
   [junit4]   2> 3441597 INFO  (TEST-TestNRTOpen.testSharedCores-seed#[890592012B790583]) [    ] o.a.s.u.DirectUpdateHandler2 start commit{,optimize=true,openSearcher=true,waitSearcher=true,expungeDeletes=false,softCommit=false,prepareCommit=false}
   [junit4]   2> 3441597 WARN  (TEST-TestNRTOpen.testSharedCores-seed#[890592012B790583]) [    ] o.a.s.u.DirectUpdateHandler2 Starting optimize... Reading and rewriting the entire index! Use with care.
   [junit4]   2> 3441597 INFO  (TEST-TestNRTOpen.testSharedCores-seed#[890592012B790583]) [    ] o.a.s.u.DirectUpdateHandler2 No uncommitted changes. Skipping IW.commit.
   [junit4]   2> 3441598 INFO  (TEST-TestNRTOpen.testSharedCores-seed#[890592012B790583]) [    ] o.a.s.u.DirectUpdateHandler2 end_commit_flush
   [junit4]   2> 3441598 INFO  (TEST-TestNRTOpen.testSharedCores-seed#[890592012B790583]) [    ] o.a.s.u.p.LogUpdateProcessorFactory [collection1]  webapp=null path=null params={}{optimize=} 0 0
   [junit4]   2> 3441599 INFO  (TEST-TestNRTOpen.testSharedCores-seed#[890592012B790583]) [    ] o.a.s.u.p.LogUpdateProcessorFactory [collection1]  webapp=null path=null params={}{add=[(null)]} 0 0
   [junit4]   2> 3441599 INFO  (TEST-TestNRTOpen.testSharedCores-seed#[890592012B790583]) [    ] o.a.s.u.DirectUpdateHandler2 start commit{,optimize=false,openSearcher=true,waitSearcher=true,expungeDeletes=false,softCommit=true,prepareCommit=false}
   [junit4]   2> 3441604 INFO  (TEST-TestNRTOpen.testSharedCores-seed#[890592012B790583]) [    ] o.a.s.s.SolrIndexSearcher Opening [Searcher@15733a21[collection1] main]
   [junit4]   2> 3441604 INFO  (TEST-TestNRTOpen.testSharedCores-seed#[890592012B790583]) [    ] o.a.s.u.DirectUpdateHandler2 end_commit_flush
   [junit4]   2> 3441605 INFO  (searcherExecutor-10680-thread-1) [    ] o.a.s.c.SolrCore [collection1] Registered new searcher Searcher@15733a21[collection1] main{ExitableDirectoryReader(UninvertingDirectoryReader(Uninverting(_1(7.2.0):C1) Uninverting(_2(7.2.0):C1)))}
   [junit4]   2> 3441606 INFO  (TEST-TestNRTOpen.testSharedCores-seed#[890592012B790583]) [    ] o.a.s.u.p.LogUpdateProcessorFactory [collection1]  webapp=null path=null params={}{commit=} 0 6
   [junit4]   2> 3441613 INFO  (TEST-TestNRTOpen.testSharedCores-seed#[890592012B790583]) [    ] o.a.s.u.p.LogUpdateProcessorFactory [collection1]  webapp=null path=null params={}{add=[(null)]} 0 6
   [junit4]   2> 3441613 INFO  (TEST-TestNRTOpen.testSharedCores-seed#[890592012B790583]) [    ] o.a.s.u.p.LogUpdateProcessorFactory [collection1]  webapp=null path=null params={}{add=[(null)]} 0 0
   [junit4]   2> 3441613 INFO  (TEST-TestNRTOpen.testSharedCores-seed#[890592012B790583]) [    ] o.a.s.u.DirectUpdateHandler2 start commit{,optimize=false,openSearcher=true,waitSearcher=true,expungeDeletes=false,softCommit=false,prepareCommit=false}
   [junit4]   2> 3441613 INFO  (TEST-TestNRTOpen.testSharedCores-seed#[890592012B790583]) [    ] o.a.s.u.SolrIndexWriter Calling setCommitData with IW:org.apache.solr.update.SolrIndexWriter@7c8296e1 commitCommandVersion:0
   [junit4]   2> 3441661 INFO  (TEST-TestNRTOpen.testSharedCores-seed#[890592012B790583]) [    ] o.a.s.s.SolrIndexSearcher Opening [Searcher@361bd96e[collection1] main]
   [junit4]   2> 3441661 INFO  (TEST-TestNRTOpen.testSharedCores-seed#[890592012B790583]) [    ] o.a.s.u.DirectUpdateHandler2 end_commit_flush
   [junit4]   2> 3441661 INFO  (searcherExecutor-10680-thread-1) [    ] o.a.s.c.SolrCore [collection1] Registered new searcher Searcher@361bd96e[collection1] main{ExitableDirectoryReader(UninvertingDirectoryReader(Uninverting(_1(7.2.0):C1) Uninverting(_2(7.2.0):C1) Uninverting(_3(7.2.0):C2)))}
   [junit4]   2> 3441661 INFO  (TEST-TestNRTOpen.testSharedCores-seed#[890592012B790583]) [    ] o.a.s.u.p.LogUpdateProcessorFactory [collection1]  webapp=null path=null params={}{commit=} 0 51
   [junit4]   2> 3441661 INFO  (TEST-TestNRTOpen.testSharedCores-seed#[890592012B790583]) [    ] o.a.s.u.p.LogUpdateProcessorFactory [collection1]  webapp=null path=null params={}{deleteByQuery=foo2:doc} 0 0
   [junit4]   2> 3441661 INFO  (TEST-TestNRTOpen.testSharedCores-seed#[890592012B790583]) [    ] o.a.s.u.DirectUpdateHandler2 start commit{,optimize=false,openSearcher=true,waitSearcher=true,expungeDeletes=false,softCommit=false,prepareCommit=false}
   [junit4]   2> 3441661 INFO  (TEST-TestNRTOpen.testSharedCores-seed#[890592012B790583]) [    ] o.a.s.u.SolrIndexWriter Calling setCommitData with IW:org.apache.solr.update.SolrIndexWriter@7c8296e1 commitCommandVersion:0
   [junit4]   2> 3441745 INFO  (TEST-TestNRTOpen.testSharedCores-seed#[890592012B790583]) [    ] o.a.s.s.SolrIndexSearcher Opening [Searcher@53ac13fe[collection1] main]
   [junit4]   2> 3441746 INFO  (TEST-TestNRTOpen.testSharedCores-seed#[890592012B790583]) [    ] o.a.s.u.DirectUpdateHandler2 end_commit_flush
   [junit4]   2> 3441747 INFO  (searcherExecutor-10680-thread-1) [    ] o.a.s.c.SolrCore [collection1] Registered new searcher Searcher@53ac13fe[collection1] main{ExitableDirectoryReader(UninvertingDirectoryReader(Uninverting(_1(7.2.0):C1) Uninverting(_2(7.2.0):C1) Uninverting(_3(7.2.0):C2/1:delGen=1)))}
   [junit4]   2> 3441748 INFO  (TEST-TestNRTOpen.testSharedCores-seed#[890592012B790583]) [    ] o.a.s.u.p.LogUpdateProcessorFactory [collection1]  webapp=null path=null params={}{commit=} 0 80
   [junit4]   2> 3441748 INFO  (TEST-TestNRTOpen.testSharedCores-seed#[890592012B790583]) [    ] o.a.s.SolrTestCaseJ4 ###Ending testSharedCores
   [junit4]   2> 3441750 INFO  (TEST-TestNRTOpen.testReaderIsNRT-seed#[890592012B790583]) [    ] o.a.s.SolrTestCaseJ4 ###Starting testReaderIsNRT
   [junit4]   2> 3441750 INFO  (TEST-TestNRTOpen.testReaderIsNRT-seed#[890592012B790583]) [    ] o.a.s.u.DirectUpdateHandler2 [collection1] REMOVING ALL DOCUMENTS FROM INDEX
   [junit4]   2> 3441750 INFO  (TEST-TestNRTOpen.testReaderIsNRT-seed#[890592012B790583]) [    ] o.a.s.u.p.LogUpdateProcessorFactory [collection1]  webapp=null path=null params={}{deleteByQuery=*:*} 0 0
   [junit4]   2> 3441751 INFO  (TEST-TestNRTOpen.testReaderIsNRT-seed#[890592012B790583]) [    ] o.a.s.u.p.LogUpdateProcessorFactory [collection1]  webapp=null path=null params={}{add=[(null)]} 0 0
   [junit4]   2> 3441752 INFO  (TEST-TestNRTOpen.testReaderIsNRT-seed#[890592012B790583]) [    ] o.a.s.u.DirectUpdateHandler2 start commit{,optimize=false,openSearcher=true,waitSearcher=true,expungeDeletes=false,softCommit=false,prepareCommit=false}
   [junit4]   2> 3441752 INFO  (TEST-TestNRTOpen.testReaderIsNRT-seed#[890592012B790583]) [    ] o.a.s.u.SolrIndexWriter Calling setCommitData with IW:org.apache.solr.update.SolrIndexWriter@7c8296e1 commitCommandVersion:0
   [junit4]   2> 3441766 INFO  (TEST-TestNRTOpen.testReaderIsNRT-seed#[890592012B790583]) [    ] o.a.s.s.SolrIndexSearcher Opening [Searcher@5443be28[collection1] main]
   [junit4]   2> 3441767 INFO  (TEST-TestNRTOpen.testReaderIsNRT-seed#[890592012B790583]) [    ] o.a.s.u.DirectUpdateHandler2 end_commit_flush
   [junit4]   2> 3441767 INFO  (searcherExecutor-10680-thread-1) [    ] o.a.s.c.SolrCore [collection1] Registered new searcher Searcher@5443be28[collection1] main{ExitableDirectoryReader(UninvertingDirectoryReader(Uninverting(_4(7.2.0):C1)))}
   [junit4]   2> 3441771 INFO  (TEST-TestNRTOpen.testReaderIsNRT-seed#[890592012B790583]) [    ] o.a.s.u.p.LogUpdateProcessorFactory [collection1]  webapp=null path=null params={}{commit=} 0 19
   [junit4]   2> 3441772 ERROR (TEST-TestNRTOpen.testReaderIsNRT-seed#[890592012B790583]) [    ] o.a.s.c.CorePropertiesLocator Couldn't load core descriptor from C:\Users\jenkins\workspace\Lucene-Solr-7.2-Windows\solr\core\src\test-files\solr\collection1\core.properties:java.nio.file.NoSuchFileException: C:\Users\jenkins\workspace\Lucene-Solr-7.2-Windows\solr\core\src\test-files\solr\collection1\core.properties
   [junit4]   2> 3441772 INFO  (TEST-TestNRTOpen.testReaderIsNRT-seed#[890592012B790583]) [    ] o.a.s.c.SolrResourceLoader [null] Added 2 libs to classloader, from paths: [/C:/Users/jenkins/workspace/Lucene-Solr-7.2-Windows/solr/core/src/test-files/solr/collection1/lib, /C:/Users/jenkins/workspace/Lucene-Solr-7.2-Windows/solr/core/src/test-files/solr/collection1/lib/classes]
   [junit4]   2> 3441834 INFO  (TEST-TestNRTOpen.testReaderIsNRT-seed#[890592012B790583]) [    ] o.a.s.c.SolrConfig Using Lucene MatchVersion: 7.2.0
   [junit4]   2> 3441839 INFO  (TEST-TestNRTOpen.testReaderIsNRT-seed#[890592012B790583]) [    ] o.a.s.s.IndexSchema [collection1] Schema name=minimal
   [junit4]   2> 3441843 WARN  (TEST-TestNRTOpen.testReaderIsNRT-seed#[890592012B790583]) [    ] o.a.s.s.IndexSchema no uniqueKey specified in schema.
   [junit4]   2> 3441844 INFO  (TEST-TestNRTOpen.testReaderIsNRT-seed#[890592012B790583]) [    ] o.a.s.s.IndexSchema Loaded schema minimal/1.1 with uniqueid field null
   [junit4]   2> 3441844 INFO  (TEST-TestNRTOpen.testReaderIsNRT-seed#[890592012B790583]) [    ] o.a.s.c.CoreContainer Reloading SolrCore 'collection1' using configuration from instancedir C:\Users\jenkins\workspace\Lucene-Solr-7.2-Windows\solr\core\src\test-files\solr\collection1
   [junit4]   2> 3441879 INFO  (TEST-TestNRTOpen.testReaderIsNRT-seed#[890592012B790583]) [    x:collection1] o.a.s.m.r.SolrJmxReporter JMX monitoring for 'solr.core.collection1' (registry 'solr.core.collection1') enabled at server: com.sun.jmx.mbeanserver.JmxMBeanServer@6c960313
   [junit4]   2> 3441880 INFO  (TEST-TestNRTOpen.testReaderIsNRT-seed#[890592012B790583]) [    x:collection1] o.a.s.c.SolrCore [[collection1] ] Opening new SolrCore at [C:\Users\jenkins\workspace\Lucene-Solr-7.2-Windows\solr\core\src\test-files\solr\collection1], dataDir=[C:\Users\jenkins\workspace\Lucene-Solr-7.2-Windows\solr\build\solr-core\test\J0\temp\solr.core.TestNRTOpen_890592012B790583-001\init-core-data-001\]
   [junit4]   2> 3441976 INFO  (TEST-TestNRTOpen.testReaderIsNRT-seed#[890592012B790583]) [    x:collection1] o.a.s.u.CommitTracker Hard AutoCommit: disabled
   [junit4]   2> 3441976 INFO  (TEST-TestNRTOpen.testReaderIsNRT-seed#[890592012B790583]) [    x:collection1] o.a.s.u.CommitTracker Soft AutoCommit: disabled
   [junit4]   2> 3441978 INFO  (TEST-TestNRTOpen.testReaderIsNRT-seed#[890592012B790583]) [    x:collection1] o.a.s.s.SolrIndexSearcher Opening [Searcher@584f9601[collection1] main]
   [junit4]   2> 3441979 WARN  (TEST-TestNRTOpen.testReaderIsNRT-seed#[890592012B790583]) [    x:collection1] o.a.s.r.ManagedResourceStorage Cannot write to config directory C:\Users\jenkins\workspace\Lucene-Solr-7.2-Windows\solr\core\src\test-files\solr\collection1\conf; switching to use InMemory storage instead.
   [junit4]   2> 3441979 INFO  (TEST-TestNRTOpen.testReaderIsNRT-seed#[890592012B790583]) [    x:collection1] o.a.s.h.ReplicationHandler Commits will be reserved for 10000ms.
   [junit4]   2> 3441981 INFO  (TEST-TestNRTOpen.testReaderIsNRT-seed#[890592012B790583]) [    x:collection1] o.a.s.u.DefaultSolrCoreState New IndexWriter is ready to be used.
   [junit4]   2> 3441981 INFO  (searcherExecutor-10684-thread-1-processing-x:collection1) [    x:collection1] o.a.s.c.SolrCore [collection1] Registered new searcher Searcher@584f9601[collection1] main{ExitableDirectoryReader(UninvertingDirectoryReader(Uninverting(_4(7.2.0):C1)))}
   [junit4]   2> 3441984 INFO  (TEST-TestNRTOpen.testReaderIsNRT-seed#[890592012B790583]) [    x:collection1] o.a.s.s.SolrIndexSearcher Opening [Searcher@58248ee0[collection1] main]
   [junit4]   2> 3441984 INFO  (TEST-TestNRTOpen.testReaderIsNRT-seed#[890592012B790583]) [    x:collection1] o.a.s.c.SolrCore [collection1]  CLOSING SolrCore org.apache.solr.core.SolrCore@230231d6
   [junit4]   2> 3441984 INFO  (TEST-TestNRTOpen.testReaderIsNRT-seed#[890592012B790583]) [    x:collection1] o.a.s.m.SolrMetricManager Closing metric reporters for registry=solr.core.collection1, tag=587346390
   [junit4]   2> 3441984 INFO  (TEST-TestNRTOpen.testReaderIsNRT-seed#[890592012B790583]) [    x:collection1] o.a.s.m.r.SolrJmxReporter Closing reporter [org.apache.solr.metrics.reporters.SolrJmxReporter@3cb7172f: rootName = null, domain = solr.core.collection1, service url = null, agent id = null] for registry solr.core.collection1 / com.codahale.metrics.MetricRegistry@61a6d7ca
   [junit4]   2> 3441984 INFO  (searcherExecutor-10684-thread-1-processing-x:collection1) [    x:collection1] o.a.s.c.SolrCore [collection1] Registered new searcher Searcher@58248ee0[collection1] main{ExitableDirectoryReader(UninvertingDirectoryReader(Uninverting(_4(7.2.0):C1)))}
   [junit4]   2> 3441992 INFO  (TEST-TestNRTOpen.testReaderIsNRT-seed#[890592012B790583]) [    x:collection1] o.a.s.u.p.LogUpdateProcessorFactory [collection1]  webapp=null path=null params={}{add=[(null)]} 0 0
   [junit4]   2> 3441992 INFO  (TEST-TestNRTOpen.testReaderIsNRT-seed#[890592012B790583]) [    x:collection1] o.a.s.u.DirectUpdateHandler2 start commit{,optimize=false,openSearcher=true,waitSearcher=true,expungeDeletes=false,softCommit=true,prepareCommit=false}
   [junit4]   2> 3441993 INFO  (TEST-TestNRTOpen.testReaderIsNRT-seed#[890592012B790583]) [    x:collection1] o.a.s.s.SolrIndexSearcher Opening [Searcher@5944367f[collection1] main]
   [junit4]   2> 3441993 INFO  (TEST-TestNRTOpen.testReaderIsNRT-seed#[890592012B790583]) [    x:collection1] o.a.s.u.DirectUpdateHandler2 end_commit_flush
   [junit4]   2> 3441993 INFO  (searcherExecutor-10684-thread-1-processing-x:collection1) [    x:collection1] o.a.s.c.SolrCore [collection1] Registered new searcher Searcher@5944367f[collection1] main{ExitableDirectoryReader(UninvertingDirectoryReader(Uninverting(_4(7.2.0):C1) Uninverting(_5(7.2.0):C1)))}
   [junit4]   2> 3441993 INFO  (TEST-TestNRTOpen.testReaderIsNRT-seed#[890592012B790583]) [    x:collection1] o.a.s.u.p.LogUpdateProcessorFactory [collection1]  webapp=null path=null params={}{commit=} 0 6
   [junit4]   2> 3442000 INFO  (TEST-TestNRTOpen.testReaderIsNRT-seed#[890592012B790583]) [    x:collection1] o.a.s.u.p.LogUpdateProcessorFactory [collection1]  webapp=null path=null params={}{add=[(null)]} 0 0
   [junit4]   2> 3442000 INFO  (TEST-TestNRTOpen.testReaderIsNRT-seed#[890592012B790583]) [    x:collection1] o.a.s.u.DirectUpdateHandler2 start commit{,optimize=false,openSearcher=true,waitSearcher=true,expungeDeletes=false,softCommit=false,prepareCommit=false}
   [junit4]   2> 3442000 INFO  (TEST-TestNRTOpen.testReaderIsNRT-seed#[890592012B790583]) [    x:collection1] o.a.s.u.SolrIndexWriter Calling setCommitData with IW:org.apache.solr.update.SolrIndexWriter@609e1b6c commitCommandVersion:0
   [junit4]   2> 3442071 INFO  (TEST-TestNRTOpen.testReaderIsNRT-seed#[890592012B790583]) [    x:collection1] o.a.s.s.SolrIndexSearcher Opening [Searcher@2e0f57d4[collection1] main]
   [junit4]   2> 3442072 INFO  (searcherExecutor-10684-thread-1-processing-x:collection1) [    x:collection1] o.a.s.c.SolrCore [collection1] Registered new searcher Searcher@2e0f57d4[collection1] main{ExitableDirectoryReader(UninvertingDirectoryReader(Uninverting(_4(7.2.0):C1) Uninverting(_5(7.2.0):C1) Uninverting(_6(7.2.0):C1)))}
   [junit4]   2> 3442073 INFO  (TEST-TestNRTOpen.testReaderIsNRT-seed#[890592012B790583]) [    x:collection1] o.a.s.u.DirectUpdateHandler2 end_commit_flush
   [junit4]   2> 3442073 INFO  (TEST-TestNRTOpen.testReaderIsNRT-seed#[890592012B790583]) [    x:collection1] o.a.s.u.p.LogUpdateProcessorFactory [collection1]  webapp=null path=null params={}{commit=} 0 73
   [junit4]   2> 3442073 INFO  (TEST-TestNRTOpen.testReaderIsNRT-seed#[890592012B790583]) [    x:collection1] o.a.s.u.p.LogUpdateProcessorFactory [collection1]  webapp=null path=null params={}{add=[(null)]} 0 0
   [junit4]   2> 3442075 ERROR (TEST-TestNRTOpen.testReaderIsNRT-seed#[890592012B790583]) [    x:collection1] o.a.s.c.CorePropertiesLocator Couldn't load core descriptor from C:\Users\jenkins\workspace\Lucene-Solr-7.2-Windows\solr\core\src\test-files\solr\collection1\core.properties:java.nio.file.NoSuchFileException: C:\Users\jenkins\workspace\Lucene-Solr-7.2-Windows\solr\core\src\test-files\solr\collection1\core.properties
   [junit4]   2> 3442075 INFO  (TEST-TestNRTOpen.testReaderIsNRT-seed#[890592012B790583]) [    x:collection1] o.a.s.c.SolrResourceLoader [null] Added 2 libs to classloader, from paths: [/C:/Users/jenkins/workspace/Lucene-Solr-7.2-Windows/solr/core/src/test-files/solr/collection1/lib, /C:/Users/jenkins/workspace/Lucene-Solr-7.2-Windows/solr/core/src/test-files/solr/collection1/lib/classes]
   [junit4]   2> 3442138 INFO  (TEST-TestNRTOpen.testReaderIsNRT-seed#[890592012B790583]) [    x:collection1] o.a.s.c.SolrConfig Using Lucene MatchVersion: 7.2.0
   [junit4]   2> 3442155 INFO  (TEST-TestNRTOpen.testReaderIsNRT-seed#[890592012B790583]) [    x:collection1] o.a.s.s.IndexSchema [collection1] Schema name=minimal
   [junit4]   2> 3442155 WARN  (TEST-TestNRTOpen.testReaderIsNRT-seed#[890592012B790583]) [    x:collection1] o.a.s.s.IndexSchema no uniqueKey specified in schema.
   [junit4]   2> 3442155 INFO  (TEST-TestNRTOpen.testReaderIsNRT-seed#[890592012B790583]) [    x:collection1] o.a.s.s.IndexSchema Loaded schema minimal/1.1 with uniqueid field null
   [junit4]   2> 3442163 INFO  (TEST-TestNRTOpen.testReaderIsNRT-seed#[890592012B790583]) [    x:collection1] o.a.s.c.CoreContainer Reloading SolrCore 'collection1' using configuration from instancedir C:\Users\jenkins\workspace\Lucene-Solr-7.2-Windows\solr\core\src\test-files\solr\collection1
   [junit4]   2> 3442199 INFO  (TEST-TestNRTOpen.testReaderIsNRT-seed#[890592012B790583]) [    x:collection1] o.a.s.m.r.SolrJmxReporter JMX monitoring for 'solr.core.collection1' (registry 'solr.core.collection1') enabled at server: com.sun.jmx.mbeanserver.JmxMBeanServer@6c960313
   [junit4]   2> 3442199 INFO  (TEST-TestNRTOpen.testReaderIsNRT-seed#[890592012B790583]) [    x:collection1] o.a.s.c.SolrCore [[collection1] ] Opening new SolrCore at [C:\Users\jenkins\workspace\Lucene-Solr-7.2-Windows\solr\core\src\test-files\solr\collection1], dataDir=[C:\Users\jenkins\workspace\Lucene-Solr-7.2-Windows\solr\build\solr-core\test\J0\temp\solr.core.TestNRTOpen_890592012B790583-001\init-core-data-001\]
   [junit4]   2> 3442283 INFO  (TEST-TestNRTOpen.testReaderIsNRT-seed#[890592012B790583]) [    x:collection1] o.a.s.u.CommitTracker Hard AutoCommit: disabled
   [junit4]   2> 3442283 INFO  (TEST-TestNRTOpen.testReaderIsNRT-seed#[890592012B790583]) [    x:collection1] o.a.s.u.CommitTracker Soft AutoCommit: disabled
   [junit4]   2> 3442286 INFO  (TEST-TestNRTOpen.testReaderIsNRT-seed#[890592012B790583]) [    x:collection1] o.a.s.s.SolrIndexSearcher Opening [Searcher@7e48e4a3[collection1] main]
   [junit4]   2> 3442286 WARN  (TEST-TestNRTOpen.testReaderIsNRT-seed#[890592012B790583]) [    x:collection1] o.a.s.r.ManagedResourceStorage Cannot write to config directory C:\Users\jenkins\workspace\Lucene-Solr-7.2-Windows\solr\core\src\test-files\solr\collection1\conf; switching to use InMemory storage instead.
   [junit4]   2> 3442286 INFO  (TEST-TestNRTOpen.testReaderIsNRT-seed#[890592012B790583]) [    x:collection1] o.a.s.h.ReplicationHandler Commits will be reserved for 10000ms.
   [junit4]   2> 3442286 INFO  (searcherExecutor-10688-thread-1-processing-x:collection1) [    x:collection1] o.a.s.c.SolrCore [collection1] Registered new searcher Searcher@7e48e4a3[collection1] main{ExitableDirectoryReader(UninvertingDirectoryReader(Uninverting(_4(7.2.0):C1) Uninverting(_5(7.2.0):C1) Uninverting(_6(7.2.0):C1) Uninverting(_7(7.2.0):C1)))}
   [junit4]   2> 3442362 INFO  (TEST-TestNRTOpen.testReaderIsNRT-seed#[890592012B790583]) [    x:collection1] o.a.s.u.DefaultSolrCoreState New IndexWriter is ready to be used.
   [junit4]   2> 3442362 INFO  (TEST-TestNRTOpen.testReaderIsNRT-seed#[890592012B790583]) [    x:collection1] o.a.s.s.SolrIndexSearcher Opening [Searcher@3882f5f[collection1] main]
   [junit4]   2> 3442362 INFO  (TEST-TestNRTOpen.testReaderIsNRT-seed#[890592012B790583]) [    x:collection1] o.a.s.c.SolrCore [collection1]  CLOSING SolrCore org.apache.solr.core.SolrCore@472c843f
   [junit4]   2> 3442362 INFO  (TEST-TestNRTOpen.testReaderIsNRT-seed#[890592012B790583]) [    x:collection1] o.a.s.m.SolrMetricManager Closing metric reporters for registry=solr.core.collection1, tag=1194099775
   [junit4]   2> 3442362 INFO  (TEST-TestNRTOpen.testReaderIsNRT-seed#[890592012B790583]) [    x:collection1] o.a.s.m.r.SolrJmxReporter Closing reporter [org.apache.solr.metrics.reporters.SolrJmxReporter@233921b9: rootName = null, domain = solr.core.collection1, service url = null, agent id = null] for registry solr.core.collection1 / com.codahale.metrics.MetricRegistry@61a6d7ca
   [junit4]   2> 3442362 INFO  (searcherExecutor-10688-thread-1-processing-x:collection1) [    x:collection1] o.a.s.c.SolrCore [collection1] Registered new searcher Searcher@3882f5f[collection1] main{ExitableDirectoryReader(UninvertingDirectoryReader(Uninverting(_4(7.2.0):C1) Uninverting(_5(7.2.0):C1) Uninverting(_6(7.2.0):C1) Uninverting(_7(7.2.0):C1)))}
   [junit4]   2> 3442375 INFO  (TEST-TestNRTOpen.testReaderIsNRT-seed#[890592012B790583]) [    x:collection1] o.a.s.SolrTestCaseJ4 ###Ending testReaderIsNRT
   [junit4]   2> 3442376 INFO  (SUITE-TestNRTOpen-seed#[890592012B790583]-worker) [    x:collection1] o.a.s.SolrTestCaseJ4 ###deleteCore
   [junit4]   2> 3442376 INFO  (SUITE-TestNRTOpen-seed#[890592012B790583]-worker) [    x:collection1] o.a.s.c.CoreContainer Shutting down CoreContainer instance=1604245572
   [junit4]   2> 3442376 INFO  (SUITE-TestNRTOpen-seed#[890592012B790583]-worker) [    x:collection1] o.a.s.m.SolrMetricManager Closing metric reporters for registry=solr.node, tag=null
   [junit4]   2> 3442376 INFO  (SUITE-TestNRTOpen-seed#[890592012B790583]-worker) [    x:collection1] o.a.s.m.r.SolrJmxReporter Closing reporter [org.apache.solr.metrics.reporters.SolrJmxReporter@1fb75018: rootName = null, domain = solr.node, service url = null, agent id = null] for registry solr.node / com.codahale.metrics.MetricRegistry@345a4df4
   [junit4]   2> 3442380 INFO  (SUITE-TestNRTOpen-seed#[890592012B790583]-worker) [    x:collection1] o.a.s.m.SolrMetricManager Closing metric reporters for registry=solr.jvm, tag=null
   [junit4]   2> 3442380 INFO  (SUITE-TestNRTOpen-seed#[890592012B790583]-worker) [    x:collection1] o.a.s.m.r.SolrJmxReporter Closing reporter [org.apache.solr.metrics.reporters.SolrJmxReporter@1d1b1c9a: rootName = null, domain = solr.jvm, service url = null, agent id = null] for registry solr.jvm / com.codahale.metrics.MetricRegistry@749e0cf0
   [junit4]   2> 3442381 INFO  (SUITE-TestNRTOpen-seed#[890592012B790583]-worker) [    x:collection1] o.a.s.m.SolrMetricManager Closing metric reporters for registry=solr.jetty, tag=null
   [junit4]   2> 3442382 INFO  (SUITE-TestNRTOpen-seed#[890592012B790583]-worker) [    x:collection1] o.a.s.m.r.SolrJmxReporter Closing reporter [org.apache.solr.metrics.reporters.SolrJmxReporter@79b37fed: rootName = null, domain = solr.jetty, service url = null, agent id = null] for registry solr.jetty / com.codahale.metrics.MetricRegistry@a2f6799
   [junit4]   2> 3442382 INFO  (coreCloseExecutor-10692-thread-1-processing-x:collection1) [    x:collection1] o.a.s.c.SolrCore [collection1]  CLOSING SolrCore org.apache.solr.core.SolrCore@4379993
   [junit4]   2> 3442382 INFO  (coreCloseExecutor-10692-thread-1-processing-x:collection1) [    x:collection1] o.a.s.m.SolrMetricManager Closing metric reporters for registry=solr.core.collection1, tag=70752659
   [junit4]   2> 3442382 INFO  (coreCloseExecutor-10692-thread-1-processing-x:collection1) [    x:collection1] o.a.s.m.r.SolrJmxReporter Closing reporter [org.apache.solr.metrics.reporters.SolrJmxReporter@23307b9b: rootName = null, domain = solr.core.collection1, service url = null, agent id = null] for registry solr.core.collection1 / com.codahale.metrics.MetricRegistry@61a6d7ca
   [junit4]   2> 3442392 INFO  (SUITE-TestNRTOpen-seed#[890592012B790583]-worker) [    x:collection1] o.a.s.SolrTestCaseJ4 ------------------------------------------------------- Done waiting for tracked resources to be released
   [junit4]   2> NOTE: test params are: codec=Asserting(Lucene70): {bazz=FST50, foo=FSTOrd50, bazzz=FST50, baz=FST50, foo2=PostingsFormat(name=LuceneVarGapFixedInterval)}, docValues:{}, maxPointsInLeafNode=1008, maxMBSortInHeap=7.325250586348052, sim=RandomSimilarity(queryNorm=false): {}, locale=de-GR, timezone=America/Argentina/Ushuaia
   [junit4]   2> NOTE: Windows 10 10.0 amd64/Oracle Corporation 1.8.0_144 (64-bit)/cpus=3,threads=1,free=156885016,total=456515584
   [junit4]   2> NOTE: All tests run in this JVM: [UninvertDocValuesMergePolicyTest, AlternateDirectoryTest, SuggesterFSTTest, TestCursorMarkWithoutUniqueKey, CdcrBidirectionalTest, NotRequiredUniqueKeyTest, TestInitParams, TestHdfsBackupRestoreCore, ConnectionReuseTest, TestConfigSetsAPIZkFailure, TestBulkSchemaAPI, TestStressInPlaceUpdates, DistribJoinFromCollectionTest, SpatialHeatmapFacetsTest, RAMDirectoryFactoryTest, AddBlockUpdateTest, TestConfigSetsAPI, CoreAdminCreateDiscoverTest, TestSolrXml, TestSolrQueryResponse, TestRecoveryHdfs, TestLocalFSCloudBackupRestore, StressHdfsTest, ClusterStateTest, SpellCheckCollatorTest, TestScoreJoinQPScore, TestFilteredDocIdSet, TestLazyCores, TestIndexingPerformance, CollectionsAPISolrJTest, DistributedFacetPivotWhiteBoxTest, TestSystemCollAutoCreate, DeleteShardTest, ShowFileRequestHandlerTest, BadIndexSchemaTest, DirectUpdateHandlerOptimizeTest, TestSerializedLuceneMatchVersion, CheckHdfsIndexTest, JvmMetricsTest, TestUseDocValuesAsStored2, CreateCollectionCleanupTest, TestLegacyFieldReuse, GraphQueryTest, PKIAuthenticationIntegrationTest, HdfsThreadLeakTest, DeleteNodeTest, TestSolrCoreProperties, TestOmitPositions, TestTolerantSearch, CollectionReloadTest, TimeZoneUtilsTest, DistributedFacetPivotLargeTest, TestConfigSets, NoCacheHeaderTest, HdfsRestartWhileUpdatingTest, MigrateRouteKeyTest, HdfsRecoverLeaseTest, ChaosMonkeySafeLeaderWithPullReplicasTest, TestSchemaNameResource, TestFieldCacheSort, TestHdfsCloudBackupRestore, TestTrieFacet, TestDownShardTolerantSearch, NumericFieldsTest, ClassificationUpdateProcessorFactoryTest, TestRequestStatusCollectionAPI, SolrInfoBeanTest, RecoveryZkTest, TestSearcherReuse, SolrMetricReporterTest, TestBinaryField, TestManagedSchemaAPI, TestBackupRepositoryFactory, TestMaxTokenLenTokenizer, TestRecovery, ScriptEngineTest, TestQuerySenderNoQuery, ZkControllerTest, TestAtomicUpdateErrorCases, CursorPagingTest, MetricsHandlerTest, StatsReloadRaceTest, SuggesterTSTTest, PeerSyncWithIndexFingerprintCachingTest, IndexBasedSpellCheckerTest, ConfigureRecoveryStrategyTest, PeerSyncReplicationTest, BJQParserTest, TestUnifiedSolrHighlighter, TestReversedWildcardFilterFactory, TestJsonFacets, TestEmbeddedSolrServerSchemaAPI, TestSolrCoreSnapshots, TestConfigSetImmutable, CloudMLTQParserTest, TestNamedUpdateProcessors, SolrCLIZkUtilsTest, TestFieldCache, TestCustomSort, TestRawTransformer, RankQueryTest, DefaultValueUpdateProcessorTest, ForceLeaderTest, TestOrdValues, TestZkAclsWithHadoopAuth, TestCSVResponseWriter, AutoScalingHandlerTest, TestAddFieldRealTimeGet, UUIDFieldTest, SuggesterWFSTTest, DistributedVersionInfoTest, DocExpirationUpdateProcessorFactoryTest, TestExactStatsCache, LeaderInitiatedRecoveryOnShardRestartTest, OverseerModifyCollectionTest, TestCoreAdminApis, TestSurroundQueryParser, QueryParsingTest, DisMaxRequestHandlerTest, SolrRequestParserTest, TestCustomStream, TestTestInjection, TestUtils, BasicDistributedZkTest, RequestHandlersTest, CdcrReplicationDistributedZkTest, TestFieldCacheVsDocValues, TestWriterPerf, ShardRoutingTest, LeaderFailureAfterFreshStartTest, TestFieldCollectionResource, DistribCursorPagingTest, TestMiniSolrCloudClusterSSL, SearchHandlerTest, TestSQLHandler, TestLMDirichletSimilarityFactory, URLClassifyProcessorTest, HdfsUnloadDistributedZkTest, TestNoOpRegenerator, BufferStoreTest, TestQueryWrapperFilter, AsyncCallRequestStatusResponseTest, TestPushWriter, SpellCheckCollatorWithCollapseTest, TestDFRSimilarityFactory, TestReloadAndDeleteDocs, BlockCacheTest, TestCollectionAPIs, TestBinaryResponseWriter, AnalyticsQueryTest, ClassificationUpdateProcessorTest, TestManagedSynonymGraphFilterFactory, TestNumericTokenStream, MoveReplicaHDFSFailoverTest, SuggestComponentTest, TestEmbeddedSolrServerAdminHandler, BinaryUpdateRequestHandlerTest, TestManagedStopFilterFactory, CollectionTooManyReplicasTest, LeaderElectionTest, TestQuerySenderListener, ZkCLITest, TestLFUCache, ReturnFieldsTest, TestExportWriter, FieldAnalysisRequestHandlerTest, DistributedSpellCheckComponentTest, TestCloudSearcherWarming, OverseerStatusTest, TestSolr4Spatial, TestReplicaProperties, AutoAddReplicasIntegrationTest, TestMissingGroups, CoreMergeIndexesAdminHandlerTest, ImplicitSnitchTest, JSONWriterTest, IndexSchemaTest, DistributedFacetPivotSmallAdvancedTest, DistanceUnitsTest, FastVectorHighlighterTest, TestPrepRecovery, ResponseLogComponentTest, TestLegacyNumericRangeQueryBuilder, TestIntervalFaceting, TestHashPartitioner, TestStressReorder, TestJoin, TestRangeQuery, StatsComponentTest, QueryElevationComponentTest, DirectUpdateHandlerTest, HighlighterTest, DistributedQueryElevationComponentTest, SignatureUpdateProcessorFactoryTest, TestFoldingMultitermQuery, SuggesterTest, TestTrie, SpatialFilterTest, WordBreakSolrSpellCheckerTest, SolrCoreCheckLockOnStartupTest, TestPseudoReturnFields, TestUpdate, QueryEqualityTest, SortByFunctionTest, TestRemoteStreaming, TestSolrDeletionPolicy1, LukeRequestHandlerTest, PrimitiveFieldTypeTest, XmlUpdateRequestHandlerTest, TermVectorComponentTest, IndexSchemaRuntimeFieldTest, SolrPluginUtilsTest, TestAnalyzedSuggestions, TestPartialUpdateDeduplication, PingRequestHandlerTest, TestSolrDeletionPolicy2, MultiTermTest, SampleTest, TestSearchPerf, TestConfig, TestFuzzyAnalyzedSuggestions, DirectSolrConnectionTest, TestLuceneMatchVersion, SpellPossibilityIteratorTest, TestCharFilters, TestCodecSupport, TestIBSimilarityFactory, TestFastWriter, ResourceLoaderTest, TestFastLRUCache, ChaosMonkeyNothingIsSafeTest, ChaosMonkeyNothingIsSafeWithPullReplicasTest, ConfigSetsAPITest, DeleteReplicaTest, LegacyCloudClusterPropTest, MissingSegmentRecoveryTest, MoveReplicaHDFSTest, MoveReplicaTest, NodeMutatorTest, OverriddenZkACLAndCredentialsProvidersTest, OverseerRolesTest, OverseerTaskQueueTest, RemoteQueryErrorTest, ReplicationFactorTest, RollingRestartTest, SSLMigrationTest, SaslZkACLProviderTest, SharedFSAutoReplicaFailoverTest, SimpleCollectionCreateDeleteTest, TestCloudDeleteByQuery, TestCloudInspectUtil, TestCloudJSONFacetJoinDomain, TestCloudPseudoReturnFields, TestCloudRecovery, TestCryptoKeys, TestDistribDocBasedVersion, TestLeaderElectionZkExpiry, TestOnReconnectListenerSupport, TestPullReplicaErrorHandling, TestSolrCloudWithSecureImpersonation, TestStressLiveNodes, TestTlogReplica, ExecutePlanActionTest, HttpTriggerListenerTest, NodeLostTriggerTest, SearchRateTriggerTest, SystemLogListenerTest, BaseCdcrDistributedZkTest, CdcrBootstrapTest, CdcrRequestHandlerTest, CdcrVersionReplicationTest, HdfsBasicDistributedZk2Test, HdfsBasicDistributedZkTest, HdfsChaosMonkeyNothingIsSafeTest, HdfsCollectionsAPIDistributedZkTest, HdfsRecoveryZkTest, HdfsSyncSliceTest, HdfsTlogReplayBufferedWhileIndexingTest, HdfsWriteToMultipleCollectionsTest, ZkStateReaderTest, ZkStateWriterTest, RuleEngineTest, RulesTest, CoreSorterTest, DirectoryFactoryTest, HdfsDirectoryFactoryTest, TestConfigOverlay, TestConfigSetProperties, TestImplicitCoreProperties, TestNRTOpen]
   [junit4]   2> NOTE: reproduce with: ant test  -Dtestcase=TestNRTOpen -Dtests.seed=890592012B790583 -Dtests.slow=true -Dtests.locale=de-GR -Dtests.timezone=America/Argentina/Ushuaia -Dtests.asserts=true -Dtests.file.encoding=Cp1252
   [junit4] ERROR   0.00s J0 | TestNRTOpen (suite) <<<
   [junit4]    > Throwable #1: java.io.IOException: Could not remove the following files (in the order of attempts):
   [junit4]    >    C:\Users\jenkins\workspace\Lucene-Solr-7.2-Windows\solr\build\solr-core\test\J0\temp\solr.core.TestNRTOpen_890592012B790583-001\init-core-data-001: java.nio.file.AccessDeniedException: C:\Users\jenkins\workspace\Lucene-Solr-7.2-Windows\solr\build\solr-core\test\J0\temp\solr.core.TestNRTOpen_890592012B790583-001\init-core-data-001
   [junit4]    >    C:\Users\jenkins\workspace\Lucene-Solr-7.2-Windows\solr\build\solr-core\test\J0\temp\solr.core.TestNRTOpen_890592012B790583-001: java.nio.file.DirectoryNotEmptyException: C:\Users\jenkins\workspace\Lucene-Solr-7.2-Windows\solr\build\solr-core\test\J0\temp\solr.core.TestNRTOpen_890592012B790583-001
   [junit4]    > 	at __randomizedtesting.SeedInfo.seed([890592012B790583]:0)
   [junit4]    > 	at org.apache.lucene.util.IOUtils.rm(IOUtils.java:329)
   [junit4]    > 	at java.lang.Thread.run(Thread.java:748)
   [junit4] Completed [595/751 (2!)] on J0 in 1.74s, 2 tests, 1 error <<< FAILURES!

[...truncated 47964 lines...]

Mime
View raw message