lucene-dev mailing list archives

Site index · List index
Message view « Date » · « Thread »
Top « Date » · « Thread »
From Policeman Jenkins Server <jenk...@thetaphi.de>
Subject [JENKINS] Lucene-Solr-7.2-Linux (64bit/jdk1.8.0_144) - Build # 99 - Still Unstable!
Date Fri, 22 Dec 2017 06:38:20 GMT
Build: https://jenkins.thetaphi.de/job/Lucene-Solr-7.2-Linux/99/
Java: 64bit/jdk1.8.0_144 -XX:-UseCompressedOops -XX:+UseConcMarkSweepGC

5 tests failed.
FAILED:  org.apache.solr.client.solrj.impl.CloudSolrClientTest.testRetryUpdatesWhenClusterStateIsStale

Error Message:
Error from server at https://127.0.0.1:40881/solr/stale_state_test_col: No registered leader was found after waiting for 4000ms , collection: stale_state_test_col slice: shard1 saw state=DocCollection(stale_state_test_col//collections/stale_state_test_col/state.json/9)={   "pullReplicas":"0",   "replicationFactor":"1",   "shards":{"shard1":{       "range":"80000000-7fffffff",       "state":"active",       "replicas":{"core_node4":{           "core":"stale_state_test_col_shard1_replica_n3",           "base_url":"https://127.0.0.1:40881/solr",           "node_name":"127.0.0.1:40881_solr",           "state":"active",           "type":"NRT"}}}},   "router":{"name":"compositeId"},   "maxShardsPerNode":"1",   "autoAddReplicas":"false",   "nrtReplicas":"1",   "tlogReplicas":"0"} with live_nodes=[127.0.0.1:46541_solr, 127.0.0.1:40881_solr, 127.0.0.1:43163_solr]

Stack Trace:
org.apache.solr.client.solrj.impl.HttpSolrClient$RemoteSolrException: Error from server at https://127.0.0.1:40881/solr/stale_state_test_col: No registered leader was found after waiting for 4000ms , collection: stale_state_test_col slice: shard1 saw state=DocCollection(stale_state_test_col//collections/stale_state_test_col/state.json/9)={
  "pullReplicas":"0",
  "replicationFactor":"1",
  "shards":{"shard1":{
      "range":"80000000-7fffffff",
      "state":"active",
      "replicas":{"core_node4":{
          "core":"stale_state_test_col_shard1_replica_n3",
          "base_url":"https://127.0.0.1:40881/solr",
          "node_name":"127.0.0.1:40881_solr",
          "state":"active",
          "type":"NRT"}}}},
  "router":{"name":"compositeId"},
  "maxShardsPerNode":"1",
  "autoAddReplicas":"false",
  "nrtReplicas":"1",
  "tlogReplicas":"0"} with live_nodes=[127.0.0.1:46541_solr, 127.0.0.1:40881_solr, 127.0.0.1:43163_solr]
	at __randomizedtesting.SeedInfo.seed([14FB31B5F4B16499:A0CAA95D175812B5]:0)
	at org.apache.solr.client.solrj.impl.HttpSolrClient.executeMethod(HttpSolrClient.java:643)
	at org.apache.solr.client.solrj.impl.HttpSolrClient.request(HttpSolrClient.java:255)
	at org.apache.solr.client.solrj.impl.HttpSolrClient.request(HttpSolrClient.java:244)
	at org.apache.solr.client.solrj.impl.LBHttpSolrClient.doRequest(LBHttpSolrClient.java:483)
	at org.apache.solr.client.solrj.impl.LBHttpSolrClient.request(LBHttpSolrClient.java:413)
	at org.apache.solr.client.solrj.impl.CloudSolrClient.sendRequest(CloudSolrClient.java:1103)
	at org.apache.solr.client.solrj.impl.CloudSolrClient.requestWithRetryOnStaleState(CloudSolrClient.java:883)
	at org.apache.solr.client.solrj.impl.CloudSolrClient.requestWithRetryOnStaleState(CloudSolrClient.java:945)
	at org.apache.solr.client.solrj.impl.CloudSolrClient.request(CloudSolrClient.java:816)
	at org.apache.solr.client.solrj.SolrRequest.process(SolrRequest.java:194)
	at org.apache.solr.client.solrj.request.UpdateRequest.commit(UpdateRequest.java:233)
	at org.apache.solr.client.solrj.impl.CloudSolrClientTest.testRetryUpdatesWhenClusterStateIsStale(CloudSolrClientTest.java:848)
	at sun.reflect.NativeMethodAccessorImpl.invoke0(Native Method)
	at sun.reflect.NativeMethodAccessorImpl.invoke(NativeMethodAccessorImpl.java:62)
	at sun.reflect.DelegatingMethodAccessorImpl.invoke(DelegatingMethodAccessorImpl.java:43)
	at java.lang.reflect.Method.invoke(Method.java:498)
	at com.carrotsearch.randomizedtesting.RandomizedRunner.invoke(RandomizedRunner.java:1737)
	at com.carrotsearch.randomizedtesting.RandomizedRunner$8.evaluate(RandomizedRunner.java:934)
	at com.carrotsearch.randomizedtesting.RandomizedRunner$9.evaluate(RandomizedRunner.java:970)
	at com.carrotsearch.randomizedtesting.RandomizedRunner$10.evaluate(RandomizedRunner.java:984)
	at org.junit.rules.ExpectedException$ExpectedExceptionStatement.evaluate(ExpectedException.java:110)
	at com.carrotsearch.randomizedtesting.rules.SystemPropertiesRestoreRule$1.evaluate(SystemPropertiesRestoreRule.java:57)
	at org.apache.lucene.util.TestRuleSetupTeardownChained$1.evaluate(TestRuleSetupTeardownChained.java:49)
	at org.apache.lucene.util.AbstractBeforeAfterRule$1.evaluate(AbstractBeforeAfterRule.java:45)
	at org.apache.lucene.util.TestRuleThreadAndTestName$1.evaluate(TestRuleThreadAndTestName.java:48)
	at org.apache.lucene.util.TestRuleIgnoreAfterMaxFailures$1.evaluate(TestRuleIgnoreAfterMaxFailures.java:64)
	at org.apache.lucene.util.TestRuleMarkFailure$1.evaluate(TestRuleMarkFailure.java:47)
	at com.carrotsearch.randomizedtesting.rules.StatementAdapter.evaluate(StatementAdapter.java:36)
	at com.carrotsearch.randomizedtesting.ThreadLeakControl$StatementRunner.run(ThreadLeakControl.java:368)
	at com.carrotsearch.randomizedtesting.ThreadLeakControl.forkTimeoutingTask(ThreadLeakControl.java:817)
	at com.carrotsearch.randomizedtesting.ThreadLeakControl$3.evaluate(ThreadLeakControl.java:468)
	at com.carrotsearch.randomizedtesting.RandomizedRunner.runSingleTest(RandomizedRunner.java:943)
	at com.carrotsearch.randomizedtesting.RandomizedRunner$5.evaluate(RandomizedRunner.java:829)
	at com.carrotsearch.randomizedtesting.RandomizedRunner$6.evaluate(RandomizedRunner.java:879)
	at com.carrotsearch.randomizedtesting.RandomizedRunner$7.evaluate(RandomizedRunner.java:890)
	at com.carrotsearch.randomizedtesting.rules.StatementAdapter.evaluate(StatementAdapter.java:36)
	at com.carrotsearch.randomizedtesting.rules.SystemPropertiesRestoreRule$1.evaluate(SystemPropertiesRestoreRule.java:57)
	at org.apache.lucene.util.AbstractBeforeAfterRule$1.evaluate(AbstractBeforeAfterRule.java:45)
	at com.carrotsearch.randomizedtesting.rules.StatementAdapter.evaluate(StatementAdapter.java:36)
	at org.apache.lucene.util.TestRuleStoreClassName$1.evaluate(TestRuleStoreClassName.java:41)
	at com.carrotsearch.randomizedtesting.rules.NoShadowingOrOverridesOnMethodsRule$1.evaluate(NoShadowingOrOverridesOnMethodsRule.java:40)
	at com.carrotsearch.randomizedtesting.rules.NoShadowingOrOverridesOnMethodsRule$1.evaluate(NoShadowingOrOverridesOnMethodsRule.java:40)
	at com.carrotsearch.randomizedtesting.rules.StatementAdapter.evaluate(StatementAdapter.java:36)
	at com.carrotsearch.randomizedtesting.rules.StatementAdapter.evaluate(StatementAdapter.java:36)
	at com.carrotsearch.randomizedtesting.rules.StatementAdapter.evaluate(StatementAdapter.java:36)
	at org.apache.lucene.util.TestRuleAssertionsRequired$1.evaluate(TestRuleAssertionsRequired.java:53)
	at org.apache.lucene.util.TestRuleMarkFailure$1.evaluate(TestRuleMarkFailure.java:47)
	at org.apache.lucene.util.TestRuleIgnoreAfterMaxFailures$1.evaluate(TestRuleIgnoreAfterMaxFailures.java:64)
	at org.apache.lucene.util.TestRuleIgnoreTestSuites$1.evaluate(TestRuleIgnoreTestSuites.java:54)
	at com.carrotsearch.randomizedtesting.rules.StatementAdapter.evaluate(StatementAdapter.java:36)
	at com.carrotsearch.randomizedtesting.ThreadLeakControl$StatementRunner.run(ThreadLeakControl.java:368)
	at java.lang.Thread.run(Thread.java:748)


FAILED:  org.apache.solr.client.solrj.impl.CloudSolrClientTest.checkCollectionParameters

Error Message:
Could not find collection:multicollection1

Stack Trace:
java.lang.AssertionError: Could not find collection:multicollection1
	at __randomizedtesting.SeedInfo.seed([14FB31B5F4B16499:EFECA205ADE6B32E]:0)
	at org.junit.Assert.fail(Assert.java:93)
	at org.junit.Assert.assertTrue(Assert.java:43)
	at org.junit.Assert.assertNotNull(Assert.java:526)
	at org.apache.solr.cloud.AbstractDistribZkTestBase.waitForRecoveriesToFinish(AbstractDistribZkTestBase.java:155)
	at org.apache.solr.client.solrj.impl.CloudSolrClientTest.checkCollectionParameters(CloudSolrClientTest.java:585)
	at sun.reflect.NativeMethodAccessorImpl.invoke0(Native Method)
	at sun.reflect.NativeMethodAccessorImpl.invoke(NativeMethodAccessorImpl.java:62)
	at sun.reflect.DelegatingMethodAccessorImpl.invoke(DelegatingMethodAccessorImpl.java:43)
	at java.lang.reflect.Method.invoke(Method.java:498)
	at com.carrotsearch.randomizedtesting.RandomizedRunner.invoke(RandomizedRunner.java:1737)
	at com.carrotsearch.randomizedtesting.RandomizedRunner$8.evaluate(RandomizedRunner.java:934)
	at com.carrotsearch.randomizedtesting.RandomizedRunner$9.evaluate(RandomizedRunner.java:970)
	at com.carrotsearch.randomizedtesting.RandomizedRunner$10.evaluate(RandomizedRunner.java:984)
	at org.junit.rules.ExpectedException$ExpectedExceptionStatement.evaluate(ExpectedException.java:110)
	at com.carrotsearch.randomizedtesting.rules.SystemPropertiesRestoreRule$1.evaluate(SystemPropertiesRestoreRule.java:57)
	at org.apache.lucene.util.TestRuleSetupTeardownChained$1.evaluate(TestRuleSetupTeardownChained.java:49)
	at org.apache.lucene.util.AbstractBeforeAfterRule$1.evaluate(AbstractBeforeAfterRule.java:45)
	at org.apache.lucene.util.TestRuleThreadAndTestName$1.evaluate(TestRuleThreadAndTestName.java:48)
	at org.apache.lucene.util.TestRuleIgnoreAfterMaxFailures$1.evaluate(TestRuleIgnoreAfterMaxFailures.java:64)
	at org.apache.lucene.util.TestRuleMarkFailure$1.evaluate(TestRuleMarkFailure.java:47)
	at com.carrotsearch.randomizedtesting.rules.StatementAdapter.evaluate(StatementAdapter.java:36)
	at com.carrotsearch.randomizedtesting.ThreadLeakControl$StatementRunner.run(ThreadLeakControl.java:368)
	at com.carrotsearch.randomizedtesting.ThreadLeakControl.forkTimeoutingTask(ThreadLeakControl.java:817)
	at com.carrotsearch.randomizedtesting.ThreadLeakControl$3.evaluate(ThreadLeakControl.java:468)
	at com.carrotsearch.randomizedtesting.RandomizedRunner.runSingleTest(RandomizedRunner.java:943)
	at com.carrotsearch.randomizedtesting.RandomizedRunner$5.evaluate(RandomizedRunner.java:829)
	at com.carrotsearch.randomizedtesting.RandomizedRunner$6.evaluate(RandomizedRunner.java:879)
	at com.carrotsearch.randomizedtesting.RandomizedRunner$7.evaluate(RandomizedRunner.java:890)
	at com.carrotsearch.randomizedtesting.rules.StatementAdapter.evaluate(StatementAdapter.java:36)
	at com.carrotsearch.randomizedtesting.rules.SystemPropertiesRestoreRule$1.evaluate(SystemPropertiesRestoreRule.java:57)
	at org.apache.lucene.util.AbstractBeforeAfterRule$1.evaluate(AbstractBeforeAfterRule.java:45)
	at com.carrotsearch.randomizedtesting.rules.StatementAdapter.evaluate(StatementAdapter.java:36)
	at org.apache.lucene.util.TestRuleStoreClassName$1.evaluate(TestRuleStoreClassName.java:41)
	at com.carrotsearch.randomizedtesting.rules.NoShadowingOrOverridesOnMethodsRule$1.evaluate(NoShadowingOrOverridesOnMethodsRule.java:40)
	at com.carrotsearch.randomizedtesting.rules.NoShadowingOrOverridesOnMethodsRule$1.evaluate(NoShadowingOrOverridesOnMethodsRule.java:40)
	at com.carrotsearch.randomizedtesting.rules.StatementAdapter.evaluate(StatementAdapter.java:36)
	at com.carrotsearch.randomizedtesting.rules.StatementAdapter.evaluate(StatementAdapter.java:36)
	at com.carrotsearch.randomizedtesting.rules.StatementAdapter.evaluate(StatementAdapter.java:36)
	at org.apache.lucene.util.TestRuleAssertionsRequired$1.evaluate(TestRuleAssertionsRequired.java:53)
	at org.apache.lucene.util.TestRuleMarkFailure$1.evaluate(TestRuleMarkFailure.java:47)
	at org.apache.lucene.util.TestRuleIgnoreAfterMaxFailures$1.evaluate(TestRuleIgnoreAfterMaxFailures.java:64)
	at org.apache.lucene.util.TestRuleIgnoreTestSuites$1.evaluate(TestRuleIgnoreTestSuites.java:54)
	at com.carrotsearch.randomizedtesting.rules.StatementAdapter.evaluate(StatementAdapter.java:36)
	at com.carrotsearch.randomizedtesting.ThreadLeakControl$StatementRunner.run(ThreadLeakControl.java:368)
	at java.lang.Thread.run(Thread.java:748)


FAILED:  org.apache.solr.client.solrj.impl.CloudSolrClientTest.testAliasHandling

Error Message:
Error from server at https://127.0.0.1:46541/solr: Could not fully create collection: 2nd_collection

Stack Trace:
org.apache.solr.client.solrj.impl.HttpSolrClient$RemoteSolrException: Error from server at https://127.0.0.1:46541/solr: Could not fully create collection: 2nd_collection
	at __randomizedtesting.SeedInfo.seed([14FB31B5F4B16499:11045E4537FF60BB]:0)
	at org.apache.solr.client.solrj.impl.HttpSolrClient.executeMethod(HttpSolrClient.java:643)
	at org.apache.solr.client.solrj.impl.HttpSolrClient.request(HttpSolrClient.java:255)
	at org.apache.solr.client.solrj.impl.HttpSolrClient.request(HttpSolrClient.java:244)
	at org.apache.solr.client.solrj.impl.LBHttpSolrClient.doRequest(LBHttpSolrClient.java:483)
	at org.apache.solr.client.solrj.impl.LBHttpSolrClient.request(LBHttpSolrClient.java:413)
	at org.apache.solr.client.solrj.impl.CloudSolrClient.sendRequest(CloudSolrClient.java:1103)
	at org.apache.solr.client.solrj.impl.CloudSolrClient.requestWithRetryOnStaleState(CloudSolrClient.java:883)
	at org.apache.solr.client.solrj.impl.CloudSolrClient.request(CloudSolrClient.java:816)
	at org.apache.solr.client.solrj.SolrRequest.process(SolrRequest.java:194)
	at org.apache.solr.client.solrj.SolrRequest.process(SolrRequest.java:211)
	at org.apache.solr.client.solrj.impl.CloudSolrClientTest.testAliasHandling(CloudSolrClientTest.java:178)
	at sun.reflect.NativeMethodAccessorImpl.invoke0(Native Method)
	at sun.reflect.NativeMethodAccessorImpl.invoke(NativeMethodAccessorImpl.java:62)
	at sun.reflect.DelegatingMethodAccessorImpl.invoke(DelegatingMethodAccessorImpl.java:43)
	at java.lang.reflect.Method.invoke(Method.java:498)
	at com.carrotsearch.randomizedtesting.RandomizedRunner.invoke(RandomizedRunner.java:1737)
	at com.carrotsearch.randomizedtesting.RandomizedRunner$8.evaluate(RandomizedRunner.java:934)
	at com.carrotsearch.randomizedtesting.RandomizedRunner$9.evaluate(RandomizedRunner.java:970)
	at com.carrotsearch.randomizedtesting.RandomizedRunner$10.evaluate(RandomizedRunner.java:984)
	at org.junit.rules.ExpectedException$ExpectedExceptionStatement.evaluate(ExpectedException.java:110)
	at com.carrotsearch.randomizedtesting.rules.SystemPropertiesRestoreRule$1.evaluate(SystemPropertiesRestoreRule.java:57)
	at org.apache.lucene.util.TestRuleSetupTeardownChained$1.evaluate(TestRuleSetupTeardownChained.java:49)
	at org.apache.lucene.util.AbstractBeforeAfterRule$1.evaluate(AbstractBeforeAfterRule.java:45)
	at org.apache.lucene.util.TestRuleThreadAndTestName$1.evaluate(TestRuleThreadAndTestName.java:48)
	at org.apache.lucene.util.TestRuleIgnoreAfterMaxFailures$1.evaluate(TestRuleIgnoreAfterMaxFailures.java:64)
	at org.apache.lucene.util.TestRuleMarkFailure$1.evaluate(TestRuleMarkFailure.java:47)
	at com.carrotsearch.randomizedtesting.rules.StatementAdapter.evaluate(StatementAdapter.java:36)
	at com.carrotsearch.randomizedtesting.ThreadLeakControl$StatementRunner.run(ThreadLeakControl.java:368)
	at com.carrotsearch.randomizedtesting.ThreadLeakControl.forkTimeoutingTask(ThreadLeakControl.java:817)
	at com.carrotsearch.randomizedtesting.ThreadLeakControl$3.evaluate(ThreadLeakControl.java:468)
	at com.carrotsearch.randomizedtesting.RandomizedRunner.runSingleTest(RandomizedRunner.java:943)
	at com.carrotsearch.randomizedtesting.RandomizedRunner$5.evaluate(RandomizedRunner.java:829)
	at com.carrotsearch.randomizedtesting.RandomizedRunner$6.evaluate(RandomizedRunner.java:879)
	at com.carrotsearch.randomizedtesting.RandomizedRunner$7.evaluate(RandomizedRunner.java:890)
	at com.carrotsearch.randomizedtesting.rules.StatementAdapter.evaluate(StatementAdapter.java:36)
	at com.carrotsearch.randomizedtesting.rules.SystemPropertiesRestoreRule$1.evaluate(SystemPropertiesRestoreRule.java:57)
	at org.apache.lucene.util.AbstractBeforeAfterRule$1.evaluate(AbstractBeforeAfterRule.java:45)
	at com.carrotsearch.randomizedtesting.rules.StatementAdapter.evaluate(StatementAdapter.java:36)
	at org.apache.lucene.util.TestRuleStoreClassName$1.evaluate(TestRuleStoreClassName.java:41)
	at com.carrotsearch.randomizedtesting.rules.NoShadowingOrOverridesOnMethodsRule$1.evaluate(NoShadowingOrOverridesOnMethodsRule.java:40)
	at com.carrotsearch.randomizedtesting.rules.NoShadowingOrOverridesOnMethodsRule$1.evaluate(NoShadowingOrOverridesOnMethodsRule.java:40)
	at com.carrotsearch.randomizedtesting.rules.StatementAdapter.evaluate(StatementAdapter.java:36)
	at com.carrotsearch.randomizedtesting.rules.StatementAdapter.evaluate(StatementAdapter.java:36)
	at com.carrotsearch.randomizedtesting.rules.StatementAdapter.evaluate(StatementAdapter.java:36)
	at org.apache.lucene.util.TestRuleAssertionsRequired$1.evaluate(TestRuleAssertionsRequired.java:53)
	at org.apache.lucene.util.TestRuleMarkFailure$1.evaluate(TestRuleMarkFailure.java:47)
	at org.apache.lucene.util.TestRuleIgnoreAfterMaxFailures$1.evaluate(TestRuleIgnoreAfterMaxFailures.java:64)
	at org.apache.lucene.util.TestRuleIgnoreTestSuites$1.evaluate(TestRuleIgnoreTestSuites.java:54)
	at com.carrotsearch.randomizedtesting.rules.StatementAdapter.evaluate(StatementAdapter.java:36)
	at com.carrotsearch.randomizedtesting.ThreadLeakControl$StatementRunner.run(ThreadLeakControl.java:368)
	at java.lang.Thread.run(Thread.java:748)


FAILED:  org.apache.solr.client.solrj.impl.CloudSolrClientTest.preferLocalShardsTest

Error Message:
Could not find collection:localShardsTestColl

Stack Trace:
java.lang.AssertionError: Could not find collection:localShardsTestColl
	at __randomizedtesting.SeedInfo.seed([14FB31B5F4B16499:E836A90C0A66F363]:0)
	at org.junit.Assert.fail(Assert.java:93)
	at org.junit.Assert.assertTrue(Assert.java:43)
	at org.junit.Assert.assertNotNull(Assert.java:526)
	at org.apache.solr.cloud.AbstractDistribZkTestBase.waitForRecoveriesToFinish(AbstractDistribZkTestBase.java:155)
	at org.apache.solr.client.solrj.impl.CloudSolrClientTest.preferLocalShardsTest(CloudSolrClientTest.java:429)
	at sun.reflect.NativeMethodAccessorImpl.invoke0(Native Method)
	at sun.reflect.NativeMethodAccessorImpl.invoke(NativeMethodAccessorImpl.java:62)
	at sun.reflect.DelegatingMethodAccessorImpl.invoke(DelegatingMethodAccessorImpl.java:43)
	at java.lang.reflect.Method.invoke(Method.java:498)
	at com.carrotsearch.randomizedtesting.RandomizedRunner.invoke(RandomizedRunner.java:1737)
	at com.carrotsearch.randomizedtesting.RandomizedRunner$8.evaluate(RandomizedRunner.java:934)
	at com.carrotsearch.randomizedtesting.RandomizedRunner$9.evaluate(RandomizedRunner.java:970)
	at com.carrotsearch.randomizedtesting.RandomizedRunner$10.evaluate(RandomizedRunner.java:984)
	at org.junit.rules.ExpectedException$ExpectedExceptionStatement.evaluate(ExpectedException.java:110)
	at com.carrotsearch.randomizedtesting.rules.SystemPropertiesRestoreRule$1.evaluate(SystemPropertiesRestoreRule.java:57)
	at org.apache.lucene.util.TestRuleSetupTeardownChained$1.evaluate(TestRuleSetupTeardownChained.java:49)
	at org.apache.lucene.util.AbstractBeforeAfterRule$1.evaluate(AbstractBeforeAfterRule.java:45)
	at org.apache.lucene.util.TestRuleThreadAndTestName$1.evaluate(TestRuleThreadAndTestName.java:48)
	at org.apache.lucene.util.TestRuleIgnoreAfterMaxFailures$1.evaluate(TestRuleIgnoreAfterMaxFailures.java:64)
	at org.apache.lucene.util.TestRuleMarkFailure$1.evaluate(TestRuleMarkFailure.java:47)
	at com.carrotsearch.randomizedtesting.rules.StatementAdapter.evaluate(StatementAdapter.java:36)
	at com.carrotsearch.randomizedtesting.ThreadLeakControl$StatementRunner.run(ThreadLeakControl.java:368)
	at com.carrotsearch.randomizedtesting.ThreadLeakControl.forkTimeoutingTask(ThreadLeakControl.java:817)
	at com.carrotsearch.randomizedtesting.ThreadLeakControl$3.evaluate(ThreadLeakControl.java:468)
	at com.carrotsearch.randomizedtesting.RandomizedRunner.runSingleTest(RandomizedRunner.java:943)
	at com.carrotsearch.randomizedtesting.RandomizedRunner$5.evaluate(RandomizedRunner.java:829)
	at com.carrotsearch.randomizedtesting.RandomizedRunner$6.evaluate(RandomizedRunner.java:879)
	at com.carrotsearch.randomizedtesting.RandomizedRunner$7.evaluate(RandomizedRunner.java:890)
	at com.carrotsearch.randomizedtesting.rules.StatementAdapter.evaluate(StatementAdapter.java:36)
	at com.carrotsearch.randomizedtesting.rules.SystemPropertiesRestoreRule$1.evaluate(SystemPropertiesRestoreRule.java:57)
	at org.apache.lucene.util.AbstractBeforeAfterRule$1.evaluate(AbstractBeforeAfterRule.java:45)
	at com.carrotsearch.randomizedtesting.rules.StatementAdapter.evaluate(StatementAdapter.java:36)
	at org.apache.lucene.util.TestRuleStoreClassName$1.evaluate(TestRuleStoreClassName.java:41)
	at com.carrotsearch.randomizedtesting.rules.NoShadowingOrOverridesOnMethodsRule$1.evaluate(NoShadowingOrOverridesOnMethodsRule.java:40)
	at com.carrotsearch.randomizedtesting.rules.NoShadowingOrOverridesOnMethodsRule$1.evaluate(NoShadowingOrOverridesOnMethodsRule.java:40)
	at com.carrotsearch.randomizedtesting.rules.StatementAdapter.evaluate(StatementAdapter.java:36)
	at com.carrotsearch.randomizedtesting.rules.StatementAdapter.evaluate(StatementAdapter.java:36)
	at com.carrotsearch.randomizedtesting.rules.StatementAdapter.evaluate(StatementAdapter.java:36)
	at org.apache.lucene.util.TestRuleAssertionsRequired$1.evaluate(TestRuleAssertionsRequired.java:53)
	at org.apache.lucene.util.TestRuleMarkFailure$1.evaluate(TestRuleMarkFailure.java:47)
	at org.apache.lucene.util.TestRuleIgnoreAfterMaxFailures$1.evaluate(TestRuleIgnoreAfterMaxFailures.java:64)
	at org.apache.lucene.util.TestRuleIgnoreTestSuites$1.evaluate(TestRuleIgnoreTestSuites.java:54)
	at com.carrotsearch.randomizedtesting.rules.StatementAdapter.evaluate(StatementAdapter.java:36)
	at com.carrotsearch.randomizedtesting.ThreadLeakControl$StatementRunner.run(ThreadLeakControl.java:368)
	at java.lang.Thread.run(Thread.java:748)


FAILED:  org.apache.solr.handler.TestReplicationHandler.doTestIndexAndConfigReplication

Error Message:
Index: 0, Size: 0

Stack Trace:
java.lang.IndexOutOfBoundsException: Index: 0, Size: 0
	at __randomizedtesting.SeedInfo.seed([82F9085F989AB97E:96B1530ABB9D0460]:0)
	at java.util.ArrayList.rangeCheck(ArrayList.java:653)
	at java.util.ArrayList.get(ArrayList.java:429)
	at org.apache.solr.handler.TestReplicationHandler.doTestIndexAndConfigReplication(TestReplicationHandler.java:561)
	at sun.reflect.NativeMethodAccessorImpl.invoke0(Native Method)
	at sun.reflect.NativeMethodAccessorImpl.invoke(NativeMethodAccessorImpl.java:62)
	at sun.reflect.DelegatingMethodAccessorImpl.invoke(DelegatingMethodAccessorImpl.java:43)
	at java.lang.reflect.Method.invoke(Method.java:498)
	at com.carrotsearch.randomizedtesting.RandomizedRunner.invoke(RandomizedRunner.java:1737)
	at com.carrotsearch.randomizedtesting.RandomizedRunner$8.evaluate(RandomizedRunner.java:934)
	at com.carrotsearch.randomizedtesting.RandomizedRunner$9.evaluate(RandomizedRunner.java:970)
	at com.carrotsearch.randomizedtesting.RandomizedRunner$10.evaluate(RandomizedRunner.java:984)
	at com.carrotsearch.randomizedtesting.rules.SystemPropertiesRestoreRule$1.evaluate(SystemPropertiesRestoreRule.java:57)
	at org.apache.lucene.util.TestRuleSetupTeardownChained$1.evaluate(TestRuleSetupTeardownChained.java:49)
	at org.apache.lucene.util.AbstractBeforeAfterRule$1.evaluate(AbstractBeforeAfterRule.java:45)
	at org.apache.lucene.util.TestRuleThreadAndTestName$1.evaluate(TestRuleThreadAndTestName.java:48)
	at org.apache.lucene.util.TestRuleIgnoreAfterMaxFailures$1.evaluate(TestRuleIgnoreAfterMaxFailures.java:64)
	at org.apache.lucene.util.TestRuleMarkFailure$1.evaluate(TestRuleMarkFailure.java:47)
	at com.carrotsearch.randomizedtesting.rules.StatementAdapter.evaluate(StatementAdapter.java:36)
	at com.carrotsearch.randomizedtesting.ThreadLeakControl$StatementRunner.run(ThreadLeakControl.java:368)
	at com.carrotsearch.randomizedtesting.ThreadLeakControl.forkTimeoutingTask(ThreadLeakControl.java:817)
	at com.carrotsearch.randomizedtesting.ThreadLeakControl$3.evaluate(ThreadLeakControl.java:468)
	at com.carrotsearch.randomizedtesting.RandomizedRunner.runSingleTest(RandomizedRunner.java:943)
	at com.carrotsearch.randomizedtesting.RandomizedRunner$5.evaluate(RandomizedRunner.java:829)
	at com.carrotsearch.randomizedtesting.RandomizedRunner$6.evaluate(RandomizedRunner.java:879)
	at com.carrotsearch.randomizedtesting.RandomizedRunner$7.evaluate(RandomizedRunner.java:890)
	at com.carrotsearch.randomizedtesting.rules.StatementAdapter.evaluate(StatementAdapter.java:36)
	at com.carrotsearch.randomizedtesting.rules.SystemPropertiesRestoreRule$1.evaluate(SystemPropertiesRestoreRule.java:57)
	at org.apache.lucene.util.AbstractBeforeAfterRule$1.evaluate(AbstractBeforeAfterRule.java:45)
	at com.carrotsearch.randomizedtesting.rules.StatementAdapter.evaluate(StatementAdapter.java:36)
	at org.apache.lucene.util.TestRuleStoreClassName$1.evaluate(TestRuleStoreClassName.java:41)
	at com.carrotsearch.randomizedtesting.rules.NoShadowingOrOverridesOnMethodsRule$1.evaluate(NoShadowingOrOverridesOnMethodsRule.java:40)
	at com.carrotsearch.randomizedtesting.rules.NoShadowingOrOverridesOnMethodsRule$1.evaluate(NoShadowingOrOverridesOnMethodsRule.java:40)
	at com.carrotsearch.randomizedtesting.rules.StatementAdapter.evaluate(StatementAdapter.java:36)
	at com.carrotsearch.randomizedtesting.rules.StatementAdapter.evaluate(StatementAdapter.java:36)
	at com.carrotsearch.randomizedtesting.rules.StatementAdapter.evaluate(StatementAdapter.java:36)
	at org.apache.lucene.util.TestRuleAssertionsRequired$1.evaluate(TestRuleAssertionsRequired.java:53)
	at org.apache.lucene.util.TestRuleMarkFailure$1.evaluate(TestRuleMarkFailure.java:47)
	at org.apache.lucene.util.TestRuleIgnoreAfterMaxFailures$1.evaluate(TestRuleIgnoreAfterMaxFailures.java:64)
	at org.apache.lucene.util.TestRuleIgnoreTestSuites$1.evaluate(TestRuleIgnoreTestSuites.java:54)
	at com.carrotsearch.randomizedtesting.rules.StatementAdapter.evaluate(StatementAdapter.java:36)
	at com.carrotsearch.randomizedtesting.ThreadLeakControl$StatementRunner.run(ThreadLeakControl.java:368)
	at java.lang.Thread.run(Thread.java:748)




Build Log:
[...truncated 13224 lines...]
   [junit4] Suite: org.apache.solr.handler.TestReplicationHandler
   [junit4]   2> 2276357 INFO  (SUITE-TestReplicationHandler-seed#[82F9085F989AB97E]-worker) [    ] o.a.s.SolrTestCaseJ4 SecureRandom sanity checks: test.solr.allowed.securerandom=null & java.security.egd=file:/dev/./urandom
   [junit4]   2> Creating dataDir: /home/jenkins/workspace/Lucene-Solr-7.2-Linux/solr/build/solr-core/test/J0/temp/solr.handler.TestReplicationHandler_82F9085F989AB97E-001/init-core-data-001
   [junit4]   2> 2276358 WARN  (SUITE-TestReplicationHandler-seed#[82F9085F989AB97E]-worker) [    ] o.a.s.SolrTestCaseJ4 startTrackingSearchers: numOpens=10 numCloses=10
   [junit4]   2> 2276358 INFO  (SUITE-TestReplicationHandler-seed#[82F9085F989AB97E]-worker) [    ] o.a.s.SolrTestCaseJ4 Using PointFields (NUMERIC_POINTS_SYSPROP=true) w/NUMERIC_DOCVALUES_SYSPROP=true
   [junit4]   2> 2276359 INFO  (SUITE-TestReplicationHandler-seed#[82F9085F989AB97E]-worker) [    ] o.a.s.SolrTestCaseJ4 Randomized ssl (false) and clientAuth (false) via: @org.apache.solr.SolrTestCaseJ4$SuppressSSL(bugUrl=None)
   [junit4]   2> 2276360 INFO  (TEST-TestReplicationHandler.doTestStressReplication-seed#[82F9085F989AB97E]) [    ] o.a.s.SolrTestCaseJ4 ###Starting doTestStressReplication
   [junit4]   2> 2276360 INFO  (TEST-TestReplicationHandler.doTestStressReplication-seed#[82F9085F989AB97E]) [    ] o.a.s.SolrTestCaseJ4 Writing core.properties file to /home/jenkins/workspace/Lucene-Solr-7.2-Linux/solr/build/solr-core/test/J0/temp/solr.handler.TestReplicationHandler_82F9085F989AB97E-001/solr-instance-001/collection1
   [junit4]   2> 2276362 INFO  (TEST-TestReplicationHandler.doTestStressReplication-seed#[82F9085F989AB97E]) [    ] o.e.j.s.Server jetty-9.3.20.v20170531
   [junit4]   2> 2276363 INFO  (TEST-TestReplicationHandler.doTestStressReplication-seed#[82F9085F989AB97E]) [    ] o.e.j.s.h.ContextHandler Started o.e.j.s.ServletContextHandler@701f97b4{/solr,null,AVAILABLE}
   [junit4]   2> 2276364 INFO  (TEST-TestReplicationHandler.doTestStressReplication-seed#[82F9085F989AB97E]) [    ] o.e.j.s.AbstractConnector Started ServerConnector@21ea4294{HTTP/1.1,[http/1.1]}{127.0.0.1:46497}
   [junit4]   2> 2276364 INFO  (TEST-TestReplicationHandler.doTestStressReplication-seed#[82F9085F989AB97E]) [    ] o.e.j.s.Server Started @2277667ms
   [junit4]   2> 2276364 INFO  (TEST-TestReplicationHandler.doTestStressReplication-seed#[82F9085F989AB97E]) [    ] o.a.s.c.s.e.JettySolrRunner Jetty properties: {solr.data.dir=/home/jenkins/workspace/Lucene-Solr-7.2-Linux/solr/build/solr-core/test/J0/temp/solr.handler.TestReplicationHandler_82F9085F989AB97E-001/solr-instance-001/collection1/data, hostContext=/solr, hostPort=46497}
   [junit4]   2> 2276364 ERROR (TEST-TestReplicationHandler.doTestStressReplication-seed#[82F9085F989AB97E]) [    ] o.a.s.u.StartupLoggingUtils Missing Java Option solr.log.dir. Logging may be missing or incomplete.
   [junit4]   2> 2276364 INFO  (TEST-TestReplicationHandler.doTestStressReplication-seed#[82F9085F989AB97E]) [    ] o.a.s.s.SolrDispatchFilter  ___      _       Welcome to Apache Solr™ version 7.2.1
   [junit4]   2> 2276364 INFO  (TEST-TestReplicationHandler.doTestStressReplication-seed#[82F9085F989AB97E]) [    ] o.a.s.s.SolrDispatchFilter / __| ___| |_ _   Starting in standalone mode on port null
   [junit4]   2> 2276364 INFO  (TEST-TestReplicationHandler.doTestStressReplication-seed#[82F9085F989AB97E]) [    ] o.a.s.s.SolrDispatchFilter \__ \/ _ \ | '_|  Install dir: null
   [junit4]   2> 2276364 INFO  (TEST-TestReplicationHandler.doTestStressReplication-seed#[82F9085F989AB97E]) [    ] o.a.s.s.SolrDispatchFilter |___/\___/_|_|    Start time: 2017-12-22T06:10:34.443Z
   [junit4]   2> 2276364 INFO  (TEST-TestReplicationHandler.doTestStressReplication-seed#[82F9085F989AB97E]) [    ] o.a.s.c.SolrXmlConfig Loading container configuration from /home/jenkins/workspace/Lucene-Solr-7.2-Linux/solr/build/solr-core/test/J0/temp/solr.handler.TestReplicationHandler_82F9085F989AB97E-001/solr-instance-001/solr.xml
   [junit4]   2> 2276366 INFO  (TEST-TestReplicationHandler.doTestStressReplication-seed#[82F9085F989AB97E]) [    ] o.a.s.c.SolrXmlConfig Configuration parameter autoReplicaFailoverWorkLoopDelay is ignored
   [junit4]   2> 2276366 INFO  (TEST-TestReplicationHandler.doTestStressReplication-seed#[82F9085F989AB97E]) [    ] o.a.s.c.SolrXmlConfig Configuration parameter autoReplicaFailoverBadNodeExpiration is ignored
   [junit4]   2> 2276367 INFO  (TEST-TestReplicationHandler.doTestStressReplication-seed#[82F9085F989AB97E]) [    ] o.a.s.c.SolrXmlConfig MBean server found: com.sun.jmx.mbeanserver.JmxMBeanServer@7c294544, but no JMX reporters were configured - adding default JMX reporter.
   [junit4]   2> 2276384 INFO  (TEST-TestReplicationHandler.doTestStressReplication-seed#[82F9085F989AB97E]) [    ] o.a.s.m.r.SolrJmxReporter JMX monitoring for 'solr.node' (registry 'solr.node') enabled at server: com.sun.jmx.mbeanserver.JmxMBeanServer@7c294544
   [junit4]   2> 2276389 INFO  (TEST-TestReplicationHandler.doTestStressReplication-seed#[82F9085F989AB97E]) [    ] o.a.s.m.r.SolrJmxReporter JMX monitoring for 'solr.jvm' (registry 'solr.jvm') enabled at server: com.sun.jmx.mbeanserver.JmxMBeanServer@7c294544
   [junit4]   2> 2276389 INFO  (TEST-TestReplicationHandler.doTestStressReplication-seed#[82F9085F989AB97E]) [    ] o.a.s.m.r.SolrJmxReporter JMX monitoring for 'solr.jetty' (registry 'solr.jetty') enabled at server: com.sun.jmx.mbeanserver.JmxMBeanServer@7c294544
   [junit4]   2> 2276391 INFO  (TEST-TestReplicationHandler.doTestStressReplication-seed#[82F9085F989AB97E]) [    ] o.a.s.c.CorePropertiesLocator Found 1 core definitions underneath /home/jenkins/workspace/Lucene-Solr-7.2-Linux/solr/build/solr-core/test/J0/temp/solr.handler.TestReplicationHandler_82F9085F989AB97E-001/solr-instance-001/.
   [junit4]   2> 2276391 INFO  (TEST-TestReplicationHandler.doTestStressReplication-seed#[82F9085F989AB97E]) [    ] o.a.s.c.CorePropertiesLocator Cores are: [collection1]
   [junit4]   2> 2276391 INFO  (coreLoadExecutor-4421-thread-1) [    ] o.a.s.c.TransientSolrCoreCacheDefault Allocating transient cache for 4 transient cores
   [junit4]   2> 2276396 INFO  (coreLoadExecutor-4421-thread-1) [    x:collection1] o.a.s.c.SolrConfig Using Lucene MatchVersion: 7.2.1
   [junit4]   2> 2276406 INFO  (coreLoadExecutor-4421-thread-1) [    x:collection1] o.a.s.s.IndexSchema [collection1] Schema name=test
   [junit4]   2> 2276407 INFO  (coreLoadExecutor-4421-thread-1) [    x:collection1] o.a.s.s.IndexSchema Loaded schema test/1.2 with uniqueid field id
   [junit4]   2> 2276407 INFO  (coreLoadExecutor-4421-thread-1) [    x:collection1] o.a.s.c.CoreContainer Creating SolrCore 'collection1' using configuration from instancedir /home/jenkins/workspace/Lucene-Solr-7.2-Linux/solr/build/solr-core/test/J0/temp/solr.handler.TestReplicationHandler_82F9085F989AB97E-001/solr-instance-001/./collection1, trusted=true
   [junit4]   2> 2276407 INFO  (coreLoadExecutor-4421-thread-1) [    x:collection1] o.a.s.m.r.SolrJmxReporter JMX monitoring for 'solr.core.collection1' (registry 'solr.core.collection1') enabled at server: com.sun.jmx.mbeanserver.JmxMBeanServer@7c294544
   [junit4]   2> 2276407 INFO  (coreLoadExecutor-4421-thread-1) [    x:collection1] o.a.s.c.SolrCore solr.RecoveryStrategy.Builder
   [junit4]   2> 2276407 INFO  (coreLoadExecutor-4421-thread-1) [    x:collection1] o.a.s.c.SolrCore [[collection1] ] Opening new SolrCore at [/home/jenkins/workspace/Lucene-Solr-7.2-Linux/solr/build/solr-core/test/J0/temp/solr.handler.TestReplicationHandler_82F9085F989AB97E-001/solr-instance-001/collection1], dataDir=[/home/jenkins/workspace/Lucene-Solr-7.2-Linux/solr/build/solr-core/test/J0/temp/solr.handler.TestReplicationHandler_82F9085F989AB97E-001/solr-instance-001/./collection1/data/]
   [junit4]   2> 2276408 INFO  (coreLoadExecutor-4421-thread-1) [    x:collection1] o.a.s.u.RandomMergePolicy RandomMergePolicy wrapping class org.apache.lucene.index.LogByteSizeMergePolicy: [LogByteSizeMergePolicy: minMergeSize=1677721, mergeFactor=44, maxMergeSize=2147483648, maxMergeSizeForForcedMerge=9223372036854775807, calibrateSizeByDeletes=false, maxMergeDocs=2147483647, maxCFSSegmentSizeMB=8.796093022207999E12, noCFSRatio=0.2989428606853436]
   [junit4]   2> 2276426 INFO  (coreLoadExecutor-4421-thread-1) [    x:collection1] o.a.s.u.CommitTracker Hard AutoCommit: disabled
   [junit4]   2> 2276426 INFO  (coreLoadExecutor-4421-thread-1) [    x:collection1] o.a.s.u.CommitTracker Soft AutoCommit: disabled
   [junit4]   2> 2276427 INFO  (coreLoadExecutor-4421-thread-1) [    x:collection1] o.a.s.u.RandomMergePolicy RandomMergePolicy wrapping class org.apache.lucene.index.LogDocMergePolicy: [LogDocMergePolicy: minMergeSize=1000, mergeFactor=44, maxMergeSize=9223372036854775807, maxMergeSizeForForcedMerge=9223372036854775807, calibrateSizeByDeletes=false, maxMergeDocs=2147483647, maxCFSSegmentSizeMB=8.796093022207999E12, noCFSRatio=0.5764853260776309]
   [junit4]   2> 2276427 INFO  (coreLoadExecutor-4421-thread-1) [    x:collection1] o.a.s.s.SolrIndexSearcher Opening [Searcher@6a105d38[collection1] main]
   [junit4]   2> 2276427 INFO  (coreLoadExecutor-4421-thread-1) [    x:collection1] o.a.s.r.ManagedResourceStorage File-based storage initialized to use dir: /home/jenkins/workspace/Lucene-Solr-7.2-Linux/solr/build/solr-core/test/J0/temp/solr.handler.TestReplicationHandler_82F9085F989AB97E-001/solr-instance-001/collection1/conf
   [junit4]   2> 2276427 INFO  (coreLoadExecutor-4421-thread-1) [    x:collection1] o.a.s.h.ReplicationHandler Replication enabled for following config files: schema.xml,xslt/dummy.xsl
   [junit4]   2> 2276427 INFO  (coreLoadExecutor-4421-thread-1) [    x:collection1] o.a.s.h.ReplicationHandler Commits will be reserved for 10000ms.
   [junit4]   2> 2276428 INFO  (searcherExecutor-4422-thread-1-processing-x:collection1) [    x:collection1] o.a.s.c.SolrCore [collection1] Registered new searcher Searcher@6a105d38[collection1] main{ExitableDirectoryReader(UninvertingDirectoryReader())}
   [junit4]   2> 2276429 INFO  (TEST-TestReplicationHandler.doTestStressReplication-seed#[82F9085F989AB97E]) [    ] o.a.s.SolrTestCaseJ4 Writing core.properties file to /home/jenkins/workspace/Lucene-Solr-7.2-Linux/solr/build/solr-core/test/J0/temp/solr.handler.TestReplicationHandler_82F9085F989AB97E-001/solr-instance-002/collection1
   [junit4]   2> 2276430 INFO  (TEST-TestReplicationHandler.doTestStressReplication-seed#[82F9085F989AB97E]) [    ] o.e.j.s.Server jetty-9.3.20.v20170531
   [junit4]   2> 2276431 INFO  (TEST-TestReplicationHandler.doTestStressReplication-seed#[82F9085F989AB97E]) [    ] o.e.j.s.h.ContextHandler Started o.e.j.s.ServletContextHandler@525d4964{/solr,null,AVAILABLE}
   [junit4]   2> 2276431 INFO  (TEST-TestReplicationHandler.doTestStressReplication-seed#[82F9085F989AB97E]) [    ] o.e.j.s.AbstractConnector Started ServerConnector@47da1912{HTTP/1.1,[http/1.1]}{127.0.0.1:35067}
   [junit4]   2> 2276431 INFO  (TEST-TestReplicationHandler.doTestStressReplication-seed#[82F9085F989AB97E]) [    ] o.e.j.s.Server Started @2277734ms
   [junit4]   2> 2276431 INFO  (TEST-TestReplicationHandler.doTestStressReplication-seed#[82F9085F989AB97E]) [    ] o.a.s.c.s.e.JettySolrRunner Jetty properties: {solr.data.dir=/home/jenkins/workspace/Lucene-Solr-7.2-Linux/solr/build/solr-core/test/J0/temp/solr.handler.TestReplicationHandler_82F9085F989AB97E-001/solr-instance-002/collection1/data, hostContext=/solr, hostPort=35067}
   [junit4]   2> 2276431 ERROR (TEST-TestReplicationHandler.doTestStressReplication-seed#[82F9085F989AB97E]) [    ] o.a.s.u.StartupLoggingUtils Missing Java Option solr.log.dir. Logging may be missing or incomplete.
   [junit4]   2> 2276431 INFO  (TEST-TestReplicationHandler.doTestStressReplication-seed#[82F9085F989AB97E]) [    ] o.a.s.s.SolrDispatchFilter  ___      _       Welcome to Apache Solr™ version 7.2.1
   [junit4]   2> 2276431 INFO  (TEST-TestReplicationHandler.doTestStressReplication-seed#[82F9085F989AB97E]) [    ] o.a.s.s.SolrDispatchFilter / __| ___| |_ _   Starting in standalone mode on port null
   [junit4]   2> 2276431 INFO  (TEST-TestReplicationHandler.doTestStressReplication-seed#[82F9085F989AB97E]) [    ] o.a.s.s.SolrDispatchFilter \__ \/ _ \ | '_|  Install dir: null
   [junit4]   2> 2276431 INFO  (TEST-TestReplicationHandler.doTestStressReplication-seed#[82F9085F989AB97E]) [    ] o.a.s.s.SolrDispatchFilter |___/\___/_|_|    Start time: 2017-12-22T06:10:34.510Z
   [junit4]   2> 2276431 INFO  (TEST-TestReplicationHandler.doTestStressReplication-seed#[82F9085F989AB97E]) [    ] o.a.s.c.SolrXmlConfig Loading container configuration from /home/jenkins/workspace/Lucene-Solr-7.2-Linux/solr/build/solr-core/test/J0/temp/solr.handler.TestReplicationHandler_82F9085F989AB97E-001/solr-instance-002/solr.xml
   [junit4]   2> 2276433 INFO  (TEST-TestReplicationHandler.doTestStressReplication-seed#[82F9085F989AB97E]) [    ] o.a.s.c.SolrXmlConfig Configuration parameter autoReplicaFailoverWorkLoopDelay is ignored
   [junit4]   2> 2276433 INFO  (TEST-TestReplicationHandler.doTestStressReplication-seed#[82F9085F989AB97E]) [    ] o.a.s.c.SolrXmlConfig Configuration parameter autoReplicaFailoverBadNodeExpiration is ignored
   [junit4]   2> 2276434 INFO  (TEST-TestReplicationHandler.doTestStressReplication-seed#[82F9085F989AB97E]) [    ] o.a.s.c.SolrXmlConfig MBean server found: com.sun.jmx.mbeanserver.JmxMBeanServer@7c294544, but no JMX reporters were configured - adding default JMX reporter.
   [junit4]   2> 2276452 INFO  (TEST-TestReplicationHandler.doTestStressReplication-seed#[82F9085F989AB97E]) [    ] o.a.s.m.r.SolrJmxReporter JMX monitoring for 'solr.node' (registry 'solr.node') enabled at server: com.sun.jmx.mbeanserver.JmxMBeanServer@7c294544
   [junit4]   2> 2276458 INFO  (TEST-TestReplicationHandler.doTestStressReplication-seed#[82F9085F989AB97E]) [    ] o.a.s.m.r.SolrJmxReporter JMX monitoring for 'solr.jvm' (registry 'solr.jvm') enabled at server: com.sun.jmx.mbeanserver.JmxMBeanServer@7c294544
   [junit4]   2> 2276459 INFO  (TEST-TestReplicationHandler.doTestStressReplication-seed#[82F9085F989AB97E]) [    ] o.a.s.m.r.SolrJmxReporter JMX monitoring for 'solr.jetty' (registry 'solr.jetty') enabled at server: com.sun.jmx.mbeanserver.JmxMBeanServer@7c294544
   [junit4]   2> 2276460 INFO  (TEST-TestReplicationHandler.doTestStressReplication-seed#[82F9085F989AB97E]) [    ] o.a.s.c.CorePropertiesLocator Found 1 core definitions underneath /home/jenkins/workspace/Lucene-Solr-7.2-Linux/solr/build/solr-core/test/J0/temp/solr.handler.TestReplicationHandler_82F9085F989AB97E-001/solr-instance-002/.
   [junit4]   2> 2276460 INFO  (TEST-TestReplicationHandler.doTestStressReplication-seed#[82F9085F989AB97E]) [    ] o.a.s.c.CorePropertiesLocator Cores are: [collection1]
   [junit4]   2> 2276460 INFO  (coreLoadExecutor-4431-thread-1) [    ] o.a.s.c.TransientSolrCoreCacheDefault Allocating transient cache for 4 transient cores
   [junit4]   2> 2276465 INFO  (coreLoadExecutor-4431-thread-1) [    x:collection1] o.a.s.c.SolrConfig Using Lucene MatchVersion: 7.2.1
   [junit4]   2> 2276469 INFO  (coreLoadExecutor-4431-thread-1) [    x:collection1] o.a.s.s.IndexSchema [collection1] Schema name=test
   [junit4]   2> 2276470 INFO  (coreLoadExecutor-4431-thread-1) [    x:collection1] o.a.s.s.IndexSchema Loaded schema test/1.2 with uniqueid field id
   [junit4]   2> 2276470 INFO  (coreLoadExecutor-4431-thread-1) [    x:collection1] o.a.s.c.CoreContainer Creating SolrCore 'collection1' using configuration from instancedir /home/jenkins/workspace/Lucene-Solr-7.2-Linux/solr/build/solr-core/test/J0/temp/solr.handler.TestReplicationHandler_82F9085F989AB97E-001/solr-instance-002/./collection1, trusted=true
   [junit4]   2> 2276470 INFO  (coreLoadExecutor-4431-thread-1) [    x:collection1] o.a.s.m.r.SolrJmxReporter JMX monitoring for 'solr.core.collection1' (registry 'solr.core.collection1') enabled at server: com.sun.jmx.mbeanserver.JmxMBeanServer@7c294544
   [junit4]   2> 2276471 INFO  (coreLoadExecutor-4431-thread-1) [    x:collection1] o.a.s.c.SolrCore solr.RecoveryStrategy.Builder
   [junit4]   2> 2276471 INFO  (coreLoadExecutor-4431-thread-1) [    x:collection1] o.a.s.c.SolrCore [[collection1] ] Opening new SolrCore at [/home/jenkins/workspace/Lucene-Solr-7.2-Linux/solr/build/solr-core/test/J0/temp/solr.handler.TestReplicationHandler_82F9085F989AB97E-001/solr-instance-002/collection1], dataDir=[/home/jenkins/workspace/Lucene-Solr-7.2-Linux/solr/build/solr-core/test/J0/temp/solr.handler.TestReplicationHandler_82F9085F989AB97E-001/solr-instance-002/./collection1/data/]
   [junit4]   2> 2276472 INFO  (coreLoadExecutor-4431-thread-1) [    x:collection1] o.a.s.u.RandomMergePolicy RandomMergePolicy wrapping class org.apache.lucene.index.LogByteSizeMergePolicy: [LogByteSizeMergePolicy: minMergeSize=1677721, mergeFactor=44, maxMergeSize=2147483648, maxMergeSizeForForcedMerge=9223372036854775807, calibrateSizeByDeletes=false, maxMergeDocs=2147483647, maxCFSSegmentSizeMB=8.796093022207999E12, noCFSRatio=0.2989428606853436]
   [junit4]   2> 2276495 INFO  (coreLoadExecutor-4431-thread-1) [    x:collection1] o.a.s.u.CommitTracker Hard AutoCommit: disabled
   [junit4]   2> 2276495 INFO  (coreLoadExecutor-4431-thread-1) [    x:collection1] o.a.s.u.CommitTracker Soft AutoCommit: disabled
   [junit4]   2> 2276496 INFO  (coreLoadExecutor-4431-thread-1) [    x:collection1] o.a.s.u.RandomMergePolicy RandomMergePolicy wrapping class org.apache.lucene.index.LogDocMergePolicy: [LogDocMergePolicy: minMergeSize=1000, mergeFactor=44, maxMergeSize=9223372036854775807, maxMergeSizeForForcedMerge=9223372036854775807, calibrateSizeByDeletes=false, maxMergeDocs=2147483647, maxCFSSegmentSizeMB=8.796093022207999E12, noCFSRatio=0.5764853260776309]
   [junit4]   2> 2276496 INFO  (coreLoadExecutor-4431-thread-1) [    x:collection1] o.a.s.s.SolrIndexSearcher Opening [Searcher@79170403[collection1] main]
   [junit4]   2> 2276496 INFO  (coreLoadExecutor-4431-thread-1) [    x:collection1] o.a.s.r.ManagedResourceStorage File-based storage initialized to use dir: /home/jenkins/workspace/Lucene-Solr-7.2-Linux/solr/build/solr-core/test/J0/temp/solr.handler.TestReplicationHandler_82F9085F989AB97E-001/solr-instance-002/collection1/conf
   [junit4]   2> 2276497 INFO  (coreLoadExecutor-4431-thread-1) [    x:collection1] o.a.s.h.ReplicationHandler Poll scheduled at an interval of 1000ms
   [junit4]   2> 2276497 INFO  (coreLoadExecutor-4431-thread-1) [    x:collection1] o.a.s.h.ReplicationHandler Commits will be reserved for 10000ms.
   [junit4]   2> 2276498 INFO  (searcherExecutor-4432-thread-1-processing-x:collection1) [    x:collection1] o.a.s.c.SolrCore [collection1] Registered new searcher Searcher@79170403[collection1] main{ExitableDirectoryReader(UninvertingDirectoryReader())}
   [junit4]   2> 2276498 INFO  (qtp1841950075-13207) [    x:collection1] o.a.s.c.S.Request [collection1]  webapp=/solr path=/replication params={qt=/replication&wt=javabin&version=2&command=indexversion} status=0 QTime=0
   [junit4]   2> 2276498 INFO  (indexFetcher-4436-thread-1) [    x:collection1] o.a.s.h.IndexFetcher Master's generation: 1
   [junit4]   2> 2276498 INFO  (indexFetcher-4436-thread-1) [    x:collection1] o.a.s.h.IndexFetcher Master's version: 0
   [junit4]   2> 2276498 INFO  (indexFetcher-4436-thread-1) [    x:collection1] o.a.s.h.IndexFetcher Slave's generation: 1
   [junit4]   2> 2276498 INFO  (indexFetcher-4436-thread-1) [    x:collection1] o.a.s.h.IndexFetcher Slave's version: 0
   [junit4]   2> 2276498 INFO  (indexFetcher-4436-thread-1) [    x:collection1] o.a.s.h.IndexFetcher New index in Master. Deleting mine...
   [junit4]   2> 2276498 INFO  (indexFetcher-4436-thread-1) [    x:collection1] o.a.s.u.DirectUpdateHandler2 start commit{,optimize=false,openSearcher=true,waitSearcher=true,expungeDeletes=false,softCommit=false,prepareCommit=false}
   [junit4]   2> 2276498 INFO  (indexFetcher-4436-thread-1) [    x:collection1] o.a.s.u.SolrIndexWriter Calling setCommitData with IW:org.apache.solr.update.SolrIndexWriter@585e5734 commitCommandVersion:0
   [junit4]   2> 2276499 INFO  (indexFetcher-4436-thread-1) [    x:collection1] o.a.s.s.SolrIndexSearcher Opening [Searcher@27d50bf[collection1] main]
   [junit4]   2> 2276499 INFO  (indexFetcher-4436-thread-1) [    x:collection1] o.a.s.u.DirectUpdateHandler2 end_commit_flush
   [junit4]   2> 2276499 INFO  (searcherExecutor-4432-thread-1-processing-x:collection1) [    x:collection1] o.a.s.c.SolrCore [collection1] Registered new searcher Searcher@27d50bf[collection1] main{ExitableDirectoryReader(UninvertingDirectoryReader())}
   [junit4]   2> 2276555 INFO  (TEST-TestReplicationHandler.doTestStressReplication-seed#[82F9085F989AB97E]) [    ] o.e.j.s.AbstractConnector Stopped ServerConnector@47da1912{HTTP/1.1,[http/1.1]}{127.0.0.1:0}
   [junit4]   2> 2276555 INFO  (TEST-TestReplicationHandler.doTestStressReplication-seed#[82F9085F989AB97E]) [    ] o.a.s.c.CoreContainer Shutting down CoreContainer instance=1068385744
   [junit4]   2> 2276556 INFO  (TEST-TestReplicationHandler.doTestStressReplication-seed#[82F9085F989AB97E]) [    ] o.a.s.m.SolrMetricManager Closing metric reporters for registry=solr.node, tag=null
   [junit4]   2> 2276556 INFO  (TEST-TestReplicationHandler.doTestStressReplication-seed#[82F9085F989AB97E]) [    ] o.a.s.m.r.SolrJmxReporter Closing reporter [org.apache.solr.metrics.reporters.SolrJmxReporter@7c7f6e3: rootName = null, domain = solr.node, service url = null, agent id = null] for registry solr.node / com.codahale.metrics.MetricRegistry@335bd5dc
   [junit4]   2> 2276562 INFO  (TEST-TestReplicationHandler.doTestStressReplication-seed#[82F9085F989AB97E]) [    ] o.a.s.m.SolrMetricManager Closing metric reporters for registry=solr.jvm, tag=null
   [junit4]   2> 2276562 INFO  (TEST-TestReplicationHandler.doTestStressReplication-seed#[82F9085F989AB97E]) [    ] o.a.s.m.r.SolrJmxReporter Closing reporter [org.apache.solr.metrics.reporters.SolrJmxReporter@7f4ffc3d: rootName = null, domain = solr.jvm, service url = null, agent id = null] for registry solr.jvm / com.codahale.metrics.MetricRegistry@4dcf7b25
   [junit4]   2> 2276567 INFO  (TEST-TestReplicationHandler.doTestStressReplication-seed#[82F9085F989AB97E]) [    ] o.a.s.m.SolrMetricManager Closing metric reporters for registry=solr.jetty, tag=null
   [junit4]   2> 2276567 INFO  (TEST-TestReplicationHandler.doTestStressReplication-seed#[82F9085F989AB97E]) [    ] o.a.s.m.r.SolrJmxReporter Closing reporter [org.apache.solr.metrics.reporters.SolrJmxReporter@1884c8a6: rootName = null, domain = solr.jetty, service url = null, agent id = null] for registry solr.jetty / com.codahale.metrics.MetricRegistry@3d4c9927
   [junit4]   2> 2276567 INFO  (coreCloseExecutor-4437-thread-1) [    x:collection1] o.a.s.c.SolrCore [collection1]  CLOSING SolrCore org.apache.solr.core.SolrCore@5027717b
   [junit4]   2> 2276567 INFO  (coreCloseExecutor-4437-thread-1) [    x:collection1] o.a.s.m.SolrMetricManager Closing metric reporters for registry=solr.core.collection1, tag=1344762235
   [junit4]   2> 2276567 INFO  (coreCloseExecutor-4437-thread-1) [    x:collection1] o.a.s.m.r.SolrJmxReporter Closing reporter [org.apache.solr.metrics.reporters.SolrJmxReporter@233fde7a: rootName = null, domain = solr.core.collection1, service url = null, agent id = null] for registry solr.core.collection1 / com.codahale.metrics.MetricRegistry@79893ed2
   [junit4]   2> 2276576 INFO  (TEST-TestReplicationHandler.doTestStressReplication-seed#[82F9085F989AB97E]) [    ] o.e.j.s.h.ContextHandler Stopped o.e.j.s.ServletContextHandler@525d4964{/solr,null,UNAVAILABLE}
   [junit4]   2> 2276577 INFO  (TEST-TestReplicationHandler.doTestStressReplication-seed#[82F9085F989AB97E]) [    ] o.e.j.s.Server jetty-9.3.20.v20170531
   [junit4]   2> 2276578 INFO  (TEST-TestReplicationHandler.doTestStressReplication-seed#[82F9085F989AB97E]) [    ] o.e.j.s.h.ContextHandler Started o.e.j.s.ServletContextHandler@7ce4b554{/solr,null,AVAILABLE}
   [junit4]   2> 2276578 INFO  (TEST-TestReplicationHandler.doTestStressReplication-seed#[82F9085F989AB97E]) [    ] o.e.j.s.AbstractConnector Started ServerConnector@52f2f35a{HTTP/1.1,[http/1.1]}{127.0.0.1:40389}
   [junit4]   2> 2276578 INFO  (TEST-TestReplicationHandler.doTestStressReplication-seed#[82F9085F989AB97E]) [    ] o.e.j.s.Server Started @2277882ms
   [junit4]   2> 2276579 INFO  (TEST-TestReplicationHandler.doTestStressReplication-seed#[82F9085F989AB97E]) [    ] o.a.s.c.s.e.JettySolrRunner Jetty properties: {solr.data.dir=/home/jenkins/workspace/Lucene-Solr-7.2-Linux/solr/build/solr-core/test/J0/temp/solr.handler.TestReplicationHandler_82F9085F989AB97E-001/solr-instance-002/collection1/data, hostContext=/solr, hostPort=40389}
   [junit4]   2> 2276579 ERROR (TEST-TestReplicationHandler.doTestStressReplication-seed#[82F9085F989AB97E]) [    ] o.a.s.u.StartupLoggingUtils Missing Java Option solr.log.dir. Logging may be missing or incomplete.
   [junit4]   2> 2276579 INFO  (TEST-TestReplicationHandler.doTestStressReplication-seed#[82F9085F989AB97E]) [    ] o.a.s.s.SolrDispatchFilter  ___      _       Welcome to Apache Solr™ version 7.2.1
   [junit4]   2> 2276579 INFO  (TEST-TestReplicationHandler.doTestStressReplication-seed#[82F9085F989AB97E]) [    ] o.a.s.s.SolrDispatchFilter / __| ___| |_ _   Starting in standalone mode on port null
   [junit4]   2> 2276579 INFO  (TEST-TestReplicationHandler.doTestStressReplication-seed#[82F9085F989AB97E]) [    ] o.a.s.s.SolrDispatchFilter \__ \/ _ \ | '_|  Install dir: null
   [junit4]   2> 2276579 INFO  (TEST-TestReplicationHandler.doTestStressReplication-seed#[82F9085F989AB97E]) [    ] o.a.s.s.SolrDispatchFilter |___/\___/_|_|    Start time: 2017-12-22T06:10:34.658Z
   [junit4]   2> 2276580 INFO  (TEST-TestReplicationHandler.doTestStressReplication-seed#[82F9085F989AB97E]) [    ] o.a.s.c.SolrXmlConfig Loading container configuration from /home/jenkins/workspace/Lucene-Solr-7.2-Linux/solr/build/solr-core/test/J0/temp/solr.handler.TestReplicationHandler_82F9085F989AB97E-001/solr-instance-002/solr.xml
   [junit4]   2> 2276583 INFO  (TEST-TestReplicationHandler.doTestStressReplication-seed#[82F9085F989AB97E]) [    ] o.a.s.c.SolrXmlConfig Configuration parameter autoReplicaFailoverWorkLoopDelay is ignored
   [junit4]   2> 2276583 INFO  (TEST-TestReplicationHandler.doTestStressReplication-seed#[82F9085F989AB97E]) [    ] o.a.s.c.SolrXmlConfig Configuration parameter autoReplicaFailoverBadNodeExpiration is ignored
   [junit4]   2> 2276584 INFO  (TEST-TestReplicationHandler.doTestStressReplication-seed#[82F9085F989AB97E]) [    ] o.a.s.c.SolrXmlConfig MBean server found: com.sun.jmx.mbeanserver.JmxMBeanServer@7c294544, but no JMX reporters were configured - adding default JMX reporter.
   [junit4]   2> 2276613 INFO  (TEST-TestReplicationHandler.doTestStressReplication-seed#[82F9085F989AB97E]) [    ] o.a.s.m.r.SolrJmxReporter JMX monitoring for 'solr.node' (registry 'solr.node') enabled at server: com.sun.jmx.mbeanserver.JmxMBeanServer@7c294544
   [junit4]   2> 2276619 INFO  (TEST-TestReplicationHandler.doTestStressReplication-seed#[82F9085F989AB97E]) [    ] o.a.s.m.r.SolrJmxReporter JMX monitoring for 'solr.jvm' (registry 'solr.jvm') enabled at server: com.sun.jmx.mbeanserver.JmxMBeanServer@7c294544
   [junit4]   2> 2276619 INFO  (TEST-TestReplicationHandler.doTestStressReplication-seed#[82F9085F989AB97E]) [    ] o.a.s.m.r.SolrJmxReporter JMX monitoring for 'solr.jetty' (registry 'solr.jetty') enabled at server: com.sun.jmx.mbeanserver.JmxMBeanServer@7c294544
   [junit4]   2> 2276621 INFO  (TEST-TestReplicationHandler.doTestStressReplication-seed#[82F9085F989AB97E]) [    ] o.a.s.c.CorePropertiesLocator Found 1 core definitions underneath /home/jenkins/workspace/Lucene-Solr-7.2-Linux/solr/build/solr-core/test/J0/temp/solr.handler.TestReplicationHandler_82F9085F989AB97E-001/solr-instance-002/.
   [junit4]   2> 2276621 INFO  (TEST-TestReplicationHandler.doTestStressReplication-seed#[82F9085F989AB97E]) [    ] o.a.s.c.CorePropertiesLocator Cores are: [collection1]
   [junit4]   2> 2276621 INFO  (coreLoadExecutor-4444-thread-1) [    ] o.a.s.c.TransientSolrCoreCacheDefault Allocating transient cache for 4 transient cores
   [junit4]   2> 2276626 INFO  (coreLoadExecutor-4444-thread-1) [    x:collection1] o.a.s.c.SolrConfig Using Lucene MatchVersion: 7.2.1
   [junit4]   2> 2276630 INFO  (coreLoadExecutor-4444-thread-1) [    x:collection1] o.a.s.s.IndexSchema [collection1] Schema name=test
   [junit4]   2> 2276631 INFO  (coreLoadExecutor-4444-thread-1) [    x:collection1] o.a.s.s.IndexSchema Loaded schema test/1.2 with uniqueid field id
   [junit4]   2> 2276631 INFO  (coreLoadExecutor-4444-thread-1) [    x:collection1] o.a.s.c.CoreContainer Creating SolrCore 'collection1' using configuration from instancedir /home/jenkins/workspace/Lucene-Solr-7.2-Linux/solr/build/solr-core/test/J0/temp/solr.handler.TestReplicationHandler_82F9085F989AB97E-001/solr-instance-002/./collection1, trusted=true
   [junit4]   2> 2276632 INFO  (coreLoadExecutor-4444-thread-1) [    x:collection1] o.a.s.m.r.SolrJmxReporter JMX monitoring for 'solr.core.collection1' (registry 'solr.core.collection1') enabled at server: com.sun.jmx.mbeanserver.JmxMBeanServer@7c294544
   [junit4]   2> 2276632 INFO  (coreLoadExecutor-4444-thread-1) [    x:collection1] o.a.s.c.SolrCore solr.RecoveryStrategy.Builder
   [junit4]   2> 2276632 INFO  (coreLoadExecutor-4444-thread-1) [    x:collection1] o.a.s.c.SolrCore [[collection1] ] Opening new SolrCore at [/home/jenkins/workspace/Lucene-Solr-7.2-Linux/solr/build/solr-core/test/J0/temp/solr.handler.TestReplicationHandler_82F9085F989AB97E-001/solr-instance-002/collection1], dataDir=[/home/jenkins/workspace/Lucene-Solr-7.2-Linux/solr/build/solr-core/test/J0/temp/solr.handler.TestReplicationHandler_82F9085F989AB97E-001/solr-instance-002/./collection1/data/]
   [junit4]   2> 2276633 INFO  (coreLoadExecutor-4444-thread-1) [    x:collection1] o.a.s.u.RandomMergePolicy RandomMergePolicy wrapping class org.apache.lucene.index.TieredMergePolicy: [TieredMergePolicy: maxMergeAtOnce=12, maxMergeAtOnceExplicit=19, maxMergedSegmentMB=32.2490234375, floorSegmentMB=1.0126953125, forceMergeDeletesPctAllowed=23.397294010922337, segmentsPerTier=44.0, maxCFSSegmentSizeMB=8.796093022207999E12, noCFSRatio=0.4136102319437118
   [junit4]   2> 2276768 INFO  (coreLoadExecutor-4444-thread-1) [    x:collection1] o.a.s.u.CommitTracker Hard AutoCommit: disabled
   [junit4]   2> 2276768 INFO  (coreLoadExecutor-4444-thread-1) [    x:collection1] o.a.s.u.CommitTracker Soft AutoCommit: disabled
   [junit4]   2> 2276769 INFO  (coreLoadExecutor-4444-thread-1) [    x:collection1] o.a.s.u.RandomMergePolicy RandomMergePolicy wrapping class org.apache.lucene.index.TieredMergePolicy: [TieredMergePolicy: maxMergeAtOnce=34, maxMergeAtOnceExplicit=10, maxMergedSegmentMB=41.17578125, floorSegmentMB=0.697265625, forceMergeDeletesPctAllowed=10.012918107647856, segmentsPerTier=37.0, maxCFSSegmentSizeMB=8.796093022207999E12, noCFSRatio=1.0
   [junit4]   2> 2276769 INFO  (coreLoadExecutor-4444-thread-1) [    x:collection1] o.a.s.s.SolrIndexSearcher Opening [Searcher@49e7ec3a[collection1] main]
   [junit4]   2> 2276769 INFO  (coreLoadExecutor-4444-thread-1) [    x:collection1] o.a.s.r.ManagedResourceStorage File-based storage initialized to use dir: /home/jenkins/workspace/Lucene-Solr-7.2-Linux/solr/build/solr-core/test/J0/temp/solr.handler.TestReplicationHandler_82F9085F989AB97E-001/solr-instance-002/collection1/conf
   [junit4]   2> 2276770 INFO  (coreLoadExecutor-4444-thread-1) [    x:collection1] o.a.s.h.ReplicationHandler Commits will be reserved for 10000ms.
   [junit4]   2> 2276770 INFO  (searcherExecutor-4445-thread-1-processing-x:collection1) [    x:collection1] o.a.s.c.SolrCore [collection1] Registered new searcher Searcher@49e7ec3a[collection1] main{ExitableDirectoryReader(UninvertingDirectoryReader())}
   [junit4]   2> 2276771 INFO  (TEST-TestReplicationHandler.doTestStressReplication-seed#[82F9085F989AB97E]) [    ] o.e.j.s.AbstractConnector Stopped ServerConnector@21ea4294{HTTP/1.1,[http/1.1]}{127.0.0.1:0}
   [junit4]   2> 2276771 INFO  (TEST-TestReplicationHandler.doTestStressReplication-seed#[82F9085F989AB97E]) [    ] o.a.s.c.CoreContainer Shutting down CoreContainer instance=1004094361
   [junit4]   2> 2276771 INFO  (TEST-TestReplicationHandler.doTestStressReplication-seed#[82F9085F989AB97E]) [    ] o.a.s.m.SolrMetricManager Closing metric reporters for registry=solr.node, tag=null
   [junit4]   2> 2276771 INFO  (TEST-TestReplicationHandler.doTestStressReplication-seed#[82F9085F989AB97E]) [    ] o.a.s.m.r.SolrJmxReporter Closing reporter [org.apache.solr.metrics.reporters.SolrJmxReporter@21a83ba4: rootName = null, domain = solr.node, service url = null, agent id = null] for registry solr.node / com.codahale.metrics.MetricRegistry@4686ce2f
   [junit4]   2> 2276774 INFO  (TEST-TestReplicationHandler.doTestStressReplication-seed#[82F9085F989AB97E]) [    ] o.a.s.m.SolrMetricManager Closing metric reporters for registry=solr.jvm, tag=null
   [junit4]   2> 2276774 INFO  (TEST-TestReplicationHandler.doTestStressReplication-seed#[82F9085F989AB97E]) [    ] o.a.s.m.r.SolrJmxReporter Closing reporter [org.apache.solr.metrics.reporters.SolrJmxReporter@1b8cb25c: rootName = null, domain = solr.jvm, service url = null, agent id = null] for registry solr.jvm / com.codahale.metrics.MetricRegistry@4dcf7b25
   [junit4]   2> 2276776 INFO  (TEST-TestReplicationHandler.doTestStressReplication-seed#[82F9085F989AB97E]) [    ] o.a.s.m.SolrMetricManager Closing metric reporters for registry=solr.jetty, tag=null
   [junit4]   2> 2276776 INFO  (TEST-TestReplicationHandler.doTestStressReplication-seed#[82F9085F989AB97E]) [    ] o.a.s.m.r.SolrJmxReporter Closing reporter [org.apache.solr.metrics.reporters.SolrJmxReporter@5f2a3da9: rootName = null, domain = solr.jetty, service url = null, agent id = null] for registry solr.jetty / com.codahale.metrics.MetricRegistry@3d4c9927
   [junit4]   2> 2276776 INFO  (coreCloseExecutor-4449-thread-1) [    x:collection1] o.a.s.c.SolrCore [collection1]  CLOSING SolrCore org.apache.solr.core.SolrCore@6cefa7fe
   [junit4]   2> 2276776 INFO  (coreCloseExecutor-4449-thread-1) [    x:collection1] o.a.s.m.SolrMetricManager Closing metric reporters for registry=solr.core.collection1, tag=1827645438
   [junit4]   2> 2276776 INFO  (coreCloseExecutor-4449-thread-1) [    x:collection1] o.a.s.m.r.SolrJmxReporter Closing reporter [org.apache.solr.metrics.reporters.SolrJmxReporter@65cdfe5b: rootName = null, domain = solr.core.collection1, service url = null, agent id = null] for registry solr.core.collection1 / com.codahale.metrics.MetricRegistry@f90725f
   [junit4]   2> 2276781 INFO  (TEST-TestReplicationHandler.doTestStressReplication-seed#[82F9085F989AB97E]) [    ] o.e.j.s.h.ContextHandler Stopped o.e.j.s.ServletContextHandler@701f97b4{/solr,null,UNAVAILABLE}
   [junit4]   2> 2276781 INFO  (TEST-TestReplicationHandler.doTestStressReplication-seed#[82F9085F989AB97E]) [    ] o.e.j.s.Server jetty-9.3.20.v20170531
   [junit4]   2> 2276782 INFO  (TEST-TestReplicationHandler.doTestStressReplication-seed#[82F9085F989AB97E]) [    ] o.e.j.s.h.ContextHandler Started o.e.j.s.ServletContextHandler@2aafa55b{/solr,null,AVAILABLE}
   [junit4]   2> 2276782 INFO  (TEST-TestReplicationHandler.doTestStressReplication-seed#[82F9085F989AB97E]) [    ] o.e.j.s.AbstractConnector Started ServerConnector@2919ffa7{HTTP/1.1,[http/1.1]}{127.0.0.1:35541}
   [junit4]   2> 2276782 INFO  (TEST-TestReplicationHandler.doTestStressReplication-seed#[82F9085F989AB97E]) [    ] o.e.j.s.Server Started @2278086ms
   [junit4]   2> 2276782 INFO  (TEST-TestReplicationHandler.doTestStressReplication-seed#[82F9085F989AB97E]) [    ] o.a.s.c.s.e.JettySolrRunner Jetty properties: {solr.data.dir=/home/jenkins/workspace/Lucene-Solr-7.2-Linux/solr/build/solr-core/test/J0/temp/solr.handler.TestReplicationHandler_82F9085F989AB97E-001/solr-instance-001/collection1/data, hostContext=/solr, hostPort=35541}
   [junit4]   2> 2276782 ERROR (TEST-TestReplicationHandler.doTestStressReplication-seed#[82F9085F989AB97E]) [    ] o.a.s.u.StartupLoggingUtils Missing Java Option solr.log.dir. Logging may be missing or incomplete.
   [junit4]   2> 2276783 INFO  (TEST-TestReplicationHandler.doTestStressReplication-seed#[82F9085F989AB97E]) [    ] o.a.s.s.SolrDispatchFilter  ___      _       Welcome to Apache Solr™ version 7.2.1
   [junit4]   2> 2276783 INFO  (TEST-TestReplicationHandler.doTestStressReplication-seed#[82F9085F989AB97E]) [    ] o.a.s.s.SolrDispatchFilter / __| ___| |_ _   Starting in standalone mode on port null
   [junit4]   2> 2276783 INFO  (TEST-TestReplicationHandler.doTestStressReplication-seed#[82F9085F989AB97E]) [    ] o.a.s.s.SolrDispatchFilter \__ \/ _ \ | '_|  Install dir: null
   [junit4]   2> 2276783 INFO  (TEST-TestReplicationHandler.doTestStressReplication-seed#[82F9085F989AB97E]) [    ] o.a.s.s.SolrDispatchFilter |___/\___/_|_|    Start time: 2017-12-22T06:10:34.862Z
   [junit4]   2> 2276783 INFO  (TEST-TestReplicationHandler.doTestStressReplication-seed#[82F9085F989AB97E]) [    ] o.a.s.c.SolrXmlConfig Loading container configuration from /home/jenkins/workspace/Lucene-Solr-7.2-Linux/solr/build/solr-core/test/J0/temp/solr.handler.TestReplicationHandler_82F9085F989AB97E-001/solr-instance-001/solr.xml
   [junit4]   2> 2276785 INFO  (TEST-TestReplicationHandler.doTestStressReplication-seed#[82F9085F989AB97E]) [    ] o.a.s.c.SolrXmlConfig Configuration parameter autoReplicaFailoverWorkLoopDelay is ignored
   [junit4]   2> 2276785 INFO  (TEST-TestReplicationHandler.doTestStressReplication-seed#[82F9085F989AB97E]) [    ] o.a.s.c.SolrXmlConfig Configuration parameter autoReplicaFailoverBadNodeExpiration is ignored
   [junit4]   2> 2276785 INFO  (TEST-TestReplicationHandler.doTestStressReplication-seed#[82F9085F989AB97E]) [    ] o.a.s.c.SolrXmlConfig MBean server found: com.sun.jmx.mbeanserver.JmxMBeanServer@7c294544, but no JMX reporters were configured - adding default JMX reporter.
   [junit4]   2> 2276803 INFO  (TEST-TestReplicationHandler.doTestStressReplication-seed#[82F9085F989AB97E]) [    ] o.a.s.m.r.SolrJmxReporter JMX monitoring for 'solr.node' (registry 'solr.node') enabled at server: com.sun.jmx.mbeanserver.JmxMBeanServer@7c294544
   [junit4]   2> 2276809 INFO  (TEST-TestReplicationHandler.doTestStressReplication-seed#[82F9085F989AB97E]) [    ] o.a.s.m.r.SolrJmxReporter JMX monitoring for 'solr.jvm' (registry 'solr.jvm') enabled at server: com.sun.jmx.mbeanserver.JmxMBeanServer@7c294544
   [junit4]   2> 2276809 INFO  (TEST-TestReplicationHandler.doTestStressReplication-seed#[82F9085F989AB97E]) [    ] o.a.s.m.r.SolrJmxReporter JMX monitoring for 'solr.jetty' (registry 'solr.jetty') enabled at server: com.sun.jmx.mbeanserver.JmxMBeanServer@7c294544
   [junit4]   2> 2276810 INFO  (TEST-TestReplicationHandler.doTestStressReplication-seed#[82F9085F989AB97E]) [    ] o.a.s.c.CorePropertiesLocator Found 1 core definitions underneath /home/jenkins/workspace/Lucene-Solr-7.2-Linux/solr/build/solr-core/test/J0/temp/solr.handler.TestReplicationHandler_82F9085F989AB97E-001/solr-instance-001/.
   [junit4]   2> 2276810 INFO  (TEST-TestReplicationHandler.doTestStressReplication-seed#[82F9085F989AB97E]) [    ] o.a.s.c.CorePropertiesLocator Cores are: [collection1]
   [junit4]   2> 2276811 INFO  (coreLoadExecutor-4456-thread-1) [    ] o.a.s.c.TransientSolrCoreCacheDefault Allocating transient cache for 4 transient cores
   [junit4]   2> 2276816 INFO  (coreLoadExecutor-4456-thread-1) [    x:collection1] o.a.s.c.SolrConfig Using Lucene MatchVersion: 7.2.1
   [junit4]   2> 2276820 INFO  (coreLoadExecutor-4456-thread-1) [    x:collection1] o.a.s.s.IndexSchema [collection1] Schema name=test
   [junit4]   2> 2276821 INFO  (coreLoadExecutor-4456-thread-1) [    x:collection1] o.a.s.s.IndexSchema Loaded schema test/1.2 with uniqueid field id
   [junit4]   2> 2276821 INFO  (coreLoadExecutor-4456-thread-1) [    x:collection1] o.a.s.c.CoreContainer Creating SolrCore 'collection1' using configuration from instancedir /home/jenkins/workspace/Lucene-Solr-7.2-Linux/solr/build/solr-core/test/J0/temp/solr.handler.TestReplicationHandler_82F9085F989AB97E-001/solr-instance-001/./collection1, trusted=true
   [junit4]   2> 2276822 INFO  (coreLoadExecutor-4456-thread-1) [    x:collection1] o.a.s.m.r.SolrJmxReporter JMX monitoring for 'solr.core.collection1' (registry 'solr.core.collection1') enabled at server: com.sun.jmx.mbeanserver.JmxMBeanServer@7c294544
   [junit4]   2> 2276822 INFO  (coreLoadExecutor-4456-thread-1) [    x:collection1] o.a.s.c.SolrCore solr.RecoveryStrategy.Builder
   [junit4]   2> 2276822 INFO  (coreLoadExecutor-4456-thread-1) [    x:collection1] o.a.s.c.SolrCore [[collection1] ] Opening new SolrCore at [/home/jenkins/workspace/Lucene-Solr-7.2-Linux/solr/build/solr-core/test/J0/temp/solr.handler.TestReplicationHandler_82F9085F989AB97E-001/solr-instance-001/collection1], dataDir=[/home/jenkins/workspace/Lucene-Solr-7.2-Linux/solr/build/solr-core/test/J0/temp/solr.handler.TestReplicationHandler_82F9085F989AB97E-001/solr-instance-001/./collection1/data/]
   [junit4]   2> 2276823 INFO  (coreLoadExecutor-4456-thread-1) [    x:collection1] o.a.s.u.RandomMergePolicy RandomMergePolicy wrapping class org.apache.lucene.index.TieredMergePolicy: [TieredMergePolicy: maxMergeAtOnce=12, maxMergeAtOnceExplicit=19, maxMergedSegmentMB=32.2490234375, floorSegmentMB=1.0126953125, forceMergeDeletesPctAllowed=23.397294010922337, segmentsPerTier=44.0, maxCFSSegmentSizeMB=8.796093022207999E12, noCFSRatio=0.4136102319437118
   [junit4]   2> 2276951 INFO  (coreLoadExecutor-4456-thread-1) [    x:collection1] o.a.s.u.CommitTracker Hard AutoCommit: disabled
   [junit4]   2> 2276951 INFO  (coreLoadExecutor-4456-thread-1) [    x:collection1] o.a.s.u.CommitTracker Soft AutoCommit: disabled
   [junit4]   2> 2276951 INFO  (coreLoadExecutor-4456-thread-1) [    x:collection1] o.a.s.u.RandomMergePolicy RandomMergePolicy wrapping class org.apache.lucene.index.TieredMergePolicy: [TieredMergePolicy: maxMergeAtOnce=34, maxMergeAtOnceExplicit=10, maxMergedSegmentMB=41.17578125, floorSegmentMB=0.697265625, forceMergeDeletesPctAllowed=10.012918107647856, segmentsPerTier=37.0, maxCFSSegmentSizeMB=8.796093022207999E12, noCFSRatio=1.0
   [junit4]   2> 2276951 INFO  (coreLoadExecutor-4456-thread-1) [    x:collection1] o.a.s.s.SolrIndexSearcher Opening [Searcher@3eaa76ed[collection1] main]
   [junit4]   2> 2276952 INFO  (coreLoadExecutor-4456-thread-1) [    x:collection1] o.a.s.r.ManagedResourceStorage File-based storage initialized to use dir: /home/jenkins/workspace/Lucene-Solr-7.2-Linux/solr/build/solr-core/test/J0/temp/solr.handler.TestReplicationHandler_82F9085F989AB97E-001/solr-instance-001/collection1/conf
   [junit4]   2> 2276952 INFO  (coreLoadExecutor-4456-thread-1) [    x:collection1] o.a.s.h.ReplicationHandler Replication enabled for following config files: schema.xml
   [junit4]   2> 2276952 INFO  (coreLoadExecutor-4456-thread-1) [    x:collection1] o.a.s.h.ReplicationHandler Commits will be reserved for 10000ms.
   [junit4]   2> 2276953 INFO  (searcherExecutor-4457-thread-1-processing-x:collection1) [    x:collection1] o.a.s.c.SolrCore [collection1] Registered new searcher Searcher@3eaa76ed[collection1] main{ExitableDirectoryReader(UninvertingDirectoryReader())}
   [junit4]   2> 2276954 INFO  (qtp2014122105-13266) [    x:collection1] o.a.s.u.DirectUpdateHandler2 [collection1] REMOVING ALL DOCUMENTS FROM INDEX
   [junit4]   2> 2276954 INFO  (qtp2014122105-13266) [    x:collection1] o.a.s.u.p.LogUpdateProcessorFactory [collection1]  webapp=/solr path=/update params={wt=javabin&version=2}{deleteByQuery=*:*} 0 0
   [junit4]   2> 2276954 INFO  (qtp873808884-13246) [    x:collection1] o.a.s.u.DirectUpdateHandler2 [collection1] REMOVING ALL DOCUMENTS FROM INDEX
   [junit4]   2> 2276954 INFO  (qtp873808884-13246) [    x:collection1] o.a.s.u.p.LogUpdateProcessorFactory [collection1]  webapp=/solr path=/update params={wt=javabin&version=2}{deleteByQuery=*:*} 0 0
   [junit4]   2> 2276955 INFO  (qtp873808884-13247) [    x:collection1] o.a.s.u.DirectUpdateHandler2 start commit{,optimize=false,openSearcher=true,waitSearcher=true,expungeDeletes=false,softCommit=false,prepareCommit=false}
   [junit4]   2> 2276955 INFO  (qtp873808884-13247) [    x:collection1] o.a.s.u.SolrIndexWriter Calling setCommitData with IW:org.apache.solr.update.SolrIndexWriter@5c0848b3 commitCommandVersion:0
   [junit4]   2> 2277051 INFO  (qtp873808884-13247) [    x:collection1] o.a.s.s.SolrIndexSearcher Opening [Searcher@56f023c3[collection1] main]
   [junit4]   2> 2277051 INFO  (qtp873808884-13247) [    x:collection1] o.a.s.u.DirectUpdateHandler2 end_commit_flush
   [junit4]   2> 2277053 INFO  (searcherExecutor-4445-thread-1-processing-x:collection1) [    x:collection1] o.a.s.c.SolrCore [collection1] Registered new searcher Searcher@56f023c3[collection1] main{ExitableDirectoryReader(UninvertingDirectoryReader())}
   [junit4]   2> 2277053 INFO  (qtp873808884-13247) [    x:collection1] o.a.s.u.p.LogUpdateProcessorFactory [collection1]  webapp=/solr path=/update params={waitSearcher=true&commit=true&softCommit=false&wt=javabin&version=2}{commit=} 0 98
   [junit4]   2> 2277055 INFO  (qtp2014122105-13267) [    x:collection1] o.a.s.u.p.LogUpdateProcessorFactory [collection1]  webapp=/solr path=/update params={wt=javabin&version=2}{add=[0]} 0 0
   [junit4]   2> 2277056 INFO  (qtp2014122105-13268) [    x:collection1] o.a.s.u.p.LogUpdateProcessorFactory [collection1]  webapp=/solr path=/update params={wt=javabin&version=2}{add=[1]} 0 0
   [junit4]   2> 2277056 INFO  (qtp2014122105-13261) [    x:collection1] o.a.s.u.p.LogUpdateProcessorFactory [collection1]  webapp=/solr path=/update params={wt=javabin&version=2}{add=[2]} 0 0
   [junit4]   2> 2277056 INFO  (qtp2014122105-13266) [    x:collection1] o.a.s.u.p.LogUpdateProcessorFactory [collection1]  webapp=/solr path=/update params={wt=javabin&version=2}{add=[3]} 0 0
   [junit4]   2> 2277057 INFO  (qtp2014122105-13267) [    x:collection1] o.a.s.u.p.LogUpdateProcessorFactory [collection1]  webapp=/solr path=/update params={wt=javabin&version=2}{add=[4]} 0 0
   [junit4]   2> 2277057 INFO  (qtp2014122105-13268) [    x:collection1] o.a.s.u.p.LogUpdateProcessorFactory [collection1]  webapp=/solr path=/update params={wt=javabin&version=2}{add=[5]} 0 0
   [junit4]   2> 2277058 INFO  (qtp2014122105-13261) [    x:collection1] o.a.s.u.p.LogUpdateProcessorFactory [collection1]  webapp=/solr path=/update params={wt=javabin&version=2}{add=[6]} 0 0
   [junit4]   2> 2277058 INFO  (qtp2014122105-13266) [    x:collection1] o.a.s.u.p.LogUpdateProcessorFactory [collection1]  webapp=/solr path=/update params={wt=javabin&version=2}{add=[7]} 0 0
   [junit4]   2> 2277059 INFO  (qtp2014122105-13267) [    x:collection1] o.a.s.u.p.LogUpdateProcessorFactory [collection1]  webapp=/solr path=/update params={wt=javabin&version=2}{add=[8]} 0 0
   [junit4]   2> 2277059 INFO  (qtp2014122105-13268) [    x:collection1] o.a.s.u.DirectUpdateHandler2 start commit{,optimize=false,openSearcher=true,waitSearcher=true,expungeDeletes=false,softCommit=false,prepareCommit=false}
   [junit4]   2> 2277059 INFO  (qtp2014122105-13268) [    x:collection1] o.a.s.u.SolrIndexWriter Calling setCommitData with IW:org.apache.solr.update.SolrIndexWriter@f0ce07f commitCommandVersion:0
   [junit4]   2> 2277205 INFO  (qtp2014122105-13268) [    x:collection1] o.a.s.s.SolrIndexSearcher Opening [Searcher@4bf50824[collection1] main]
   [junit4]   2> 2277205 INFO  (qtp2014122105-13268) [    x:collection1] o.a.s.u.DirectUpdateHandler2 end_commit_flush
   [junit4]   2> 2277220 INFO  (searcherExecutor-4457-thread-1-processing-x:collection1) [    x:collection1] o.a.s.c.SolrCore [collection1] Registered new searcher Searcher@4bf50824[collection1] main{ExitableDirectoryReader(UninvertingDirectoryReader(Uninverting(_0(7.2.1):C9)))}
   [junit4]   2> 2277220 INFO  (qtp2014122105-13268) [    x:collection1] o.a.s.u.p.LogUpdateProcessorFactory [collection1]  webapp=/solr path=/update params={waitSearcher=true&commit=true&softCommit=false&wt=javabin&version=2}{commit=} 0 161
   [junit4]   2> 2277221 INFO  (qtp2014122105-13261) [    x:collection1] o.a.s.c.S.Request [collection1]  webapp=/solr path=/select params={q=*:*&sort=id+desc&wt=javabin&version=2} hits=9 status=0 QTime=0
   [junit4]   2> 2277222 INFO  (TEST-TestReplicationHandler.doTestStressReplication-seed#[82F9085F989AB97E]) [    ] o.a.s.h.TestReplicationHandler Waited for 0ms and found 9 docs
   [junit4]   2> 2277224 INFO  (qtp873808884-13241) [    ] o.a.s.s.HttpSolrCall [admin] webapp=null path=/admin/cores params={core=collection1&action=status&wt=javabin&version=2} status=0 QTime=0
   [junit4]   2> 2277227 WARN  (explicit-fetchindex-cmd) [    x:collection1] o.a.s.h.IndexFetcher 'masterUrl' must be specified without the /replication suffix
   [junit4]   2> 2277228 INFO  (qtp2014122105-13267) [    x:collection1] o.a.s.c.S.Request [collection1]  webapp=/solr path=/replication params={qt=/replication&wt=javabin&version=2&command=indexversion} status=0 QTime=0
   [junit4]   2> 2277229 INFO  (explicit-fetchindex-cmd) [    x:collection1] o.a.s.h.IndexFetcher Master's generation: 2
   [junit4]   2> 2277229 INFO  (explicit-fetchindex-cmd) [    x:collection1] o.a.s.h.IndexFetcher Master's version: 1513923035138
   [junit4]   2> 2277229 INFO  (explicit-fetchindex-cmd) [    x:collection1] o.a.s.h.IndexFetcher Slave's generation: 2
   [junit4]   2> 2277229 INFO  (explicit-fetchindex-cmd) [    x:collection1] o.a.s.h.IndexFetcher Slave's version: 1513923035034
   [junit4]   2> 2277229 INFO  (explicit-fetchindex-cmd) [    x:collection1] o.a.s.h.IndexFetcher Starting replication process
   [junit4]   2> 2277232 INFO  (qtp2014122105-13268) [    x:collection1] o.a.s.c.S.Request [collection1]  webapp=/solr path=/replication params={generation=2&qt=/replication&tlogFiles=false&wt=javabin&version=2&command=filelist} status=0 QTime=2
   [junit4]   2> 2277232 INFO  (explicit-fetchindex-cmd) [    x:collection1] o.a.s.h.IndexFetcher Number of files in latest index in master: 10
   [junit4]   2> 2277233 INFO  (explicit-fetchindex-cmd) [    x:collection1] o.a.s.h.IndexFetcher Starting download (fullCopy=true) to NRTCachingDirectory(MMapDirectory@/home/jenkins/workspace/Lucene-Solr-7.2-Linux/solr/build/solr-core/test/J0/temp/solr.handler.TestReplicationHandler_82F9085F989AB97E-001/solr-instance-002/collection1/data/index.20171222171035311 lockFactory=org.apache.lucene.store.SingleInstanceLockFactory@73a9f6a1; maxCacheMB=48.0 maxMergeSizeMB=4.0)
   [junit4]   2> 2277233 INFO  (qtp2014122105-13261) [    x:collection1] o.a.s.c.S.Request [collection1]  webapp=/solr path=/replication params={generation=2&qt=/replication&file=_0.si&checksum=true&wt=filestream&command=filecontent} status=0 QTime=0
   [junit4]   2> 2277235 INFO  (qtp2014122105-13262) [    x:collection1] o.a.s.c.S.Request [collection1]  webapp=/solr path=/replication params={generation=2&qt=/replication&file=_0_Lucene50_0.doc&checksum=true&wt=filestream&command=filecontent} status=0 QTime=0
   [junit4]   2> 2277236 INFO  (qtp2014122105-13267) [    x:collection1] o.a.s.c.S.Request [collection1]  webapp=/solr path=/replication params={generation=2&qt=/replication&file=_0_Lucene50_0.tim&checksum=true&wt=filestream&command=filecontent} status=0 QTime=0
   [junit4]   2> 2277237 INFO  (qtp2014122105-13268) [    x:collection1] o.a.s.c.S.Request [collection1]  webapp=/solr path=/replication params={generation=2&qt=/replication&file=_0.nvd&checksum=true&wt=filestream&command=filecontent} status=0 QTime=0
   [junit4]   2> 2277238 INFO  (qtp2014122105-13261) [    x:collection1] o.a.s.c.S.Request [collection1]  webapp=/solr path=/replication params={generation=2&qt=/replication&file=_0.fdx&checksum=true&wt=filestream&command=filecontent} status=0 QTime=0
   [junit4]   2> 2277239 INFO  (qtp2014122105-13262) [    x:collection1] o.a.s.c.S.Request [collection1]  webapp=/solr path=/replication params={generation=2&qt=/replication&file=_0_Lucene50_0.tip&checksum=true&wt=filestream&command=filecontent} status=0 QTime=0
   [junit4]   2> 2277240 INFO  (qtp2014122105-13267) [    x:collection1] o.a.s.c.S.Request [collection1]  webapp=/solr path=/replication params={generation=2&qt=/replication&file=_0.fdt&checksum=true&wt=filestream&command=filecontent} status=0 QTime=0
   [junit4]   2> 2277241 INFO  (qtp2014122105-13268) [    x:collection1] o.a.s.c.S.Request [collection1]  webapp=/solr path=/replication params={generation=2&qt=/replication&file=_0.fnm&checksum=true&wt=filestream&command=filecontent} status=0 QTime=0
   [junit4]   2> 2277242 INFO  (qtp2014122105-13261) [    x:collection1] o.a.s.c.S.Request [collection1]  webapp=/solr path=/replication params={generation=2&qt=/replication&file=_0.nvm&checksum=true&wt=filestream&command=filecontent} status=0 QTime=0
   [junit4]   2> 2277243 WARN  (explicit-fetchindex-cmd) [    x:collection1] o.a.s.h.IndexFetcher File segments_2 did not match. expected checksum is 375601261 and actual is checksum 1038498042. expected length is 181 and actual length is 117
   [junit4]   2> 2277243 INFO  (qtp2014122105-13262) [    x:collection1] o.a.s.c.S.Request [collection1]  webapp=/solr path=/replication params={generation=2&qt=/replication&file=segments_2&checksum=true&wt=filestream&command=filecontent} status=0 QTime=0
   [junit4]   2> 2277244 INFO  (explicit-fetchindex-cmd) [    x:collection1] o.a.s.h.IndexFetcher Total time taken for download (fullCopy=true,bytesDownloaded=1874) : 0 secs (null bytes/sec) to NRTCachingDirectory(MMapDirectory@/home/jenkins/workspace/Lucene-Solr-7.2-Linux/solr/build/solr-core/test/J0/temp/solr.handler.TestReplicationHandler_82F9085F989AB97E-001/solr-instance-002/collection1/data/index.20171222171035311 lockFactory=org.apache.lucene.store.SingleInstanceLockFactory@73a9f6a1; maxCacheMB=48.0 maxMergeSizeMB=4.0)
   [junit4]   2> 2277244 INFO  (explicit-fetchindex-cmd) [    x:collection1] o.a.s.h.IndexFetcher Starting download of configuration files from master: [{size=1530, name=schema.xml, checksum=1508380349}]
   [junit4]   2> 2277253 INFO  (qtp2014122105-13267) [    x:collection1] o.a.s.c.S.Request [collection1]  webapp=/solr path=/replication params={generation=2&qt=/replication&cf=schema.xml&checksum=true&wt=filestream&command=filecontent} status=0 QTime=4
   [junit4]   2> 2277298 INFO  (explicit-fetchindex-cmd) [    x:collection1] o.a.s.c.SolrCore Updating index properties... index=index.20171222171035311
   [junit4]   2> 2277303 INFO  (explicit-fetchindex-cmd) [    x:collection1] o.a.s.h.IndexFetcher Configuration files are modified, core will be reloaded
   [junit4]   2> 2277308 INFO  (explicit-fetchindex-cmd) [    x:collection1] o.a.s.h.IndexFetcher Reloading SolrCore collection1
   [junit4]   2> 2277315 INFO  (Thread-2156) [    x:collection1] o.a.s.c.SolrConfig Using Lucene MatchVersion: 7.2.1
   [junit4]   2> 2277320 INFO  (Thread-2156) [    x:collection1] o.a.s.s.IndexSchema [collection1] Schema name=test
   [junit4]   2> 2277322 INFO  (Thread-2156) [    x:collection1] o.a.s.s.IndexSchema Loaded schema test/1.2 with uniqueid field id
   [junit4]   2> 2277322 INFO  (Thread-2156) [    x:collection1] o.a.s.c.CoreContainer Reloading SolrCore 'collection1' using configuration from instancedir /home/jenkins/workspace/Lucene-Solr-7.2-Linux/solr/build/solr-core/test/J0/temp/solr.handler.TestReplicationHandler_82F9085F989AB97E-001/solr-instance-002/./collection1
   [junit4]   2> 2277338 INFO  (Thread-2156) [    x:collection1] o.a.s.m.r.SolrJmxReporter JMX monitoring for 'solr.core.collection1' (registry 'solr.core.collection1') enabled at server: com.sun.jmx.mbeanserver.JmxMBeanServer@7c294544
   [junit4]   2> 2277338 INFO  (Thread-2156) [    x:collection1] o.a.s.c.SolrCore [[collection1] ] Opening new SolrCore at [/home/jenkins/workspace/Lucene-Solr-7.2-Linux/solr/build/solr-core/test/J0/temp/solr.handler.TestReplicationHandler_82F9085F989AB97E-001/solr-instance-002/collection1], dataDir=[/home/jenkins/workspace/Lucene-Solr-7.2-Linux/solr/build/solr-core/test/J0/temp/solr.handler.TestReplicationHandler_82F9085F989AB97E-001/solr-instance-002/./collection1/data/]
   [junit4]   2> 2277340 INFO  (OldIndexDirectoryCleanupThreadForCore-collection1) [    x:collection1] o.a.s.c.DirectoryFactory Will not remove most recent old directory after reload /home/jenkins/workspace/Lucene-Solr-7.2-Linux/solr/build/solr-core/test/J0/temp/solr.handler.TestReplicationHandler_82F9085F989AB97E-001/solr-instance-002/./collection1/data/index
   [junit4]   2> 2277340 INFO  (OldIndexDirectoryCleanupThreadForCore-collection1) [    x:collection1] o.a.s.c.DirectoryFactory Found 0 old index directories to clean-up under /home/jenkins/workspace/Lucene-Solr-7.2-Linux/solr/build/solr-core/test/J0/temp/solr.handler.TestReplicationHandler_82F9085F989AB97E-001/solr-instance-002/./collection1/data/ afterReload=true
   [junit4]   2> 2277363 INFO  (Thread-2156) [    x:collection1] o.a.s.u.CommitTracker Hard AutoCommit: disabled
   [junit4]   2> 2277363 INFO  (Thread-2156) [    x:collection1] o.a.s.u.CommitTracker Soft AutoCommit: disabled
   [junit4]   2> 2277363 INFO  (Thread-2156) [    x:collection1] o.a.s.s.SolrIndexSearcher Opening [Searcher@4189b0b0[collection1] main]
   [junit4]   2> 2277363 INFO  (Thread-2156) [    x:collection1] o.a.s.r.ManagedResourceStorage File-based storage initialized to use dir: /home/jenkins/workspace/Lucene-Solr-7.2-Linux/solr/build/solr-core/test/J0/temp/solr.handler.TestReplicationHandler_82F9085F989AB97E-001/solr-instance-002/collection1/conf
   [junit4]   2> 2277364 INFO  (Thread-2156) [    x:collection1] o.a.s.h.ReplicationHandler Commits will be reserved for 10000ms.
   [junit4]   2> 2277364 INFO  (Thread-2156) [    x:collection1] o.a.s.u.RandomMergePolicy RandomMergePolicy wrapping class org.apache.lucene.index.TieredMergePolicy: [TieredMergePolicy: maxMergeAtOnce=12, maxMergeAtOnceExplicit=19, maxMergedSegmentMB=32.2490234375, floorSegmentMB=1.0126953125, forceMergeDeletesPctAllowed=23.397294010922337, segmentsPerTier=44.0, maxCFSSegmentSizeMB=8.796093022207999E12, noCFSRatio=0.4136102319437118
   [junit4]   2> 2277364 INFO  (Thread-2156) [    x:collection1] o.a.s.u.DefaultSolrCoreState New IndexWriter is ready to be used.
   [junit4]   2> 2277365 INFO  (searcherExecutor-4462-thread-1-processing-x:collection1) [    x:collection1] o.a.s.c.SolrCore [collection1] Registered new searcher Searcher@4189b0b0[collection1] main{ExitableDirectoryReader(UninvertingDirectoryReader())}
   [junit4]   2> 2277365 INFO  (Thread-2156) [    x:collection1] o.a.s.s.SolrIndexSearcher Opening [Searcher@bf4d668[collection1] main]
   [junit4]   2> 2277365 INFO  (explicit-fetchindex-cmd) [    x:collection1] o.a.s.h.IndexFetcher removing old index directory NRTCachingDirectory(MMapDirectory@/home/jenkins/workspace/Lucene-Solr-7.2-Linux/solr/build/solr-core/test/J0/temp/solr.handler.TestReplicationHandler_82F9085F989AB97E-001/solr-instance-002/collection1/data/index lockFactory=org.apache.lucene.store.SingleInstanceLockFactory@3928d2d1; maxCacheMB=48.0 maxMergeSizeMB=4.0)
   [junit4]   2> 2277366 INFO  (explicit-fetchindex-cmd) [    x:collection1] o.a.s.u.RandomMergePolicy RandomMergePolicy wrapping class org.apache.lucene.index.TieredMergePolicy: [TieredMergePolicy: maxMergeAtOnce=12, maxMergeAtOnceExplicit=19, maxMergedSegmentMB=32.2490234375, floorSegmentMB=1.0126953125, forceMergeDeletesPctAllowed=23.397294010922337, segmentsPerTier=44.0, maxCFSSegmentSizeMB=8.796093022207999E12, noCFSRatio=0.4136102319437118
   [junit4]   2> 2277366 INFO  (explicit-fetchindex-cmd) [    x:collection1] o.a.s.u.DefaultSolrCoreState New IndexWriter is ready to be used.
   [junit4]   2> 2277366 INFO  (searcherExecutor-4462-thread-1-processing-x:collection1) [    x:collection1] o.a.s.c.SolrCore [collection1] Registered new searcher Searcher@bf4d668[collection1] main{ExitableDirectoryReader(UninvertingDirectoryReader(Uninverting(_0(7.2.1):C9)))}
   [junit4]   2> 2277367 INFO  (explicit-fetchindex-cmd) [    x:collection1] o.a.s.s.SolrIndexSearcher Opening [Searcher@166c3076[collection1] main]
   [junit4]   2> 2277368 INFO  (searcherExecutor-4462-thread-1-processing-x:collection1) [    x:collection1] o.a.s.c.SolrCore [collection1] Registered new searcher Searcher@166c3076[collection1] main{ExitableDirectoryReader(UninvertingDirectoryReader(Uninverting(_0(7.2.1):C9)))}
   [junit4]   2> 2277368 INFO  (qtp873808884-13241) [    x:collection1] o.a.s.c.S.Request [collection1]  webapp=/solr path=/replication params={wait=true&masterUrl=http://127.0.0.1:35541/solr/collection1/replication&command=fetchindex} status=0 QTime=142
   [junit4]   2> 2277368 INFO  (qtp873808884-13241) [    x:collection1] o.a.s.c.SolrCore [collection1]  CLOSING SolrCore org.apache.solr.core.SolrCore@1b1d3c26
   [junit4]   2> 2277368 INFO  (qtp873808884-13241) [    x:collection1] o.a.s.m.SolrMetricManager Closing metric reporters for registry=solr.core.collection1, tag=454900774
   [junit4]   2> 2277368 INFO  (qtp873808884-13241) [    x:collection1] o.a.s.m.r.SolrJmxReporter Closing reporter [org.apache.solr.metrics.reporters.SolrJmxReporter@718795fe: rootName = null, domain = solr.core.collection1, service url = null, agent id = null] for registry solr.core.collection1 / com.codahale.metrics.MetricRegistry@1dcb0af4
   [junit4]   2> 2277375 INFO  (qtp873808884-13247) [    ] o.a.s.s.HttpSolrCall [admin] webapp=null path=/admin/cores params={core=collection1&action=status&wt=javabin&version=2} status=0 QTime=0
   [junit4]   2> 2277375 INFO  (qtp873808884-13248) [    x:collection1] o.a.s.c.S.Request [collection1]  webapp=/solr path=/select params={q=*:*&sort=id+desc&wt=javabin&version=2} hits=9 status=0 QTime=0
   [junit4]   2> 2277376 INFO  (TEST-TestReplicationHandler.doTestStressReplication-seed#[82F9085F989AB97E]) [    ] o.a.s.h.TestReplicationHandler Waited for 0ms and found 9 docs
   [junit4]   2> 2277376 INFO  (qtp2014122105-13266) [    x:collection1] o.a.s.c.S.Request [collection1]  webapp=/solr path=/replication params={_trace=getDetails&qt=/replication&wt=javabin&version=2&command=details} status=0 QTime=0
   [junit4]   2> 2277377 INFO  (qtp2014122105-13261) [    x:collection1] o.a.s.c.S.Request [collection1]  webapp=/solr path=/replication params={_trace=getDetails&qt=/replication&wt=javabin&version=2&command=details} status=0 QTime=0
   [junit4]   2> 2277378 INFO  (qtp873808884-13243) [    x:collection1] o.a.s.c.S.Request [collection1]  webapp=/solr path=/replication params={_trace=getDetails&qt=/replication&wt=javabin&version=2&command=details} status=0 QTime=0
   [junit4]   2> 2277378 INFO  (qtp2014122105-13262) [    x:collection1] o.a.s.c.S.Request [collection1]  webapp=/solr path=/replication params={_trace=assertVersions&qt=/replication&wt=javabin&version=2&command=indexversion} status=0 QTime=0
   [junit4]   2> 2277378 INFO  (qtp873808884-13244) [    x:collection1] o.a.s.c.S.Request [collection1]  webapp=/solr path=/replication params={_trace=assertVersions&qt=/replication&wt=javabin&version=2&command=indexversion} status=0 QTime=0
   [junit4]   1> [index, snapshot_metadata]
   [junit4]   1> [index.20171222171035311, snapshot_metadata, replication.properties, index.properties]
   [junit4]   2> 2277380 INFO  (qtp873808884-13247) [    x:collection1] o.a.s.u.p.LogUpdateProcessorFactory [collection1]  webapp=/solr path=/update params={wt=javabin&version=2}{add=[9]} 0 0
   [junit4]   2> 2277380 INFO  (qtp873808884-13248) [    x:collection1] o.a.s.u.p.LogUpdateProcessorFactory [collection1]  webapp=/solr path=/update params={wt=javabin&version=2}{add=[10]} 0 0
   [junit4]   2> 2277380 INFO  (qtp873808884-13243) [    x:collection1] o.a.s.u.p.LogUpdateProcessorFactory [collection1]  webapp=/solr path=/update params={wt=javabin&version=2}{add=[11]} 0 0
   [junit4]   

[...truncated too long message...]

ry=solr.core.collection1.shard1.replica_n1, tag=668349152
   [junit4]   2> 126334 INFO  (coreCloseExecutor-102-thread-1) [n:127.0.0.1:40881_solr c:collection1 s:shard1 r:core_node3 x:collection1_shard1_replica_n1] o.a.s.m.r.SolrJmxReporter Closing reporter [org.apache.solr.metrics.reporters.SolrJmxReporter@4a244622: rootName = solr_40881, domain = solr.core.collection1.shard1.replica_n1, service url = null, agent id = null] for registry solr.core.collection1.shard1.replica_n1 / com.codahale.metrics.MetricRegistry@4ac086b6
   [junit4]   2> 126334 INFO  (coreCloseExecutor-102-thread-2) [n:127.0.0.1:40881_solr c:foo s:shard1 r:core_node3 x:foo_shard1_replica_n1] o.a.s.c.SolrCore [foo_shard1_replica_n1]  CLOSING SolrCore org.apache.solr.core.SolrCore@70094ff8
   [junit4]   2> 126334 INFO  (zkCallback-29-thread-5-processing-n:127.0.0.1:40881_solr) [n:127.0.0.1:40881_solr    ] o.a.s.c.c.ZkStateReader Updated live nodes from ZooKeeper... (1) -> (0)
   [junit4]   2> 126334 INFO  (coreCloseExecutor-102-thread-3) [n:127.0.0.1:40881_solr c:stale_state_test_col s:shard1 r:core_node4 x:stale_state_test_col_shard1_replica_n3] o.a.s.c.SolrCore [stale_state_test_col_shard1_replica_n3]  CLOSING SolrCore org.apache.solr.core.SolrCore@39ec7c3f
   [junit4]   2> 126349 INFO  (coreCloseExecutor-100-thread-1) [n:127.0.0.1:46541_solr c:foo s:shard1 r:core_node6 x:foo_shard1_replica_n4] o.a.s.m.SolrMetricManager Closing metric reporters for registry=solr.collection.foo.shard1.leader, tag=1222092971
   [junit4]   2> 126349 INFO  (coreCloseExecutor-101-thread-2) [n:127.0.0.1:43163_solr c:foo s:shard1 r:core_node5 x:foo_shard1_replica_n2] o.a.s.m.SolrMetricManager Closing metric reporters for registry=solr.core.foo.shard1.replica_n2, tag=2127363141
   [junit4]   2> 126349 INFO  (coreCloseExecutor-101-thread-2) [n:127.0.0.1:43163_solr c:foo s:shard1 r:core_node5 x:foo_shard1_replica_n2] o.a.s.m.r.SolrJmxReporter Closing reporter [org.apache.solr.metrics.reporters.SolrJmxReporter@71e413ca: rootName = solr_43163, domain = solr.core.foo.shard1.replica_n2, service url = null, agent id = null] for registry solr.core.foo.shard1.replica_n2 / com.codahale.metrics.MetricRegistry@af9504b
   [junit4]   2> 126353 INFO  (coreCloseExecutor-102-thread-2) [n:127.0.0.1:40881_solr c:foo s:shard1 r:core_node3 x:foo_shard1_replica_n1] o.a.s.m.SolrMetricManager Closing metric reporters for registry=solr.core.foo.shard1.replica_n1, tag=1879658488
   [junit4]   2> 126353 INFO  (coreCloseExecutor-102-thread-2) [n:127.0.0.1:40881_solr c:foo s:shard1 r:core_node3 x:foo_shard1_replica_n1] o.a.s.m.r.SolrJmxReporter Closing reporter [org.apache.solr.metrics.reporters.SolrJmxReporter@226a8943: rootName = solr_40881, domain = solr.core.foo.shard1.replica_n1, service url = null, agent id = null] for registry solr.core.foo.shard1.replica_n1 / com.codahale.metrics.MetricRegistry@10b60236
   [junit4]   2> 126356 INFO  (coreCloseExecutor-101-thread-3) [n:127.0.0.1:43163_solr c:overwrite s:shard1 r:core_node2 x:overwrite_shard1_replica_n1] o.a.s.m.SolrMetricManager Closing metric reporters for registry=solr.core.overwrite.shard1.replica_n1, tag=1250774379
   [junit4]   2> 126357 INFO  (coreCloseExecutor-101-thread-3) [n:127.0.0.1:43163_solr c:overwrite s:shard1 r:core_node2 x:overwrite_shard1_replica_n1] o.a.s.m.r.SolrJmxReporter Closing reporter [org.apache.solr.metrics.reporters.SolrJmxReporter@461aaa8b: rootName = solr_43163, domain = solr.core.overwrite.shard1.replica_n1, service url = null, agent id = null] for registry solr.core.overwrite.shard1.replica_n1 / com.codahale.metrics.MetricRegistry@4221652b
   [junit4]   2> 126361 INFO  (coreCloseExecutor-102-thread-3) [n:127.0.0.1:40881_solr c:stale_state_test_col s:shard1 r:core_node4 x:stale_state_test_col_shard1_replica_n3] o.a.s.m.SolrMetricManager Closing metric reporters for registry=solr.core.stale_state_test_col.shard1.replica_n3, tag=971799615
   [junit4]   2> 126361 INFO  (coreCloseExecutor-102-thread-3) [n:127.0.0.1:40881_solr c:stale_state_test_col s:shard1 r:core_node4 x:stale_state_test_col_shard1_replica_n3] o.a.s.m.r.SolrJmxReporter Closing reporter [org.apache.solr.metrics.reporters.SolrJmxReporter@16578cb6: rootName = solr_40881, domain = solr.core.stale_state_test_col.shard1.replica_n3, service url = null, agent id = null] for registry solr.core.stale_state_test_col.shard1.replica_n3 / com.codahale.metrics.MetricRegistry@2381fb60
   [junit4]   2> 126365 INFO  (coreCloseExecutor-101-thread-1) [n:127.0.0.1:43163_solr c:collection1 s:shard2 r:core_node4 x:collection1_shard2_replica_n2] o.a.s.m.SolrMetricManager Closing metric reporters for registry=solr.collection.collection1.shard2.leader, tag=1560788884
   [junit4]   2> 126365 INFO  (coreCloseExecutor-101-thread-2) [n:127.0.0.1:43163_solr c:foo s:shard1 r:core_node5 x:foo_shard1_replica_n2] o.a.s.m.SolrMetricManager Closing metric reporters for registry=solr.collection.foo.shard1.leader, tag=2127363141
   [junit4]   2> 126365 INFO  (coreCloseExecutor-101-thread-3) [n:127.0.0.1:43163_solr c:overwrite s:shard1 r:core_node2 x:overwrite_shard1_replica_n1] o.a.s.m.SolrMetricManager Closing metric reporters for registry=solr.collection.overwrite.shard1.leader, tag=1250774379
   [junit4]   2> 126370 INFO  (coreCloseExecutor-102-thread-3) [n:127.0.0.1:40881_solr c:stale_state_test_col s:shard1 r:core_node4 x:stale_state_test_col_shard1_replica_n3] o.a.s.m.SolrMetricManager Closing metric reporters for registry=solr.collection.stale_state_test_col.shard1.leader, tag=971799615
   [junit4]   2> 126370 INFO  (coreCloseExecutor-102-thread-1) [n:127.0.0.1:40881_solr c:collection1 s:shard1 r:core_node3 x:collection1_shard1_replica_n1] o.a.s.m.SolrMetricManager Closing metric reporters for registry=solr.collection.collection1.shard1.leader, tag=668349152
   [junit4]   2> 126370 INFO  (coreCloseExecutor-102-thread-2) [n:127.0.0.1:40881_solr c:foo s:shard1 r:core_node3 x:foo_shard1_replica_n1] o.a.s.m.SolrMetricManager Closing metric reporters for registry=solr.collection.foo.shard1.leader, tag=1879658488
   [junit4]   2> 126381 INFO  (jetty-closer-6-thread-2) [    ] o.a.s.c.Overseer Overseer (id=99216524722896904-127.0.0.1:40881_solr-n_0000000000) closing
   [junit4]   2> 126381 INFO  (OverseerStateUpdate-99216524722896904-127.0.0.1:40881_solr-n_0000000000) [n:127.0.0.1:40881_solr    ] o.a.s.c.Overseer Overseer Loop exiting : 127.0.0.1:40881_solr
   [junit4]   2> 126381 WARN  (NIOServerCxn.Factory:0.0.0.0/0.0.0.0:0) [    ] o.a.z.s.NIOServerCnxn caught end of stream exception
   [junit4]   2> EndOfStreamException: Unable to read additional data from client sessionid 0x1607ce74ff50007, likely client has closed socket
   [junit4]   2> 	at org.apache.zookeeper.server.NIOServerCnxn.doIO(NIOServerCnxn.java:239)
   [junit4]   2> 	at org.apache.zookeeper.server.NIOServerCnxnFactory.run(NIOServerCnxnFactory.java:203)
   [junit4]   2> 	at java.lang.Thread.run(Thread.java:748)
   [junit4]   2> 126382 INFO  (jetty-closer-6-thread-1) [    ] o.e.j.s.h.ContextHandler Stopped o.e.j.s.ServletContextHandler@321ade75{/solr,null,UNAVAILABLE}
   [junit4]   2> 126382 WARN  (OverseerAutoScalingTriggerThread-99216524722896904-127.0.0.1:40881_solr-n_0000000000) [n:127.0.0.1:40881_solr    ] o.a.s.c.a.OverseerTriggerThread OverseerTriggerThread woken up but we are closed, exiting.
   [junit4]   2> 126383 INFO  (jetty-closer-6-thread-3) [    ] o.e.j.s.h.ContextHandler Stopped o.e.j.s.ServletContextHandler@18ce4d22{/solr,null,UNAVAILABLE}
   [junit4]   2> 126384 INFO  (jetty-closer-6-thread-2) [    ] o.e.j.s.h.ContextHandler Stopped o.e.j.s.ServletContextHandler@78c021ba{/solr,null,UNAVAILABLE}
   [junit4]   2> 126384 ERROR (SUITE-CloudSolrClientTest-seed#[14FB31B5F4B16499]-worker) [    ] o.a.z.s.ZooKeeperServer ZKShutdownHandler is not registered, so ZooKeeper server won't take any action on ERROR or SHUTDOWN server state changes
   [junit4]   2> 126385 INFO  (SUITE-CloudSolrClientTest-seed#[14FB31B5F4B16499]-worker) [    ] o.a.s.c.ZkTestServer connecting to 127.0.0.1:45117 45117
   [junit4]   2> 132169 INFO  (Thread-13) [    ] o.a.s.c.ZkTestServer connecting to 127.0.0.1:45117 45117
   [junit4]   2> 132171 WARN  (Thread-13) [    ] o.a.s.c.ZkTestServer Watch limit violations: 
   [junit4]   2> Maximum concurrent create/delete watches above limit:
   [junit4]   2> 
   [junit4]   2> 	8	/solr/aliases.json
   [junit4]   2> 	3	/solr/security.json
   [junit4]   2> 	3	/solr/configs/conf
   [junit4]   2> 
   [junit4]   2> Maximum concurrent data watches above limit:
   [junit4]   2> 
   [junit4]   2> 	18	/solr/collections/foo/state.json
   [junit4]   2> 	14	/solr/collections/stale_state_test_col/state.json
   [junit4]   2> 	10	/solr/collections/collection1/state.json
   [junit4]   2> 	10	/solr/collections/nemesis/state.json
   [junit4]   2> 	8	/solr/clusterprops.json
   [junit4]   2> 	8	/solr/clusterstate.json
   [junit4]   2> 	5	/solr/collections/overwrite/state.json
   [junit4]   2> 
   [junit4]   2> Maximum concurrent children watches above limit:
   [junit4]   2> 
   [junit4]   2> 	8	/solr/live_nodes
   [junit4]   2> 	8	/solr/collections
   [junit4]   2> 
   [junit4]   2> NOTE: leaving temporary files on disk at: /home/jenkins/workspace/Lucene-Solr-7.2-Linux/solr/build/solr-solrj/test/J2/temp/solr.client.solrj.impl.CloudSolrClientTest_14FB31B5F4B16499-001
   [junit4]   2> NOTE: test params are: codec=Lucene70, sim=RandomSimilarity(queryNorm=false): {}, locale=sv, timezone=Asia/Kashgar
   [junit4]   2> NOTE: Linux 4.10.0-40-generic amd64/Oracle Corporation 1.8.0_144 (64-bit)/cpus=8,threads=1,free=398819864,total=518979584
   [junit4]   2> NOTE: All tests run in this JVM: [GreaterThanEqualToEvaluatorTest, SolrExampleXMLTest, SolrParamTest, CosineEvaluatorTest, CoalesceEvaluatorTest, TestJavaBinCodec, ArcCosineEvaluatorTest, GetByIdTest, UuidEvaluatorTest, CloudSolrClientTest]
   [junit4] Completed [131/146 (1!)] on J2 in 122.54s, 16 tests, 2 failures, 2 errors <<< FAILURES!

[...truncated 46497 lines...]

Mime
View raw message