lucene-dev mailing list archives

Site index · List index
Message view « Date » · « Thread »
Top « Date » · « Thread »
From Policeman Jenkins Server <jenk...@thetaphi.de>
Subject [JENKINS] Lucene-Solr-master-MacOSX (64bit/jdk-9) - Build # 4341 - Unstable!
Date Sun, 24 Dec 2017 20:54:43 GMT
Build: https://jenkins.thetaphi.de/job/Lucene-Solr-master-MacOSX/4341/
Java: 64bit/jdk-9 -XX:-UseCompressedOops -XX:+UseG1GC

1 tests failed.
FAILED:  junit.framework.TestSuite.org.apache.solr.analytics.legacy.facet.LegacyFieldFacetExtrasCloudTest

Error Message:
Could not find collection:collection1

Stack Trace:
java.lang.AssertionError: Could not find collection:collection1
	at __randomizedtesting.SeedInfo.seed([5D4F2E938EE19998]:0)
	at org.junit.Assert.fail(Assert.java:93)
	at org.junit.Assert.assertTrue(Assert.java:43)
	at org.junit.Assert.assertNotNull(Assert.java:526)
	at org.apache.solr.cloud.AbstractDistribZkTestBase.waitForRecoveriesToFinish(AbstractDistribZkTestBase.java:155)
	at org.apache.solr.analytics.legacy.LegacyAbstractAnalyticsCloudTest.setupCollection(LegacyAbstractAnalyticsCloudTest.java:51)
	at java.base/jdk.internal.reflect.NativeMethodAccessorImpl.invoke0(Native Method)
	at java.base/jdk.internal.reflect.NativeMethodAccessorImpl.invoke(NativeMethodAccessorImpl.java:62)
	at java.base/jdk.internal.reflect.DelegatingMethodAccessorImpl.invoke(DelegatingMethodAccessorImpl.java:43)
	at java.base/java.lang.reflect.Method.invoke(Method.java:564)
	at com.carrotsearch.randomizedtesting.RandomizedRunner.invoke(RandomizedRunner.java:1737)
	at com.carrotsearch.randomizedtesting.RandomizedRunner$6.evaluate(RandomizedRunner.java:874)
	at com.carrotsearch.randomizedtesting.RandomizedRunner$7.evaluate(RandomizedRunner.java:890)
	at com.carrotsearch.randomizedtesting.rules.StatementAdapter.evaluate(StatementAdapter.java:36)
	at com.carrotsearch.randomizedtesting.rules.SystemPropertiesRestoreRule$1.evaluate(SystemPropertiesRestoreRule.java:57)
	at org.apache.lucene.util.AbstractBeforeAfterRule$1.evaluate(AbstractBeforeAfterRule.java:45)
	at com.carrotsearch.randomizedtesting.rules.StatementAdapter.evaluate(StatementAdapter.java:36)
	at org.apache.lucene.util.TestRuleStoreClassName$1.evaluate(TestRuleStoreClassName.java:41)
	at com.carrotsearch.randomizedtesting.rules.NoShadowingOrOverridesOnMethodsRule$1.evaluate(NoShadowingOrOverridesOnMethodsRule.java:40)
	at com.carrotsearch.randomizedtesting.rules.NoShadowingOrOverridesOnMethodsRule$1.evaluate(NoShadowingOrOverridesOnMethodsRule.java:40)
	at com.carrotsearch.randomizedtesting.rules.StatementAdapter.evaluate(StatementAdapter.java:36)
	at com.carrotsearch.randomizedtesting.rules.StatementAdapter.evaluate(StatementAdapter.java:36)
	at org.apache.lucene.util.TestRuleAssertionsRequired$1.evaluate(TestRuleAssertionsRequired.java:53)
	at org.apache.lucene.util.TestRuleMarkFailure$1.evaluate(TestRuleMarkFailure.java:47)
	at org.apache.lucene.util.TestRuleIgnoreAfterMaxFailures$1.evaluate(TestRuleIgnoreAfterMaxFailures.java:64)
	at org.apache.lucene.util.TestRuleIgnoreTestSuites$1.evaluate(TestRuleIgnoreTestSuites.java:54)
	at com.carrotsearch.randomizedtesting.rules.StatementAdapter.evaluate(StatementAdapter.java:36)
	at com.carrotsearch.randomizedtesting.ThreadLeakControl$StatementRunner.run(ThreadLeakControl.java:368)
	at java.base/java.lang.Thread.run(Thread.java:844)




Build Log:
[...truncated 17279 lines...]
   [junit4] Suite: org.apache.solr.analytics.legacy.facet.LegacyFieldFacetExtrasCloudTest
   [junit4]   2> Creating dataDir: /Users/jenkins/workspace/Lucene-Solr-master-MacOSX/solr/build/contrib/solr-analytics/test/J1/temp/solr.analytics.legacy.facet.LegacyFieldFacetExtrasCloudTest_5D4F2E938EE19998-001/init-core-data-001
   [junit4]   2> NOTE: test params are: codec=Asserting(Lucene70): {}, docValues:{}, maxPointsInLeafNode=1727,
maxMBSortInHeap=5.7682556722886345, sim=Asserting(org.apache.lucene.search.similarities.AssertingSimilarity@3e3ff8b5),
locale=so-DJ, timezone=America/Indiana/Vevay
   [junit4]   2> NOTE: Mac OS X 10.11.6 x86_64/Oracle Corporation 9 (64-bit)/cpus=3,threads=1,free=139758392,total=226492416
   [junit4]   2> NOTE: All tests run in this JVM: [RemoveFunctionTest, DivideFunctionTest,
LongFieldsTest, LegacyFieldFacetTest, AbsoluteValueFunctionTest, AndFunctionTest, CeilingFunctionTest,
LegacyAbstractAnalyticsCloudTest, DateFieldsTest, CastingFloatValueStreamTest, DateMathFunctionTest,
GTEFunctionTest, LTFunctionTest, PivotFacetTest, LegacyNoFacetCloudTest, ExistsFunctionTest,
CastingDateValueStreamTest, SubtractFunctionTest, LegacyFacetSortingTest, CastingDoubleValueStreamTest,
QueryFacetTest, ValueFacetTest, OrFunctionTest, RoundFunctionTest, LegacyExpressionTest, LegacyFunctionTest,
LegacyFieldFacetExtrasCloudTest]
   [junit4]   2> NOTE: reproduce with: ant test  -Dtestcase=LegacyFieldFacetExtrasCloudTest
-Dtests.seed=5D4F2E938EE19998 -Dtests.slow=true -Dtests.locale=so-DJ -Dtests.timezone=America/Indiana/Vevay
-Dtests.asserts=true -Dtests.file.encoding=ISO-8859-1
   [junit4] ERROR   0.00s J1 | LegacyFieldFacetExtrasCloudTest (suite) <<<
   [junit4]    > Throwable #1: java.lang.AssertionError: Could not find collection:collection1
   [junit4]    > 	at __randomizedtesting.SeedInfo.seed([5D4F2E938EE19998]:0)
   [junit4]    > 	at org.apache.solr.cloud.AbstractDistribZkTestBase.waitForRecoveriesToFinish(AbstractDistribZkTestBase.java:155)
   [junit4]    > 	at org.apache.solr.analytics.legacy.LegacyAbstractAnalyticsCloudTest.setupCollection(LegacyAbstractAnalyticsCloudTest.java:51)
   [junit4]    > 	at java.base/jdk.internal.reflect.NativeMethodAccessorImpl.invoke0(Native
Method)
   [junit4]    > 	at java.base/jdk.internal.reflect.NativeMethodAccessorImpl.invoke(NativeMethodAccessorImpl.java:62)
   [junit4]    > 	at java.base/jdk.internal.reflect.DelegatingMethodAccessorImpl.invoke(DelegatingMethodAccessorImpl.java:43)
   [junit4]    > 	at java.base/java.lang.reflect.Method.invoke(Method.java:564)
   [junit4]    > 	at java.base/java.lang.Thread.run(Thread.java:844)
   [junit4] Completed [78/78 (1!)] on J1 in 34.85s, 0 tests, 1 failure <<< FAILURES!

[...truncated 37608 lines...]

Mime
View raw message