lucene-dev mailing list archives

Site index · List index
Message view « Date » · « Thread »
Top « Date » · « Thread »
From Policeman Jenkins Server <jenk...@thetaphi.de>
Subject [JENKINS] Lucene-Solr-master-Solaris (64bit/jdk1.8.0) - Build # 1577 - Unstable!
Date Wed, 20 Dec 2017 16:46:49 GMT
Build: https://jenkins.thetaphi.de/job/Lucene-Solr-master-Solaris/1577/
Java: 64bit/jdk1.8.0 -XX:+UseCompressedOops -XX:+UseSerialGC

2 tests failed.
FAILED:  org.apache.solr.cloud.TestStressInPlaceUpdates.stressTest

Error Message:
Captured an uncaught exception in thread: Thread[id=7478, name=WRITER11, state=RUNNABLE, group=TGRP-TestStressInPlaceUpdates]

Stack Trace:
com.carrotsearch.randomizedtesting.UncaughtExceptionError: Captured an uncaught exception in thread: Thread[id=7478, name=WRITER11, state=RUNNABLE, group=TGRP-TestStressInPlaceUpdates]
Caused by: java.lang.RuntimeException: org.apache.solr.client.solrj.SolrServerException: Timeout occured while waiting response from server at: http://127.0.0.1:42457/collection1
	at __randomizedtesting.SeedInfo.seed([C6E4D9108527E444]:0)
	at org.apache.solr.cloud.TestStressInPlaceUpdates$1.run(TestStressInPlaceUpdates.java:306)
Caused by: org.apache.solr.client.solrj.SolrServerException: Timeout occured while waiting response from server at: http://127.0.0.1:42457/collection1
	at org.apache.solr.client.solrj.impl.HttpSolrClient.executeMethod(HttpSolrClient.java:654)
	at org.apache.solr.client.solrj.impl.HttpSolrClient.request(HttpSolrClient.java:255)
	at org.apache.solr.client.solrj.impl.HttpSolrClient.request(HttpSolrClient.java:244)
	at org.apache.solr.client.solrj.SolrRequest.process(SolrRequest.java:194)
	at org.apache.solr.client.solrj.SolrRequest.process(SolrRequest.java:211)
	at org.apache.solr.cloud.TestStressInPlaceUpdates.deleteDocAndGetVersion(TestStressInPlaceUpdates.java:570)
	at org.apache.solr.cloud.TestStressInPlaceUpdates$1.run(TestStressInPlaceUpdates.java:218)
Caused by: java.net.SocketTimeoutException: Read timed out
	at java.net.SocketInputStream.socketRead0(Native Method)
	at java.net.SocketInputStream.socketRead(SocketInputStream.java:116)
	at java.net.SocketInputStream.read(SocketInputStream.java:171)
	at java.net.SocketInputStream.read(SocketInputStream.java:141)
	at org.apache.http.impl.io.SessionInputBufferImpl.streamRead(SessionInputBufferImpl.java:137)
	at org.apache.http.impl.io.SessionInputBufferImpl.fillBuffer(SessionInputBufferImpl.java:153)
	at org.apache.http.impl.io.SessionInputBufferImpl.readLine(SessionInputBufferImpl.java:282)
	at org.apache.http.impl.conn.DefaultHttpResponseParser.parseHead(DefaultHttpResponseParser.java:138)
	at org.apache.http.impl.conn.DefaultHttpResponseParser.parseHead(DefaultHttpResponseParser.java:56)
	at org.apache.http.impl.io.AbstractMessageParser.parse(AbstractMessageParser.java:259)
	at org.apache.http.impl.DefaultBHttpClientConnection.receiveResponseHeader(DefaultBHttpClientConnection.java:163)
	at org.apache.http.impl.conn.CPoolProxy.receiveResponseHeader(CPoolProxy.java:165)
	at org.apache.http.protocol.HttpRequestExecutor.doReceiveResponse(HttpRequestExecutor.java:273)
	at org.apache.http.protocol.HttpRequestExecutor.execute(HttpRequestExecutor.java:125)
	at org.apache.http.impl.execchain.MainClientExec.execute(MainClientExec.java:272)
	at org.apache.http.impl.execchain.ProtocolExec.execute(ProtocolExec.java:185)
	at org.apache.http.impl.execchain.RetryExec.execute(RetryExec.java:89)
	at org.apache.http.impl.execchain.RedirectExec.execute(RedirectExec.java:111)
	at org.apache.http.impl.client.InternalHttpClient.doExecute(InternalHttpClient.java:185)
	at org.apache.http.impl.client.CloseableHttpClient.execute(CloseableHttpClient.java:83)
	at org.apache.http.impl.client.CloseableHttpClient.execute(CloseableHttpClient.java:56)
	at org.apache.solr.client.solrj.impl.HttpSolrClient.executeMethod(HttpSolrClient.java:542)
	... 6 more


FAILED:  org.apache.solr.update.processor.TimeRoutedAliasUpdateProcessorTest.test

Error Message:
expected:<1> but was:<0>

Stack Trace:
java.lang.AssertionError: expected:<1> but was:<0>
	at __randomizedtesting.SeedInfo.seed([C6E4D9108527E444:4EB0E6CA2BDB89BC]:0)
	at org.junit.Assert.fail(Assert.java:93)
	at org.junit.Assert.failNotEquals(Assert.java:647)
	at org.junit.Assert.assertEquals(Assert.java:128)
	at org.junit.Assert.assertEquals(Assert.java:472)
	at org.junit.Assert.assertEquals(Assert.java:456)
	at org.apache.solr.update.processor.TimeRoutedAliasUpdateProcessorTest.assertInvariants(TimeRoutedAliasUpdateProcessorTest.java:245)
	at org.apache.solr.update.processor.TimeRoutedAliasUpdateProcessorTest.test(TimeRoutedAliasUpdateProcessorTest.java:123)
	at sun.reflect.NativeMethodAccessorImpl.invoke0(Native Method)
	at sun.reflect.NativeMethodAccessorImpl.invoke(NativeMethodAccessorImpl.java:62)
	at sun.reflect.DelegatingMethodAccessorImpl.invoke(DelegatingMethodAccessorImpl.java:43)
	at java.lang.reflect.Method.invoke(Method.java:498)
	at com.carrotsearch.randomizedtesting.RandomizedRunner.invoke(RandomizedRunner.java:1737)
	at com.carrotsearch.randomizedtesting.RandomizedRunner$8.evaluate(RandomizedRunner.java:934)
	at com.carrotsearch.randomizedtesting.RandomizedRunner$9.evaluate(RandomizedRunner.java:970)
	at com.carrotsearch.randomizedtesting.RandomizedRunner$10.evaluate(RandomizedRunner.java:984)
	at com.carrotsearch.randomizedtesting.rules.SystemPropertiesRestoreRule$1.evaluate(SystemPropertiesRestoreRule.java:57)
	at org.apache.lucene.util.TestRuleSetupTeardownChained$1.evaluate(TestRuleSetupTeardownChained.java:49)
	at org.apache.lucene.util.AbstractBeforeAfterRule$1.evaluate(AbstractBeforeAfterRule.java:45)
	at org.apache.lucene.util.TestRuleThreadAndTestName$1.evaluate(TestRuleThreadAndTestName.java:48)
	at org.apache.lucene.util.TestRuleIgnoreAfterMaxFailures$1.evaluate(TestRuleIgnoreAfterMaxFailures.java:64)
	at org.apache.lucene.util.TestRuleMarkFailure$1.evaluate(TestRuleMarkFailure.java:47)
	at com.carrotsearch.randomizedtesting.rules.StatementAdapter.evaluate(StatementAdapter.java:36)
	at com.carrotsearch.randomizedtesting.ThreadLeakControl$StatementRunner.run(ThreadLeakControl.java:368)
	at com.carrotsearch.randomizedtesting.ThreadLeakControl.forkTimeoutingTask(ThreadLeakControl.java:817)
	at com.carrotsearch.randomizedtesting.ThreadLeakControl$3.evaluate(ThreadLeakControl.java:468)
	at com.carrotsearch.randomizedtesting.RandomizedRunner.runSingleTest(RandomizedRunner.java:943)
	at com.carrotsearch.randomizedtesting.RandomizedRunner$5.evaluate(RandomizedRunner.java:829)
	at com.carrotsearch.randomizedtesting.RandomizedRunner$6.evaluate(RandomizedRunner.java:879)
	at com.carrotsearch.randomizedtesting.RandomizedRunner$7.evaluate(RandomizedRunner.java:890)
	at com.carrotsearch.randomizedtesting.rules.StatementAdapter.evaluate(StatementAdapter.java:36)
	at com.carrotsearch.randomizedtesting.rules.SystemPropertiesRestoreRule$1.evaluate(SystemPropertiesRestoreRule.java:57)
	at org.apache.lucene.util.AbstractBeforeAfterRule$1.evaluate(AbstractBeforeAfterRule.java:45)
	at com.carrotsearch.randomizedtesting.rules.StatementAdapter.evaluate(StatementAdapter.java:36)
	at org.apache.lucene.util.TestRuleStoreClassName$1.evaluate(TestRuleStoreClassName.java:41)
	at com.carrotsearch.randomizedtesting.rules.NoShadowingOrOverridesOnMethodsRule$1.evaluate(NoShadowingOrOverridesOnMethodsRule.java:40)
	at com.carrotsearch.randomizedtesting.rules.NoShadowingOrOverridesOnMethodsRule$1.evaluate(NoShadowingOrOverridesOnMethodsRule.java:40)
	at com.carrotsearch.randomizedtesting.rules.StatementAdapter.evaluate(StatementAdapter.java:36)
	at com.carrotsearch.randomizedtesting.rules.StatementAdapter.evaluate(StatementAdapter.java:36)
	at com.carrotsearch.randomizedtesting.rules.StatementAdapter.evaluate(StatementAdapter.java:36)
	at org.apache.lucene.util.TestRuleAssertionsRequired$1.evaluate(TestRuleAssertionsRequired.java:53)
	at org.apache.lucene.util.TestRuleMarkFailure$1.evaluate(TestRuleMarkFailure.java:47)
	at org.apache.lucene.util.TestRuleIgnoreAfterMaxFailures$1.evaluate(TestRuleIgnoreAfterMaxFailures.java:64)
	at org.apache.lucene.util.TestRuleIgnoreTestSuites$1.evaluate(TestRuleIgnoreTestSuites.java:54)
	at com.carrotsearch.randomizedtesting.rules.StatementAdapter.evaluate(StatementAdapter.java:36)
	at com.carrotsearch.randomizedtesting.ThreadLeakControl$StatementRunner.run(ThreadLeakControl.java:368)
	at java.lang.Thread.run(Thread.java:748)




Build Log:
[...truncated 11848 lines...]
   [junit4] Suite: org.apache.solr.update.processor.TimeRoutedAliasUpdateProcessorTest
   [junit4]   2> 392491 INFO  (SUITE-TimeRoutedAliasUpdateProcessorTest-seed#[C6E4D9108527E444]-worker) [    ] o.a.s.SolrTestCaseJ4 SecureRandom sanity checks: test.solr.allowed.securerandom=null & java.security.egd=file:/dev/./urandom
   [junit4]   2> Creating dataDir: /export/home/jenkins/workspace/Lucene-Solr-master-Solaris/solr/build/solr-core/test/J0/temp/solr.update.processor.TimeRoutedAliasUpdateProcessorTest_C6E4D9108527E444-001/init-core-data-001
   [junit4]   2> 392492 WARN  (SUITE-TimeRoutedAliasUpdateProcessorTest-seed#[C6E4D9108527E444]-worker) [    ] o.a.s.SolrTestCaseJ4 startTrackingSearchers: numOpens=2 numCloses=2
   [junit4]   2> 392492 INFO  (SUITE-TimeRoutedAliasUpdateProcessorTest-seed#[C6E4D9108527E444]-worker) [    ] o.a.s.SolrTestCaseJ4 Using PointFields (NUMERIC_POINTS_SYSPROP=true) w/NUMERIC_DOCVALUES_SYSPROP=true
   [junit4]   2> 392494 INFO  (SUITE-TimeRoutedAliasUpdateProcessorTest-seed#[C6E4D9108527E444]-worker) [    ] o.a.s.SolrTestCaseJ4 Randomized ssl (true) and clientAuth (false) via: @org.apache.solr.util.RandomizeSSL(reason=, value=NaN, ssl=NaN, clientAuth=NaN)
   [junit4]   2> 392494 INFO  (SUITE-TimeRoutedAliasUpdateProcessorTest-seed#[C6E4D9108527E444]-worker) [    ] o.a.s.c.MiniSolrCloudCluster Starting cluster of 2 servers in /export/home/jenkins/workspace/Lucene-Solr-master-Solaris/solr/build/solr-core/test/J0/temp/solr.update.processor.TimeRoutedAliasUpdateProcessorTest_C6E4D9108527E444-001/tempDir-001
   [junit4]   2> 392495 INFO  (SUITE-TimeRoutedAliasUpdateProcessorTest-seed#[C6E4D9108527E444]-worker) [    ] o.a.s.c.ZkTestServer STARTING ZK TEST SERVER
   [junit4]   2> 392495 INFO  (Thread-1057) [    ] o.a.s.c.ZkTestServer client port:0.0.0.0/0.0.0.0:0
   [junit4]   2> 392495 INFO  (Thread-1057) [    ] o.a.s.c.ZkTestServer Starting server
   [junit4]   2> 392496 ERROR (Thread-1057) [    ] o.a.z.s.ZooKeeperServer ZKShutdownHandler is not registered, so ZooKeeper server won't take any action on ERROR or SHUTDOWN server state changes
   [junit4]   2> 392595 INFO  (SUITE-TimeRoutedAliasUpdateProcessorTest-seed#[C6E4D9108527E444]-worker) [    ] o.a.s.c.ZkTestServer start zk server on port:50619
   [junit4]   2> 392598 INFO  (zkConnectionManagerCallback-869-thread-1) [    ] o.a.s.c.c.ConnectionManager zkClient has connected
   [junit4]   2> 392605 INFO  (jetty-launcher-866-thread-1) [    ] o.e.j.s.Server jetty-9.3.20.v20170531
   [junit4]   2> 392606 INFO  (jetty-launcher-866-thread-2) [    ] o.e.j.s.Server jetty-9.3.20.v20170531
   [junit4]   2> 392607 INFO  (jetty-launcher-866-thread-1) [    ] o.e.j.s.h.ContextHandler Started o.e.j.s.ServletContextHandler@1ee19e1e{/solr,null,AVAILABLE}
   [junit4]   2> 392607 INFO  (jetty-launcher-866-thread-2) [    ] o.e.j.s.h.ContextHandler Started o.e.j.s.ServletContextHandler@155b61{/solr,null,AVAILABLE}
   [junit4]   2> 392608 INFO  (jetty-launcher-866-thread-1) [    ] o.e.j.s.AbstractConnector Started ServerConnector@717537cf{SSL,[ssl, http/1.1]}{127.0.0.1:57883}
   [junit4]   2> 392608 INFO  (jetty-launcher-866-thread-1) [    ] o.e.j.s.Server Started @395301ms
   [junit4]   2> 392608 INFO  (jetty-launcher-866-thread-1) [    ] o.a.s.c.s.e.JettySolrRunner Jetty properties: {hostContext=/solr, hostPort=57883}
   [junit4]   2> 392608 ERROR (jetty-launcher-866-thread-1) [    ] o.a.s.u.StartupLoggingUtils Missing Java Option solr.log.dir. Logging may be missing or incomplete.
   [junit4]   2> 392608 INFO  (jetty-launcher-866-thread-2) [    ] o.e.j.s.AbstractConnector Started ServerConnector@214ef077{SSL,[ssl, http/1.1]}{127.0.0.1:34683}
   [junit4]   2> 392608 INFO  (jetty-launcher-866-thread-2) [    ] o.e.j.s.Server Started @395301ms
   [junit4]   2> 392608 INFO  (jetty-launcher-866-thread-1) [    ] o.a.s.s.SolrDispatchFilter  ___      _       Welcome to Apache Solr™ version 8.0.0
   [junit4]   2> 392608 INFO  (jetty-launcher-866-thread-2) [    ] o.a.s.c.s.e.JettySolrRunner Jetty properties: {hostContext=/solr, hostPort=34683}
   [junit4]   2> 392608 INFO  (jetty-launcher-866-thread-1) [    ] o.a.s.s.SolrDispatchFilter / __| ___| |_ _   Starting in cloud mode on port null
   [junit4]   2> 392608 INFO  (jetty-launcher-866-thread-1) [    ] o.a.s.s.SolrDispatchFilter \__ \/ _ \ | '_|  Install dir: null
   [junit4]   2> 392608 INFO  (jetty-launcher-866-thread-1) [    ] o.a.s.s.SolrDispatchFilter |___/\___/_|_|    Start time: 2017-12-20T15:22:45.799Z
   [junit4]   2> 392608 ERROR (jetty-launcher-866-thread-2) [    ] o.a.s.u.StartupLoggingUtils Missing Java Option solr.log.dir. Logging may be missing or incomplete.
   [junit4]   2> 392608 INFO  (jetty-launcher-866-thread-2) [    ] o.a.s.s.SolrDispatchFilter  ___      _       Welcome to Apache Solr™ version 8.0.0
   [junit4]   2> 392608 INFO  (jetty-launcher-866-thread-2) [    ] o.a.s.s.SolrDispatchFilter / __| ___| |_ _   Starting in cloud mode on port null
   [junit4]   2> 392609 INFO  (jetty-launcher-866-thread-2) [    ] o.a.s.s.SolrDispatchFilter \__ \/ _ \ | '_|  Install dir: null
   [junit4]   2> 392609 INFO  (jetty-launcher-866-thread-2) [    ] o.a.s.s.SolrDispatchFilter |___/\___/_|_|    Start time: 2017-12-20T15:22:45.800Z
   [junit4]   2> 392613 INFO  (zkConnectionManagerCallback-873-thread-1) [    ] o.a.s.c.c.ConnectionManager zkClient has connected
   [junit4]   2> 392614 INFO  (zkConnectionManagerCallback-872-thread-1) [    ] o.a.s.c.c.ConnectionManager zkClient has connected
   [junit4]   2> 392614 INFO  (jetty-launcher-866-thread-2) [    ] o.a.s.s.SolrDispatchFilter solr.xml found in ZooKeeper. Loading...
   [junit4]   2> 392617 INFO  (jetty-launcher-866-thread-1) [    ] o.a.s.s.SolrDispatchFilter solr.xml found in ZooKeeper. Loading...
   [junit4]   2> 392650 INFO  (jetty-launcher-866-thread-2) [    ] o.a.s.c.ZkContainer Zookeeper client=127.0.0.1:50619/solr
   [junit4]   2> 392653 INFO  (zkConnectionManagerCallback-877-thread-1) [    ] o.a.s.c.c.ConnectionManager zkClient has connected
   [junit4]   2> 392655 INFO  (jetty-launcher-866-thread-1) [    ] o.a.s.c.ZkContainer Zookeeper client=127.0.0.1:50619/solr
   [junit4]   2> 392657 INFO  (zkConnectionManagerCallback-881-thread-1) [    ] o.a.s.c.c.ConnectionManager zkClient has connected
   [junit4]   2> 392658 INFO  (zkConnectionManagerCallback-883-thread-1-processing-n:127.0.0.1:34683_solr) [n:127.0.0.1:34683_solr    ] o.a.s.c.c.ConnectionManager zkClient has connected
   [junit4]   2> 392662 INFO  (zkConnectionManagerCallback-885-thread-1-processing-n:127.0.0.1:57883_solr) [n:127.0.0.1:57883_solr    ] o.a.s.c.c.ConnectionManager zkClient has connected
   [junit4]   2> 392691 INFO  (jetty-launcher-866-thread-1) [n:127.0.0.1:57883_solr    ] o.a.s.c.Overseer Overseer (id=null) closing
   [junit4]   2> 392691 INFO  (jetty-launcher-866-thread-1) [n:127.0.0.1:57883_solr    ] o.a.s.c.OverseerElectionContext I am going to be the leader 127.0.0.1:57883_solr
   [junit4]   2> 392693 INFO  (jetty-launcher-866-thread-1) [n:127.0.0.1:57883_solr    ] o.a.s.c.Overseer Overseer (id=99207306653663238-127.0.0.1:57883_solr-n_0000000000) starting
   [junit4]   2> 392703 INFO  (jetty-launcher-866-thread-1) [n:127.0.0.1:57883_solr    ] o.a.s.c.ZkController Register node as live in ZooKeeper:/live_nodes/127.0.0.1:57883_solr
   [junit4]   2> 392738 INFO  (zkCallback-884-thread-1-processing-n:127.0.0.1:57883_solr) [n:127.0.0.1:57883_solr    ] o.a.s.c.c.ZkStateReader Updated live nodes from ZooKeeper... (0) -> (1)
   [junit4]   2> 392809 INFO  (jetty-launcher-866-thread-2) [n:127.0.0.1:34683_solr    ] o.a.s.c.c.ZkStateReader Updated live nodes from ZooKeeper... (0) -> (1)
   [junit4]   2> 392812 INFO  (jetty-launcher-866-thread-2) [n:127.0.0.1:34683_solr    ] o.a.s.c.Overseer Overseer (id=null) closing
   [junit4]   2> 392814 INFO  (jetty-launcher-866-thread-2) [n:127.0.0.1:34683_solr    ] o.a.s.c.ZkController Register node as live in ZooKeeper:/live_nodes/127.0.0.1:34683_solr
   [junit4]   2> 392818 INFO  (zkCallback-884-thread-1-processing-n:127.0.0.1:57883_solr) [n:127.0.0.1:57883_solr    ] o.a.s.c.c.ZkStateReader Updated live nodes from ZooKeeper... (1) -> (2)
   [junit4]   2> 392818 INFO  (zkCallback-882-thread-1-processing-n:127.0.0.1:34683_solr) [n:127.0.0.1:34683_solr    ] o.a.s.c.c.ZkStateReader Updated live nodes from ZooKeeper... (1) -> (2)
   [junit4]   2> 392864 INFO  (jetty-launcher-866-thread-1) [n:127.0.0.1:57883_solr    ] o.a.s.m.r.SolrJmxReporter JMX monitoring for 'solr_57883.solr.node' (registry 'solr.node') enabled at server: com.sun.jmx.mbeanserver.JmxMBeanServer@e8ccf12
   [junit4]   2> 392869 INFO  (jetty-launcher-866-thread-1) [n:127.0.0.1:57883_solr    ] o.a.s.m.r.SolrJmxReporter JMX monitoring for 'solr_57883.solr.jvm' (registry 'solr.jvm') enabled at server: com.sun.jmx.mbeanserver.JmxMBeanServer@e8ccf12
   [junit4]   2> 392869 INFO  (jetty-launcher-866-thread-1) [n:127.0.0.1:57883_solr    ] o.a.s.m.r.SolrJmxReporter JMX monitoring for 'solr_57883.solr.jetty' (registry 'solr.jetty') enabled at server: com.sun.jmx.mbeanserver.JmxMBeanServer@e8ccf12
   [junit4]   2> 392870 INFO  (jetty-launcher-866-thread-1) [n:127.0.0.1:57883_solr    ] o.a.s.c.CorePropertiesLocator Found 0 core definitions underneath /export/home/jenkins/workspace/Lucene-Solr-master-Solaris/solr/build/solr-core/test/J0/temp/solr.update.processor.TimeRoutedAliasUpdateProcessorTest_C6E4D9108527E444-001/tempDir-001/node1/.
   [junit4]   2> 392929 INFO  (jetty-launcher-866-thread-2) [n:127.0.0.1:34683_solr    ] o.a.s.m.r.SolrJmxReporter JMX monitoring for 'solr_34683.solr.node' (registry 'solr.node') enabled at server: com.sun.jmx.mbeanserver.JmxMBeanServer@e8ccf12
   [junit4]   2> 392934 INFO  (jetty-launcher-866-thread-2) [n:127.0.0.1:34683_solr    ] o.a.s.m.r.SolrJmxReporter JMX monitoring for 'solr_34683.solr.jvm' (registry 'solr.jvm') enabled at server: com.sun.jmx.mbeanserver.JmxMBeanServer@e8ccf12
   [junit4]   2> 392934 INFO  (jetty-launcher-866-thread-2) [n:127.0.0.1:34683_solr    ] o.a.s.m.r.SolrJmxReporter JMX monitoring for 'solr_34683.solr.jetty' (registry 'solr.jetty') enabled at server: com.sun.jmx.mbeanserver.JmxMBeanServer@e8ccf12
   [junit4]   2> 392935 INFO  (jetty-launcher-866-thread-2) [n:127.0.0.1:34683_solr    ] o.a.s.c.CorePropertiesLocator Found 0 core definitions underneath /export/home/jenkins/workspace/Lucene-Solr-master-Solaris/solr/build/solr-core/test/J0/temp/solr.update.processor.TimeRoutedAliasUpdateProcessorTest_C6E4D9108527E444-001/tempDir-001/node2/.
   [junit4]   2> 392969 INFO  (zkConnectionManagerCallback-891-thread-1) [    ] o.a.s.c.c.ConnectionManager zkClient has connected
   [junit4]   2> 392989 INFO  (TEST-TimeRoutedAliasUpdateProcessorTest.testParse-seed#[C6E4D9108527E444]) [    ] o.a.s.SolrTestCaseJ4 ###Starting testParse
   [junit4]   2> 392991 INFO  (TEST-TimeRoutedAliasUpdateProcessorTest.testParse-seed#[C6E4D9108527E444]) [    ] o.a.s.SolrTestCaseJ4 ###Ending testParse
   [junit4]   2> 393007 INFO  (TEST-TimeRoutedAliasUpdateProcessorTest.test-seed#[C6E4D9108527E444]) [    ] o.a.s.SolrTestCaseJ4 ###Starting test
   [junit4]   2> 393009 INFO  (zkConnectionManagerCallback-896-thread-1) [    ] o.a.s.c.c.ConnectionManager zkClient has connected
   [junit4]   2> 393010 INFO  (TEST-TimeRoutedAliasUpdateProcessorTest.test-seed#[C6E4D9108527E444]) [    ] o.a.s.c.c.ZkStateReader Updated live nodes from ZooKeeper... (0) -> (2)
   [junit4]   2> 393011 INFO  (TEST-TimeRoutedAliasUpdateProcessorTest.test-seed#[C6E4D9108527E444]) [    ] o.a.s.c.s.i.ZkClientClusterStateProvider Cluster at 127.0.0.1:50619/solr ready
   [junit4]   2> 393026 INFO  (qtp1045704224-4153) [n:127.0.0.1:34683_solr    ] o.a.s.h.a.CollectionsHandler Invoked Collection Action :create with params pullReplicas=0&replicationFactor=1&name=timeConfig&nrtReplicas=1&action=CREATE&numShards=1&tlogReplicas=0&wt=javabin&version=2 and sendToOCPQueue=true
   [junit4]   2> 393029 INFO  (OverseerThreadFactory-1399-thread-1-processing-n:127.0.0.1:57883_solr) [n:127.0.0.1:57883_solr    ] o.a.s.c.CreateCollectionCmd Create collection timeConfig
   [junit4]   2> 393029 INFO  (OverseerThreadFactory-1399-thread-1-processing-n:127.0.0.1:57883_solr) [n:127.0.0.1:57883_solr    ] o.a.s.c.CreateCollectionCmd Only _default config set found, using it.
   [junit4]   2> 393031 INFO  (OverseerThreadFactory-1399-thread-1-processing-n:127.0.0.1:57883_solr) [n:127.0.0.1:57883_solr    ] o.a.s.c.c.ZkConfigManager Copying zk node /configs/_default/protwords.txt to /configs/timeConfig/protwords.txt
   [junit4]   2> 393033 INFO  (OverseerThreadFactory-1399-thread-1-processing-n:127.0.0.1:57883_solr) [n:127.0.0.1:57883_solr    ] o.a.s.c.c.ZkConfigManager Copying zk node /configs/_default/managed-schema to /configs/timeConfig/managed-schema
   [junit4]   2> 393035 INFO  (OverseerThreadFactory-1399-thread-1-processing-n:127.0.0.1:57883_solr) [n:127.0.0.1:57883_solr    ] o.a.s.c.c.ZkConfigManager Copying zk node /configs/_default/solrconfig.xml to /configs/timeConfig/solrconfig.xml
   [junit4]   2> 393037 INFO  (OverseerThreadFactory-1399-thread-1-processing-n:127.0.0.1:57883_solr) [n:127.0.0.1:57883_solr    ] o.a.s.c.c.ZkConfigManager Copying zk node /configs/_default/synonyms.txt to /configs/timeConfig/synonyms.txt
   [junit4]   2> 393039 INFO  (OverseerThreadFactory-1399-thread-1-processing-n:127.0.0.1:57883_solr) [n:127.0.0.1:57883_solr    ] o.a.s.c.c.ZkConfigManager Copying zk node /configs/_default/stopwords.txt to /configs/timeConfig/stopwords.txt
   [junit4]   2> 393042 INFO  (OverseerThreadFactory-1399-thread-1-processing-n:127.0.0.1:57883_solr) [n:127.0.0.1:57883_solr    ] o.a.s.c.c.ZkConfigManager Copying zk node /configs/_default/params.json to /configs/timeConfig/params.json
   [junit4]   2> 393044 INFO  (OverseerThreadFactory-1399-thread-1-processing-n:127.0.0.1:57883_solr) [n:127.0.0.1:57883_solr    ] o.a.s.c.c.ZkConfigManager Copying zk node /configs/_default/lang/contractions_it.txt to /configs/timeConfig/lang/contractions_it.txt
   [junit4]   2> 393046 INFO  (OverseerThreadFactory-1399-thread-1-processing-n:127.0.0.1:57883_solr) [n:127.0.0.1:57883_solr    ] o.a.s.c.c.ZkConfigManager Copying zk node /configs/_default/lang/stemdict_nl.txt to /configs/timeConfig/lang/stemdict_nl.txt
   [junit4]   2> 393049 INFO  (OverseerThreadFactory-1399-thread-1-processing-n:127.0.0.1:57883_solr) [n:127.0.0.1:57883_solr    ] o.a.s.c.c.ZkConfigManager Copying zk node /configs/_default/lang/stopwords_no.txt to /configs/timeConfig/lang/stopwords_no.txt
   [junit4]   2> 393051 INFO  (OverseerThreadFactory-1399-thread-1-processing-n:127.0.0.1:57883_solr) [n:127.0.0.1:57883_solr    ] o.a.s.c.c.ZkConfigManager Copying zk node /configs/_default/lang/stopwords_hy.txt to /configs/timeConfig/lang/stopwords_hy.txt
   [junit4]   2> 393053 INFO  (OverseerThreadFactory-1399-thread-1-processing-n:127.0.0.1:57883_solr) [n:127.0.0.1:57883_solr    ] o.a.s.c.c.ZkConfigManager Copying zk node /configs/_default/lang/contractions_ca.txt to /configs/timeConfig/lang/contractions_ca.txt
   [junit4]   2> 393055 INFO  (OverseerThreadFactory-1399-thread-1-processing-n:127.0.0.1:57883_solr) [n:127.0.0.1:57883_solr    ] o.a.s.c.c.ZkConfigManager Copying zk node /configs/_default/lang/stopwords_id.txt to /configs/timeConfig/lang/stopwords_id.txt
   [junit4]   2> 393057 INFO  (OverseerThreadFactory-1399-thread-1-processing-n:127.0.0.1:57883_solr) [n:127.0.0.1:57883_solr    ] o.a.s.c.c.ZkConfigManager Copying zk node /configs/_default/lang/stopwords_ga.txt to /configs/timeConfig/lang/stopwords_ga.txt
   [junit4]   2> 393059 INFO  (OverseerThreadFactory-1399-thread-1-processing-n:127.0.0.1:57883_solr) [n:127.0.0.1:57883_solr    ] o.a.s.c.c.ZkConfigManager Copying zk node /configs/_default/lang/stopwords_da.txt to /configs/timeConfig/lang/stopwords_da.txt
   [junit4]   2> 393061 INFO  (OverseerThreadFactory-1399-thread-1-processing-n:127.0.0.1:57883_solr) [n:127.0.0.1:57883_solr    ] o.a.s.c.c.ZkConfigManager Copying zk node /configs/_default/lang/stopwords_hi.txt to /configs/timeConfig/lang/stopwords_hi.txt
   [junit4]   2> 393063 INFO  (OverseerThreadFactory-1399-thread-1-processing-n:127.0.0.1:57883_solr) [n:127.0.0.1:57883_solr    ] o.a.s.c.c.ZkConfigManager Copying zk node /configs/_default/lang/stopwords_ja.txt to /configs/timeConfig/lang/stopwords_ja.txt
   [junit4]   2> 393065 INFO  (OverseerThreadFactory-1399-thread-1-processing-n:127.0.0.1:57883_solr) [n:127.0.0.1:57883_solr    ] o.a.s.c.c.ZkConfigManager Copying zk node /configs/_default/lang/stopwords_pt.txt to /configs/timeConfig/lang/stopwords_pt.txt
   [junit4]   2> 393067 INFO  (OverseerThreadFactory-1399-thread-1-processing-n:127.0.0.1:57883_solr) [n:127.0.0.1:57883_solr    ] o.a.s.c.c.ZkConfigManager Copying zk node /configs/_default/lang/stopwords_hu.txt to /configs/timeConfig/lang/stopwords_hu.txt
   [junit4]   2> 393069 INFO  (OverseerThreadFactory-1399-thread-1-processing-n:127.0.0.1:57883_solr) [n:127.0.0.1:57883_solr    ] o.a.s.c.c.ZkConfigManager Copying zk node /configs/_default/lang/stopwords_el.txt to /configs/timeConfig/lang/stopwords_el.txt
   [junit4]   2> 393071 INFO  (OverseerThreadFactory-1399-thread-1-processing-n:127.0.0.1:57883_solr) [n:127.0.0.1:57883_solr    ] o.a.s.c.c.ZkConfigManager Copying zk node /configs/_default/lang/stopwords_ru.txt to /configs/timeConfig/lang/stopwords_ru.txt
   [junit4]   2> 393073 INFO  (OverseerThreadFactory-1399-thread-1-processing-n:127.0.0.1:57883_solr) [n:127.0.0.1:57883_solr    ] o.a.s.c.c.ZkConfigManager Copying zk node /configs/_default/lang/stopwords_tr.txt to /configs/timeConfig/lang/stopwords_tr.txt
   [junit4]   2> 393075 INFO  (OverseerThreadFactory-1399-thread-1-processing-n:127.0.0.1:57883_solr) [n:127.0.0.1:57883_solr    ] o.a.s.c.c.ZkConfigManager Copying zk node /configs/_default/lang/stopwords_ar.txt to /configs/timeConfig/lang/stopwords_ar.txt
   [junit4]   2> 393077 INFO  (OverseerThreadFactory-1399-thread-1-processing-n:127.0.0.1:57883_solr) [n:127.0.0.1:57883_solr    ] o.a.s.c.c.ZkConfigManager Copying zk node /configs/_default/lang/userdict_ja.txt to /configs/timeConfig/lang/userdict_ja.txt
   [junit4]   2> 393080 INFO  (OverseerThreadFactory-1399-thread-1-processing-n:127.0.0.1:57883_solr) [n:127.0.0.1:57883_solr    ] o.a.s.c.c.ZkConfigManager Copying zk node /configs/_default/lang/stopwords_eu.txt to /configs/timeConfig/lang/stopwords_eu.txt
   [junit4]   2> 393082 INFO  (OverseerThreadFactory-1399-thread-1-processing-n:127.0.0.1:57883_solr) [n:127.0.0.1:57883_solr    ] o.a.s.c.c.ZkConfigManager Copying zk node /configs/_default/lang/stopwords_it.txt to /configs/timeConfig/lang/stopwords_it.txt
   [junit4]   2> 393084 INFO  (OverseerThreadFactory-1399-thread-1-processing-n:127.0.0.1:57883_solr) [n:127.0.0.1:57883_solr    ] o.a.s.c.c.ZkConfigManager Copying zk node /configs/_default/lang/stopwords_cz.txt to /configs/timeConfig/lang/stopwords_cz.txt
   [junit4]   2> 393086 INFO  (OverseerThreadFactory-1399-thread-1-processing-n:127.0.0.1:57883_solr) [n:127.0.0.1:57883_solr    ] o.a.s.c.c.ZkConfigManager Copying zk node /configs/_default/lang/stoptags_ja.txt to /configs/timeConfig/lang/stoptags_ja.txt
   [junit4]   2> 393088 INFO  (OverseerThreadFactory-1399-thread-1-processing-n:127.0.0.1:57883_solr) [n:127.0.0.1:57883_solr    ] o.a.s.c.c.ZkConfigManager Copying zk node /configs/_default/lang/contractions_fr.txt to /configs/timeConfig/lang/contractions_fr.txt
   [junit4]   2> 393090 INFO  (OverseerThreadFactory-1399-thread-1-processing-n:127.0.0.1:57883_solr) [n:127.0.0.1:57883_solr    ] o.a.s.c.c.ZkConfigManager Copying zk node /configs/_default/lang/stopwords_de.txt to /configs/timeConfig/lang/stopwords_de.txt
   [junit4]   2> 393092 INFO  (OverseerThreadFactory-1399-thread-1-processing-n:127.0.0.1:57883_solr) [n:127.0.0.1:57883_solr    ] o.a.s.c.c.ZkConfigManager Copying zk node /configs/_default/lang/stopwords_fa.txt to /configs/timeConfig/lang/stopwords_fa.txt
   [junit4]   2> 393094 INFO  (OverseerThreadFactory-1399-thread-1-processing-n:127.0.0.1:57883_solr) [n:127.0.0.1:57883_solr    ] o.a.s.c.c.ZkConfigManager Copying zk node /configs/_default/lang/contractions_ga.txt to /configs/timeConfig/lang/contractions_ga.txt
   [junit4]   2> 393096 INFO  (OverseerThreadFactory-1399-thread-1-processing-n:127.0.0.1:57883_solr) [n:127.0.0.1:57883_solr    ] o.a.s.c.c.ZkConfigManager Copying zk node /configs/_default/lang/stopwords_ca.txt to /configs/timeConfig/lang/stopwords_ca.txt
   [junit4]   2> 393099 INFO  (OverseerThreadFactory-1399-thread-1-processing-n:127.0.0.1:57883_solr) [n:127.0.0.1:57883_solr    ] o.a.s.c.c.ZkConfigManager Copying zk node /configs/_default/lang/stopwords_nl.txt to /configs/timeConfig/lang/stopwords_nl.txt
   [junit4]   2> 393101 INFO  (OverseerThreadFactory-1399-thread-1-processing-n:127.0.0.1:57883_solr) [n:127.0.0.1:57883_solr    ] o.a.s.c.c.ZkConfigManager Copying zk node /configs/_default/lang/stopwords_bg.txt to /configs/timeConfig/lang/stopwords_bg.txt
   [junit4]   2> 393103 INFO  (OverseerThreadFactory-1399-thread-1-processing-n:127.0.0.1:57883_solr) [n:127.0.0.1:57883_solr    ] o.a.s.c.c.ZkConfigManager Copying zk node /configs/_default/lang/stopwords_lv.txt to /configs/timeConfig/lang/stopwords_lv.txt
   [junit4]   2> 393105 INFO  (OverseerThreadFactory-1399-thread-1-processing-n:127.0.0.1:57883_solr) [n:127.0.0.1:57883_solr    ] o.a.s.c.c.ZkConfigManager Copying zk node /configs/_default/lang/stopwords_en.txt to /configs/timeConfig/lang/stopwords_en.txt
   [junit4]   2> 393107 INFO  (OverseerThreadFactory-1399-thread-1-processing-n:127.0.0.1:57883_solr) [n:127.0.0.1:57883_solr    ] o.a.s.c.c.ZkConfigManager Copying zk node /configs/_default/lang/stopwords_es.txt to /configs/timeConfig/lang/stopwords_es.txt
   [junit4]   2> 393109 INFO  (OverseerThreadFactory-1399-thread-1-processing-n:127.0.0.1:57883_solr) [n:127.0.0.1:57883_solr    ] o.a.s.c.c.ZkConfigManager Copying zk node /configs/_default/lang/stopwords_ro.txt to /configs/timeConfig/lang/stopwords_ro.txt
   [junit4]   2> 393111 INFO  (OverseerThreadFactory-1399-thread-1-processing-n:127.0.0.1:57883_solr) [n:127.0.0.1:57883_solr    ] o.a.s.c.c.ZkConfigManager Copying zk node /configs/_default/lang/stopwords_th.txt to /configs/timeConfig/lang/stopwords_th.txt
   [junit4]   2> 393113 INFO  (OverseerThreadFactory-1399-thread-1-processing-n:127.0.0.1:57883_solr) [n:127.0.0.1:57883_solr    ] o.a.s.c.c.ZkConfigManager Copying zk node /configs/_default/lang/stopwords_fr.txt to /configs/timeConfig/lang/stopwords_fr.txt
   [junit4]   2> 393115 INFO  (OverseerThreadFactory-1399-thread-1-processing-n:127.0.0.1:57883_solr) [n:127.0.0.1:57883_solr    ] o.a.s.c.c.ZkConfigManager Copying zk node /configs/_default/lang/stopwords_sv.txt to /configs/timeConfig/lang/stopwords_sv.txt
   [junit4]   2> 393117 INFO  (OverseerThreadFactory-1399-thread-1-processing-n:127.0.0.1:57883_solr) [n:127.0.0.1:57883_solr    ] o.a.s.c.c.ZkConfigManager Copying zk node /configs/_default/lang/stopwords_fi.txt to /configs/timeConfig/lang/stopwords_fi.txt
   [junit4]   2> 393119 INFO  (OverseerThreadFactory-1399-thread-1-processing-n:127.0.0.1:57883_solr) [n:127.0.0.1:57883_solr    ] o.a.s.c.c.ZkConfigManager Copying zk node /configs/_default/lang/hyphenations_ga.txt to /configs/timeConfig/lang/hyphenations_ga.txt
   [junit4]   2> 393121 INFO  (OverseerThreadFactory-1399-thread-1-processing-n:127.0.0.1:57883_solr) [n:127.0.0.1:57883_solr    ] o.a.s.c.c.ZkConfigManager Copying zk node /configs/_default/lang/stopwords_gl.txt to /configs/timeConfig/lang/stopwords_gl.txt
   [junit4]   2> 393237 INFO  (OverseerStateUpdate-99207306653663238-127.0.0.1:57883_solr-n_0000000000) [n:127.0.0.1:57883_solr    ] o.a.s.c.o.SliceMutator createReplica() {
   [junit4]   2>   "operation":"ADDREPLICA",
   [junit4]   2>   "collection":"timeConfig",
   [junit4]   2>   "shard":"shard1",
   [junit4]   2>   "core":"timeConfig_shard1_replica_n1",
   [junit4]   2>   "state":"down",
   [junit4]   2>   "base_url":"https://127.0.0.1:57883/solr",
   [junit4]   2>   "type":"NRT",
   [junit4]   2>   "waitForFinalState":"false"} 
   [junit4]   2> 393471 INFO  (qtp717990150-4142) [n:127.0.0.1:57883_solr    ] o.a.s.h.a.CoreAdminOperation core create command qt=/admin/cores&coreNodeName=core_node2&collection.configName=timeConfig&newCollection=true&name=timeConfig_shard1_replica_n1&action=CREATE&numShards=1&collection=timeConfig&shard=shard1&wt=javabin&version=2&replicaType=NRT
   [junit4]   2> 393471 INFO  (qtp717990150-4142) [n:127.0.0.1:57883_solr    ] o.a.s.c.TransientSolrCoreCacheDefault Allocating transient cache for 2147483647 transient cores
   [junit4]   2> 393579 INFO  (zkCallback-884-thread-1-processing-n:127.0.0.1:57883_solr) [n:127.0.0.1:57883_solr    ] o.a.s.c.c.ZkStateReader A cluster state change: [WatchedEvent state:SyncConnected type:NodeDataChanged path:/collections/timeConfig/state.json] for collection [timeConfig] has occurred - updating... (live nodes size: [2])
   [junit4]   2> 393579 INFO  (zkCallback-884-thread-2-processing-n:127.0.0.1:57883_solr) [n:127.0.0.1:57883_solr    ] o.a.s.c.c.ZkStateReader A cluster state change: [WatchedEvent state:SyncConnected type:NodeDataChanged path:/collections/timeConfig/state.json] for collection [timeConfig] has occurred - updating... (live nodes size: [2])
   [junit4]   2> 394489 INFO  (qtp717990150-4142) [n:127.0.0.1:57883_solr c:timeConfig s:shard1 r:core_node2 x:timeConfig_shard1_replica_n1] o.a.s.c.RequestParams conf resource params.json loaded . version : 0 
   [junit4]   2> 394489 INFO  (qtp717990150-4142) [n:127.0.0.1:57883_solr c:timeConfig s:shard1 r:core_node2 x:timeConfig_shard1_replica_n1] o.a.s.c.RequestParams request params refreshed to version 0
   [junit4]   2> 394490 WARN  (qtp717990150-4142) [n:127.0.0.1:57883_solr c:timeConfig s:shard1 r:core_node2 x:timeConfig_shard1_replica_n1] o.a.s.c.SolrConfig Couldn't add files from /export/home/jenkins/workspace/Lucene-Solr-master-Solaris/solr/build/solr-core/test/J0/temp/solr.update.processor.TimeRoutedAliasUpdateProcessorTest_C6E4D9108527E444-001/tempDir-001/node1/timeConfig_shard1_replica_n1/../../../../contrib/extraction/lib filtered by .*\.jar to classpath: /export/home/jenkins/workspace/Lucene-Solr-master-Solaris/solr/build/solr-core/test/J0/temp/solr.update.processor.TimeRoutedAliasUpdateProcessorTest_C6E4D9108527E444-001/tempDir-001/node1/timeConfig_shard1_replica_n1/../../../../contrib/extraction/lib
   [junit4]   2> 394490 WARN  (qtp717990150-4142) [n:127.0.0.1:57883_solr c:timeConfig s:shard1 r:core_node2 x:timeConfig_shard1_replica_n1] o.a.s.c.SolrConfig Couldn't add files from /export/home/jenkins/workspace/Lucene-Solr-master-Solaris/solr/build/solr-core/test/J0/temp/solr.update.processor.TimeRoutedAliasUpdateProcessorTest_C6E4D9108527E444-001/tempDir-001/node1/timeConfig_shard1_replica_n1/../../../../dist filtered by solr-cell-\d.*\.jar to classpath: /export/home/jenkins/workspace/Lucene-Solr-master-Solaris/solr/build/solr-core/test/J0/temp/solr.update.processor.TimeRoutedAliasUpdateProcessorTest_C6E4D9108527E444-001/tempDir-001/node1/timeConfig_shard1_replica_n1/../../../../dist
   [junit4]   2> 394490 WARN  (qtp717990150-4142) [n:127.0.0.1:57883_solr c:timeConfig s:shard1 r:core_node2 x:timeConfig_shard1_replica_n1] o.a.s.c.SolrConfig Couldn't add files from /export/home/jenkins/workspace/Lucene-Solr-master-Solaris/solr/build/solr-core/test/J0/temp/solr.update.processor.TimeRoutedAliasUpdateProcessorTest_C6E4D9108527E444-001/tempDir-001/node1/timeConfig_shard1_replica_n1/../../../../contrib/clustering/lib filtered by .*\.jar to classpath: /export/home/jenkins/workspace/Lucene-Solr-master-Solaris/solr/build/solr-core/test/J0/temp/solr.update.processor.TimeRoutedAliasUpdateProcessorTest_C6E4D9108527E444-001/tempDir-001/node1/timeConfig_shard1_replica_n1/../../../../contrib/clustering/lib
   [junit4]   2> 394491 WARN  (qtp717990150-4142) [n:127.0.0.1:57883_solr c:timeConfig s:shard1 r:core_node2 x:timeConfig_shard1_replica_n1] o.a.s.c.SolrConfig Couldn't add files from /export/home/jenkins/workspace/Lucene-Solr-master-Solaris/solr/build/solr-core/test/J0/temp/solr.update.processor.TimeRoutedAliasUpdateProcessorTest_C6E4D9108527E444-001/tempDir-001/node1/timeConfig_shard1_replica_n1/../../../../dist filtered by solr-clustering-\d.*\.jar to classpath: /export/home/jenkins/workspace/Lucene-Solr-master-Solaris/solr/build/solr-core/test/J0/temp/solr.update.processor.TimeRoutedAliasUpdateProcessorTest_C6E4D9108527E444-001/tempDir-001/node1/timeConfig_shard1_replica_n1/../../../../dist
   [junit4]   2> 394491 WARN  (qtp717990150-4142) [n:127.0.0.1:57883_solr c:timeConfig s:shard1 r:core_node2 x:timeConfig_shard1_replica_n1] o.a.s.c.SolrConfig Couldn't add files from /export/home/jenkins/workspace/Lucene-Solr-master-Solaris/solr/build/solr-core/test/J0/temp/solr.update.processor.TimeRoutedAliasUpdateProcessorTest_C6E4D9108527E444-001/tempDir-001/node1/timeConfig_shard1_replica_n1/../../../../contrib/langid/lib filtered by .*\.jar to classpath: /export/home/jenkins/workspace/Lucene-Solr-master-Solaris/solr/build/solr-core/test/J0/temp/solr.update.processor.TimeRoutedAliasUpdateProcessorTest_C6E4D9108527E444-001/tempDir-001/node1/timeConfig_shard1_replica_n1/../../../../contrib/langid/lib
   [junit4]   2> 394491 WARN  (qtp717990150-4142) [n:127.0.0.1:57883_solr c:timeConfig s:shard1 r:core_node2 x:timeConfig_shard1_replica_n1] o.a.s.c.SolrConfig Couldn't add files from /export/home/jenkins/workspace/Lucene-Solr-master-Solaris/solr/build/solr-core/test/J0/temp/solr.update.processor.TimeRoutedAliasUpdateProcessorTest_C6E4D9108527E444-001/tempDir-001/node1/timeConfig_shard1_replica_n1/../../../../dist filtered by solr-langid-\d.*\.jar to classpath: /export/home/jenkins/workspace/Lucene-Solr-master-Solaris/solr/build/solr-core/test/J0/temp/solr.update.processor.TimeRoutedAliasUpdateProcessorTest_C6E4D9108527E444-001/tempDir-001/node1/timeConfig_shard1_replica_n1/../../../../dist
   [junit4]   2> 394491 WARN  (qtp717990150-4142) [n:127.0.0.1:57883_solr c:timeConfig s:shard1 r:core_node2 x:timeConfig_shard1_replica_n1] o.a.s.c.SolrConfig Couldn't add files from /export/home/jenkins/workspace/Lucene-Solr-master-Solaris/solr/build/solr-core/test/J0/temp/solr.update.processor.TimeRoutedAliasUpdateProcessorTest_C6E4D9108527E444-001/tempDir-001/node1/timeConfig_shard1_replica_n1/../../../../contrib/velocity/lib filtered by .*\.jar to classpath: /export/home/jenkins/workspace/Lucene-Solr-master-Solaris/solr/build/solr-core/test/J0/temp/solr.update.processor.TimeRoutedAliasUpdateProcessorTest_C6E4D9108527E444-001/tempDir-001/node1/timeConfig_shard1_replica_n1/../../../../contrib/velocity/lib
   [junit4]   2> 394491 WARN  (qtp717990150-4142) [n:127.0.0.1:57883_solr c:timeConfig s:shard1 r:core_node2 x:timeConfig_shard1_replica_n1] o.a.s.c.SolrConfig Couldn't add files from /export/home/jenkins/workspace/Lucene-Solr-master-Solaris/solr/build/solr-core/test/J0/temp/solr.update.processor.TimeRoutedAliasUpdateProcessorTest_C6E4D9108527E444-001/tempDir-001/node1/timeConfig_shard1_replica_n1/../../../../dist filtered by solr-velocity-\d.*\.jar to classpath: /export/home/jenkins/workspace/Lucene-Solr-master-Solaris/solr/build/solr-core/test/J0/temp/solr.update.processor.TimeRoutedAliasUpdateProcessorTest_C6E4D9108527E444-001/tempDir-001/node1/timeConfig_shard1_replica_n1/../../../../dist
   [junit4]   2> 394498 INFO  (qtp717990150-4142) [n:127.0.0.1:57883_solr c:timeConfig s:shard1 r:core_node2 x:timeConfig_shard1_replica_n1] o.a.s.c.SolrConfig Using Lucene MatchVersion: 8.0.0
   [junit4]   2> 394520 INFO  (qtp717990150-4142) [n:127.0.0.1:57883_solr c:timeConfig s:shard1 r:core_node2 x:timeConfig_shard1_replica_n1] o.a.s.s.IndexSchema [timeConfig_shard1_replica_n1] Schema name=default-config
   [junit4]   2> 394695 INFO  (qtp717990150-4142) [n:127.0.0.1:57883_solr c:timeConfig s:shard1 r:core_node2 x:timeConfig_shard1_replica_n1] o.a.s.s.IndexSchema Loaded schema default-config/1.6 with uniqueid field id
   [junit4]   2> 394759 INFO  (qtp717990150-4142) [n:127.0.0.1:57883_solr c:timeConfig s:shard1 r:core_node2 x:timeConfig_shard1_replica_n1] o.a.s.c.CoreContainer Creating SolrCore 'timeConfig_shard1_replica_n1' using configuration from collection timeConfig, trusted=true
   [junit4]   2> 394760 INFO  (qtp717990150-4142) [n:127.0.0.1:57883_solr c:timeConfig s:shard1 r:core_node2 x:timeConfig_shard1_replica_n1] o.a.s.m.r.SolrJmxReporter JMX monitoring for 'solr_57883.solr.core.timeConfig.shard1.replica_n1' (registry 'solr.core.timeConfig.shard1.replica_n1') enabled at server: com.sun.jmx.mbeanserver.JmxMBeanServer@e8ccf12
   [junit4]   2> 394760 INFO  (qtp717990150-4142) [n:127.0.0.1:57883_solr c:timeConfig s:shard1 r:core_node2 x:timeConfig_shard1_replica_n1] o.a.s.c.SolrCore solr.RecoveryStrategy.Builder
   [junit4]   2> 394760 INFO  (qtp717990150-4142) [n:127.0.0.1:57883_solr c:timeConfig s:shard1 r:core_node2 x:timeConfig_shard1_replica_n1] o.a.s.c.SolrCore [[timeConfig_shard1_replica_n1] ] Opening new SolrCore at [/export/home/jenkins/workspace/Lucene-Solr-master-Solaris/solr/build/solr-core/test/J0/temp/solr.update.processor.TimeRoutedAliasUpdateProcessorTest_C6E4D9108527E444-001/tempDir-001/node1/timeConfig_shard1_replica_n1], dataDir=[/export/home/jenkins/workspace/Lucene-Solr-master-Solaris/solr/build/solr-core/test/J0/temp/solr.update.processor.TimeRoutedAliasUpdateProcessorTest_C6E4D9108527E444-001/tempDir-001/node1/./timeConfig_shard1_replica_n1/data/]
   [junit4]   2> 394763 INFO  (qtp717990150-4142) [n:127.0.0.1:57883_solr c:timeConfig s:shard1 r:core_node2 x:timeConfig_shard1_replica_n1] o.a.s.r.XSLTResponseWriter xsltCacheLifetimeSeconds=5
   [junit4]   2> 394951 INFO  (qtp717990150-4142) [n:127.0.0.1:57883_solr c:timeConfig s:shard1 r:core_node2 x:timeConfig_shard1_replica_n1] o.a.s.u.UpdateHandler Using UpdateLog implementation: org.apache.solr.update.UpdateLog
   [junit4]   2> 394951 INFO  (qtp717990150-4142) [n:127.0.0.1:57883_solr c:timeConfig s:shard1 r:core_node2 x:timeConfig_shard1_replica_n1] o.a.s.u.UpdateLog Initializing UpdateLog: dataDir= defaultSyncLevel=FLUSH numRecordsToKeep=100 maxNumLogsToKeep=10 numVersionBuckets=65536
   [junit4]   2> 394952 INFO  (qtp717990150-4142) [n:127.0.0.1:57883_solr c:timeConfig s:shard1 r:core_node2 x:timeConfig_shard1_replica_n1] o.a.s.u.CommitTracker Hard AutoCommit: if uncommited for 15000ms; 
   [junit4]   2> 394952 INFO  (qtp717990150-4142) [n:127.0.0.1:57883_solr c:timeConfig s:shard1 r:core_node2 x:timeConfig_shard1_replica_n1] o.a.s.u.CommitTracker Soft AutoCommit: disabled
   [junit4]   2> 394954 INFO  (qtp717990150-4142) [n:127.0.0.1:57883_solr c:timeConfig s:shard1 r:core_node2 x:timeConfig_shard1_replica_n1] o.a.s.s.SolrIndexSearcher Opening [Searcher@6a8b07ac[timeConfig_shard1_replica_n1] main]
   [junit4]   2> 394955 INFO  (qtp717990150-4142) [n:127.0.0.1:57883_solr c:timeConfig s:shard1 r:core_node2 x:timeConfig_shard1_replica_n1] o.a.s.r.ManagedResourceStorage Configured ZooKeeperStorageIO with znodeBase: /configs/timeConfig
   [junit4]   2> 394956 INFO  (qtp717990150-4142) [n:127.0.0.1:57883_solr c:timeConfig s:shard1 r:core_node2 x:timeConfig_shard1_replica_n1] o.a.s.r.ManagedResourceStorage Loaded null at path _rest_managed.json using ZooKeeperStorageIO:path=/configs/timeConfig
   [junit4]   2> 394956 INFO  (qtp717990150-4142) [n:127.0.0.1:57883_solr c:timeConfig s:shard1 r:core_node2 x:timeConfig_shard1_replica_n1] o.a.s.s.ZkIndexSchemaReader Creating ZooKeeper watch for the managed schema at /configs/timeConfig/managed-schema
   [junit4]   2> 394957 INFO  (qtp717990150-4142) [n:127.0.0.1:57883_solr c:timeConfig s:shard1 r:core_node2 x:timeConfig_shard1_replica_n1] o.a.s.s.ZkIndexSchemaReader Current schema version 0 is already the latest
   [junit4]   2> 394958 INFO  (qtp717990150-4142) [n:127.0.0.1:57883_solr c:timeConfig s:shard1 r:core_node2 x:timeConfig_shard1_replica_n1] o.a.s.h.c.SpellCheckComponent Initializing spell checkers
   [junit4]   2> 394958 INFO  (qtp717990150-4142) [n:127.0.0.1:57883_solr c:timeConfig s:shard1 r:core_node2 x:timeConfig_shard1_replica_n1] o.a.s.s.DirectSolrSpellChecker init: {name=default,field=_text_,classname=solr.DirectSolrSpellChecker,distanceMeasure=internal,accuracy=0.5,maxEdits=2,minPrefix=1,maxInspections=5,minQueryLength=4,maxQueryFrequency=0.01}
   [junit4]   2> 394961 INFO  (qtp717990150-4142) [n:127.0.0.1:57883_solr c:timeConfig s:shard1 r:core_node2 x:timeConfig_shard1_replica_n1] o.a.s.h.ReplicationHandler Commits will be reserved for 10000ms.
   [junit4]   2> 394961 INFO  (searcherExecutor-1404-thread-1-processing-n:127.0.0.1:57883_solr x:timeConfig_shard1_replica_n1 s:shard1 c:timeConfig r:core_node2) [n:127.0.0.1:57883_solr c:timeConfig s:shard1 r:core_node2 x:timeConfig_shard1_replica_n1] o.a.s.c.QuerySenderListener QuerySenderListener sending requests to Searcher@6a8b07ac[timeConfig_shard1_replica_n1] main{ExitableDirectoryReader(UninvertingDirectoryReader())}
   [junit4]   2> 394961 INFO  (qtp717990150-4142) [n:127.0.0.1:57883_solr c:timeConfig s:shard1 r:core_node2 x:timeConfig_shard1_replica_n1] o.a.s.u.UpdateLog Could not find max version in index or recent updates, using new clock 1587316909043351552
   [junit4]   2> 394961 INFO  (searcherExecutor-1404-thread-1-processing-n:127.0.0.1:57883_solr x:timeConfig_shard1_replica_n1 s:shard1 c:timeConfig r:core_node2) [n:127.0.0.1:57883_solr c:timeConfig s:shard1 r:core_node2 x:timeConfig_shard1_replica_n1] o.a.s.c.QuerySenderListener QuerySenderListener done.
   [junit4]   2> 394961 INFO  (searcherExecutor-1404-thread-1-processing-n:127.0.0.1:57883_solr x:timeConfig_shard1_replica_n1 s:shard1 c:timeConfig r:core_node2) [n:127.0.0.1:57883_solr c:timeConfig s:shard1 r:core_node2 x:timeConfig_shard1_replica_n1] o.a.s.h.c.SpellCheckComponent Loading spell index for spellchecker: default
   [junit4]   2> 394965 INFO  (searcherExecutor-1404-thread-1-processing-n:127.0.0.1:57883_solr x:timeConfig_shard1_replica_n1 s:shard1 c:timeConfig r:core_node2) [n:127.0.0.1:57883_solr c:timeConfig s:shard1 r:core_node2 x:timeConfig_shard1_replica_n1] o.a.s.c.SolrCore [timeConfig_shard1_replica_n1] Registered new searcher Searcher@6a8b07ac[timeConfig_shard1_replica_n1] main{ExitableDirectoryReader(UninvertingDirectoryReader())}
   [junit4]   2> 394973 INFO  (qtp717990150-4142) [n:127.0.0.1:57883_solr c:timeConfig s:shard1 r:core_node2 x:timeConfig_shard1_replica_n1] o.a.s.c.ShardLeaderElectionContext Enough replicas found to continue.
   [junit4]   2> 394973 INFO  (qtp717990150-4142) [n:127.0.0.1:57883_solr c:timeConfig s:shard1 r:core_node2 x:timeConfig_shard1_replica_n1] o.a.s.c.ShardLeaderElectionContext I may be the new leader - try and sync
   [junit4]   2> 394974 INFO  (qtp717990150-4142) [n:127.0.0.1:57883_solr c:timeConfig s:shard1 r:core_node2 x:timeConfig_shard1_replica_n1] o.a.s.c.SyncStrategy Sync replicas to https://127.0.0.1:57883/solr/timeConfig_shard1_replica_n1/
   [junit4]   2> 394974 INFO  (qtp717990150-4142) [n:127.0.0.1:57883_solr c:timeConfig s:shard1 r:core_node2 x:timeConfig_shard1_replica_n1] o.a.s.c.SyncStrategy Sync Success - now sync replicas to me
   [junit4]   2> 394974 INFO  (qtp717990150-4142) [n:127.0.0.1:57883_solr c:timeConfig s:shard1 r:core_node2 x:timeConfig_shard1_replica_n1] o.a.s.c.SyncStrategy https://127.0.0.1:57883/solr/timeConfig_shard1_replica_n1/ has no replicas
   [junit4]   2> 394974 INFO  (qtp717990150-4142) [n:127.0.0.1:57883_solr c:timeConfig s:shard1 r:core_node2 x:timeConfig_shard1_replica_n1] o.a.s.c.ShardLeaderElectionContext Found all replicas participating in election, clear LIR
   [junit4]   2> 394980 INFO  (qtp717990150-4142) [n:127.0.0.1:57883_solr c:timeConfig s:shard1 r:core_node2 x:timeConfig_shard1_replica_n1] o.a.s.c.ShardLeaderElectionContext I am the new leader: https://127.0.0.1:57883/solr/timeConfig_shard1_replica_n1/ shard1
   [junit4]   2> 395085 INFO  (zkCallback-884-thread-2-processing-n:127.0.0.1:57883_solr) [n:127.0.0.1:57883_solr    ] o.a.s.c.c.ZkStateReader A cluster state change: [WatchedEvent state:SyncConnected type:NodeDataChanged path:/collections/timeConfig/state.json] for collection [timeConfig] has occurred - updating... (live nodes size: [2])
   [junit4]   2> 395085 INFO  (zkCallback-884-thread-3-processing-n:127.0.0.1:57883_solr) [n:127.0.0.1:57883_solr    ] o.a.s.c.c.ZkStateReader A cluster state change: [WatchedEvent state:SyncConnected type:NodeDataChanged path:/collections/timeConfig/state.json] for collection [timeConfig] has occurred - updating... (live nodes size: [2])
   [junit4]   2> 395134 INFO  (qtp717990150-4142) [n:127.0.0.1:57883_solr c:timeConfig s:shard1 r:core_node2 x:timeConfig_shard1_replica_n1] o.a.s.c.ZkController I am the leader, no recovery necessary
   [junit4]   2> 395139 INFO  (qtp717990150-4142) [n:127.0.0.1:57883_solr c:timeConfig s:shard1 r:core_node2 x:timeConfig_shard1_replica_n1] o.a.s.s.HttpSolrCall [admin] webapp=null path=/admin/cores params={qt=/admin/cores&coreNodeName=core_node2&collection.configName=timeConfig&newCollection=true&name=timeConfig_shard1_replica_n1&action=CREATE&numShards=1&collection=timeConfig&shard=shard1&wt=javabin&version=2&replicaType=NRT} status=0 QTime=1668
   [junit4]   2> 395145 INFO  (qtp1045704224-4153) [n:127.0.0.1:34683_solr    ] o.a.s.h.a.CollectionsHandler Wait for new collection to be active for at most 30 seconds. Check all shard replicas
   [junit4]   2> 395237 INFO  (zkCallback-884-thread-3-processing-n:127.0.0.1:57883_solr) [n:127.0.0.1:57883_solr    ] o.a.s.c.c.ZkStateReader A cluster state change: [WatchedEvent state:SyncConnected type:NodeDataChanged path:/collections/timeConfig/state.json] for collection [timeConfig] has occurred - updating... (live nodes size: [2])
   [junit4]   2> 395238 INFO  (zkCallback-884-thread-2-processing-n:127.0.0.1:57883_solr) [n:127.0.0.1:57883_solr    ] o.a.s.c.c.ZkStateReader A cluster state change: [WatchedEvent state:SyncConnected type:NodeDataChanged path:/collections/timeConfig/state.json] for collection [timeConfig] has occurred - updating... (live nodes size: [2])
   [junit4]   2> 396152 INFO  (qtp1045704224-4153) [n:127.0.0.1:34683_solr    ] o.a.s.s.HttpSolrCall [admin] webapp=null path=/admin/collections params={pullReplicas=0&replicationFactor=1&name=timeConfig&nrtReplicas=1&action=CREATE&numShards=1&tlogReplicas=0&wt=javabin&version=2} status=0 QTime=3125
   [junit4]   2> 396177 INFO  (qtp717990150-4148) [n:127.0.0.1:57883_solr c:timeConfig s:shard1 r:core_node2 x:timeConfig_shard1_replica_n1] o.a.s.h.SolrConfigHandler Executed config commands successfully and persisted to ZK [{"set-user-property":{"timePartitionAliasName":"myalias"}}, {"set-user-property":{"update.autoCreateFields":false}}, {"add-updateprocessor":{
   [junit4]   2>     "name":"tolerant",
   [junit4]   2>     "class":"solr.TolerantUpdateProcessorFactory"}}, {"add-updateprocessor":{
   [junit4]   2>     "name":"inc",
   [junit4]   2>     "class":"org.apache.solr.update.processor.TimeRoutedAliasUpdateProcessorTest$IncrementURPFactory",
   [junit4]   2>     "fieldName":"integer_i"}}]
   [junit4]   2> 396177 INFO  (qtp717990150-4148) [n:127.0.0.1:57883_solr c:timeConfig s:shard1 r:core_node2 x:timeConfig_shard1_replica_n1] o.a.s.h.SolrConfigHandler Waiting up to 30 secs for 1 replicas to set the property overlay to be of version 0 for collection timeConfig
   [junit4]   2> 396178 INFO  (Thread-1079) [n:127.0.0.1:57883_solr    ] o.a.s.c.SolrCore config update listener called for core timeConfig_shard1_replica_n1
   [junit4]   2> 396179 INFO  (solrHandlerExecutor-1409-thread-1-processing-n:127.0.0.1:57883_solr x:timeConfig_shard1_replica_n1 s:shard1 c:timeConfig r:core_node2) [n:127.0.0.1:57883_solr c:timeConfig s:shard1 r:core_node2 x:timeConfig_shard1_replica_n1] o.a.s.h.SolrConfigHandler Time elapsed : 0 secs, maxWait 30
   [junit4]   2> 396179 INFO  (Thread-1079) [n:127.0.0.1:57883_solr    ] o.a.s.c.SolrCore core reload timeConfig_shard1_replica_n1
   [junit4]   2> 396189 INFO  (Thread-1079) [n:127.0.0.1:57883_solr    ] o.a.s.c.RequestParams conf resource params.json loaded . version : 0 
   [junit4]   2> 396189 INFO  (Thread-1079) [n:127.0.0.1:57883_solr    ] o.a.s.c.RequestParams request params refreshed to version 0
   [junit4]   2> 396189 WARN  (Thread-1079) [n:127.0.0.1:57883_solr    ] o.a.s.c.SolrConfig Couldn't add files from /export/home/jenkins/workspace/Lucene-Solr-master-Solaris/solr/build/solr-core/test/J0/temp/solr.update.processor.TimeRoutedAliasUpdateProcessorTest_C6E4D9108527E444-001/tempDir-001/node1/timeConfig_shard1_replica_n1/../../../../contrib/extraction/lib filtered by .*\.jar to classpath: /export/home/jenkins/workspace/Lucene-Solr-master-Solaris/solr/build/solr-core/test/J0/temp/solr.update.processor.TimeRoutedAliasUpdateProcessorTest_C6E4D9108527E444-001/tempDir-001/node1/timeConfig_shard1_replica_n1/../../../../contrib/extraction/lib
   [junit4]   2> 396190 WARN  (Thread-1079) [n:127.0.0.1:57883_solr    ] o.a.s.c.SolrConfig Couldn't add files from /export/home/jenkins/workspace/Lucene-Solr-master-Solaris/solr/build/solr-core/test/J0/temp/solr.update.processor.TimeRoutedAliasUpdateProcessorTest_C6E4D9108527E444-001/tempDir-001/node1/timeConfig_shard1_replica_n1/../../../../dist filtered by solr-cell-\d.*\.jar to classpath: /export/home/jenkins/workspace/Lucene-Solr-master-Solaris/solr/build/solr-core/test/J0/temp/solr.update.processor.TimeRoutedAliasUpdateProcessorTest_C6E4D9108527E444-001/tempDir-001/node1/timeConfig_shard1_replica_n1/../../../../dist
   [junit4]   2> 396190 WARN  (Thread-1079) [n:127.0.0.1:57883_solr    ] o.a.s.c.SolrConfig Couldn't add files from /export/home/jenkins/workspace/Lucene-Solr-master-Solaris/solr/build/solr-core/test/J0/temp/solr.update.processor.TimeRoutedAliasUpdateProcessorTest_C6E4D9108527E444-001/tempDir-001/node1/timeConfig_shard1_replica_n1/../../../../contrib/clustering/lib filtered by .*\.jar to classpath: /export/home/jenkins/workspace/Lucene-Solr-master-Solaris/solr/build/solr-core/test/J0/temp/solr.update.processor.TimeRoutedAliasUpdateProcessorTest_C6E4D9108527E444-001/tempDir-001/node1/timeConfig_shard1_replica_n1/../../../../contrib/clustering/lib
   [junit4]   2> 396190 WARN  (Thread-1079) [n:127.0.0.1:57883_solr    ] o.a.s.c.SolrConfig Couldn't add files from /export/home/jenkins/workspace/Lucene-Solr-master-Solaris/solr/build/solr-core/test/J0/temp/solr.update.processor.TimeRoutedAliasUpdateProcessorTest_C6E4D9108527E444-001/tempDir-001/node1/timeConfig_shard1_replica_n1/../../../../dist filtered by solr-clustering-\d.*\.jar to classpath: /export/home/jenkins/workspace/Lucene-Solr-master-Solaris/solr/build/solr-core/test/J0/temp/solr.update.processor.TimeRoutedAliasUpdateProcessorTest_C6E4D9108527E444-001/tempDir-001/node1/timeConfig_shard1_replica_n1/../../../../dist
   [junit4]   2> 396191 WARN  (Thread-1079) [n:127.0.0.1:57883_solr    ] o.a.s.c.SolrConfig Couldn't add files from /export/home/jenkins/workspace/Lucene-Solr-master-Solaris/solr/build/solr-core/test/J0/temp/solr.update.processor.TimeRoutedAliasUpdateProcessorTest_C6E4D9108527E444-001/tempDir-001/node1/timeConfig_shard1_replica_n1/../../../../contrib/langid/lib filtered by .*\.jar to classpath: /export/home/jenkins/workspace/Lucene-Solr-master-Solaris/solr/build/solr-core/test/J0/temp/solr.update.processor.TimeRoutedAliasUpdateProcessorTest_C6E4D9108527E444-001/tempDir-001/node1/timeConfig_shard1_replica_n1/../../../../contrib/langid/lib
   [junit4]   2> 396191 WARN  (Thread-1079) [n:127.0.0.1:57883_solr    ] o.a.s.c.SolrConfig Couldn't add files from /export/home/jenkins/workspace/Lucene-Solr-master-Solaris/solr/build/solr-core/test/J0/temp/solr.update.processor.TimeRoutedAliasUpdateProcessorTest_C6E4D9108527E444-001/tempDir-001/node1/timeConfig_shard1_replica_n1/../../../../dist filtered by solr-langid-\d.*\.jar to classpath: /export/home/jenkins/workspace/Lucene-Solr-master-Solaris/solr/build/solr-core/test/J0/temp/solr.update.processor.TimeRoutedAliasUpdateProcessorTest_C6E4D9108527E444-001/tempDir-001/node1/timeConfig_shard1_replica_n1/../../../../dist
   [junit4]   2> 396191 WARN  (Thread-1079) [n:127.0.0.1:57883_solr    ] o.a.s.c.SolrConfig Couldn't add files from /export/home/jenkins/workspace/Lucene-Solr-master-Solaris/solr/build/solr-core/test/J0/temp/solr.update.processor.TimeRoutedAliasUpdateProcessorTest_C6E4D9108527E444-001/tempDir-001/node1/timeConfig_shard1_replica_n1/../../../../contrib/velocity/lib filtered by .*\.jar to classpath: /export/home/jenkins/workspace/Lucene-Solr-master-Solaris/solr/build/solr-core/test/J0/temp/solr.update.processor.TimeRoutedAliasUpdateProcessorTest_C6E4D9108527E444-001/tempDir-001/node1/timeConfig_shard1_replica_n1/../../../../contrib/velocity/lib
   [junit4]   2> 396191 WARN  (Thread-1079) [n:127.0.0.1:57883_solr    ] o.a.s.c.SolrConfig Couldn't add files from /export/home/jenkins/workspace/Lucene-Solr-master-Solaris/solr/build/solr-core/test/J0/temp/solr.update.processor.TimeRoutedAliasUpdateProcessorTest_C6E4D9108527E444-001/tempDir-001/node1/timeConfig_shard1_replica_n1/../../../../dist filtered by solr-velocity-\d.*\.jar to classpath: /export/home/jenkins/workspace/Lucene-Solr-master-Solaris/solr/build/solr-core/test/J0/temp/solr.update.processor.TimeRoutedAliasUpdateProcessorTest_C6E4D9108527E444-001/tempDir-001/node1/timeConfig_shard1_replica_n1/../../../../dist
   [junit4]   2> 396195 INFO  (Thread-1079) [n:127.0.0.1:57883_solr    ] o.a.s.c.SolrConfig Using Lucene MatchVersion: 8.0.0
   [junit4]   2> 396225 INFO  (Thread-1079) [n:127.0.0.1:57883_solr    ] o.a.s.s.IndexSchema [timeConfig_shard1_replica_n1] Schema name=default-config
   [junit4]   2> 396287 INFO  (qtp717990150-4146) [n:127.0.0.1:57883_solr c:timeConfig s:shard1 r:core_node2 x:timeConfig_shard1_replica_n1] o.a.s.h.SolrConfigHandler expecting overlay version 0 but my version is -1
   [junit4]   2> 396287 INFO  (qtp717990150-4146) [n:127.0.0.1:57883_solr c:timeConfig s:shard1 r:core_node2 x:timeConfig_shard1_replica_n1] o.a.s.c.S.Request [timeConfig_shard1_replica_n1]  webapp=/solr path=/config/znodeVersion params={overlay=0&wt=javabin&version=2} status=0 QTime=0
   [junit4]   2> 396288 INFO  (SolrConfigHandler-refreshconf) [n:127.0.0.1:57883_solr c:timeConfig s:shard1 r:core_node2 x:timeConfig_shard1_replica_n1] o.a.s.h.SolrConfigHandler Another reload is in progress . Not doing anything
   [junit4]   2> 396288 INFO  (solrHandlerExecutor-1409-thread-1-processing-n:127.0.0.1:57883_solr x:timeConfig_shard1_replica_n1 s:shard1 c:timeConfig r:core_node2) [n:127.0.0.1:57883_solr c:timeConfig s:shard1 r:core_node2 x:timeConfig_shard1_replica_n1] o.a.s.h.SolrConfigHandler Could not get expectedVersion 0 from https://127.0.0.1:57883/solr/timeConfig_shard1_replica_n1/ for prop overlay   after 1 attempts
   [junit4]   2> 396288 INFO  (solrHandlerExecutor-1409-thread-1-processing-n:127.0.0.1:57883_solr x:timeConfig_shard1_replica_n1 s:shard1 c:timeConfig r:core_node2) [n:127.0.0.1:57883_solr c:timeConfig s:shard1 r:core_node2 x:timeConfig_shard1_replica_n1] o.a.s.h.SolrConfigHandler Time elapsed : 0 secs, maxWait 30
   [junit4]   2> 396357 INFO  (Thread-1079) [n:127.0.0.1:57883_solr    ] o.a.s.s.IndexSchema Loaded schema default-config/1.6 with uniqueid field id
   [junit4]   2> 396389 INFO  (qtp717990150-4142) [n:127.0.0.1:57883_solr c:timeConfig s:shard1 r:core_node2 x:timeConfig_shard1_replica_n1] o.a.s.h.SolrConfigHandler expecting overlay version 0 but my version is -1
   [junit4]   2> 396389 INFO  (qtp717990150-4142) [n:127.0.0.1:57883_solr c:timeConfig s:shard1 r:core_node2 x:timeConfig_shard1_replica_n1] o.a.s.c.S.Request [timeConfig_shard1_replica_n1]  webapp=/solr path=/config/znodeVersion params={overlay=0&wt=javabin&version=2} status=0 QTime=0
   [junit4]   2> 396389 INFO  (SolrConfigHandler-refreshconf) [n:127.0.0.1:57883_solr c:timeConfig s:shard1 r:core_node2 x:timeConfig_shard1_replica_n1] o.a.s.h.SolrConfigHandler Another reload is in progress . Not doing anything
   [junit4]   2> 396389 INFO  (solrHandlerExecutor-1409-thread-1-processing-n:127.0.0.1:57883_solr x:timeConfig_shard1_replica_n1 s:shard1 c:timeConfig r:core_node2) [n:127.0.0.1:57883_solr c:timeConfig s:shard1 r:core_node2 x:timeConfig_shard1_replica_n1] o.a.s.h.SolrConfigHandler Could not get expectedVersion 0 from https://127.0.0.1:57883/solr/timeConfig_shard1_replica_n1/ for prop overlay   after 2 attempts
   [junit4]   2> 396389 INFO  (solrHandlerExecutor-1409-thread-1-processing-n:127.0.0.1:57883_solr x:timeConfig_shard1_replica_n1 s:shard1 c:timeConfig r:core_node2) [n:127.0.0.1:57883_solr c:timeConfig s:shard1 r:core_node2 x:timeConfig_shard1_replica_n1] o.a.s.h.SolrConfigHandler Time elapsed : 0 secs, maxWait 30
   [junit4]   2> 396396 INFO  (Thread-1079) [n:127.0.0.1:57883_solr    ] o.a.s.c.CoreContainer Reloading SolrCore 'timeConfig_shard1_replica_n1' using configuration from collection timeConfig
   [junit4]   2> 396412 INFO  (Thread-1079) [n:127.0.0.1:57883_solr c:timeConfig s:shard1 r:core_node2 x:timeConfig_shard1_replica_n1] o.a.s.m.r.SolrJmxReporter JMX monitoring for 'solr_57883.solr.core.timeConfig.shard1.replica_n1' (registry 'solr.core.timeConfig.shard1.replica_n1') enabled at server: com.sun.jmx.mbeanserver.JmxMBeanServer@e8ccf12
   [junit4]   2> 396412 INFO  (Thread-1079) [n:127.0.0.1:57883_solr c:timeConfig s:shard1 r:core_node2 x:timeConfig_shard1_replica_n1] o.a.s.c.SolrCore [[timeConfig_shard1_replica_n1] ] Opening new SolrCore at [/export/home/jenkins/workspace/Lucene-Solr-master-Solaris/solr/build/solr-core/test/J0/temp/solr.update.processor.TimeRoutedAliasUpdateProcessorTest_C6E4D9108527E444-001/tempDir-001/node1/timeConfig_shard1_replica_n1], dataDir=[/export/home/jenkins/workspace/Lucene-Solr-master-Solaris/solr/build/solr-core/test/J0/temp/solr.update.processor.TimeRoutedAliasUpdateProcessorTest_C6E4D9108527E444-001/tempDir-001/node1/./timeConfig_shard1_replica_n1/data/]
   [junit4]   2> 396422 INFO  (Thread-1079) [n:127.0.0.1:57883_solr c:timeConfig s:shard1 r:core_node2 x:timeConfig_shard1_replica_n1] o.a.s.r.XSLTResponseWriter xsltCacheLifetimeSeconds=5
   [junit4]   2> 396486 INFO  (Thread-1079) [n:127.0.0.1:57883_solr c:timeConfig s:shard1 r:core_node2 x:timeConfig_shard1_replica_n1] o.a.s.u.CommitTracker Hard AutoCommit: if uncommited for 15000ms; 
   [junit4]   2> 396486 INFO  (Thread-1079) [n:127.0.0.1:57883_solr c:timeConfig s:shard1 r:core_node2 x:timeConfig_shard1_replica_n1] o.a.s.u.CommitTracker Soft AutoCommit: disabled
   [junit4]   2> 396489 INFO  (Thread-1079) [n:127.0.0.1:57883_solr c:timeConfig s:shard1 r:core_node2 x:timeConfig_shard1_replica_n1] o.a.s.s.SolrIndexSearcher Opening [Searcher@583f1e1a[timeConfig_shard1_replica_n1] main]
   [junit4]   2> 396491 INFO  (Thread-1079) [n:127.0.0.1:57883_solr c:timeConfig s:shard1 r:core_node2 x:timeConfig_shard1_replica_n1] o.a.s.r.ManagedResourceStorage Configured ZooKeeperStorageIO with znodeBase: /configs/timeConfig
   [junit4]   2> 396492 INFO  (qtp717990150-4144) [n:127.0.0.1:57883_solr c:timeConfig s:shard1 r:core_node2 x:timeConfig_shard1_replica_n1] o.a.s.h.SolrConfigHandler expecting overlay version 0 but my version is -1
   [junit4]   2> 396492 INFO  (qtp717990150-4144) [n:127.0.0.1:57883_solr c:timeConfig s:shard1 r:core_node2 x:timeConfig_shard1_replica_n1] o.a.s.c.S.Request [timeConfig_shard1_replica_n1]  webapp=/solr path=/config/znodeVersion params={overlay=0&wt=javabin&version=2} status=0 QTime=0
   [junit4]   2> 396492 INFO  (SolrConfigHandler-refreshconf) [n:127.0.0.1:57883_solr c:timeConfig s:shard1 r:core_node2 x:timeConfig_shard1_replica_n1] o.a.s.h.SolrConfigHandler Another reload is in progress . Not doing anything
   [junit4]   2> 396492 INFO  (solrHandlerExecutor-1409-thread-1-processing-n:127.0.0.1:57883_solr x:timeConfig_shard1_replica_n1 s:shard1 c:timeConfig r:core_node2) [n:127.0.0.1:57883_solr c:timeConfig s:shard1 r:core_node2 x:timeConfig_shard1_replica_n1] o.a.s.h.SolrConfigHandler Could not get expectedVersion 0 from https://127.0.0.1:57883/solr/timeConfig_shard1_replica_n1/ for prop overlay   after 3 attempts
   [junit4]   2> 396492 INFO  (solrHandlerExecutor-1409-thread-1-processing-n:127.0.0.1:57883_solr x:timeConfig_shard1_replica_n1 s:shard1 c:timeConfig r:core_node2) [n:127.0.0.1:57883_solr c:timeConfig s:shard1 r:core_node2 x:timeConfig_shard1_replica_n1] o.a.s.h.SolrConfigHandler Time elapsed : 0 secs, maxWait 30
   [junit4]   2> 396493 INFO  (Thread-1079) [n:127.0.0.1:57883_solr c:timeConfig s:shard1 r:core_node2 x:timeConfig_shard1_replica_n1] o.a.s.r.ManagedResourceStorage Loaded null at path _rest_managed.json using ZooKeeperStorageIO:path=/configs/timeConfig
   [junit4]   2> 396494 INFO  (Thread-1079) [n:127.0.0.1:57883_solr c:timeConfig s:shard1 r:core_node2 x:timeConfig_shard1_replica_n1] o.a.s.s.ZkIndexSchemaReader Creating ZooKeeper watch for the managed schema at /configs/timeConfig/managed-schema
   [junit4]   2> 396496 INFO  (Thread-1079) [n:127.0.0.1:57883_solr c:timeConfig s:shard1 r:core_node2 x:timeConfig_shard1_replica_n1] o.a.s.s.ZkIndexSchemaReader Current schema version 0 is already the latest
   [junit4]   2> 396496 INFO  (Thread-1079) [n:127.0.0.1:57883_solr c:timeConfig s:shard1 r:core_node2 x:timeConfig_shard1_replica_n1] o.a.s.h.c.SpellCheckComponent Initializing spell checkers
   [junit4]   2> 396496 INFO  (Thread-1079) [n:127.0.0.1:57883_solr c:timeConfig s:shard1 r:core_node2 x:timeConfig_shard1_replica_n1] o.a.s.s.DirectSolrSpellChecker init: {name=default,field=_text_,classname=solr.DirectSolrSpellChecker,distanceMeasure=internal,accuracy=0.5,maxEdits=2,minPrefix=1,maxInspections=5,minQueryLength=4,maxQueryFrequency=0.01}
   [junit4]   2> 396498 INFO  (Thread-1079) [n:127.0.0.1:57883_solr c:timeConfig s:shard1 r:core_node2 x:timeConfig_shard1_replica_n1] o.a.s.h.ReplicationHandler Commits will be reserved for 10000ms.
   [junit4]   2> 396498 INFO  (searcherExecutor-1410-thread-1-processing-n:127.0.0.1:57883_solr x:timeConfig_shard1_replica_n1 s:shard1 c:timeConfig r:core_node2) [n:127.0.0.1:57883_solr c:timeConfig s:shard1 r:core_node2 x:timeConfig_shard1_replica_n1] o.a.s.c.QuerySenderListener QuerySenderListener sending requests to Searcher@583f1e1a[timeConfig_shard1_replica_n1] main{ExitableDirectoryReader(UninvertingDirectoryReader())}
   [junit4]   2> 396498 INFO  (searcherExecutor-1410-thread-1-processing-n:127.0.0.1:57883_solr x:timeConfig_shard1_replica_n1 s:shard1 c:timeConfig r:core_node2) [n:127.0.0.1:57883_solr c:timeConfig s:shard1 r:core_node2 x:timeConfig_shard1_replica_n1] o.a.s.c.QuerySenderListener QuerySenderListener done.
   [junit4]   2> 396498 INFO  (searcherExecutor-1410-thread-1-processing-n:127.0.0.1:57883_solr x:timeConfig_shard1_replica_n1 s:shard1 c:timeConfig r:core_node2) [n:127.0.0.1:57883_solr c:timeConfig s:shard1 r:core_node2 x:timeConfig_shard1_replica_n1] o.a.s.h.c.SpellCheckComponent Loading spell index for spellchecker: default
   [junit4]   2> 396499 INFO  (Thread-1079) [n:127.0.0.1:57883_solr c:timeConfig s:shard1 r:core_node2 x:timeConfig_shard1_replica_n1] o.a.s.u.UpdateLog Could not find max version in index or recent updates, using new clock 1587316910656061440
   [junit4]   2> 396503 INFO  (Thread-1079) [n:127.0.0.1:57883_solr c:timeConfig s:shard1 r:core_node2 x:timeConfig_shard1_replica_n1] o.a.s.u.DefaultSolrCoreState New IndexWriter is ready to be used.
   [junit4]   2> 396506 INFO  (searcherExecutor-1410-thread-1-processing-n:127.0.0.1:57883_solr x:timeConfig_shard1_replica_n1 s:shard1 c:timeConfig r:core_node2) [n:127.0.0.1:57883_solr c:timeConfig s:shard1 r:core_node2 x:timeConfig_shard1_replica_n1] o.a.s.c.SolrCore [timeConfig_shard1_replica_n1] Registered new searcher Searcher@583f1e1a[timeConfig_shard1_replica_n1] main{ExitableDirectoryReader(UninvertingDirectoryReader())}
   [junit4]   2> 396507 INFO  (Thread-1079) [n:127.0.0.1:57883_solr c:timeConfig s:shard1 r:core_node2 x:timeConfig_shard1_replica_n1] o.a.s.s.SolrIndexSearcher Opening [Searcher@17d40650[timeConfig_shard1_replica_n1] main]
   [junit4]   2> 396507 INFO  (searcherExecutor-1410-thread-1-processing-n:127.0.0.1:57883_solr x:timeConfig_shard1_replica_n1 s:shard1 c:timeConfig r:core_node2) [n:127.0.0.1:57883_solr c:timeConfig s:shard1 r:core_node2 x:timeConfig_shard1_replica_n1] o.a.s.c.QuerySenderListener QuerySenderListener sending requests to Searcher@17d40650[timeConfig_shard1_replica_n1] main{ExitableDirectoryReader(UninvertingDirectoryReader())}
   [junit4]   2> 396508 INFO  (searcherExecutor-1410-thread-1-processing-n:127.0.0.1:57883_solr x:timeConfig_shard1_replica_n1 s:shard1 c:timeConfig r:core_node2) [n:127.0.0.1:57883_solr c:timeConfig s:shard1 r:core_node2 x:timeConfig_shard1_replica_n1] o.a.s.c.QuerySenderListener QuerySenderListener done.
   [junit4]   2> 396520 INFO  (searcherExecutor-1410-thread-1-processing-n:127.0.0.1:57883_solr x:timeConfig_shard1_replica_n1 s:shard1 c:timeConfig r:core_node2) [n:127.0.0.1:57883_solr c:timeConfig s:shard1 r:core_node2 x:timeConfig_shard1_replica_n1] o.a.s.c.SolrCore [timeConfig_shard1_replica_n1] Registered new searcher Searcher@17d40650[timeConfig_shard1_replica_n1] main{ExitableDirectoryReader(UninvertingDirectoryReader())}
   [junit4]   2> 396593 INFO  (qtp717990150-4145) [n:127.0.0.1:57883_solr c:timeConfig s:shard1 r:core_node2 x:timeConfig_shard1_replica_n1] o.a.s.h.SolrConfigHandler I already have the expected version 0 of config
   [junit4]   2> 396593 INFO  (qtp717990150-4145) [n:127.0.0.1:57883_solr c:timeConfig s:shard1 r:core_node2 x:timeConfig_shard1_replica_n1] o.a.s.h.SolrConfigHandler isStale false , resourceloader org.apache.solr.cloud.ZkSolrResourceLoader
   [junit4]   2> 396593 INFO  (qtp717990150-4145) [n:127.0.0.1:57883_solr c:timeConfig s:shard1 r:core_node2 x:timeConfig_shard1_replica_n1] o.a.s.c.S.Request [timeConfig_shard1_replica_n1]  webapp=/solr path=/config/znodeVersion params={overlay=0&wt=javabin&version=2} status=0 QTime=0
   [junit4]   2> 396594 INFO  (qtp717990150-4148) [n:127.0.0.1:57883_solr c:timeConfig s:shard1 r:core_node2 x:timeConfig_shard1_replica_n1] o.a.s.h.SolrConfigHandler Took 417.0ms to set the property overlay to be of version 0 for collection timeConfig
   [junit4]   2> 396594 INFO  (qtp717990150-4148) [n:127.0.0.1:57883_solr c:timeConfig s:shard1 r:core_node2 x:timeConfig_shard1_replica_n1] o.a.s.c.S.Request [timeConfig_shard1_replica_n1]  webapp=/solr path=/config params={wt=javabin&version=2} status=0 QTime=422
   [junit4]   2> 396594 INFO  (qtp717990150-4148) [n:127.0.0.1:57883_solr c:timeConfig s:shard1 r:core_node2 x:timeConfig_shard1_replica_n1] o.a.s.c.SolrCore [timeConfig_shard1_replica_n1]  CLOSING SolrCore org.apache.solr.core.SolrCore@3710c226
   [junit4]   2> 396594 INFO  (qtp717990150-4148) [n:127.0.0.1:57883_solr c:timeConfig s:shard1 r:core_node2 x:timeConfig_shard1_replica_n1] o.a.s.m.SolrMetricManager Closing metric reporters for registry=solr.core.timeConfig.shard1.replica_n1, tag=923845158
   [junit4]   2> 396594 INFO  (qtp717990150-4148) [n:127.0.0.1:57883_solr c:timeConfig s:shard1 r:core_node2 x:timeConfig_shard1_replica_n1] o.a.s.m.r.SolrJmxReporter Closing reporter [org.apache.solr.metrics.reporters.SolrJmxReporter@3fc8dda3: rootName = solr_57883, domain = solr.core.timeConfig.shard1.replica_n1, service url = null, agent id = null] for registry solr.core.timeConfig.shard1.replica_n1 / com.codahale.metrics.MetricRegistry@272338dd
   [junit4]   2> 396599 INFO  (qtp717990150-4148) [n:127.0.0.1:57883_solr c:timeConfig s:shard1 r:core_node2 x:timeConfig_shard1_replica_n1] o.a.s.m.SolrMetricManager Closing metric reporters for registry=solr.collection.timeConfig.shard1.leader, tag=923845158
   [junit4]   2> 396607 INFO  (qtp717990150-4140) [n:127.0.0.1:57883_solr c:timeConfig s:shard1 r:core_node2 x:timeConfig_shard1_replica_n1] o.a.s.c.ZkController Persisted config data to node /configs/timeConfig/params.json 
   [junit4]   2> 396607 INFO  (qtp717990150-4140) [n:127.0.0.1:57883_solr c:timeConfig s:shard1 r:core_node2 x:timeConfig_shard1_replica_n1] o.a.s.h.SolrConfigHandler Waiting up to 30 secs for 1 replicas to set the property params to be of version 1 for collection timeConfig
   [junit4]   2> 396609 INFO  (solrHandlerExecutor-1414-thread-1-processing-n:127.0.0.1:57883_solr x:timeConfig_shard1_replica_n1 s:shard1 c:timeConfig r:core_node2) [n:127.0.0.1:57883_solr c:timeConfig s:shard1 r:core_node2 x:timeConfig_shard1_replica_n1] o.a.s.h.SolrConfigHandler Time elapsed : 0 secs, maxWait 30
   [junit4]   2> 396609 INFO  (Thread-1080) [n:127.0.0.1:57883_solr    ] o.a.s.c.SolrCore config update listener called for core timeConfig_shard1_replica_n1
   [junit4]   2> 396609 INFO  (Thread-1080) [n:127.0.0.1:57883_solr    ] o.a.s.c.RequestParams conf resource params.json loaded . version : 1 
   [junit4]   2> 396609 INFO  (Thread-1080) [n:127.0.0.1:57883_solr    ] o.a.s.c.RequestParams request params refreshed to version 1
   [junit4]   2> 396717 INFO  (qtp717990150-4144) [n:127.0.0.1:57883_solr c:timeConfig s:shard1 r:core_node2 x:timeConfig_shard1_replica_n1] o.a.s.h.SolrConfigHandler I already have the expected version 1 of params
   [junit4]   2> 396717 INFO  (qtp717990150-4144) [n:127.0.0.1:57883_solr c:timeConfig s:shard1 r:core_node2 x:timeConfig_shard1_replica_n1] o.a.s.h.SolrConfigHandler isStale false , resourceloader org.apache.solr.cloud.ZkSolrResourceLoader
   [junit4]   2> 396717 INFO  (qtp717990150-4144) [n:127.0.0.1:57883_solr c:timeConfig s:shard1 r:core_node2 x:timeConfig_shard1_replica_n1] o.a.s.c.S.Request [timeConfig_shard1_replica_n1]  webapp=/solr path=/config/znodeVersion params={params=1&wt=javabin&version=2} status=0 QTime=0
   [junit4]   2> 396719 INFO  (qtp717990150-4140) [n:127.0.0.1:57883_solr c:timeConfig s:shard1 r:core_node2 x:timeConfig_shard1_replica_n1] o.a.s.h.SolrConfigHandler Took 111.0ms to set the property params to be of version 1 for collection timeConfig
   [junit4]   2> 396719 INFO  (qtp717990150-4140) [n:127.0.0.1:57883_solr c:timeConfig s:shard1 r:core_node2 x:timeConfig_shard1_replica_n1] o.a.s.c.S.Request [timeConfig_shard1_replica_n1]  webapp=/solr path=/config/params params={wt=javabin&version=2} status=0 QTime=113
   [junit4]   2> 396721 INFO  (qtp1045704224-4162) [n:127.0.0.1:34683_solr    ] o.a.s.h.a.CollectionsHandler Invoked Collection Action :delete with params name=timeConfig&action=DELETE&wt=javabin&version=2 and sendToOCPQueue=true
   [junit4]   2> 396723 INFO  (OverseerCollectionConfigSetProcessor-99207306653663238-127.0.0.1:57883_solr-n_0000000000) [n:127.0.0.1:57883_solr    ] o.a.s.c.OverseerTaskQueue Response ZK path: /overseer/collection-queue-work/qnr-0000000000 doesn't exist.  Requestor may have disconnected from ZooKeeper
   [junit4]   2> 396724 INFO  (OverseerThreadFactory-1399-thread-2-processing-n:127.0.0.1:57883_solr) [n:127.0.0.1:57883_solr    ] o.a.s.c.OverseerCollectionMessageHandler Executing Collection Cmd : action=UNLOAD&deleteInstanceDir=true&deleteDataDir=true
   [junit4]   2> 396725 INFO  (qtp717990150-4145) [n:127.0.0.1:57883_solr    ] o.a.s.m.SolrMetricManager Closing metric reporters for registry=solr.core.timeConfig.shard1.replica_n1, tag=null
   [junit4]   2> 396725 INFO  (qtp717990150-4145) [n:127.0.0.1:57883_solr    ] o.a.s.m.r.SolrJmxReporter Closing reporter [org.apache.solr.metrics.reporters.SolrJmxReporter@7ce0850: rootName = solr_57883, domain = solr.core.timeConfig.shard1.replica_n1, service url = null, agent id = null] for registry solr.core.timeConfig.shard1.replica_n1 / com.codahale.metrics.MetricRegistry@272338dd
   [junit4]   2> 396735 INFO  (qtp717990150-4145) [n:127.0.0.1:57883_solr    ] o.a.s.c.SolrCore [timeConfig_shard1_replica_n1]  CLOSING SolrCore org.apache.solr.core.SolrCore@4433e896
   [junit4]   2> 396735 INFO  (qtp717990150-4145) [n:127.0.0.1:57883_solr    ] o.a.s.m.SolrMetricManager Closing metric reporters for registry=solr.core.timeConfig.shard1.replica_n1, tag=1144252566
   [junit4]   2> 396735 INFO  (qtp717990150-4145) [n:127.0.0.1:57883_solr    ] o.a.s.m.SolrMetricManager Closing metric reporters for registry=solr.collection.timeConfig.shard1.leader, tag=1144252566
   [junit4]   2> 396739 INFO  (qtp717990150-4145) [n:127.0.0.1:57883_solr    ] o.a.s.s.HttpSolrCall [admin] webapp=null path=/admin/cores params={deleteInstanceDir=true&core=timeConfig_shard1_replica_n1&qt=/admin/cores&deleteDataDir=true&action=UNLOAD&wt=javabin&version=2} status=0 QTime=14
   [junit4]   2> 397447 INFO  (qtp1045704224-4162) [n:127.0.0.1:34683_solr    ] o.a.s.s.HttpSolrCall [admin] webapp=null path=/admin/collections params={name=timeConfig&action=DELETE&wt=javabin&version=2} status=0 QTime=726
   [junit4]   2> 397449 INFO  (qtp1045704224-4156) [n:127.0.0.1:34683_solr    ] o.a.s.h.a.CollectionsHandler Invoked Collection Action :create with params replicationFactor=1&property.timePartitionAliasName=myalias&collection.configName=timeConfig&name=myalias_2017-10-23&nrtReplicas=1&action=CREATE&numShards=1&wt=javabin&version=2 and sendToOCPQueue=true
   [junit4]   2> 397452 INFO  (OverseerThreadFactory-1399-thread-3-processing-n:127.0.0.1:57883_solr) [n:127.0.0.1:57883_solr    ] o.a.s.c.CreateCollectionCmd Create collection myalias_2017-10-23
   [junit4]   2> 397453 INFO  (OverseerCollectionConfigSetProcessor-99207306653663238-127.0.0.1:57883_solr-n_0000000000) [n:127.0.0.1:57883_solr    ] o.a.s.c.OverseerTaskQueue Response ZK path: /overseer/collection-queue-work/qnr-0000000002 doesn't exist.  Requestor may have disconnected from ZooKeeper
   [junit4]   2> 397668 INFO  (OverseerStateUpdate-99207306653663238-127.0.0.1:57883_solr-n_0000000000) [n:127.0.0.1:57883_solr    ] o.a.s.c.o.SliceMutator createReplica() {
   [junit4]   2>   "operation":"ADDREPLICA",
   [junit4]   2>   "collection":"myalias_2017-10-23",
   [junit4]   2>   "shard":"shard1",
   [junit4]   2>   "core":"myalias_2017-10-23_shard1_replica_n1",
   [junit4]   2>   "state":"down",
   [junit4]   2>   "base_url":"https://127.0.0.1:57883/solr",
   [junit4]   2>   "type":"NRT",
   [junit4]   2>   "waitForFinalState":"false"} 
   [junit4]   2> 397874 INFO  (qtp717990150-4148) [n:127.0.0.1:57883_solr    ] o.a.s.h.a.CoreAdminOperation core create command qt=/admin/cores&collection.configName=timeConfig&newCollection=true&collection=myalias_2017-10-23&version=2&replicaType=NRT&coreNodeName=core_node2&property.timePartitionAliasName=myalias&name=myalias_2017-10-23_shard1_replica_n1&action=CREATE&numShards=1&shard=shard1&wt=javabin
   [junit4]   2> 397988 INFO  (zkCallback-884-thread-2-processing-n:127.0.0.1:57883_solr) [n:127.0.0.1:57883_solr    ] o.a.s.c.c.ZkStateReader A cluster state change: [WatchedEvent state:SyncConnected type:NodeDataChanged path:/collections/myalias_2017-10-23/state.json] for collection [myalias_2017-10-23] has occurred - updating... (live nodes size: [2])
   [junit4]   2> 397989 INFO  (zkCallback-884-thread-3-processing-n:127.0.0.1:57883_solr) [n:127.0.0.1:57883_solr    ] o.a.s.c.c.ZkStateReader A cluster state change: [WatchedEvent state:SyncConnected type:NodeDataChanged path:/collections/myalias_2017-10-23/state.json] for collection [myalias_2017-10-23] has occurred - updating... (live nodes size: [2])
   [junit4]   2> 398897 INFO  (qtp717990150-4148) [n:127.0.0.1:57883_solr c:myalias_2017-10-23 s:shard1 r:core_node2 x:myalias_2017-10-23_shard1_replica_n1] o.a.s.c.RequestParams conf resource params.json loaded . version : 1 
   [junit4]   2> 398898 INFO  (qtp717990150-4148) [n:127.0.0.1:57883_solr c:myalias_2017-10-23 s:shard1 r:core_node2 x:myalias_2017-10-23_shard1_replica_n1] o.a.s.c.RequestParams request params refreshed to version 1
   [junit4]   2> 398898 WARN  (qtp717990150-4148) [n:127.0.0.1:57883_solr c:myalias_2017-10-23 s:shard1 r:core_node2 x:myalias_2017-10-23_shard1_replica_n1] o.a.s.c.SolrConfig Couldn't add files from /export/home/jenkins/workspace/Lucene-Solr-master-Solaris/solr/build/solr-core/test/J0/temp/solr.update.processor.TimeRoutedAliasUpdateProcessorTest_C6E4D9108527E444-001/tempDir-001/node1/myalias_2017-10-23_shard1_replica_n1/../../../../contrib/extraction/lib filtered by .*\.jar to classpath: /export/home/jenkins/workspace/Lucene-Solr-master-Solaris/solr/build/solr-core/test/J0/temp/solr.update.processor.TimeRoutedAliasUpdateProcessorTest_C6E4D9108527E444-001/tempDir-001/node1/myalias_2017-10-23_shard1_replica_n1/../../../../contrib/extraction/lib
   [junit4]   2> 398899 WARN  (qtp717990150-4148) [n:127.0.0.1:57883_solr c:myalias_2017-10-23 s:shard1 r:core_node2 x:myalias_2017-10-23_shard1_replica_n1] o.a.s.c.SolrConfig Couldn't add files from /export/home/jenkins/workspace/Lucene-Solr-master-Solaris/solr/build/solr-core/test/J0/temp/solr.update.processor.TimeRoutedAliasUpdateProcessorTest_C6E4D9108527E444-001/tempDir-001/node1/myalias_2017-10-23_shard1_replica_n1/../../../../dist filtered by solr-cell-\d.*\.jar to classpath: /export/home/jenkins/workspace/Lucene-Solr-master-Solaris/solr/build/solr-core/test/J0/temp/solr.update.processor.TimeRoutedAliasUpdateProcessorTest_C6E4D9108527E444-001/tempDir-001/node1/myalias_2017-10-23_shard1_replica_n1/../../../../dist
   [junit4]   2> 398899 WARN  (qtp717990150-4148) [n:127.0.0.1:57883_solr c:myalias_2017-10-23 s:shard1 r:core_node2 x:myalias_2017-10-23_shard1_replica_n1] o.a.s.c.SolrConfig Couldn't add files from /export/home/jenkins/workspace/Lucene-Solr-master-Solaris/solr/build/solr-core/test/J0/temp/solr.update.processor.TimeRoutedAliasUpdateProcessorTest_C6E4D9108527E444-001/tempDir-001/node1/myalias_2017-10-23_shard1_replica_n1/../../../../contrib/clustering/lib filtered by .*\.jar to classpath: /export/home/jenkins/workspace/Lucene-Solr-master-Solaris/solr/build/solr-core/test/J0/temp/solr.update.processor.TimeRoutedAliasUpdateProcessorTest_C6E4D9108527E444-001/tempDir-001/node1/myalias_2017-10-23_shard1_replica_n1/../../../../contrib/clustering/lib
   [junit4]   2> 398899 WARN  (qtp717990150-4148) [n:127.0.0.1:57883_solr c:myalias_2017-10-23 s:shard1 r:core_node2 x:myalias_2017-10-23_shard1_replica_n1] o.a.s.c.SolrConfig Couldn't add files from /export/home/jenkins/workspace/Lucene-Solr-master-Solaris/solr/build/solr-core/test/J0/temp/solr.update.processor.TimeRoutedAliasUpdateProcessorTest_C6E4D9108527E444-001/tempDir-001/node1/myalias_2017-10-23_shard1_replica_n1/../../../../dist filtered by solr-clustering-\d.*\.jar to classpath: /export/home/jenkins/workspace/Lucene-Solr-master-Solaris/solr/build/solr-core/test/J0/temp/solr.update.processor.TimeRoutedAliasUpdateProcessorTest_C6E4D9108527E444-001/tempDir-001/node1/myalias_2017-10-23_shard1_replica_n1/../../../../dist
   [junit4]   2> 398899 WARN  (qtp717990150-4148) [n:127.0.0.1:57883_solr c:myalias_2017-10-23 s:shard1 r:core_node2 x:myalias_2017-10-23_shard1_replica_n1] o.a.s.c.SolrConfig Couldn't add files from /export/home/jenkins/workspace/Lucene-Solr-master-Solaris/solr/build/solr-core/test/J0/temp/solr.update.processor.TimeRoutedAliasUpdateProcessorTest_C6E4D9108527E444-001/tempDir-001/node1/myalias_2017-10-23_shard1_replica_n1/../../../../contrib/langid/lib filtered by .*\.jar to classpath: /export/home/jenkins/workspace/Lucene-Solr-master-Solaris/solr/build/solr-core/test/J0/temp/solr.update.processor.TimeRoutedAliasUpdateProcessorTest_C6E4D9108527E444-001/tempDir-001/node1/myalias_2017-10-23_shard1_replica_n1/../../../../contrib/langid/lib
   [junit4]   2> 398899 WARN  (qtp717990150-4148) [n:127.0.0.1:57883_solr c:myalias_2017-10-23 s:shard1 r:core_node2 x:myalias_2017-10-23_shard1_replica_n1] o.a.s.c.SolrConfig Couldn't add files from /export/home/jenkins/workspace/Lucene-Solr-master-Solaris/solr/build/solr-core/test/J0/temp/solr.update.processor.TimeRoutedAliasUpdateProcessorTest_C6E4D9108527E444-001/tempDir-001/node1/myalias_2017-10-23_shard1_replica_n1/../../../../dist filtered by solr-langid-\d.*\.jar to classpath: /export/home/jenkins/workspace/Lucene-Solr-master-Solaris/solr/build/solr-core/test/J0/temp/solr.update.processor.TimeRoutedAliasUpdateProcessorTest_C6E4D9108527E444-001/tempDir-001/node1/myalias_2017-10-23_shard1_replica_n1/../../../../dist
   [junit4]   2> 398899 WARN  (qtp717990150-4148) [n:127.0.0.1:57883_solr c:myalias_2017-10-23 s:shard1 r:core_node2 x:myalias_2017-10-23_shard1_replica_n1] o.a.s.c.SolrConfig Couldn't add files from /export/home/jenkins/workspace/Lucene-Solr-master-Solaris/solr/build/solr-core/test/J0/temp/solr.update.processor.TimeRoutedAliasUpdateProcessorTest_C6E4D9108527E444-001/tempDir-001/node1/myalias_2017-10-23_shard1_replica_n1/../../../../contrib/velocity/lib filtered by .*\.jar to classpath: /export/home/jenkins/workspace/Lucene-Solr-master-Solaris/solr/build/solr-core/test/J0/temp/solr.update.processor.TimeRoutedAliasUpdateProcessorTest_C6E4D9108527E444-001/tempDir-001/node1/myalias_2017-10-23_shard1_replica_n1/../../../../contrib/velocity/lib
   [junit4]   2> 398900 WARN  (qtp717990150-4148) [n:127.0.0.1:57883_solr c:myalias_2017-10-23 s:shard1 r:core_node2 x:myalias_2017-10-23_shard1_replica_n1] o.a.s.c.SolrConfig Couldn't add files from /export/home/jenkins/workspace/Lucene-Solr-master-Solaris/solr/build/solr-core/test/J0/temp/solr.update.processor.TimeRoutedAliasUpdateProcessorTest_C6E4D9108527E444-001/tempDir-001/node1/myalias_2017-10-23_shard1_replica_n1/../../../../dist filtered by solr-velocity-\d.*\.jar to classpath: /export/home/jenkins/workspace/Lucene-Solr-master-Solaris/solr/build/solr-core/test/J0/temp/solr.update.processor.TimeRoutedAliasUpdateProcessorTest_C6E4D9108527E444-001/tempDir-001/node1/myalias_2017-10-23_shard1_replica_n1/../../../../dist
   [junit4]   2> 398907 INFO  (qtp717990150-4148) [n:127.0.0.1:57883_solr c:myalias_2017-10-23 s:shard1 r:core_node2 x:myalias_2017-10-23_shard1_replica_n1] o.a.s.c.SolrConfig Using Lucene MatchVersion: 8.0.0
   [junit4]   2> 398932 INFO  (qtp717990150-4148) [n:127.0.0.1:57883_solr c:myalias_2017-10-23 s:shard1 r:core_node2 x:myalias_2017-10-23_shard1_replica_n1] o.a.s.s.IndexSchema [myalias_2017-10-23_shard1_replica_n1] Schema name=default-config
   [junit4]   2> 399228 INFO  (qtp717990150-4148) [n:127.0.0.1:57883_solr c:myalias_2017-10-23 s:shard1 r:core_node2 x:myalias_2017-10-23_shard1_replica_n1] o.a.s.s.IndexSchema Loaded schema default-config/1.6 with uniqueid field id
   [junit4]   2> 399292 INFO  (qtp717990150-4148) [n:127.0.0.1:57883_solr c:myalias_2017-10-23 s:shard1 r:core_node2 x:myalias_2017-10-23_shard1_replica_n1] o.a.s.c.CoreContainer Creating SolrCore 'myalias_2017-10-23_shard1_replica_n1' using configuration from collection myalias_2017-10-23, trusted=true
   [junit4]   2> 399292 INFO  (qtp717990150-4148) [n:127.0.0.1:57883_solr c:myalias_2017-10-23 s:shard1 r:core_node2 x:myalias_2017-10-23_shard1_replica_n1] o.a.s.m.r.SolrJmxReporter JMX monitoring for 'solr_57883.solr.core.myalias_2017-10-23.shard1.replica_n1' (registry 'solr.core.myalias_2017-10-23.shard1.replica_n1') enabled at server: com.sun.jmx.mbeanserver.JmxMBeanServer@e8ccf12
   [junit4]   2> 399293 INFO  (qtp717990150-4148) [n:127.0.0.1:57883_solr c:myalias_2017-10-23 s:shard1 r:core_node2 x:myalias_2017-10-23_shard1_replica_n1] o.a.s.c.SolrCore solr.RecoveryStrategy.Builder
   [junit4]   2> 399293 INFO  (qtp717990150-4148) [n:127.0.0.1:57883_solr c:myalias_2017-10-23 s:shard1 r:core_node2 x:myalias_2017-10-23_shard1_replica_n1] o.a.s.c.SolrCore [[myalias_2017-10-23_shard1_replica_n1] ] Opening new SolrCore at [/export/home/jenkins/workspace/Lucene-Solr-master-Solaris/solr/build/solr-core/test/J0/temp/solr.update.processor.TimeRoutedAliasUpdateProcessorTest_C6E4D9108527E444-001/tempDir-001/node1/myalias_2017-10-23_shard1_replica_n1], dataDir=[/export/home/jenkins/workspace/Lucene-Solr-master-Solaris/solr/build/solr-core/test/J0/temp/solr.update.processor.TimeRoutedAliasUpdateProcessorTest_C6E4D9108527E444-001/tempDir-001/node1/./myalias_2017-10-23_shard1_replica_n1/data/]
   [junit4]   2> 399296 INFO  (qtp717990150-4148) [n:127.0.0.1:57883_solr c:myalias_2017-10-23 s:shard1 r:core_node2 x:myalias_2017-10-23_shard1_replica_n1] o.a.s.r.XSLTResponseWriter xsltCacheLifetimeSeconds=5
   [junit4]   2> 399489 INFO  (qtp717990150-4148) [n:127.0.0.1:57883_solr c:myalias_2017-10-23 s:shard1 r:core_node2 x:myalias_2017-10-23_shard1_replica_n1] o.a.s.u.UpdateHandler Using UpdateLog implementation: org.apache.solr.update.UpdateLog
   [junit4]   2> 399489 INFO  (qtp717990150-4148) [n:127.0.0.1:57883_solr c:myalias_2017-10-23 s:shard1 r:core_node2 x:myalias_2017-10-23_shard1_replica_n1] o.a.s.u.UpdateLog Initializing UpdateLog: dataDir= defaultSyncLevel=FLUSH numRecordsToKeep=100 maxNumLogsToKeep=10 numVersionBuckets=65536
   [junit4]   2> 399490 INFO  (qtp717990150-4148) [n:127.0.0.1:57883_solr c:myalias_2017-10-23 s:shard1 r:core_node2 x:myalias_2017-10-23_shard1_replica_n1] o.a.s.u.CommitTracker Hard AutoCommit: if uncommited for 15000ms; 
   [junit4]   2> 399490 INFO  (qtp717990150-4148) [n:127.0.0.1:57883_solr c:myalias_2017-10-23 s:shard1 r:core_node2 x:myalias_2017-10-23_shard1_replica_n1] o.a.s.u.CommitTracker Soft AutoCommit: disabled
   [junit4]   2> 399492 INFO  (qtp717990150-4148) [n:127.0.0.1:57883_solr c:myalias_2017-10-23 s:shard1 r:core_node2 x:myalias_2017-10-23_shard1_replica_n1] o.a.s.s.SolrIndexSearcher Opening [Searcher@20622dad[myalias_2017-10-23_shard1_replica_n1] main]
   [junit4]   2> 399493 INFO  (qtp717990150-4148) [n:127.0.0.1:57883_solr c:myalias_2017-10-23 s:shard1 r:core_node2 x:myalias_2017-10-23_shard1_replica_n1] o.a.s.r.ManagedResourceStorage Configured ZooKeeperStorageIO with znodeBase: /configs/timeConfig
   [junit4]   2> 399496 INFO  (qtp717990150-4148) [n:127.0.0.1:57883_solr c:myalias_2017-10-23 s:shard1 

[...truncated too long message...]

xec.execute(ProtocolExec.java:185)
   [junit4]    > 	at org.apache.http.impl.execchain.RetryExec.execute(RetryExec.java:89)
   [junit4]    > 	at org.apache.http.impl.execchain.RedirectExec.execute(RedirectExec.java:111)
   [junit4]    > 	at org.apache.http.impl.client.InternalHttpClient.doExecute(InternalHttpClient.java:185)
   [junit4]    > 	at org.apache.http.impl.client.CloseableHttpClient.execute(CloseableHttpClient.java:83)
   [junit4]    > 	at org.apache.http.impl.client.CloseableHttpClient.execute(CloseableHttpClient.java:56)
   [junit4]    > 	at org.apache.solr.client.solrj.impl.HttpSolrClient.executeMethod(HttpSolrClient.java:542)
   [junit4]    > 	... 6 moreThrowable #5: com.carrotsearch.randomizedtesting.UncaughtExceptionError: Captured an uncaught exception in thread: Thread[id=7479, name=WRITER12, state=RUNNABLE, group=TGRP-TestStressInPlaceUpdates]
   [junit4]    > Caused by: java.lang.RuntimeException: org.apache.solr.client.solrj.SolrServerException: Timeout occured while waiting response from server at: http://127.0.0.1:42457/collection1
   [junit4]    > 	at __randomizedtesting.SeedInfo.seed([C6E4D9108527E444]:0)
   [junit4]    > 	at org.apache.solr.cloud.TestStressInPlaceUpdates$1.run(TestStressInPlaceUpdates.java:306)
   [junit4]    > Caused by: org.apache.solr.client.solrj.SolrServerException: Timeout occured while waiting response from server at: http://127.0.0.1:42457/collection1
   [junit4]    > 	at org.apache.solr.client.solrj.impl.HttpSolrClient.executeMethod(HttpSolrClient.java:654)
   [junit4]    > 	at org.apache.solr.client.solrj.impl.HttpSolrClient.request(HttpSolrClient.java:255)
   [junit4]    > 	at org.apache.solr.client.solrj.impl.HttpSolrClient.request(HttpSolrClient.java:244)
   [junit4]    > 	at org.apache.solr.client.solrj.SolrRequest.process(SolrRequest.java:194)
   [junit4]    > 	at org.apache.solr.client.solrj.SolrRequest.process(SolrRequest.java:211)
   [junit4]    > 	at org.apache.solr.cloud.TestStressInPlaceUpdates.deleteDocAndGetVersion(TestStressInPlaceUpdates.java:570)
   [junit4]    > 	at org.apache.solr.cloud.TestStressInPlaceUpdates$1.run(TestStressInPlaceUpdates.java:218)
   [junit4]    > Caused by: java.net.SocketTimeoutException: Read timed out
   [junit4]    > 	at java.net.SocketInputStream.socketRead0(Native Method)
   [junit4]    > 	at java.net.SocketInputStream.socketRead(SocketInputStream.java:116)
   [junit4]    > 	at java.net.SocketInputStream.read(SocketInputStream.java:171)
   [junit4]    > 	at java.net.SocketInputStream.read(SocketInputStream.java:141)
   [junit4]    > 	at org.apache.http.impl.io.SessionInputBufferImpl.streamRead(SessionInputBufferImpl.java:137)
   [junit4]    > 	at org.apache.http.impl.io.SessionInputBufferImpl.fillBuffer(SessionInputBufferImpl.java:153)
   [junit4]    > 	at org.apache.http.impl.io.SessionInputBufferImpl.readLine(SessionInputBufferImpl.java:282)
   [junit4]    > 	at org.apache.http.impl.conn.DefaultHttpResponseParser.parseHead(DefaultHttpResponseParser.java:138)
   [junit4]    > 	at org.apache.http.impl.conn.DefaultHttpResponseParser.parseHead(DefaultHttpResponseParser.java:56)
   [junit4]    > 	at org.apache.http.impl.io.AbstractMessageParser.parse(AbstractMessageParser.java:259)
   [junit4]    > 	at org.apache.http.impl.DefaultBHttpClientConnection.receiveResponseHeader(DefaultBHttpClientConnection.java:163)
   [junit4]    > 	at org.apache.http.impl.conn.CPoolProxy.receiveResponseHeader(CPoolProxy.java:165)
   [junit4]    > 	at org.apache.http.protocol.HttpRequestExecutor.doReceiveResponse(HttpRequestExecutor.java:273)
   [junit4]    > 	at org.apache.http.protocol.HttpRequestExecutor.execute(HttpRequestExecutor.java:125)
   [junit4]    > 	at org.apache.http.impl.execchain.MainClientExec.execute(MainClientExec.java:272)
   [junit4]    > 	at org.apache.http.impl.execchain.ProtocolExec.execute(ProtocolExec.java:185)
   [junit4]    > 	at org.apache.http.impl.execchain.RetryExec.execute(RetryExec.java:89)
   [junit4]    > 	at org.apache.http.impl.execchain.RedirectExec.execute(RedirectExec.java:111)
   [junit4]    > 	at org.apache.http.impl.client.InternalHttpClient.doExecute(InternalHttpClient.java:185)
   [junit4]    > 	at org.apache.http.impl.client.CloseableHttpClient.execute(CloseableHttpClient.java:83)
   [junit4]    > 	at org.apache.http.impl.client.CloseableHttpClient.execute(CloseableHttpClient.java:56)
   [junit4]    > 	at org.apache.solr.client.solrj.impl.HttpSolrClient.executeMethod(HttpSolrClient.java:542)
   [junit4]    > 	... 6 more
   [junit4]   2> 1044791 INFO  (SUITE-TestStressInPlaceUpdates-seed#[C6E4D9108527E444]-worker) [    ] o.a.s.SolrTestCaseJ4 ###deleteCore
   [junit4]   2> 1044791 INFO  (SUITE-TestStressInPlaceUpdates-seed#[C6E4D9108527E444]-worker) [    ] o.a.s.c.CoreContainer Shutting down CoreContainer instance=671726263
   [junit4]   2> 1044791 INFO  (SUITE-TestStressInPlaceUpdates-seed#[C6E4D9108527E444]-worker) [    ] o.a.s.m.SolrMetricManager Closing metric reporters for registry=solr.node, tag=null
   [junit4]   2> 1044791 INFO  (SUITE-TestStressInPlaceUpdates-seed#[C6E4D9108527E444]-worker) [    ] o.a.s.m.r.SolrJmxReporter Closing reporter [org.apache.solr.metrics.reporters.SolrJmxReporter@d84188e: rootName = null, domain = solr.node, service url = null, agent id = null] for registry solr.node / com.codahale.metrics.MetricRegistry@3523f2be
   [junit4]   2> 1044791 INFO  (SUITE-TestStressInPlaceUpdates-seed#[C6E4D9108527E444]-worker) [    ] o.a.s.m.SolrMetricManager Closing metric reporters for registry=solr.jvm, tag=null
   [junit4]   2> 1044791 INFO  (SUITE-TestStressInPlaceUpdates-seed#[C6E4D9108527E444]-worker) [    ] o.a.s.m.r.SolrJmxReporter Closing reporter [org.apache.solr.metrics.reporters.SolrJmxReporter@2c532fc3: rootName = null, domain = solr.jvm, service url = null, agent id = null] for registry solr.jvm / com.codahale.metrics.MetricRegistry@640e7d9
   [junit4]   2> 1044791 INFO  (SUITE-TestStressInPlaceUpdates-seed#[C6E4D9108527E444]-worker) [    ] o.a.s.m.SolrMetricManager Closing metric reporters for registry=solr.jetty, tag=null
   [junit4]   2> 1044791 INFO  (SUITE-TestStressInPlaceUpdates-seed#[C6E4D9108527E444]-worker) [    ] o.a.s.m.r.SolrJmxReporter Closing reporter [org.apache.solr.metrics.reporters.SolrJmxReporter@56dfedb3: rootName = null, domain = solr.jetty, service url = null, agent id = null] for registry solr.jetty / com.codahale.metrics.MetricRegistry@4188c50
   [junit4]   2> 1044795 INFO  (coreCloseExecutor-2442-thread-1) [    x:collection1] o.a.s.c.SolrCore [collection1]  CLOSING SolrCore org.apache.solr.core.SolrCore@184c16c
   [junit4]   2> 1044795 INFO  (coreCloseExecutor-2442-thread-1) [    x:collection1] o.a.s.m.SolrMetricManager Closing metric reporters for registry=solr.core.collection1, tag=25477484
   [junit4]   2> 1044795 INFO  (coreCloseExecutor-2442-thread-1) [    x:collection1] o.a.s.m.r.SolrJmxReporter Closing reporter [org.apache.solr.metrics.reporters.SolrJmxReporter@5e4536c4: rootName = null, domain = solr.core.collection1, service url = null, agent id = null] for registry solr.core.collection1 / com.codahale.metrics.MetricRegistry@63894b7
   [junit4]   2> NOTE: leaving temporary files on disk at: /export/home/jenkins/workspace/Lucene-Solr-master-Solaris/solr/build/solr-core/test/J1/temp/solr.cloud.TestStressInPlaceUpdates_C6E4D9108527E444-001
   [junit4]   2> NOTE: test params are: codec=HighCompressionCompressingStoredFields(storedFieldsFormat=CompressingStoredFieldsFormat(compressionMode=HIGH_COMPRESSION, chunkSize=20678, maxDocsPerChunk=6, blockSize=1), termVectorsFormat=CompressingTermVectorsFormat(compressionMode=HIGH_COMPRESSION, chunkSize=20678, blockSize=1)), sim=Asserting(org.apache.lucene.search.similarities.AssertingSimilarity@4a75ac79), locale=pl, timezone=Asia/Srednekolymsk
   [junit4]   2> NOTE: SunOS 5.11 amd64/Oracle Corporation 1.8.0_152 (64-bit)/cpus=3,threads=1,free=96492896,total=292306944
   [junit4]   2> NOTE: All tests run in this JVM: [TermsComponentTest, ShardRoutingCustomTest, FileBasedSpellCheckerTest, DistributedFacetPivotSmallTest, TestComplexPhraseQParserPlugin, TestConfigSetsAPI, TestDynamicLoading, TestZkChroot, TestRemoteStreaming, TestChildDocTransformer, EchoParamsTest, TestDocSet, OpenExchangeRatesOrgProviderTest, QueryResultKeyTest, HealthCheckHandlerTest, TestNumericTerms64, OverseerModifyCollectionTest, TestFieldTypeResource, TestLegacyField, HdfsWriteToMultipleCollectionsTest, TestCorePropertiesReload, TestFieldCacheVsDocValues, TestExtendedDismaxParser, TestPartialUpdateDeduplication, MoreLikeThisHandlerTest, ChangedSchemaMergeTest, TestImpersonationWithHadoopAuth, PeerSyncWithIndexFingerprintCachingTest, DistributedQueryComponentCustomSortTest, LeaderElectionContextKeyTest, FileUtilsTest, TestManagedResource, CacheHeaderTest, LeaderElectionIntegrationTest, TestSimpleTrackingShardHandler, SolrMetricManagerTest, TestSearchPerf, SystemLogListenerTest, QueryElevationComponentTest, TestCustomDocTransformer, TestClassicSimilarityFactory, SuggestComponentContextFilterQueryTest, AssignTest, TolerantUpdateProcessorTest, DistributedFacetPivotLongTailTest, TestRandomCollapseQParserPlugin, TestPullReplicaErrorHandling, TestSolrQueryParser, AutoScalingHandlerTest, TestCloudPseudoReturnFields, TestSubQueryTransformerCrossCore, TestStreamBody, TestBadConfig, TestMaxTokenLenTokenizer, TestReplicaProperties, TestPayloadScoreQParserPlugin, OpenCloseCoreStressTest, TestJettySolrRunner, SoftAutoCommitTest, TestStressVersions, TestExecutePlanAction, TestDistributedGrouping, HdfsBasicDistributedZkTest, TestSolrCloudSnapshots, RemoteQueryErrorTest, AliasIntegrationTest, TestLegacyNumericUtils, SegmentsInfoRequestHandlerTest, TestNRTOpen, CloudExitableDirectoryReaderTest, TestNodeLostTrigger, SolrXmlInZkTest, TestNestedDocsSort, SpellPossibilityIteratorTest, TestHdfsUpdateLog, TestStressInPlaceUpdates]
   [junit4] Completed [163/764 (2!)] on J1 in 138.56s, 1 test, 1 error <<< FAILURES!

[...truncated 50072 lines...]

Mime
View raw message