lucene-dev mailing list archives

Site index · List index
Message view « Date » · « Thread »
Top « Date » · « Thread »
From Policeman Jenkins Server <jenk...@thetaphi.de>
Subject [JENKINS-EA] Lucene-Solr-7.x-Linux (64bit/jdk-10-ea+32) - Build # 1024 - Still Unstable!
Date Thu, 21 Dec 2017 10:05:28 GMT
Build: https://jenkins.thetaphi.de/job/Lucene-Solr-7.x-Linux/1024/
Java: 64bit/jdk-10-ea+32 -XX:+UseCompressedOops -XX:+UseSerialGC

2 tests failed.
FAILED:  org.apache.solr.cloud.CollectionsAPIDistributedZkTest.testCollectionsAPI

Error Message:
Error from server at https://127.0.0.1:43503/solr/awhollynewcollection_0_shard1_replica_n1: ClusterState says we are the leader (https://127.0.0.1:43503/solr/awhollynewcollection_0_shard1_replica_n1), but locally we don't think so. Request came from null

Stack Trace:
org.apache.solr.client.solrj.impl.CloudSolrClient$RouteException: Error from server at https://127.0.0.1:43503/solr/awhollynewcollection_0_shard1_replica_n1: ClusterState says we are the leader (https://127.0.0.1:43503/solr/awhollynewcollection_0_shard1_replica_n1), but locally we don't think so. Request came from null
	at __randomizedtesting.SeedInfo.seed([C24F81FE41E820F8:8A3AF54A47DB0F6D]:0)
	at org.apache.solr.client.solrj.impl.CloudSolrClient.directUpdate(CloudSolrClient.java:550)
	at org.apache.solr.client.solrj.impl.CloudSolrClient.sendRequest(CloudSolrClient.java:1013)
	at org.apache.solr.client.solrj.impl.CloudSolrClient.requestWithRetryOnStaleState(CloudSolrClient.java:884)
	at org.apache.solr.client.solrj.impl.CloudSolrClient.requestWithRetryOnStaleState(CloudSolrClient.java:946)
	at org.apache.solr.client.solrj.impl.CloudSolrClient.requestWithRetryOnStaleState(CloudSolrClient.java:946)
	at org.apache.solr.client.solrj.impl.CloudSolrClient.requestWithRetryOnStaleState(CloudSolrClient.java:946)
	at org.apache.solr.client.solrj.impl.CloudSolrClient.requestWithRetryOnStaleState(CloudSolrClient.java:946)
	at org.apache.solr.client.solrj.impl.CloudSolrClient.requestWithRetryOnStaleState(CloudSolrClient.java:946)
	at org.apache.solr.client.solrj.impl.CloudSolrClient.request(CloudSolrClient.java:817)
	at org.apache.solr.client.solrj.SolrRequest.process(SolrRequest.java:194)
	at org.apache.solr.client.solrj.request.UpdateRequest.commit(UpdateRequest.java:233)
	at org.apache.solr.cloud.CollectionsAPIDistributedZkTest.testCollectionsAPI(CollectionsAPIDistributedZkTest.java:460)
	at java.base/jdk.internal.reflect.NativeMethodAccessorImpl.invoke0(Native Method)
	at java.base/jdk.internal.reflect.NativeMethodAccessorImpl.invoke(NativeMethodAccessorImpl.java:62)
	at java.base/jdk.internal.reflect.DelegatingMethodAccessorImpl.invoke(DelegatingMethodAccessorImpl.java:43)
	at java.base/java.lang.reflect.Method.invoke(Method.java:564)
	at com.carrotsearch.randomizedtesting.RandomizedRunner.invoke(RandomizedRunner.java:1737)
	at com.carrotsearch.randomizedtesting.RandomizedRunner$8.evaluate(RandomizedRunner.java:934)
	at com.carrotsearch.randomizedtesting.RandomizedRunner$9.evaluate(RandomizedRunner.java:970)
	at com.carrotsearch.randomizedtesting.RandomizedRunner$10.evaluate(RandomizedRunner.java:984)
	at com.carrotsearch.randomizedtesting.rules.SystemPropertiesRestoreRule$1.evaluate(SystemPropertiesRestoreRule.java:57)
	at org.apache.lucene.util.TestRuleSetupTeardownChained$1.evaluate(TestRuleSetupTeardownChained.java:49)
	at org.apache.lucene.util.AbstractBeforeAfterRule$1.evaluate(AbstractBeforeAfterRule.java:45)
	at org.apache.lucene.util.TestRuleThreadAndTestName$1.evaluate(TestRuleThreadAndTestName.java:48)
	at org.apache.lucene.util.TestRuleIgnoreAfterMaxFailures$1.evaluate(TestRuleIgnoreAfterMaxFailures.java:64)
	at org.apache.lucene.util.TestRuleMarkFailure$1.evaluate(TestRuleMarkFailure.java:47)
	at com.carrotsearch.randomizedtesting.rules.StatementAdapter.evaluate(StatementAdapter.java:36)
	at com.carrotsearch.randomizedtesting.ThreadLeakControl$StatementRunner.run(ThreadLeakControl.java:368)
	at com.carrotsearch.randomizedtesting.ThreadLeakControl.forkTimeoutingTask(ThreadLeakControl.java:817)
	at com.carrotsearch.randomizedtesting.ThreadLeakControl$3.evaluate(ThreadLeakControl.java:468)
	at com.carrotsearch.randomizedtesting.RandomizedRunner.runSingleTest(RandomizedRunner.java:943)
	at com.carrotsearch.randomizedtesting.RandomizedRunner$5.evaluate(RandomizedRunner.java:829)
	at com.carrotsearch.randomizedtesting.RandomizedRunner$6.evaluate(RandomizedRunner.java:879)
	at com.carrotsearch.randomizedtesting.RandomizedRunner$7.evaluate(RandomizedRunner.java:890)
	at com.carrotsearch.randomizedtesting.rules.StatementAdapter.evaluate(StatementAdapter.java:36)
	at com.carrotsearch.randomizedtesting.rules.SystemPropertiesRestoreRule$1.evaluate(SystemPropertiesRestoreRule.java:57)
	at org.apache.lucene.util.AbstractBeforeAfterRule$1.evaluate(AbstractBeforeAfterRule.java:45)
	at com.carrotsearch.randomizedtesting.rules.StatementAdapter.evaluate(StatementAdapter.java:36)
	at org.apache.lucene.util.TestRuleStoreClassName$1.evaluate(TestRuleStoreClassName.java:41)
	at com.carrotsearch.randomizedtesting.rules.NoShadowingOrOverridesOnMethodsRule$1.evaluate(NoShadowingOrOverridesOnMethodsRule.java:40)
	at com.carrotsearch.randomizedtesting.rules.NoShadowingOrOverridesOnMethodsRule$1.evaluate(NoShadowingOrOverridesOnMethodsRule.java:40)
	at com.carrotsearch.randomizedtesting.rules.StatementAdapter.evaluate(StatementAdapter.java:36)
	at com.carrotsearch.randomizedtesting.rules.StatementAdapter.evaluate(StatementAdapter.java:36)
	at org.apache.lucene.util.TestRuleAssertionsRequired$1.evaluate(TestRuleAssertionsRequired.java:53)
	at org.apache.lucene.util.TestRuleMarkFailure$1.evaluate(TestRuleMarkFailure.java:47)
	at org.apache.lucene.util.TestRuleIgnoreAfterMaxFailures$1.evaluate(TestRuleIgnoreAfterMaxFailures.java:64)
	at org.apache.lucene.util.TestRuleIgnoreTestSuites$1.evaluate(TestRuleIgnoreTestSuites.java:54)
	at com.carrotsearch.randomizedtesting.rules.StatementAdapter.evaluate(StatementAdapter.java:36)
	at com.carrotsearch.randomizedtesting.ThreadLeakControl$StatementRunner.run(ThreadLeakControl.java:368)
	at java.base/java.lang.Thread.run(Thread.java:844)
Caused by: org.apache.solr.client.solrj.impl.HttpSolrClient$RemoteSolrException: Error from server at https://127.0.0.1:43503/solr/awhollynewcollection_0_shard1_replica_n1: ClusterState says we are the leader (https://127.0.0.1:43503/solr/awhollynewcollection_0_shard1_replica_n1), but locally we don't think so. Request came from null
	at org.apache.solr.client.solrj.impl.HttpSolrClient.executeMethod(HttpSolrClient.java:643)
	at org.apache.solr.client.solrj.impl.HttpSolrClient.request(HttpSolrClient.java:255)
	at org.apache.solr.client.solrj.impl.HttpSolrClient.request(HttpSolrClient.java:244)
	at org.apache.solr.client.solrj.impl.LBHttpSolrClient.doRequest(LBHttpSolrClient.java:483)
	at org.apache.solr.client.solrj.impl.LBHttpSolrClient.request(LBHttpSolrClient.java:413)
	at org.apache.solr.client.solrj.impl.CloudSolrClient.lambda$directUpdate$0(CloudSolrClient.java:527)
	at java.base/java.util.concurrent.FutureTask.run(FutureTask.java:264)
	at org.apache.solr.common.util.ExecutorUtil$MDCAwareThreadPoolExecutor.lambda$execute$0(ExecutorUtil.java:188)
	at java.base/java.util.concurrent.ThreadPoolExecutor.runWorker(ThreadPoolExecutor.java:1135)
	at java.base/java.util.concurrent.ThreadPoolExecutor$Worker.run(ThreadPoolExecutor.java:635)
	... 1 more


FAILED:  org.apache.solr.update.processor.TestNamedUpdateProcessors.test

Error Message:
Error from server at http://127.0.0.1:35007/_cp/d: Could not fully create collection: collection1

Stack Trace:
org.apache.solr.client.solrj.impl.HttpSolrClient$RemoteSolrException: Error from server at http://127.0.0.1:35007/_cp/d: Could not fully create collection: collection1
	at __randomizedtesting.SeedInfo.seed([C24F81FE41E820F8:4A1BBE24EF144D00]:0)
	at org.apache.solr.client.solrj.impl.HttpSolrClient.executeMethod(HttpSolrClient.java:643)
	at org.apache.solr.client.solrj.impl.HttpSolrClient.request(HttpSolrClient.java:255)
	at org.apache.solr.client.solrj.impl.HttpSolrClient.request(HttpSolrClient.java:244)
	at org.apache.solr.client.solrj.impl.LBHttpSolrClient.doRequest(LBHttpSolrClient.java:483)
	at org.apache.solr.client.solrj.impl.LBHttpSolrClient.request(LBHttpSolrClient.java:413)
	at org.apache.solr.client.solrj.impl.CloudSolrClient.sendRequest(CloudSolrClient.java:1104)
	at org.apache.solr.client.solrj.impl.CloudSolrClient.requestWithRetryOnStaleState(CloudSolrClient.java:884)
	at org.apache.solr.client.solrj.impl.CloudSolrClient.request(CloudSolrClient.java:817)
	at org.apache.solr.client.solrj.SolrRequest.process(SolrRequest.java:194)
	at org.apache.solr.client.solrj.SolrRequest.process(SolrRequest.java:211)
	at org.apache.solr.cloud.AbstractFullDistribZkTestBase.createJettys(AbstractFullDistribZkTestBase.java:385)
	at org.apache.solr.cloud.AbstractFullDistribZkTestBase.createServers(AbstractFullDistribZkTestBase.java:334)
	at org.apache.solr.BaseDistributedSearchTestCase$ShardsRepeatRule$ShardsFixedStatement.callStatement(BaseDistributedSearchTestCase.java:991)
	at org.apache.solr.BaseDistributedSearchTestCase$ShardsRepeatRule$ShardsStatement.evaluate(BaseDistributedSearchTestCase.java:968)
	at com.carrotsearch.randomizedtesting.rules.SystemPropertiesRestoreRule$1.evaluate(SystemPropertiesRestoreRule.java:57)
	at org.apache.lucene.util.TestRuleSetupTeardownChained$1.evaluate(TestRuleSetupTeardownChained.java:49)
	at org.apache.lucene.util.AbstractBeforeAfterRule$1.evaluate(AbstractBeforeAfterRule.java:45)
	at org.apache.lucene.util.TestRuleThreadAndTestName$1.evaluate(TestRuleThreadAndTestName.java:48)
	at org.apache.lucene.util.TestRuleIgnoreAfterMaxFailures$1.evaluate(TestRuleIgnoreAfterMaxFailures.java:64)
	at org.apache.lucene.util.TestRuleMarkFailure$1.evaluate(TestRuleMarkFailure.java:47)
	at com.carrotsearch.randomizedtesting.rules.StatementAdapter.evaluate(StatementAdapter.java:36)
	at com.carrotsearch.randomizedtesting.ThreadLeakControl$StatementRunner.run(ThreadLeakControl.java:368)
	at com.carrotsearch.randomizedtesting.ThreadLeakControl.forkTimeoutingTask(ThreadLeakControl.java:817)
	at com.carrotsearch.randomizedtesting.ThreadLeakControl$3.evaluate(ThreadLeakControl.java:468)
	at com.carrotsearch.randomizedtesting.RandomizedRunner.runSingleTest(RandomizedRunner.java:943)
	at com.carrotsearch.randomizedtesting.RandomizedRunner$5.evaluate(RandomizedRunner.java:829)
	at com.carrotsearch.randomizedtesting.RandomizedRunner$6.evaluate(RandomizedRunner.java:879)
	at com.carrotsearch.randomizedtesting.RandomizedRunner$7.evaluate(RandomizedRunner.java:890)
	at com.carrotsearch.randomizedtesting.rules.StatementAdapter.evaluate(StatementAdapter.java:36)
	at com.carrotsearch.randomizedtesting.rules.SystemPropertiesRestoreRule$1.evaluate(SystemPropertiesRestoreRule.java:57)
	at org.apache.lucene.util.AbstractBeforeAfterRule$1.evaluate(AbstractBeforeAfterRule.java:45)
	at com.carrotsearch.randomizedtesting.rules.StatementAdapter.evaluate(StatementAdapter.java:36)
	at org.apache.lucene.util.TestRuleStoreClassName$1.evaluate(TestRuleStoreClassName.java:41)
	at com.carrotsearch.randomizedtesting.rules.NoShadowingOrOverridesOnMethodsRule$1.evaluate(NoShadowingOrOverridesOnMethodsRule.java:40)
	at com.carrotsearch.randomizedtesting.rules.NoShadowingOrOverridesOnMethodsRule$1.evaluate(NoShadowingOrOverridesOnMethodsRule.java:40)
	at com.carrotsearch.randomizedtesting.rules.StatementAdapter.evaluate(StatementAdapter.java:36)
	at com.carrotsearch.randomizedtesting.rules.StatementAdapter.evaluate(StatementAdapter.java:36)
	at org.apache.lucene.util.TestRuleAssertionsRequired$1.evaluate(TestRuleAssertionsRequired.java:53)
	at org.apache.lucene.util.TestRuleMarkFailure$1.evaluate(TestRuleMarkFailure.java:47)
	at org.apache.lucene.util.TestRuleIgnoreAfterMaxFailures$1.evaluate(TestRuleIgnoreAfterMaxFailures.java:64)
	at org.apache.lucene.util.TestRuleIgnoreTestSuites$1.evaluate(TestRuleIgnoreTestSuites.java:54)
	at com.carrotsearch.randomizedtesting.rules.StatementAdapter.evaluate(StatementAdapter.java:36)
	at com.carrotsearch.randomizedtesting.ThreadLeakControl$StatementRunner.run(ThreadLeakControl.java:368)
	at java.base/java.lang.Thread.run(Thread.java:844)




Build Log:
[...truncated 12374 lines...]
   [junit4] Suite: org.apache.solr.update.processor.TestNamedUpdateProcessors
   [junit4]   2> Creating dataDir: /home/jenkins/workspace/Lucene-Solr-7.x-Linux/solr/build/solr-core/test/J1/temp/solr.update.processor.TestNamedUpdateProcessors_C24F81FE41E820F8-001/init-core-data-001
   [junit4]   2> 609573 INFO  (SUITE-TestNamedUpdateProcessors-seed#[C24F81FE41E820F8]-worker) [    ] o.a.s.SolrTestCaseJ4 Using PointFields (NUMERIC_POINTS_SYSPROP=true) w/NUMERIC_DOCVALUES_SYSPROP=true
   [junit4]   2> 609573 INFO  (SUITE-TestNamedUpdateProcessors-seed#[C24F81FE41E820F8]-worker) [    ] o.a.s.SolrTestCaseJ4 Randomized ssl (false) and clientAuth (true) via: @org.apache.solr.util.RandomizeSSL(reason="", ssl=0.0/0.0, value=0.0/0.0, clientAuth=0.0/0.0)
   [junit4]   2> 609573 INFO  (SUITE-TestNamedUpdateProcessors-seed#[C24F81FE41E820F8]-worker) [    ] o.a.s.SolrTestCaseJ4 SecureRandom sanity checks: test.solr.allowed.securerandom=null & java.security.egd=file:/dev/./urandom
   [junit4]   2> 609574 INFO  (SUITE-TestNamedUpdateProcessors-seed#[C24F81FE41E820F8]-worker) [    ] o.a.s.BaseDistributedSearchTestCase Setting hostContext system property: /_cp/d
   [junit4]   2> 609575 INFO  (TEST-TestNamedUpdateProcessors.test-seed#[C24F81FE41E820F8]) [    ] o.a.s.c.ZkTestServer STARTING ZK TEST SERVER
   [junit4]   2> 609579 INFO  (Thread-2307) [    ] o.a.s.c.ZkTestServer client port:0.0.0.0/0.0.0.0:0
   [junit4]   2> 609579 INFO  (Thread-2307) [    ] o.a.s.c.ZkTestServer Starting server
   [junit4]   2> 609586 ERROR (Thread-2307) [    ] o.a.z.s.ZooKeeperServer ZKShutdownHandler is not registered, so ZooKeeper server won't take any action on ERROR or SHUTDOWN server state changes
   [junit4]   2> 609676 INFO  (TEST-TestNamedUpdateProcessors.test-seed#[C24F81FE41E820F8]) [    ] o.a.s.c.ZkTestServer start zk server on port:33709
   [junit4]   2> 609683 INFO  (zkConnectionManagerCallback-1089-thread-1) [    ] o.a.s.c.c.ConnectionManager zkClient has connected
   [junit4]   2> 609685 INFO  (zkConnectionManagerCallback-1091-thread-1) [    ] o.a.s.c.c.ConnectionManager zkClient has connected
   [junit4]   2> 609691 INFO  (TEST-TestNamedUpdateProcessors.test-seed#[C24F81FE41E820F8]) [    ] o.a.s.c.AbstractZkTestCase put /home/jenkins/workspace/Lucene-Solr-7.x-Linux/solr/core/src/test-files/solr/collection1/conf/solrconfig-tlog.xml to /configs/conf1/solrconfig.xml
   [junit4]   2> 609693 INFO  (TEST-TestNamedUpdateProcessors.test-seed#[C24F81FE41E820F8]) [    ] o.a.s.c.AbstractZkTestCase put /home/jenkins/workspace/Lucene-Solr-7.x-Linux/solr/core/src/test-files/solr/collection1/conf/schema.xml to /configs/conf1/schema.xml
   [junit4]   2> 609695 INFO  (TEST-TestNamedUpdateProcessors.test-seed#[C24F81FE41E820F8]) [    ] o.a.s.c.AbstractZkTestCase put /home/jenkins/workspace/Lucene-Solr-7.x-Linux/solr/core/src/test-files/solr/collection1/conf/solrconfig.snippet.randomindexconfig.xml to /configs/conf1/solrconfig.snippet.randomindexconfig.xml
   [junit4]   2> 609697 INFO  (TEST-TestNamedUpdateProcessors.test-seed#[C24F81FE41E820F8]) [    ] o.a.s.c.AbstractZkTestCase put /home/jenkins/workspace/Lucene-Solr-7.x-Linux/solr/core/src/test-files/solr/collection1/conf/stopwords.txt to /configs/conf1/stopwords.txt
   [junit4]   2> 609698 INFO  (TEST-TestNamedUpdateProcessors.test-seed#[C24F81FE41E820F8]) [    ] o.a.s.c.AbstractZkTestCase put /home/jenkins/workspace/Lucene-Solr-7.x-Linux/solr/core/src/test-files/solr/collection1/conf/protwords.txt to /configs/conf1/protwords.txt
   [junit4]   2> 609698 INFO  (TEST-TestNamedUpdateProcessors.test-seed#[C24F81FE41E820F8]) [    ] o.a.s.c.AbstractZkTestCase put /home/jenkins/workspace/Lucene-Solr-7.x-Linux/solr/core/src/test-files/solr/collection1/conf/currency.xml to /configs/conf1/currency.xml
   [junit4]   2> 609699 INFO  (TEST-TestNamedUpdateProcessors.test-seed#[C24F81FE41E820F8]) [    ] o.a.s.c.AbstractZkTestCase put /home/jenkins/workspace/Lucene-Solr-7.x-Linux/solr/core/src/test-files/solr/collection1/conf/enumsConfig.xml to /configs/conf1/enumsConfig.xml
   [junit4]   2> 609700 INFO  (TEST-TestNamedUpdateProcessors.test-seed#[C24F81FE41E820F8]) [    ] o.a.s.c.AbstractZkTestCase put /home/jenkins/workspace/Lucene-Solr-7.x-Linux/solr/core/src/test-files/solr/collection1/conf/open-exchange-rates.json to /configs/conf1/open-exchange-rates.json
   [junit4]   2> 609701 INFO  (TEST-TestNamedUpdateProcessors.test-seed#[C24F81FE41E820F8]) [    ] o.a.s.c.AbstractZkTestCase put /home/jenkins/workspace/Lucene-Solr-7.x-Linux/solr/core/src/test-files/solr/collection1/conf/mapping-ISOLatin1Accent.txt to /configs/conf1/mapping-ISOLatin1Accent.txt
   [junit4]   2> 609701 INFO  (TEST-TestNamedUpdateProcessors.test-seed#[C24F81FE41E820F8]) [    ] o.a.s.c.AbstractZkTestCase put /home/jenkins/workspace/Lucene-Solr-7.x-Linux/solr/core/src/test-files/solr/collection1/conf/old_synonyms.txt to /configs/conf1/old_synonyms.txt
   [junit4]   2> 609702 INFO  (TEST-TestNamedUpdateProcessors.test-seed#[C24F81FE41E820F8]) [    ] o.a.s.c.AbstractZkTestCase put /home/jenkins/workspace/Lucene-Solr-7.x-Linux/solr/core/src/test-files/solr/collection1/conf/synonyms.txt to /configs/conf1/synonyms.txt
   [junit4]   2> 609703 INFO  (TEST-TestNamedUpdateProcessors.test-seed#[C24F81FE41E820F8]) [    ] o.a.s.c.AbstractFullDistribZkTestBase Will use NRT replicas unless explicitly asked otherwise
   [junit4]   2> 609832 INFO  (TEST-TestNamedUpdateProcessors.test-seed#[C24F81FE41E820F8]) [    ] o.e.j.s.Server jetty-9.3.20.v20170531
   [junit4]   2> 609834 INFO  (TEST-TestNamedUpdateProcessors.test-seed#[C24F81FE41E820F8]) [    ] o.e.j.s.h.ContextHandler Started o.e.j.s.ServletContextHandler@4a287dce{/_cp/d,null,AVAILABLE}
   [junit4]   2> 609836 INFO  (TEST-TestNamedUpdateProcessors.test-seed#[C24F81FE41E820F8]) [    ] o.e.j.s.AbstractConnector Started ServerConnector@5d6968ad{HTTP/1.1,[http/1.1]}{127.0.0.1:35007}
   [junit4]   2> 609836 INFO  (TEST-TestNamedUpdateProcessors.test-seed#[C24F81FE41E820F8]) [    ] o.e.j.s.Server Started @611482ms
   [junit4]   2> 609836 INFO  (TEST-TestNamedUpdateProcessors.test-seed#[C24F81FE41E820F8]) [    ] o.a.s.c.s.e.JettySolrRunner Jetty properties: {hostContext=/_cp/d, solr.data.dir=/home/jenkins/workspace/Lucene-Solr-7.x-Linux/solr/build/solr-core/test/J1/temp/solr.update.processor.TestNamedUpdateProcessors_C24F81FE41E820F8-001/tempDir-001/control/data, hostPort=35007, coreRootDirectory=/home/jenkins/workspace/Lucene-Solr-7.x-Linux/solr/build/solr-core/test/J1/temp/solr.update.processor.TestNamedUpdateProcessors_C24F81FE41E820F8-001/control-001/cores}
   [junit4]   2> 609836 ERROR (TEST-TestNamedUpdateProcessors.test-seed#[C24F81FE41E820F8]) [    ] o.a.s.u.StartupLoggingUtils Missing Java Option solr.log.dir. Logging may be missing or incomplete.
   [junit4]   2> 609836 INFO  (TEST-TestNamedUpdateProcessors.test-seed#[C24F81FE41E820F8]) [    ] o.a.s.s.SolrDispatchFilter  ___      _       Welcome to Apache Solr™ version 7.3.0
   [junit4]   2> 609836 INFO  (TEST-TestNamedUpdateProcessors.test-seed#[C24F81FE41E820F8]) [    ] o.a.s.s.SolrDispatchFilter / __| ___| |_ _   Starting in cloud mode on port null
   [junit4]   2> 609837 INFO  (TEST-TestNamedUpdateProcessors.test-seed#[C24F81FE41E820F8]) [    ] o.a.s.s.SolrDispatchFilter \__ \/ _ \ | '_|  Install dir: null
   [junit4]   2> 609837 INFO  (TEST-TestNamedUpdateProcessors.test-seed#[C24F81FE41E820F8]) [    ] o.a.s.s.SolrDispatchFilter |___/\___/_|_|    Start time: 2017-12-21T09:22:41.891035Z
   [junit4]   2> 609842 INFO  (zkConnectionManagerCallback-1093-thread-1) [    ] o.a.s.c.c.ConnectionManager zkClient has connected
   [junit4]   2> 609842 INFO  (TEST-TestNamedUpdateProcessors.test-seed#[C24F81FE41E820F8]) [    ] o.a.s.s.SolrDispatchFilter Loading solr.xml from SolrHome (not found in ZooKeeper)
   [junit4]   2> 609842 INFO  (TEST-TestNamedUpdateProcessors.test-seed#[C24F81FE41E820F8]) [    ] o.a.s.c.SolrXmlConfig Loading container configuration from /home/jenkins/workspace/Lucene-Solr-7.x-Linux/solr/build/solr-core/test/J1/temp/solr.update.processor.TestNamedUpdateProcessors_C24F81FE41E820F8-001/control-001/solr.xml
   [junit4]   2> 609845 INFO  (TEST-TestNamedUpdateProcessors.test-seed#[C24F81FE41E820F8]) [    ] o.a.s.c.SolrXmlConfig Configuration parameter autoReplicaFailoverWorkLoopDelay is ignored
   [junit4]   2> 609845 INFO  (TEST-TestNamedUpdateProcessors.test-seed#[C24F81FE41E820F8]) [    ] o.a.s.c.SolrXmlConfig Configuration parameter autoReplicaFailoverBadNodeExpiration is ignored
   [junit4]   2> 609846 INFO  (TEST-TestNamedUpdateProcessors.test-seed#[C24F81FE41E820F8]) [    ] o.a.s.c.SolrXmlConfig MBean server found: com.sun.jmx.mbeanserver.JmxMBeanServer@240bdffd, but no JMX reporters were configured - adding default JMX reporter.
   [junit4]   2> 609851 INFO  (TEST-TestNamedUpdateProcessors.test-seed#[C24F81FE41E820F8]) [    ] o.a.s.c.ZkContainer Zookeeper client=127.0.0.1:33709/solr
   [junit4]   2> 609854 INFO  (zkConnectionManagerCallback-1097-thread-1) [    ] o.a.s.c.c.ConnectionManager zkClient has connected
   [junit4]   2> 609856 INFO  (zkConnectionManagerCallback-1099-thread-1) [    ] o.a.s.c.c.ConnectionManager zkClient has connected
   [junit4]   2> 609902 INFO  (TEST-TestNamedUpdateProcessors.test-seed#[C24F81FE41E820F8]) [    ] o.a.s.c.Overseer Overseer (id=null) closing
   [junit4]   2> 609903 INFO  (TEST-TestNamedUpdateProcessors.test-seed#[C24F81FE41E820F8]) [    ] o.a.s.c.OverseerElectionContext I am going to be the leader 127.0.0.1:35007__cp%2Fd
   [junit4]   2> 609903 INFO  (TEST-TestNamedUpdateProcessors.test-seed#[C24F81FE41E820F8]) [    ] o.a.s.c.Overseer Overseer (id=99211553120976900-127.0.0.1:35007__cp%2Fd-n_0000000000) starting
   [junit4]   2> 609924 INFO  (TEST-TestNamedUpdateProcessors.test-seed#[C24F81FE41E820F8]) [    ] o.a.s.c.ZkController Register node as live in ZooKeeper:/live_nodes/127.0.0.1:35007__cp%2Fd
   [junit4]   2> 609926 INFO  (zkCallback-1098-thread-1) [    ] o.a.s.c.c.ZkStateReader Updated live nodes from ZooKeeper... (0) -> (1)
   [junit4]   2> 609985 INFO  (TEST-TestNamedUpdateProcessors.test-seed#[C24F81FE41E820F8]) [    ] o.a.s.m.r.SolrJmxReporter JMX monitoring for 'solr.node' (registry 'solr.node') enabled at server: com.sun.jmx.mbeanserver.JmxMBeanServer@240bdffd
   [junit4]   2> 609996 INFO  (TEST-TestNamedUpdateProcessors.test-seed#[C24F81FE41E820F8]) [    ] o.a.s.m.r.SolrJmxReporter JMX monitoring for 'solr.jvm' (registry 'solr.jvm') enabled at server: com.sun.jmx.mbeanserver.JmxMBeanServer@240bdffd
   [junit4]   2> 609996 INFO  (TEST-TestNamedUpdateProcessors.test-seed#[C24F81FE41E820F8]) [    ] o.a.s.m.r.SolrJmxReporter JMX monitoring for 'solr.jetty' (registry 'solr.jetty') enabled at server: com.sun.jmx.mbeanserver.JmxMBeanServer@240bdffd
   [junit4]   2> 609997 INFO  (TEST-TestNamedUpdateProcessors.test-seed#[C24F81FE41E820F8]) [    ] o.a.s.c.CorePropertiesLocator Found 0 core definitions underneath /home/jenkins/workspace/Lucene-Solr-7.x-Linux/solr/build/solr-core/test/J1/temp/solr.update.processor.TestNamedUpdateProcessors_C24F81FE41E820F8-001/control-001/cores
   [junit4]   2> 610027 INFO  (zkConnectionManagerCallback-1105-thread-1) [    ] o.a.s.c.c.ConnectionManager zkClient has connected
   [junit4]   2> 610028 INFO  (TEST-TestNamedUpdateProcessors.test-seed#[C24F81FE41E820F8]) [    ] o.a.s.c.c.ZkStateReader Updated live nodes from ZooKeeper... (0) -> (1)
   [junit4]   2> 610028 INFO  (TEST-TestNamedUpdateProcessors.test-seed#[C24F81FE41E820F8]) [    ] o.a.s.c.s.i.ZkClientClusterStateProvider Cluster at 127.0.0.1:33709/solr ready
   [junit4]   2> 610032 INFO  (qtp1162318585-6669) [    ] o.a.s.h.a.CollectionsHandler Invoked Collection Action :create with params replicationFactor=1&collection.configName=conf1&name=control_collection&nrtReplicas=1&action=CREATE&numShards=1&createNodeSet=127.0.0.1:35007__cp%252Fd&wt=javabin&version=2 and sendToOCPQueue=true
   [junit4]   2> 610036 INFO  (OverseerThreadFactory-2324-thread-1) [    ] o.a.s.c.CreateCollectionCmd Create collection control_collection
   [junit4]   2> 610142 INFO  (qtp1162318585-6671) [    ] o.a.s.h.a.CoreAdminOperation core create command qt=/admin/cores&collection.configName=conf1&newCollection=true&name=control_collection_shard1_replica_n1&action=CREATE&numShards=1&collection=control_collection&shard=shard1&wt=javabin&version=2&replicaType=NRT
   [junit4]   2> 610142 INFO  (qtp1162318585-6671) [    ] o.a.s.c.TransientSolrCoreCacheDefault Allocating transient cache for 4 transient cores
   [junit4]   2> 610246 INFO  (zkCallback-1098-thread-1) [    ] o.a.s.c.c.ZkStateReader A cluster state change: [WatchedEvent state:SyncConnected type:NodeDataChanged path:/collections/control_collection/state.json] for collection [control_collection] has occurred - updating... (live nodes size: [1])
   [junit4]   2> 611172 INFO  (qtp1162318585-6671) [    ] o.a.s.c.SolrConfig Using Lucene MatchVersion: 7.3.0
   [junit4]   2> 611180 INFO  (qtp1162318585-6671) [    ] o.a.s.s.IndexSchema [control_collection_shard1_replica_n1] Schema name=test
   [junit4]   2> 611247 INFO  (qtp1162318585-6671) [    ] o.a.s.s.IndexSchema Loaded schema test/1.0 with uniqueid field id
   [junit4]   2> 611260 INFO  (qtp1162318585-6671) [    ] o.a.s.c.CoreContainer Creating SolrCore 'control_collection_shard1_replica_n1' using configuration from collection control_collection, trusted=true
   [junit4]   2> 611260 INFO  (qtp1162318585-6671) [    ] o.a.s.m.r.SolrJmxReporter JMX monitoring for 'solr.core.control_collection.shard1.replica_n1' (registry 'solr.core.control_collection.shard1.replica_n1') enabled at server: com.sun.jmx.mbeanserver.JmxMBeanServer@240bdffd
   [junit4]   2> 611260 INFO  (qtp1162318585-6671) [    ] o.a.s.c.SolrCore solr.RecoveryStrategy.Builder
   [junit4]   2> 611260 INFO  (qtp1162318585-6671) [    ] o.a.s.c.SolrCore [[control_collection_shard1_replica_n1] ] Opening new SolrCore at [/home/jenkins/workspace/Lucene-Solr-7.x-Linux/solr/build/solr-core/test/J1/temp/solr.update.processor.TestNamedUpdateProcessors_C24F81FE41E820F8-001/control-001/cores/control_collection_shard1_replica_n1], dataDir=[/home/jenkins/workspace/Lucene-Solr-7.x-Linux/solr/build/solr-core/test/J1/temp/solr.update.processor.TestNamedUpdateProcessors_C24F81FE41E820F8-001/control-001/cores/control_collection_shard1_replica_n1/data/]
   [junit4]   2> 611263 INFO  (qtp1162318585-6671) [    ] o.a.s.u.RandomMergePolicy RandomMergePolicy wrapping class org.apache.lucene.index.TieredMergePolicy: [TieredMergePolicy: maxMergeAtOnce=46, maxMergeAtOnceExplicit=27, maxMergedSegmentMB=85.2666015625, floorSegmentMB=0.486328125, forceMergeDeletesPctAllowed=16.3789743543794, segmentsPerTier=21.0, maxCFSSegmentSizeMB=8.796093022207999E12, noCFSRatio=1.0
   [junit4]   2> 611265 WARN  (qtp1162318585-6671) [    ] o.a.s.c.RequestHandlers INVALID paramSet a in requestHandler {type = requestHandler,name = /dump,class = DumpRequestHandler,attributes = {initParams=a, name=/dump, class=DumpRequestHandler},args = {defaults={a=A,b=B}}}
   [junit4]   2> 611310 INFO  (qtp1162318585-6671) [    ] o.a.s.u.UpdateHandler Using UpdateLog implementation: org.apache.solr.update.UpdateLog
   [junit4]   2> 611310 INFO  (qtp1162318585-6671) [    ] o.a.s.u.UpdateLog Initializing UpdateLog: dataDir= defaultSyncLevel=FLUSH numRecordsToKeep=100 maxNumLogsToKeep=10 numVersionBuckets=65536
   [junit4]   2> 611311 INFO  (qtp1162318585-6671) [    ] o.a.s.u.CommitTracker Hard AutoCommit: disabled
   [junit4]   2> 611311 INFO  (qtp1162318585-6671) [    ] o.a.s.u.CommitTracker Soft AutoCommit: disabled
   [junit4]   2> 611312 INFO  (qtp1162318585-6671) [    ] o.a.s.u.RandomMergePolicy RandomMergePolicy wrapping class org.apache.lucene.index.TieredMergePolicy: [TieredMergePolicy: maxMergeAtOnce=18, maxMergeAtOnceExplicit=45, maxMergedSegmentMB=76.6328125, floorSegmentMB=1.2900390625, forceMergeDeletesPctAllowed=21.25508421966216, segmentsPerTier=20.0, maxCFSSegmentSizeMB=8.796093022207999E12, noCFSRatio=1.0
   [junit4]   2> 611312 INFO  (qtp1162318585-6671) [    ] o.a.s.s.SolrIndexSearcher Opening [Searcher@4b4d6fbd[control_collection_shard1_replica_n1] main]
   [junit4]   2> 611313 INFO  (qtp1162318585-6671) [    ] o.a.s.r.ManagedResourceStorage Configured ZooKeeperStorageIO with znodeBase: /configs/conf1
   [junit4]   2> 611313 INFO  (qtp1162318585-6671) [    ] o.a.s.r.ManagedResourceStorage Loaded null at path _rest_managed.json using ZooKeeperStorageIO:path=/configs/conf1
   [junit4]   2> 611314 INFO  (qtp1162318585-6671) [    ] o.a.s.h.ReplicationHandler Commits will be reserved for 10000ms.
   [junit4]   2> 611315 INFO  (searcherExecutor-2327-thread-1) [    ] o.a.s.c.SolrCore [control_collection_shard1_replica_n1] Registered new searcher Searcher@4b4d6fbd[control_collection_shard1_replica_n1] main{ExitableDirectoryReader(UninvertingDirectoryReader())}
   [junit4]   2> 611315 INFO  (qtp1162318585-6671) [    ] o.a.s.u.UpdateLog Could not find max version in index or recent updates, using new clock 1587384851752812544
   [junit4]   2> 611318 INFO  (qtp1162318585-6671) [    ] o.a.s.c.ShardLeaderElectionContext Enough replicas found to continue.
   [junit4]   2> 611319 INFO  (qtp1162318585-6671) [    ] o.a.s.c.ShardLeaderElectionContext I may be the new leader - try and sync
   [junit4]   2> 611319 INFO  (qtp1162318585-6671) [    ] o.a.s.c.SyncStrategy Sync replicas to http://127.0.0.1:35007/_cp/d/control_collection_shard1_replica_n1/
   [junit4]   2> 611319 INFO  (qtp1162318585-6671) [    ] o.a.s.c.SyncStrategy Sync Success - now sync replicas to me
   [junit4]   2> 611319 INFO  (qtp1162318585-6671) [    ] o.a.s.c.SyncStrategy http://127.0.0.1:35007/_cp/d/control_collection_shard1_replica_n1/ has no replicas
   [junit4]   2> 611319 INFO  (qtp1162318585-6671) [    ] o.a.s.c.ShardLeaderElectionContext Found all replicas participating in election, clear LIR
   [junit4]   2> 611321 INFO  (qtp1162318585-6671) [    ] o.a.s.c.ShardLeaderElectionContext I am the new leader: http://127.0.0.1:35007/_cp/d/control_collection_shard1_replica_n1/ shard1
   [junit4]   2> 611423 INFO  (zkCallback-1098-thread-2) [    ] o.a.s.c.c.ZkStateReader A cluster state change: [WatchedEvent state:SyncConnected type:NodeDataChanged path:/collections/control_collection/state.json] for collection [control_collection] has occurred - updating... (live nodes size: [1])
   [junit4]   2> 611472 INFO  (qtp1162318585-6671) [    ] o.a.s.c.ZkController I am the leader, no recovery necessary
   [junit4]   2> 611479 INFO  (qtp1162318585-6671) [    ] o.a.s.s.HttpSolrCall [admin] webapp=null path=/admin/cores params={qt=/admin/cores&collection.configName=conf1&newCollection=true&name=control_collection_shard1_replica_n1&action=CREATE&numShards=1&collection=control_collection&shard=shard1&wt=javabin&version=2&replicaType=NRT} status=0 QTime=1337
   [junit4]   2> 611481 INFO  (qtp1162318585-6669) [    ] o.a.s.h.a.CollectionsHandler Wait for new collection to be active for at most 30 seconds. Check all shard replicas
   [junit4]   2> 612037 INFO  (OverseerCollectionConfigSetProcessor-99211553120976900-127.0.0.1:35007__cp%2Fd-n_0000000000) [    ] o.a.s.c.OverseerTaskQueue Response ZK path: /overseer/collection-queue-work/qnr-0000000000 doesn't exist.  Requestor may have disconnected from ZooKeeper
   [junit4]   2> 641485 ERROR (qtp1162318585-6669) [    ] o.a.s.h.a.CollectionsHandler Timed out waiting for new collection's replicas to become ACTIVE replica http://127.0.0.1:35007/_cp/d/control_collection_shard1_replica_n1/ is in state of down with timeout=30
   [junit4]   2> 641485 INFO  (qtp1162318585-6669) [    ] o.a.s.s.HttpSolrCall [admin] webapp=null path=/admin/collections params={replicationFactor=1&collection.configName=conf1&name=control_collection&nrtReplicas=1&action=CREATE&numShards=1&createNodeSet=127.0.0.1:35007__cp%252Fd&wt=javabin&version=2} status=0 QTime=31452
   [junit4]   2> 641489 INFO  (zkConnectionManagerCallback-1109-thread-1) [    ] o.a.s.c.c.ConnectionManager zkClient has connected
   [junit4]   2> 641490 INFO  (TEST-TestNamedUpdateProcessors.test-seed#[C24F81FE41E820F8]) [    ] o.a.s.c.c.ZkStateReader Updated live nodes from ZooKeeper... (0) -> (1)
   [junit4]   2> 641492 INFO  (TEST-TestNamedUpdateProcessors.test-seed#[C24F81FE41E820F8]) [    ] o.a.s.c.s.i.ZkClientClusterStateProvider Cluster at 127.0.0.1:33709/solr ready
   [junit4]   2> 641492 INFO  (TEST-TestNamedUpdateProcessors.test-seed#[C24F81FE41E820F8]) [    ] o.a.s.c.ChaosMonkey monkey: init - expire sessions:false cause connection loss:false
   [junit4]   2> 641492 INFO  (qtp1162318585-6669) [    ] o.a.s.h.a.CollectionsHandler Invoked Collection Action :create with params replicationFactor=1&collection.configName=conf1&name=collection1&nrtReplicas=1&action=CREATE&numShards=2&createNodeSet=&stateFormat=2&wt=javabin&version=2 and sendToOCPQueue=true
   [junit4]   2> 641494 INFO  (OverseerThreadFactory-2324-thread-2) [    ] o.a.s.c.CreateCollectionCmd Create collection collection1
   [junit4]   2> 641495 WARN  (OverseerThreadFactory-2324-thread-2) [    ] o.a.s.c.CreateCollectionCmd It is unusual to create a collection (collection1) without cores.
   [junit4]   2> 671549 ERROR (OverseerThreadFactory-2324-thread-2) [    ] o.a.s.c.OverseerCollectionMessageHandler Collection: collection1 operation: create failed:org.apache.solr.common.SolrException: Could not fully create collection: collection1
   [junit4]   2> 	at org.apache.solr.cloud.CreateCollectionCmd.call(CreateCollectionCmd.java:151)
   [junit4]   2> 	at org.apache.solr.cloud.OverseerCollectionMessageHandler.processMessage(OverseerCollectionMessageHandler.java:242)
   [junit4]   2> 	at org.apache.solr.cloud.OverseerTaskProcessor$Runner.run(OverseerTaskProcessor.java:464)
   [junit4]   2> 	at org.apache.solr.common.util.ExecutorUtil$MDCAwareThreadPoolExecutor.lambda$execute$0(ExecutorUtil.java:188)
   [junit4]   2> 	at java.base/java.util.concurrent.ThreadPoolExecutor.runWorker(ThreadPoolExecutor.java:1135)
   [junit4]   2> 	at java.base/java.util.concurrent.ThreadPoolExecutor$Worker.run(ThreadPoolExecutor.java:635)
   [junit4]   2> 	at java.base/java.lang.Thread.run(Thread.java:844)
   [junit4]   2> 
   [junit4]   2> 671552 INFO  (qtp1162318585-6669) [    ] o.a.s.s.HttpSolrCall [admin] webapp=null path=/admin/collections params={replicationFactor=1&collection.configName=conf1&name=collection1&nrtReplicas=1&action=CREATE&numShards=2&createNodeSet=&stateFormat=2&wt=javabin&version=2} status=500 QTime=30059
   [junit4]   2> 671552 ERROR (qtp1162318585-6669) [    ] o.a.s.s.HttpSolrCall null:org.apache.solr.common.SolrException: Could not fully create collection: collection1
   [junit4]   2> 	at org.apache.solr.handler.admin.CollectionsHandler.handleResponse(CollectionsHandler.java:309)
   [junit4]   2> 	at org.apache.solr.handler.admin.CollectionsHandler.invokeAction(CollectionsHandler.java:246)
   [junit4]   2> 	at org.apache.solr.handler.admin.CollectionsHandler.handleRequestBody(CollectionsHandler.java:224)
   [junit4]   2> 	at org.apache.solr.handler.RequestHandlerBase.handleRequest(RequestHandlerBase.java:177)
   [junit4]   2> 	at org.apache.solr.servlet.HttpSolrCall.handleAdmin(HttpSolrCall.java:736)
   [junit4]   2> 	at org.apache.solr.servlet.HttpSolrCall.handleAdminRequest(HttpSolrCall.java:717)
   [junit4]   2> 	at org.apache.solr.servlet.HttpSolrCall.call(HttpSolrCall.java:498)
   [junit4]   2> 	at org.apache.solr.servlet.SolrDispatchFilter.doFilter(SolrDispatchFilter.java:382)
   [junit4]   2> 	at org.apache.solr.servlet.SolrDispatchFilter.doFilter(SolrDispatchFilter.java:326)
   [junit4]   2> 	at org.eclipse.jetty.servlet.ServletHandler$CachedChain.doFilter(ServletHandler.java:1759)
   [junit4]   2> 	at org.apache.solr.client.solrj.embedded.JettySolrRunner$DebugFilter.doFilter(JettySolrRunner.java:139)
   [junit4]   2> 	at org.eclipse.jetty.servlet.ServletHandler$CachedChain.doFilter(ServletHandler.java:1759)
   [junit4]   2> 	at org.eclipse.jetty.servlet.ServletHandler.doHandle(ServletHandler.java:582)
   [junit4]   2> 	at org.eclipse.jetty.server.session.SessionHandler.doHandle(SessionHandler.java:224)
   [junit4]   2> 	at org.eclipse.jetty.server.handler.ContextHandler.doHandle(ContextHandler.java:1180)
   [junit4]   2> 	at org.eclipse.jetty.servlet.ServletHandler.doScope(ServletHandler.java:512)
   [junit4]   2> 	at org.eclipse.jetty.server.session.SessionHandler.doScope(SessionHandler.java:185)
   [junit4]   2> 	at org.eclipse.jetty.server.handler.ContextHandler.doScope(ContextHandler.java:1112)
   [junit4]   2> 	at org.eclipse.jetty.server.handler.ScopedHandler.handle(ScopedHandler.java:141)
   [junit4]   2> 	at org.eclipse.jetty.server.handler.gzip.GzipHandler.handle(GzipHandler.java:493)
   [junit4]   2> 	at org.eclipse.jetty.server.handler.HandlerWrapper.handle(HandlerWrapper.java:134)
   [junit4]   2> 	at org.eclipse.jetty.server.Server.handle(Server.java:534)
   [junit4]   2> 	at org.eclipse.jetty.server.HttpChannel.handle(HttpChannel.java:320)
   [junit4]   2> 	at org.eclipse.jetty.server.HttpConnection.onFillable(HttpConnection.java:251)
   [junit4]   2> 	at org.eclipse.jetty.io.AbstractConnection$ReadCallback.succeeded(AbstractConnection.java:283)
   [junit4]   2> 	at org.eclipse.jetty.io.FillInterest.fillable(FillInterest.java:108)
   [junit4]   2> 	at org.eclipse.jetty.io.SelectChannelEndPoint$2.run(SelectChannelEndPoint.java:93)
   [junit4]   2> 	at org.eclipse.jetty.util.thread.strategy.ExecuteProduceConsume.executeProduceConsume(ExecuteProduceConsume.java:303)
   [junit4]   2> 	at org.eclipse.jetty.util.thread.strategy.ExecuteProduceConsume.produceConsume(ExecuteProduceConsume.java:148)
   [junit4]   2> 	at org.eclipse.jetty.util.thread.strategy.ExecuteProduceConsume.run(ExecuteProduceConsume.java:136)
   [junit4]   2> 	at org.eclipse.jetty.util.thread.QueuedThreadPool.runJob(QueuedThreadPool.java:671)
   [junit4]   2> 	at org.eclipse.jetty.util.thread.QueuedThreadPool$2.run(QueuedThreadPool.java:589)
   [junit4]   2> 	at java.base/java.lang.Thread.run(Thread.java:844)
   [junit4]   2> 
   [junit4]   2> 671553 INFO  (TEST-TestNamedUpdateProcessors.test-seed#[C24F81FE41E820F8]) [    ] o.a.s.c.ChaosMonkey monkey: stop jetty! 35007
   [junit4]   2> 671553 INFO  (TEST-TestNamedUpdateProcessors.test-seed#[C24F81FE41E820F8]) [    ] o.a.s.c.CoreContainer Shutting down CoreContainer instance=1118886
   [junit4]   2> 671554 INFO  (TEST-TestNamedUpdateProcessors.test-seed#[C24F81FE41E820F8]) [    ] o.a.s.m.SolrMetricManager Closing metric reporters for registry=solr.node, tag=null
   [junit4]   2> 671554 INFO  (TEST-TestNamedUpdateProcessors.test-seed#[C24F81FE41E820F8]) [    ] o.a.s.m.r.SolrJmxReporter Closing reporter [org.apache.solr.metrics.reporters.SolrJmxReporter@336f0f0f: rootName = null, domain = solr.node, service url = null, agent id = null] for registry solr.node / com.codahale.metrics.MetricRegistry@b9bcd
   [junit4]   2> 671563 INFO  (TEST-TestNamedUpdateProcessors.test-seed#[C24F81FE41E820F8]) [    ] o.a.s.m.SolrMetricManager Closing metric reporters for registry=solr.jvm, tag=null
   [junit4]   2> 671563 INFO  (TEST-TestNamedUpdateProcessors.test-seed#[C24F81FE41E820F8]) [    ] o.a.s.m.r.SolrJmxReporter Closing reporter [org.apache.solr.metrics.reporters.SolrJmxReporter@53af70ce: rootName = null, domain = solr.jvm, service url = null, agent id = null] for registry solr.jvm / com.codahale.metrics.MetricRegistry@186bcdae
   [junit4]   2> 671570 INFO  (TEST-TestNamedUpdateProcessors.test-seed#[C24F81FE41E820F8]) [    ] o.a.s.m.SolrMetricManager Closing metric reporters for registry=solr.jetty, tag=null
   [junit4]   2> 671570 INFO  (TEST-TestNamedUpdateProcessors.test-seed#[C24F81FE41E820F8]) [    ] o.a.s.m.r.SolrJmxReporter Closing reporter [org.apache.solr.metrics.reporters.SolrJmxReporter@5476c6f1: rootName = null, domain = solr.jetty, service url = null, agent id = null] for registry solr.jetty / com.codahale.metrics.MetricRegistry@702d016f
   [junit4]   2> 671572 INFO  (TEST-TestNamedUpdateProcessors.test-seed#[C24F81FE41E820F8]) [    ] o.a.s.c.ZkController Remove node as live in ZooKeeper:/live_nodes/127.0.0.1:35007__cp%2Fd
   [junit4]   2> 671572 INFO  (TEST-TestNamedUpdateProcessors.test-seed#[C24F81FE41E820F8]) [    ] o.a.s.m.SolrMetricManager Closing metric reporters for registry=solr.cluster, tag=null
   [junit4]   2> 671573 INFO  (zkCallback-1098-thread-2) [    ] o.a.s.c.c.ZkStateReader Updated live nodes from ZooKeeper... (1) -> (0)
   [junit4]   2> 671573 INFO  (coreCloseExecutor-2332-thread-1) [    ] o.a.s.c.SolrCore [control_collection_shard1_replica_n1]  CLOSING SolrCore org.apache.solr.core.SolrCore@c56e0d
   [junit4]   2> 671574 INFO  (coreCloseExecutor-2332-thread-1) [    ] o.a.s.m.SolrMetricManager Closing metric reporters for registry=solr.core.control_collection.shard1.replica_n1, tag=12938765
   [junit4]   2> 671574 INFO  (coreCloseExecutor-2332-thread-1) [    ] o.a.s.m.r.SolrJmxReporter Closing reporter [org.apache.solr.metrics.reporters.SolrJmxReporter@44ccebb4: rootName = null, domain = solr.core.control_collection.shard1.replica_n1, service url = null, agent id = null] for registry solr.core.control_collection.shard1.replica_n1 / com.codahale.metrics.MetricRegistry@46311e1d
   [junit4]   2> 671583 INFO  (coreCloseExecutor-2332-thread-1) [    ] o.a.s.m.SolrMetricManager Closing metric reporters for registry=solr.collection.control_collection.shard1.leader, tag=12938765
   [junit4]   2> 671584 INFO  (TEST-TestNamedUpdateProcessors.test-seed#[C24F81FE41E820F8]) [    ] o.a.s.c.Overseer Overseer (id=99211553120976900-127.0.0.1:35007__cp%2Fd-n_0000000000) closing
   [junit4]   2> 671584 INFO  (OverseerStateUpdate-99211553120976900-127.0.0.1:35007__cp%2Fd-n_0000000000) [    ] o.a.s.c.Overseer Overseer Loop exiting : 127.0.0.1:35007__cp%2Fd
   [junit4]   2> 671584 WARN  (OverseerAutoScalingTriggerThread-99211553120976900-127.0.0.1:35007__cp%2Fd-n_0000000000) [    ] o.a.s.c.a.OverseerTriggerThread OverseerTriggerThread woken up but we are closed, exiting.
   [junit4]   2> 671586 INFO  (TEST-TestNamedUpdateProcessors.test-seed#[C24F81FE41E820F8]) [    ] o.e.j.s.AbstractConnector Stopped ServerConnector@5d6968ad{HTTP/1.1,[http/1.1]}{127.0.0.1:0}
   [junit4]   2> 671586 INFO  (TEST-TestNamedUpdateProcessors.test-seed#[C24F81FE41E820F8]) [    ] o.e.j.s.h.ContextHandler Stopped o.e.j.s.ServletContextHandler@4a287dce{/_cp/d,null,UNAVAILABLE}
   [junit4]   2> 671587 ERROR (TEST-TestNamedUpdateProcessors.test-seed#[C24F81FE41E820F8]) [    ] o.a.z.s.ZooKeeperServer ZKShutdownHandler is not registered, so ZooKeeper server won't take any action on ERROR or SHUTDOWN server state changes
   [junit4]   2> 671587 INFO  (TEST-TestNamedUpdateProcessors.test-seed#[C24F81FE41E820F8]) [    ] o.a.s.c.ZkTestServer connecting to 127.0.0.1:33709 33709
   [junit4]   2> 686598 INFO  (Thread-2307) [    ] o.a.s.c.ZkTestServer connecting to 127.0.0.1:33709 33709
   [junit4]   2> 686599 WARN  (Thread-2307) [    ] o.a.s.c.ZkTestServer Watch limit violations: 
   [junit4]   2> Maximum concurrent create/delete watches above limit:
   [junit4]   2> 
   [junit4]   2> 	3	/solr/aliases.json
   [junit4]   2> 
   [junit4]   2> Maximum concurrent data watches above limit:
   [junit4]   2> 
   [junit4]   2> 	3	/solr/clusterstate.json
   [junit4]   2> 	3	/solr/clusterprops.json
   [junit4]   2> 
   [junit4]   2> Maximum concurrent children watches above limit:
   [junit4]   2> 
   [junit4]   2> 	3	/solr/live_nodes
   [junit4]   2> 	3	/solr/collections
   [junit4]   2> 
   [junit4]   2> NOTE: reproduce with: ant test  -Dtestcase=TestNamedUpdateProcessors -Dtests.method=test -Dtests.seed=C24F81FE41E820F8 -Dtests.multiplier=3 -Dtests.slow=true -Dtests.locale=ca -Dtests.timezone=Europe/Ulyanovsk -Dtests.asserts=true -Dtests.file.encoding=UTF-8
   [junit4] ERROR   77.0s J1 | TestNamedUpdateProcessors.test <<<
   [junit4]    > Throwable #1: org.apache.solr.client.solrj.impl.HttpSolrClient$RemoteSolrException: Error from server at http://127.0.0.1:35007/_cp/d: Could not fully create collection: collection1
   [junit4]    > 	at __randomizedtesting.SeedInfo.seed([C24F81FE41E820F8:4A1BBE24EF144D00]:0)
   [junit4]    > 	at org.apache.solr.client.solrj.impl.HttpSolrClient.executeMethod(HttpSolrClient.java:643)
   [junit4]    > 	at org.apache.solr.client.solrj.impl.HttpSolrClient.request(HttpSolrClient.java:255)
   [junit4]    > 	at org.apache.solr.client.solrj.impl.HttpSolrClient.request(HttpSolrClient.java:244)
   [junit4]    > 	at org.apache.solr.client.solrj.impl.LBHttpSolrClient.doRequest(LBHttpSolrClient.java:483)
   [junit4]    > 	at org.apache.solr.client.solrj.impl.LBHttpSolrClient.request(LBHttpSolrClient.java:413)
   [junit4]    > 	at org.apache.solr.client.solrj.impl.CloudSolrClient.sendRequest(CloudSolrClient.java:1104)
   [junit4]    > 	at org.apache.solr.client.solrj.impl.CloudSolrClient.requestWithRetryOnStaleState(CloudSolrClient.java:884)
   [junit4]    > 	at org.apache.solr.client.solrj.impl.CloudSolrClient.request(CloudSolrClient.java:817)
   [junit4]    > 	at org.apache.solr.client.solrj.SolrRequest.process(SolrRequest.java:194)
   [junit4]    > 	at org.apache.solr.client.solrj.SolrRequest.process(SolrRequest.java:211)
   [junit4]    > 	at org.apache.solr.cloud.AbstractFullDistribZkTestBase.createJettys(AbstractFullDistribZkTestBase.java:385)
   [junit4]    > 	at org.apache.solr.cloud.AbstractFullDistribZkTestBase.createServers(AbstractFullDistribZkTestBase.java:334)
   [junit4]    > 	at org.apache.solr.BaseDistributedSearchTestCase$ShardsRepeatRule$ShardsFixedStatement.callStatement(BaseDistributedSearchTestCase.java:991)
   [junit4]    > 	at org.apache.solr.BaseDistributedSearchTestCase$ShardsRepeatRule$ShardsStatement.evaluate(BaseDistributedSearchTestCase.java:968)
   [junit4]    > 	at java.base/java.lang.Thread.run(Thread.java:844)
   [junit4]   2> NOTE: leaving temporary files on disk at: /home/jenkins/workspace/Lucene-Solr-7.x-Linux/solr/build/solr-core/test/J1/temp/solr.update.processor.TestNamedUpdateProcessors_C24F81FE41E820F8-001
   [junit4]   2> NOTE: test params are: codec=CheapBastard, sim=RandomSimilarity(queryNorm=true): {}, locale=ca, timezone=Europe/Ulyanovsk
   [junit4]   2> NOTE: Linux 4.10.0-40-generic amd64/Oracle Corporation 10-ea (64-bit)/cpus=8,threads=1,free=212707096,total=518979584
   [junit4]   2> NOTE: All tests run in this JVM: [SampleTest, CreateCollectionCleanupTest, TestLazyCores, TestHalfAndHalfDocValues, OverriddenZkACLAndCredentialsProvidersTest, ClassificationUpdateProcessorIntegrationTest, BadIndexSchemaTest, DocumentAnalysisRequestHandlerTest, ChaosMonkeySafeLeaderTest, BadCopyFieldTest, SolrIndexConfigTest, SynonymTokenizerTest, TestFileDictionaryLookup, TestTolerantUpdateProcessorCloud, RollingRestartTest, ZkStateReaderTest, JvmMetricsTest, TestSurroundQueryParser, TestJmxIntegration, TlogReplayBufferedWhileIndexingTest, SchemaVersionSpecificBehaviorTest, AtomicUpdateProcessorFactoryTest, TestCollationField, HttpSolrCallGetCoreTest, NodeLostTriggerTest, InfixSuggestersTest, TestConfigSets, DocValuesMultiTest, ShardRoutingCustomTest, LeaderFailureAfterFreshStartTest, TestPivotHelperCode, TestHdfsUpdateLog, TestSchemalessBufferedUpdates, DistributedFacetPivotSmallTest, TestReplicationHandlerBackup, ZkSolrClientTest, DirectUpdateHandlerTest, SmileWriterTest, TestRestManager, OpenCloseCoreStressTest, HdfsDirectoryFactoryTest, TestGenericDistributedQueue, AnalyticsMergeStrategyTest, CloudExitableDirectoryReaderTest, TestReloadDeadlock, TestComputePlanAction, SortSpecParsingTest, HdfsBasicDistributedZkTest, TestLegacyFieldCache, CoreSorterTest, TestClassicSimilarityFactory, TestSimpleTrackingShardHandler, SolrJmxReporterTest, HttpPartitionTest, SuggesterTSTTest, MoveReplicaHDFSFailoverTest, HighlighterMaxOffsetTest, HLLSerializationTest, SolrGangliaReporterTest, TestMinMaxOnMultiValuedField, UninvertDocValuesMergePolicyTest, TestFieldCache, DistributedTermsComponentTest, SolrShardReporterTest, TestAtomicUpdateErrorCases, TestConfigSetsAPIExclusivity, TestNamedUpdateProcessors]
   [junit4] Completed [204/763 (1!)] on J1 in 77.06s, 1 test, 1 error <<< FAILURES!

[...truncated 521 lines...]
   [junit4] Suite: org.apache.solr.cloud.CollectionsAPIDistributedZkTest
   [junit4]   2> Creating dataDir: /home/jenkins/workspace/Lucene-Solr-7.x-Linux/solr/build/solr-core/test/J1/temp/solr.cloud.CollectionsAPIDistributedZkTest_C24F81FE41E820F8-001/init-core-data-001
   [junit4]   2> 1131292 WARN  (SUITE-CollectionsAPIDistributedZkTest-seed#[C24F81FE41E820F8]-worker) [    ] o.a.s.SolrTestCaseJ4 startTrackingSearchers: numOpens=841 numCloses=841
   [junit4]   2> 1131292 INFO  (SUITE-CollectionsAPIDistributedZkTest-seed#[C24F81FE41E820F8]-worker) [    ] o.a.s.SolrTestCaseJ4 Using PointFields (NUMERIC_POINTS_SYSPROP=true) w/NUMERIC_DOCVALUES_SYSPROP=false
   [junit4]   2> 1131293 INFO  (SUITE-CollectionsAPIDistributedZkTest-seed#[C24F81FE41E820F8]-worker) [    ] o.a.s.SolrTestCaseJ4 Randomized ssl (true) and clientAuth (false) via: @org.apache.solr.util.RandomizeSSL(reason="", ssl=0.0/0.0, value=0.0/0.0, clientAuth=0.0/0.0)
   [junit4]   2> 1131293 INFO  (SUITE-CollectionsAPIDistributedZkTest-seed#[C24F81FE41E820F8]-worker) [    ] o.a.s.SolrTestCaseJ4 SecureRandom sanity checks: test.solr.allowed.securerandom=null & java.security.egd=file:/dev/./urandom
   [junit4]   2> 1131294 INFO  (SUITE-CollectionsAPIDistributedZkTest-seed#[C24F81FE41E820F8]-worker) [    ] o.a.s.c.MiniSolrCloudCluster Starting cluster of 4 servers in /home/jenkins/workspace/Lucene-Solr-7.x-Linux/solr/build/solr-core/test/J1/temp/solr.cloud.CollectionsAPIDistributedZkTest_C24F81FE41E820F8-001/tempDir-001
   [junit4]   2> 1131294 INFO  (SUITE-CollectionsAPIDistributedZkTest-seed#[C24F81FE41E820F8]-worker) [    ] o.a.s.c.ZkTestServer STARTING ZK TEST SERVER
   [junit4]   2> 1131294 INFO  (Thread-3361) [    ] o.a.s.c.ZkTestServer client port:0.0.0.0/0.0.0.0:0
   [junit4]   2> 1131294 INFO  (Thread-3361) [    ] o.a.s.c.ZkTestServer Starting server
   [junit4]   2> 1131295 ERROR (Thread-3361) [    ] o.a.z.s.ZooKeeperServer ZKShutdownHandler is not registered, so ZooKeeper server won't take any action on ERROR or SHUTDOWN server state changes
   [junit4]   2> 1131394 INFO  (SUITE-CollectionsAPIDistributedZkTest-seed#[C24F81FE41E820F8]-worker) [    ] o.a.s.c.ZkTestServer start zk server on port:40029
   [junit4]   2> 1131396 INFO  (zkConnectionManagerCallback-3849-thread-1) [    ] o.a.s.c.c.ConnectionManager zkClient has connected
   [junit4]   2> 1131397 INFO  (jetty-launcher-3846-thread-2) [    ] o.e.j.s.Server jetty-9.3.20.v20170531
   [junit4]   2> 1131398 INFO  (jetty-launcher-3846-thread-4) [    ] o.e.j.s.Server jetty-9.3.20.v20170531
   [junit4]   2> 1131398 INFO  (jetty-launcher-3846-thread-1) [    ] o.e.j.s.Server jetty-9.3.20.v20170531
   [junit4]   2> 1131398 INFO  (jetty-launcher-3846-thread-3) [    ] o.e.j.s.Server jetty-9.3.20.v20170531
   [junit4]   2> 1131398 INFO  (jetty-launcher-3846-thread-4) [    ] o.e.j.s.h.ContextHandler Started o.e.j.s.ServletContextHandler@63d5e9b6{/solr,null,AVAILABLE}
   [junit4]   2> 1131398 INFO  (jetty-launcher-3846-thread-2) [    ] o.e.j.s.h.ContextHandler Started o.e.j.s.ServletContextHandler@5496bdc9{/solr,null,AVAILABLE}
   [junit4]   2> 1131398 INFO  (jetty-launcher-3846-thread-3) [    ] o.e.j.s.h.ContextHandler Started o.e.j.s.ServletContextHandler@3fc283ab{/solr,null,AVAILABLE}
   [junit4]   2> 1131399 INFO  (jetty-launcher-3846-thread-1) [    ] o.e.j.s.h.ContextHandler Started o.e.j.s.ServletContextHandler@4bfca8d0{/solr,null,AVAILABLE}
   [junit4]   2> 1131404 INFO  (jetty-launcher-3846-thread-4) [    ] o.e.j.s.AbstractConnector Started ServerConnector@7e4690e6{SSL,[ssl, http/1.1]}{127.0.0.1:39525}
   [junit4]   2> 1131404 INFO  (jetty-launcher-3846-thread-3) [    ] o.e.j.s.AbstractConnector Started ServerConnector@78a70614{SSL,[ssl, http/1.1]}{127.0.0.1:42821}
   [junit4]   2> 1131404 INFO  (jetty-launcher-3846-thread-4) [    ] o.e.j.s.Server Started @1133050ms
   [junit4]   2> 1131404 INFO  (jetty-launcher-3846-thread-3) [    ] o.e.j.s.Server Started @1133050ms
   [junit4]   2> 1131404 INFO  (jetty-launcher-3846-thread-1) [    ] o.e.j.s.AbstractConnector Started ServerConnector@c0eced5{SSL,[ssl, http/1.1]}{127.0.0.1:35395}
   [junit4]   2> 1131404 INFO  (jetty-launcher-3846-thread-4) [    ] o.a.s.c.s.e.JettySolrRunner Jetty properties: {hostContext=/solr, hostPort=39525}
   [junit4]   2> 1131404 INFO  (jetty-launcher-3846-thread-1) [    ] o.e.j.s.Server Started @1133050ms
   [junit4]   2> 1131404 INFO  (jetty-launcher-3846-thread-2) [    ] o.e.j.s.AbstractConnector Started ServerConnector@49b97179{SSL,[ssl, http/1.1]}{127.0.0.1:43503}
   [junit4]   2> 1131404 INFO  (jetty-launcher-3846-thread-1) [    ] o.a.s.c.s.e.JettySolrRunner Jetty properties: {hostContext=/solr, hostPort=35395}
   [junit4]   2> 1131404 INFO  (jetty-launcher-3846-thread-2) [    ] o.e.j.s.Server Started @1133050ms
   [junit4]   2> 1131404 INFO  (jetty-launcher-3846-thread-3) [    ] o.a.s.c.s.e.JettySolrRunner Jetty properties: {hostContext=/solr, hostPort=42821}
   [junit4]   2> 1131404 INFO  (jetty-launcher-3846-thread-2) [    ] o.a.s.c.s.e.JettySolrRunner Jetty properties: {hostContext=/solr, hostPort=43503}
   [junit4]   2> 1131404 ERROR (jetty-launcher-3846-thread-4) [    ] o.a.s.u.StartupLoggingUtils Missing Java Option solr.log.dir. Logging may be missing or incomplete.
   [junit4]   2> 1131404 ERROR (jetty-launcher-3846-thread-1) [    ] o.a.s.u.StartupLoggingUtils Missing Java Option solr.log.dir. Logging may be missing or incomplete.
   [junit4]   2> 1131404 ERROR (jetty-launcher-3846-thread-2) [    ] o.a.s.u.StartupLoggingUtils Missing Java Option solr.log.dir. Logging may be missing or incomplete.
   [junit4]   2> 1131404 INFO  (jetty-launcher-3846-thread-1) [    ] o.a.s.s.SolrDispatchFilter  ___      _       Welcome to Apache Solr™ version 7.3.0
   [junit4]   2> 1131404 INFO  (jetty-launcher-3846-thread-2) [    ] o.a.s.s.SolrDispatchFilter  ___      _       Welcome to Apache Solr™ version 7.3.0
   [junit4]   2> 1131404 INFO  (jetty-launcher-3846-thread-1) [    ] o.a.s.s.SolrDispatchFilter / __| ___| |_ _   Starting in cloud mode on port null
   [junit4]   2> 1131404 INFO  (jetty-launcher-3846-thread-2) [    ] o.a.s.s.SolrDispatchFilter / __| ___| |_ _   Starting in cloud mode on port null
   [junit4]   2> 1131404 INFO  (jetty-launcher-3846-thread-1) [    ] o.a.s.s.SolrDispatchFilter \__ \/ _ \ | '_|  Install dir: null
   [junit4]   2> 1131404 INFO  (jetty-launcher-3846-thread-2) [    ] o.a.s.s.SolrDispatchFilter \__ \/ _ \ | '_|  Install dir: null
   [junit4]   2> 1131404 INFO  (jetty-launcher-3846-thread-1) [    ] o.a.s.s.SolrDispatchFilter |___/\___/_|_|    Start time: 2017-12-21T09:31:23.458984Z
   [junit4]   2> 1131405 INFO  (jetty-launcher-3846-thread-2) [    ] o.a.s.s.SolrDispatchFilter |___/\___/_|_|    Start time: 2017-12-21T09:31:23.458998Z
   [junit4]   2> 1131404 INFO  (jetty-launcher-3846-thread-4) [    ] o.a.s.s.SolrDispatchFilter  ___      _       Welcome to Apache Solr™ version 7.3.0
   [junit4]   2> 1131404 ERROR (jetty-launcher-3846-thread-3) [    ] o.a.s.u.StartupLoggingUtils Missing Java Option solr.log.dir. Logging may be missing or incomplete.
   [junit4]   2> 1131405 INFO  (jetty-launcher-3846-thread-4) [    ] o.a.s.s.SolrDispatchFilter / __| ___| |_ _   Starting in cloud mode on port null
   [junit4]   2> 1131405 INFO  (jetty-launcher-3846-thread-3) [    ] o.a.s.s.SolrDispatchFilter  ___      _       Welcome to Apache Solr™ version 7.3.0
   [junit4]   2> 1131405 INFO  (jetty-launcher-3846-thread-4) [    ] o.a.s.s.SolrDispatchFilter \__ \/ _ \ | '_|  Install dir: null
   [junit4]   2> 1131405 INFO  (jetty-launcher-3846-thread-3) [    ] o.a.s.s.SolrDispatchFilter / __| ___| |_ _   Starting in cloud mode on port null
   [junit4]   2> 1131405 INFO  (jetty-launcher-3846-thread-4) [    ] o.a.s.s.SolrDispatchFilter |___/\___/_|_|    Start time: 2017-12-21T09:31:23.459179Z
   [junit4]   2> 1131405 INFO  (jetty-launcher-3846-thread-3) [    ] o.a.s.s.SolrDispatchFilter \__ \/ _ \ | '_|  Install dir: null
   [junit4]   2> 1131405 INFO  (jetty-launcher-3846-thread-3) [    ] o.a.s.s.SolrDispatchFilter |___/\___/_|_|    Start time: 2017-12-21T09:31:23.459242Z
   [junit4]   2> 1131405 INFO  (zkConnectionManagerCallback-3852-thread-1) [    ] o.a.s.c.c.ConnectionManager zkClient has connected
   [junit4]   2> 1131405 INFO  (zkConnectionManagerCallback-3855-thread-1) [    ] o.a.s.c.c.ConnectionManager zkClient has connected
   [junit4]   2> 1131406 INFO  (jetty-launcher-3846-thread-1) [    ] o.a.s.s.SolrDispatchFilter solr.xml found in ZooKeeper. Loading...
   [junit4]   2> 1131406 INFO  (jetty-launcher-3846-thread-4) [    ] o.a.s.s.SolrDispatchFilter solr.xml found in ZooKeeper. Loading...
   [junit4]   2> 1131406 INFO  (zkConnectionManagerCallback-3853-thread-1) [    ] o.a.s.c.c.ConnectionManager zkClient has connected
   [junit4]   2> 1131406 INFO  (zkConnectionManagerCallback-3857-thread-1) [    ] o.a.s.c.c.ConnectionManager zkClient has connected
   [junit4]   2> 1131406 INFO  (jetty-launcher-3846-thread-3) [    ] o.a.s.s.SolrDispatchFilter solr.xml found in ZooKeeper. Loading...
   [junit4]   2> 1131406 INFO  (jetty-launcher-3846-thread-2) [    ] o.a.s.s.SolrDispatchFilter solr.xml found in ZooKeeper. Loading...
   [junit4]   2> 1131407 INFO  (jetty-launcher-3846-thread-3) [    ] o.a.s.c.SolrXmlConfig Configuration parameter autoReplicaFailoverWorkLoopDelay is ignored
   [junit4]   2> 1131407 INFO  (jetty-launcher-3846-thread-4) [    ] o.a.s.c.SolrXmlConfig Configuration parameter autoReplicaFailoverWorkLoopDelay is ignored
   [junit4]   2> 1131407 INFO  (jetty-launcher-3846-thread-3) [    ] o.a.s.c.SolrXmlConfig Configuration parameter autoReplicaFailoverBadNodeExpiration is ignored
   [junit4]   2> 1131407 INFO  (jetty-launcher-3846-thread-4) [    ] o.a.s.c.SolrXmlConfig Configuration parameter autoReplicaFailoverBadNodeExpiration is ignored
   [junit4]   2> 1131407 INFO  (jetty-launcher-3846-thread-1) [    ] o.a.s.c.SolrXmlConfig Configuration parameter autoReplicaFailoverWorkLoopDelay is ignored
   [junit4]   2> 1131407 INFO  (jetty-launcher-3846-thread-1) [    ] o.a.s.c.SolrXmlConfig Configuration parameter autoReplicaFailoverBadNodeExpiration is ignored
   [junit4]   2> 1131417 INFO  (jetty-launcher-3846-thread-2) [    ] o.a.s.c.SolrXmlConfig Configuration parameter autoReplicaFailoverWorkLoopDelay is ignored
   [junit4]   2> 1131417 INFO  (jetty-launcher-3846-thread-2) [    ] o.a.s.c.SolrXmlConfig Configuration parameter autoReplicaFailoverBadNodeExpiration is ignored
   [junit4]   2> 1131417 WARN  (NIOServerCxn.Factory:0.0.0.0/0.0.0.0:0) [    ] o.a.z.s.NIOServerCnxn caught end of stream exception
   [junit4]   2> EndOfStreamException: Unable to read additional data from client sessionid 0x1607869bb550001, likely client has closed socket
   [junit4]   2> 	at org.apache.zookeeper.server.NIOServerCnxn.doIO(NIOServerCnxn.java:239)
   [junit4]   2> 	at org.apache.zookeeper.server.NIOServerCnxnFactory.run(NIOServerCnxnFactory.java:203)
   [junit4]   2> 	at java.base/java.lang.Thread.run(Thread.java:844)
   [junit4]   2> 1131419 INFO  (jetty-launcher-3846-thread-1) [    ] o.a.s.c.ZkContainer Zookeeper client=127.0.0.1:40029/solr
   [junit4]   2> 1131419 INFO  (jetty-launcher-3846-thread-4) [    ] o.a.s.c.ZkContainer Zookeeper client=127.0.0.1:40029/solr
   [junit4]   2> 1131419 INFO  (jetty-launcher-3846-thread-2) [    ] o.a.s.c.ZkContainer Zookeeper client=127.0.0.1:40029/solr
   [junit4]   2> 1131420 INFO  (jetty-launcher-3846-thread-3) [    ] o.a.s.c.ZkContainer Zookeeper client=127.0.0.1:40029/solr
   [junit4]   2> 1131420 INFO  (zkConnectionManagerCallback-3865-thread-1) [    ] o.a.s.c.c.ConnectionManager zkClient has connected
   [junit4]   2> 1131420 INFO  (zkConnectionManagerCallback-3868-thread-1) [    ] o.a.s.c.c.ConnectionManager zkClient has connected
   [junit4]   2> 1131420 INFO  (zkConnectionManagerCallback-3870-thread-1) [    ] o.a.s.c.c.ConnectionManager zkClient has connected
   [junit4]   2> 1131420 INFO  (zkConnectionManagerCallback-3873-thread-1) [    ] o.a.s.c.c.ConnectionManager zkClient has connected
   [junit4]   2> 1131421 INFO  (zkConnectionManagerCallback-3875-thread-1) [    ] o.a.s.c.c.ConnectionManager zkClient has connected
   [junit4]   2> 1131421 INFO  (zkConnectionManagerCallback-3877-thread-1) [    ] o.a.s.c.c.ConnectionManager zkClient has connected
   [junit4]   2> 1131425 INFO  (zkConnectionManagerCallback-3879-thread-1) [    ] o.a.s.c.c.ConnectionManager zkClient has connected
   [junit4]   2> 1131425 INFO  (zkConnectionManagerCallback-3881-thread-1) [    ] o.a.s.c.c.ConnectionManager zkClient has connected
   [junit4]   2> 1131429 INFO  (jetty-launcher-3846-thread-2) [    ] o.a.s.c.Overseer Overseer (id=null) closing
   [junit4]   2> 1131429 INFO  (jetty-launcher-3846-thread-3) [    ] o.a.s.c.Overseer Overseer (id=null) closing
   [junit4]   2> 1131430 INFO  (jetty-launcher-3846-thread-2) [    ] o.a.s.c.OverseerElectionContext I am going to be the leader 127.0.0.1:43503_solr
   [junit4]   2> 1131430 INFO  (jetty-launcher-3846-thread-3) [    ] o.a.s.c.ZkController Register node as live in ZooKeeper:/live_nodes/127.0.0.1:42821_solr
   [junit4]   2> 1131430 INFO  (jetty-launcher-3846-thread-2) [    ] o.a.s.c.Overseer Overseer (id=99211587311960075-127.0.0.1:43503_solr-n_0000000000) starting
   [junit4]   2> 1131433 INFO  (jetty-launcher-3846-thread-2) [    ] o.a.s.c.ZkController Register node as live in ZooKeeper:/live_nodes/127.0.0.1:43503_solr
   [junit4]   2> 1131442 INFO  (zkCallback-3880-thread-1) [    ] o.a.s.c.c.ZkStateReader Updated live nodes from ZooKeeper... (0) -> (1)
   [junit4]   2> 1131442 INFO  (zkCallback-3878-thread-1) [    ] o.a.s.c.c.ZkStateReader Updated live nodes from ZooKeeper... (0) -> (1)
   [junit4]   2> 1131442 INFO  (OverseerStateUpdate-99211587311960075-127.0.0.1:43503_solr-n_0000000000) [    ] o.a.s.c.c.ZkStateReader Updated live nodes from ZooKeeper... (1) -> (2)
   [junit4]   2> 1131443 INFO  (zkCallback-3880-thread-2) [    ] o.a.s.c.c.ZkStateReader Updated live nodes from ZooKeeper... (1) -> (2)
   [junit4]   2> 1131453 INFO  (jetty-launcher-3846-thread-4) [    ] o.a.s.c.c.ZkStateReader Updated live nodes from ZooKeeper... (0) -> (2)
   [junit4]   2> 1131454 INFO  (jetty-launcher-3846-thread-4) [    ] o.a.s.c.Overseer Overseer (id=null) closing
   [junit4]   2> 1131455 INFO  (jetty-launcher-3846-thread-4) [    ] o.a.s.c.ZkController Register node as live in ZooKeeper:/live_nodes/127.0.0.1:39525_solr
   [junit4]   2> 1131455 INFO  (zkCallback-3880-thread-2) [    ] o.a.s.c.c.ZkStateReader Updated live nodes from ZooKeeper... (2) -> (3)
   [junit4]   2> 1131455 INFO  (zkCallback-3878-thread-2) [    ] o.a.s.c.c.ZkStateReader Updated live nodes from ZooKeeper... (2) -> (3)
   [junit4]   2> 1131455 INFO  (zkCallback-3876-thread-1) [    ] o.a.s.c.c.ZkStateReader Updated live nodes from ZooKeeper... (2) -> (3)
   [junit4]   2> 1131458 INFO  (jetty-launcher-3846-thread-1) [    ] o.a.s.c.c.ZkStateReader Updated live nodes from ZooKeeper... (0) -> (3)
   [junit4]   2> 1131458 INFO  (jetty-launcher-3846-thread-1) [    ] o.a.s.c.Overseer Overseer (id=null) closing
   [junit4]   2> 1131459 INFO  (jetty-launcher-3846-thread-1) [    ] o.a.s.c.ZkController Register node as live in ZooKeeper:/live_nodes/127.0.0.1:35395_solr
   [junit4]   2> 1131459 INFO  (zkCallback-3880-thread-2) [    ] o.a.s.c.c.ZkStateReader Updated live nodes from ZooKeeper... (3) -> (4)
   [junit4]   2> 1131459 INFO  (zkCallback-3876-thread-1) [    ] o.a.s.c.c.ZkStateReader Updated live nodes from ZooKeeper... (3) -> (4)
   [junit4]   2> 1131459 INFO  (zkCallback-3878-thread-2) [    ] o.a.s.c.c.ZkStateReader Updated live nodes from ZooKeeper... (3) -> (4)
   [junit4]   2> 1131466 INFO  (zkCallback-3874-thread-1) [    ] o.a.s.c.c.ZkStateReader Updated live nodes from ZooKeeper... (3) -> (4)
   [junit4]   2> 1131466 INFO  (jetty-launcher-3846-thread-2) [    ] o.a.s.m.r.SolrJmxReporter JMX monitoring for 'solr.node' (registry 'solr.node') enabled at server: com.sun.jmx.mbeanserver.JmxMBeanServer@240bdffd
   [junit4]   2> 1131471 INFO  (jetty-launcher-3846-thread-2) [    ] o.a.s.m.r.SolrJmxReporter JMX monitoring for 'solr.jvm' (registry 'solr.jvm') enabled at server: com.sun.jmx.mbeanserver.JmxMBeanServer@240bdffd
   [junit4]   2> 1131471 INFO  (jetty-launcher-3846-thread-2) [    ] o.a.s.m.r.SolrJmxReporter JMX monitoring for 'solr.jetty' (registry 'solr.jetty') enabled at server: com.sun.jmx.mbeanserver.JmxMBeanServer@240bdffd
   [junit4]   2> 1131472 INFO  (jetty-launcher-3846-thread-2) [    ] o.a.s.c.CorePropertiesLocator Found 0 core definitions underneath /home/jenkins/workspace/Lucene-Solr-7.x-Linux/solr/build/solr-core/test/J1/temp/solr.cloud.CollectionsAPIDistributedZkTest_C24F81FE41E820F8-001/tempDir-001/node2
   [junit4]   2> 1131479 INFO  (jetty-launcher-3846-thread-4) [    ] o.a.s.m.r.SolrJmxReporter JMX monitoring for 'solr.node' (registry 'solr.node') enabled at server: com.sun.jmx.mbeanserver.JmxMBeanServer@240bdffd
   [junit4]   2> 1131482 INFO  (jetty-launcher-3846-thread-3) [    ] o.a.s.m.r.SolrJmxReporter JMX monitoring for 'solr.node' (registry 'solr.node') enabled at server: com.sun.jmx.mbeanserver.JmxMBeanServer@240bdffd
   [junit4]   2> 1131484 WARN  (jetty-launcher-3846-thread-3) [    ] o.a.s.m.r.j.JmxMetricsReporter Unable to register gauge
   [junit4]   2> javax.management.InstanceNotFoundException: solr:dom1=jvm,name0=memory,name1=pools,name2=Survivor-Space,name=committed
   [junit4]   2> 	at java.management/com.sun.jmx.interceptor.DefaultMBeanServerInterceptor.getMBean(DefaultMBeanServerInterceptor.java:1083)
   [junit4]   2> 	at java.management/com.sun.jmx.interceptor.DefaultMBeanServerInterceptor.exclusiveUnregisterMBean(DefaultMBeanServerInterceptor.java:423)
   [junit4]   2> 	at java.management/com.sun.jmx.interceptor.DefaultMBeanServerInterceptor.unregisterMBean(DefaultMBeanServerInterceptor.java:411)
   [junit4]   2> 	at java.management/com.sun.jmx.mbeanserver.JmxMBeanServer.unregisterMBean(JmxMBeanServer.java:546)
   [junit4]   2> 	at org.apache.solr.metrics.reporters.jmx.JmxMetricsReporter$JmxListener.registerMBean(JmxMetricsReporter.java:530)
   [junit4]   2> 	at org.apache.solr.metrics.reporters.jmx.JmxMetricsReporter$JmxListener.onGaugeAdded(JmxMetricsReporter.java:565)
   [junit4]   2> 	at com.codahale.metrics.MetricRegistry.notifyListenerOfAddedMetric(MetricRegistry.java:454)
   [junit4]   2> 	at com.codahale.metrics.MetricRegistry.addListener(MetricRegistry.java:297)
   [junit4]   2> 	at org.apache.solr.metrics.reporters.jmx.JmxMetricsReporter.start(JmxMetricsReporter.java:725)
   [junit4]   2> 	at org.apache.solr.metrics.reporters.SolrJmxReporter.doInit(SolrJmxReporter.java:109)
   [junit4]   2> 	at org.apache.solr.metrics.SolrMetricReporter.init(SolrMetricReporter.java:70)
   [junit4]   2> 	at org.apache.solr.metrics.SolrMetricManager.loadReporter(SolrMetricManager.java:881)
   [junit4]   2> 	at org.apache.solr.metrics.SolrMetricManager.loadReporters(SolrMetricManager.java:817)
   [junit4]   2> 	at org.apache.solr.core.CoreContainer.load(CoreContainer.java:547)
   [junit4]   2> 	at org.apache.solr.servlet.SolrDispatchFilter.createCoreContainer(SolrDispatchFilter.java:263)
   [junit4]   2> 	at org.apache.solr.servlet.SolrDispatchFilter.init(SolrDispatchFilter.java:183)
   [junit4]   2> 	at org.eclipse.jetty.servlet.FilterHolder.initialize(FilterHolder.java:139)
   [junit4]   2> 	at org.eclipse.jetty.servlet.ServletHandler.initialize(ServletHandler.java:873)
   [junit4]   2> 	at org.eclipse.jetty.servlet.ServletHandler.updateMappings(ServletHandler.java:1596)
   [junit4]   2> 	at org.eclipse.jetty.servlet.ServletHandler.setFilterMappings(ServletHandler.java:1659)
   [junit4]   2> 	at org.eclipse.jetty.servlet.ServletHandler.addFilterMapping(ServletHandler.java:1316)
   [junit4]   2> 	at org.eclipse.jetty.servlet.ServletHandler.addFilterWithMapping(ServletHandler.java:1145)
   [junit4]   2> 	at org.eclipse.jetty.servlet.ServletContextHandler.addFilter(ServletContextHandler.java:448)
   [junit4]   2> 	at org.apache.solr.client.solrj.embedded.JettySolrRunner$1.lifeCycleStarted(JettySolrRunner.java:306)
   [junit4]   2> 	at org.eclipse.jetty.util.component.AbstractLifeCycle.setStarted(AbstractLifeCycle.java:179)
   [junit4]   2> 	at org.eclipse.jetty.util.component.AbstractLifeCycle.start(AbstractLifeCycle.java:69)
   [junit4]   2> 	at org.apache.solr.client.solrj.embedded.JettySolrRunner.start(JettySolrRunner.java:394)
   [junit4]   2> 	at org.apache.solr.client.solrj.embedded.JettySolrRunner.start(JettySolrRunner.java:367)
   [junit4]   2> 	at org.apache.solr.cloud.MiniSolrCloudCluster.startJettySolrRunner(MiniSolrCloudCluster.java:384)
   [junit4]   2> 	at org.apache.solr.cloud.MiniSolrCloudCluster.lambda$new$0(MiniSolrCloudCluster.java:247)
   [junit4]   2> 	at java.base/java.util.concurrent.FutureTask.run(FutureTask.java:264)
   [junit4]   2> 	at org.apache.solr.common.util.ExecutorUtil$MDCAwareThreadPoolExecutor.lambda$execute$0(ExecutorUtil.java:188)
   [junit4]   2> 	at java.base/java.util.concurrent.ThreadPoolExecutor.runWorker(ThreadPoolExecutor.java:1135)
   [junit4]   2> 	at java.base/java.util.concurrent.ThreadPoolExecutor$Worker.run(ThreadPoolExecutor.java:635)
   [junit4]   2> 	at java.base/java.lang.Thread.run(Thread.java:844)
   [junit4]   2> 1131484 WARN  (jetty-launcher-3846-thread-4) [    ] o.a.s.m.r.j.JmxMetricsReporter Unable to register gauge
   [junit4]   2> javax.management.InstanceNotFoundException: solr:dom1=jvm,name0=system,name=properties
   [junit4]   2> 	at java.management/com.sun.jmx.interceptor.DefaultMBeanServerInterceptor.getMBean(DefaultMBeanServerInterceptor.java:1083)
   [junit4]   2> 	at java.management/com.sun.jmx.interceptor.DefaultMBeanServerInterceptor.exclusiveUnregisterMBean(DefaultMBeanServerInterceptor.java:423)
   [junit4]   2> 	at java.management/com.sun.jmx.interceptor.DefaultMBeanServerInterceptor.unregisterMBean(DefaultMBeanServerInterceptor.java:411)
   [junit4]   2> 	at java.management/com.sun.jmx.mbeanserver.JmxMBeanServer.unregisterMBean(JmxMBeanServer.java:546)
   [junit4]   2> 	at org.apache.solr.metrics.reporters.jmx.JmxMetricsReporter$JmxListener.registerMBean(JmxMetricsReporter.java:530)
   [junit4]   2> 	at org.apache.solr.metrics.reporters.jmx.JmxMetricsReporter$JmxListener.onGaugeAdded(JmxMetricsReporter.java:563)
   [junit4]   2> 	at org.apache.solr.metrics.reporters.jmx.JmxMetricsReporter.lambda$start$0(JmxMetricsReporter.java:738)
   [junit4]   2> 	at java.base/java.util.HashMap.forEach(HashMap.java:1341)
   [junit4]   2> 	at org.apache.solr.metrics.reporters.jmx.JmxMetricsReporter.start(JmxMetricsReporter.java:728)
   [junit4]   2> 	at org.apache.solr.metrics.reporters.SolrJmxReporter.doInit(SolrJmxReporter.java:109)
   [junit4]   2> 	at org.apache.solr.metrics.SolrMetricReporter.init(SolrMetricReporter.java:70)
   [junit4]   2> 	at org.apache.solr.metrics.SolrMetricManager.loadReporter(SolrMetricManager.java:881)
   [junit4]   2> 	at org.apache.solr.metrics.SolrMetricManager.loadReporters(SolrMetricManager.java:817)
   [junit4]   2> 	at org.apache.solr.core.CoreContainer.load(CoreContainer.java:547)
   [junit4]   2> 	at org.apache.solr.servlet.SolrDispatchFilter.createCoreContainer(SolrDispatchFilter.java:263)
   [junit4]   2> 	at org.apache.solr.servlet.SolrDispatchFilter.init(SolrDispatchFilter.java:183)
   [junit4]   2> 	at org.eclipse.jetty.servlet.FilterHolder.initialize(FilterHolder.java:139)
   [junit4]   2> 	at org.eclipse.jetty.servlet.ServletHandler.initialize(ServletHandler.java:873)
   [junit4]   2> 	at org.eclipse.jetty.servlet.ServletHandler.updateMappings(ServletHandler.java:1596)
   [junit4]   2> 	at org.eclipse.jetty.servlet.ServletHandler.setFilterMappings(ServletHandler.java:1659)
   [junit4]   2> 	at org.eclipse.jetty.servlet.ServletHandler.addFilterMapping(ServletHandler.java:1316)
   [junit4]   2> 	at org.eclipse.jetty.servlet.ServletHandler.addFilterWithMapping(ServletHandler.java:1145)
   [junit4]   2> 	at org.eclipse.jetty.servlet.ServletContextHandler.addFilter(ServletContextHandler.java:448)
   [junit4]   2> 	at org.apache.solr.client.solrj.embedded.JettySolrRunner$1.lifeCycleStarted(JettySolrRunner.java:306)
   [junit4]   2> 	at org.eclipse.jetty.util.component.AbstractLifeCycle.setStarted(AbstractLifeCycle.java:179)
   [junit4]   2> 	at org.eclipse.jetty.util.component.AbstractLifeCycle.start(AbstractLifeCycle.java:69)
   [junit4]   2> 	at org.apache.solr.client.solrj.embedded.JettySolrRunner.start(JettySolrRunner.java:394)
   [junit4]   2> 	at org.apache.solr.client.solrj.embedded.JettySolrRunner.start(JettySolrRunner.java:367)
   [junit4]   2> 	at org.apache.solr.cloud.MiniSolrCloudCluster.startJettySolrRunner(MiniSolrCloudCluster.java:384)
   [junit4]   2> 	at org.apache.solr.cloud.MiniSolrCloudCluster.lambda$new$0(MiniSolrCloudCluster.java:247)
   [junit4]   2> 	at java.base/java.util.concurrent.FutureTask.run(FutureTask.java:264)
   [junit4]   2> 	at org.apache.solr.common.util.ExecutorUtil$MDCAwareThreadPoolExecutor.lambda$execute$0(ExecutorUtil.java:188)
   [junit4]   2> 	at java.base/java.util.concurrent.ThreadPoolExecutor.runWorker(ThreadPoolExecutor.java:1135)
   [junit4]   2> 	at java.base/java.util.concurrent.ThreadPoolExecutor$Worker.run(ThreadPoolExecutor.java:635)
   [junit4]   2> 	at java.base/java.lang.Thread.run(Thread.java:844)
   [junit4]   2> 1131487 INFO  (jetty-launcher-3846-thread-4) [    ] o.a.s.m.r.SolrJmxReporter JMX monitoring for 'solr.jvm' (registry 'solr.jvm') enabled at server: com.sun.jmx.mbeanserver.JmxMBeanServer@240bdffd
   [junit4]   2> 1131487 INFO  (jetty-launcher-3846-thread-4) [    ] o.a.s.m.r.SolrJmxReporter JMX monitoring for 'solr.jetty' (registry 'solr.jetty') enabled at server: com.sun.jmx.mbeanserver.JmxMBeanServer@240bdffd
   [junit4]   2> 1131488 INFO  (jetty-launcher-3846-thread-4) [    ] o.a.s.c.CorePropertiesLocator Found 0 core definitions underneath /home/jenkins/workspace/Lucene-Solr-7.x-Linux/solr/build/solr-core/test/J1/temp/solr.cloud.CollectionsAPIDistributedZkTest_C24F81FE41E820F8-001/tempDir-001/node4
   [junit4]   2> 1131488 WARN  (jetty-launcher-3846-thread-3) [    ] o.a.s.m.r.j.JmxMetricsReporter Unable to register gauge
   [junit4]   2> javax.management.InstanceNotFoundException: solr:dom1=jvm,name0=system,name=properties
   [junit4]   2> 	at java.management/com.sun.jmx.interceptor.DefaultMBeanServerInterceptor.getMBean(DefaultMBeanServerInterceptor.java:1083)
   [junit4]   2> 	at java.management/com.sun.jmx.interceptor.DefaultMBeanServerInterceptor.exclusiveUnregisterMBean(DefaultMBeanServerInterceptor.java:423)
   [junit4]   2> 	at java.management/com.sun.jmx.interceptor.DefaultMBeanServerInterceptor.unregisterMBean(DefaultMBeanServerInterceptor.java:411)
   [junit4]   2> 	at java.management/com.sun.jmx.mbeanserver.JmxMBeanServer.unregisterMBean(JmxMBeanServer.java:546)
   [junit4]   2> 	at org.apache.solr.metrics.reporters.jmx.JmxMetricsReporter$JmxListener.registerMBean(JmxMetricsReporter.java:530)
   [junit4]   2> 	at org.apache.solr.metrics.reporters.jmx.JmxMetricsReporter$JmxListener.onGaugeAdded(JmxMetricsReporter.java:563)
   [junit4]   2> 	at com.codahale.metrics.MetricRegistry.notifyListenerOfAddedMetric(MetricRegistry.java:454)
   [junit4]   2> 	at com.codahale.metrics.MetricRegistry.addListener(MetricRegistry.java:297)
   [junit4]   2> 	at org.apache.solr.metrics.reporters.jmx.JmxMetricsReporter.start(JmxMetricsReporter.java:725)
   [junit4]   2> 	at org.apache.solr.metrics.reporters.SolrJmxReporter.doInit(SolrJmxReporter.java:109)
   [junit4]   2> 	at org.apache.solr.metrics.SolrMetricReporter.init(SolrMetricReporter.java:70)
   [junit4]   2> 	at org.apache.solr.metrics.SolrMetricManager.loadReporter(SolrMetricManager.java:881)
   [junit4]   2> 	at org.apache.solr.metrics.SolrMetricManager.loadReporters(SolrMetricManager.java:817)
   [junit4]   2> 	at org.apache.solr.core.CoreContainer.load(CoreContainer.java:547)
   [junit4]   2> 	at org.apache.solr.servlet.SolrDispatchFilter.createCoreContainer(SolrDispatchFilter.java:263)
   [junit4]   2> 	at org.apache.solr.servlet.SolrDispatchFilter.init(SolrDispatchFilter.java:183)
   [junit4]   2> 	at org.eclipse.jetty.servlet.FilterHolder.initialize(FilterHolder.java:139)
   [junit4]   2> 	at org.eclipse.jetty.servlet.ServletHandler.initialize(ServletHandler.java:873)
   [junit4]   2> 	at org.eclipse.jetty.servlet.ServletHandler.updateMappings(ServletHandler.java:1596)
   [junit4]   2> 	at org.eclipse.jetty.servlet.ServletHandler.setFilterMappings(ServletHandler.java:1659)
   [junit4]   2> 	at org.eclipse.jetty.servlet.ServletHandler.addFilterMapping(ServletHandler.java:1316)
   [junit4]   2> 	at org.eclipse.jetty.servlet.ServletHandler.addFilterWithMapping(ServletHandler.java:1145)
   [junit4]   2> 	at org.eclipse.jetty.servlet.ServletContextHandler.addFilter(ServletContextHandler.java:448)
   [junit4]   2> 	at org.apache.solr.client.solrj.embedded.JettySolrRunner$1.lifeCycleStarted(JettySolrRunner.java:306)
   [junit4]   2> 	at org.eclipse.jetty.util.component.AbstractLifeCycle.setStarted(AbstractLifeCycle.java:179)
   [junit4]   2> 	at org.eclipse.jetty.util.component.AbstractLifeCycle.start(AbstractLifeCycle.java:69)
   [junit4]   2> 	at org.apache.solr.client.solrj.embedded.JettySolrRunner.start(JettySolrRunner.java:394)
   [junit4]   2> 	at org.apache.solr.client.solrj.embedded.JettySolrRunner.start(JettySolrRunner.java:367)
   [junit4]   2> 	at org.apache.solr.cloud.MiniSolrCloudCluster.startJettySolrRunner(MiniSolrCloudCluster.java:384)
   [junit4]   2> 	at org.apache.solr.cloud.MiniSolrCloudCluster.lambda$new$0(MiniSolrCloudCluster.java:247)
   [junit4]   2> 	at java.base/java.util.concurrent.FutureTask.run(FutureTask.java:264)
   [junit4]   2> 	at org.apache.solr.common.util.ExecutorUtil$MDCAwareThreadPoolExecutor.lambda$execute$0(ExecutorUtil.java:188)
   [junit4]   2> 	at java.base/java.util.concurrent.ThreadPoolExecutor.runWorker(ThreadPoolExecutor.java:1135)
   [junit4]   2> 	at java.base/java.util.concurrent.ThreadPoolExecutor$Worker.run(ThreadPoolExecutor.java:635)
   [junit4]   2> 	at java.base/java.lang.Thread.run(Thread.java:844)
   [junit4]   2> 1131511 INFO  (jetty-launcher-3846-thread-3) [    ] o.a.s.m.r.SolrJmxReporter JMX monitoring for 'solr.jvm' (registry 'solr.jvm') enabled at server: com.sun.jmx.mbeanserver.JmxMBeanServer@240bdffd
   [junit4]   2> 1131511 INFO  (jetty-launcher-3846-thread-3) [    ] o.a.s.m.r.SolrJmxReporter JMX monitoring for 'solr.jetty' (registry 'solr.jetty') enabled at server: com.sun.jmx.mbeanserver.JmxMBeanServer@240bdffd
   [junit4]   2> 1131512 INFO  (jetty-launcher-3846-thread-3) [    ] o.a.s.c.CorePropertiesLocator Found 0 core definitions underneath /home/jenkins/workspace/Lucene-Solr-7.x-Linux/solr/build/solr-core/test/J1/temp/solr.cloud.CollectionsAPIDistributedZkTest_C24F81FE41E820F8-001/tempDir-001/node3
   [junit4]   2> 1131522 INFO  (jetty-launcher-3846-thread-1) [    ] o.a.s.m.r.SolrJmxReporter JMX monitoring for 'solr.node' (registry 'solr.node') enabled at server: com.sun.jmx.mbeanserver.JmxMBeanServer@240bdffd
   [junit4]   2> 1131527 WARN  (jetty-launcher-3846-thread-1) [    ] o.a.s.m.r.j.JmxMetricsReporter Unable to register gauge
   [junit4]   2> javax.management.InstanceNotFoundException: solr:dom1=jvm,name0=system,name=properties
   [junit4]   2> 	at java.management/com.sun.jmx.interceptor.DefaultMBeanServerInterceptor.getMBean(DefaultMBeanServerInterceptor.java:1083)
   [junit4]   2> 	at java.management/com.sun.jmx.interceptor.DefaultMBeanServerInterceptor.exclusiveUnregisterMBean(DefaultMBeanServerInterceptor.java:423)
   [junit4]   2> 	at java.management/com.sun.jmx.interceptor.DefaultMBeanServerInterceptor.unregisterMBean(DefaultMBeanServerInterceptor.java:411)
   [junit4]   2> 	at java.management/com.sun.jmx.mbeanserver.JmxMBeanServer.unregisterMBean(JmxMBeanServer.java:546)
   [junit4]   2> 	at org.apache.solr.metrics.reporters.jmx.JmxMetricsReporter$JmxListener.registerMBean(JmxMetricsReporter.java:530)
   [junit4]   2> 	at org.apache.solr.metrics.reporters.jmx.JmxMetricsReporter$JmxListener.onGaugeAdded(JmxMetricsReporter.java:563)
   [junit4]   2> 	at org.apache.solr.metrics.reporters.jmx.JmxMetricsReporter.lambda$start$0(JmxMetricsReporter.java:738)
   [junit4]   2> 	at java.base/java.util.HashMap.forEach(HashMap.java:1341)
   [junit4]   2> 	at org.apache.solr.metrics.reporters.jmx.JmxMetricsReporter.start(JmxMetricsReporter.java:728)
   [junit4]   2> 	at org.apache.solr.metrics.reporters.SolrJmxReporter.doInit(SolrJmxReporter.java:109)
   [junit4]   2> 	at org.apache.solr.metrics.SolrMetricReporter.init(SolrMetricReporter.java:70)
   [junit4]   2> 	at org.apache.solr.metrics.SolrMetricManager.loadReporter(SolrMetricManager.java:881)
   [junit4]   2> 	at org.apache.solr.metrics.SolrMetricManager.loadReporters(SolrMetricManager.java:817)
   [junit4]   2> 	at org.apache.solr.core.CoreContainer.load(CoreContainer.java:547)
   [junit4]   2> 	at org.apache.solr.servlet.SolrDispatchFilter.createCoreContainer(SolrDispatchFilter.java:263)
   [junit4]   2> 	at org.apache.solr.servlet.SolrDispatchFilter.init(SolrDispatchFilter.java:183)
   [junit4]   2> 	at org.eclipse.jetty.servlet.FilterHolder.initialize(FilterHolder.java:139)
   [junit4]   2> 	at org.eclipse.jetty.servlet.ServletHandler.initialize(ServletHandler.java:873)
   [junit4]   2> 	at org.eclipse.jetty.servlet.ServletHandler.updateMappings(ServletHandler.java:1596)
   [junit4]   2> 	at org.eclipse.jetty.servlet.ServletHandler.setFilterMappings(ServletHandler.java:1659)
   [junit4]   2> 	at org.eclipse.jetty.servlet.ServletHandler.addFilterMapping(ServletHandler.java:1316)
   [junit4]   2> 	at org.eclipse.jetty.servlet.ServletHandler.addFilterWithMapping(ServletHandler.java:1145)
   [junit4]   2> 	at org.eclipse.jetty.servlet.ServletContextHandler.addFilter(ServletContextHandler.java:448)
   [junit4]   2> 	at org.apache.solr.client.solrj.embedded.JettySolrRunner$1.lifeCycleStarted(JettySolrRunner.java:306)
   [junit4]   2> 	at org.eclipse.jetty.util.component.AbstractLifeCycle.setStarted(AbstractLifeCycle.java:179)
   [junit4]   2> 	at org.eclipse.jetty.util.component.AbstractLifeCycle.start(AbstractLifeCycle.java:69)
   [junit4]   2> 	at org.apache.solr.client.solrj.embedded.JettySolrRunner.start(JettySolrRunner.java:394)
   [junit4]   2> 	at org.apache.solr.client.solrj.embedded.JettySolrRunner.start(JettySolrRunner.java:367)
   [junit4]   2> 	at org.apache.solr.cloud.MiniSolrCloudCluster.startJettySolrRunner(MiniSolrCloudCluster.java:384)
   [junit4]   2> 	at org.apache.solr.cloud.MiniSolrCloudCluster.lambda$new$0(MiniSolrCloudCluster.java:247)
   [junit4]   2> 	at java.base/java.util.concurrent.FutureTask.run(FutureTask.java:264)
   [junit4]   2> 	at org.apache.solr.common.util.ExecutorUtil$MDCAwareThreadPoolExecutor.lambda$execute$0(ExecutorUtil.java:188)
   [junit4]   2> 	at java.base/java.util.concurrent.ThreadPoolExecutor.runWorker(ThreadPoolExecutor.java:1135)
   [junit4]   2> 	at java.base/java.util.concurrent.ThreadPoolExecutor$Worker.run(ThreadPoolExecutor.java:635)
   [junit4]   2> 	at java.base/java.lang.Thread.run(Thread.java:844)
   [junit4]   2> 1131528 INFO  (jetty-launcher-3846-thread-1) [    ] o.a.s.m.r.SolrJmxReporter JMX monitoring for 'solr.jvm' (registry 'solr.jvm') enabled at server: com.sun.jmx.mbeanserver.JmxMBeanServer@240bdffd
   [junit4]   2> 1131528 INFO  (jetty-launcher-3846-thread-1) [    ] o.a.s.m.r.SolrJmxReporter JMX monitoring for 'solr.jetty' (registry 'solr.jetty') enabled at server: com.sun.jmx.mbeanserver.JmxMBeanServer@240bdffd
   [junit4]   2> 1131529 INFO  (jetty-launcher-3846-thread-1) [    ] o.a.s.c.CorePropertiesLocator Found 0 core definitions underneath /home/jenkins/workspace/Lucene-Solr-7.x-Linux/solr/build/solr-core/test/J1/temp/solr.cloud.CollectionsAPIDistributedZkTest_C24F81FE41E820F8-001/tempDir-001/node1
   [junit4]   2> 1131563 INFO  (zkConnectionManagerCallback-3891-thread-1) [    ] o.a.s.c.c.ConnectionManager zkClient has connected
   [junit4]   2> 1131565 INFO  (zkConnectionManagerCallback-3895-thread-1) [    ] o.a.s.c.c.ConnectionManager zkClient has connected
   [junit4]   2> 1131565 INFO  (SUITE-CollectionsAPIDistributedZkTest-seed#[C24F81FE41E820F8]-worker) [    ] o.a.s.c.c.ZkStateReader Updated live nodes from ZooKeeper... (0) -> (4)
   [junit4]   2> 1131565 INFO  (SUITE-CollectionsAPIDistributedZkTest-seed#[C24F81FE41E820F8]-worker) [    ] o.a.s.c.s.i.ZkClientClusterStateProvider Cluster at 127.0.0.1:40029/solr ready
   [junit4]   2> 1131578 INFO  (TEST-CollectionsAPIDistributedZkTest.addReplicaTest-seed#[C24F81FE41E820F8]) [    ] o.a.s.SolrTestCaseJ4 ###Starting addReplicaTest
   [junit4]   2> 1131578 INFO  (TEST-CollectionsAPIDistributedZkTest.addReplicaTest-seed#[C24F81FE41E820F8]) [    ] o.a.s.c.c.ZkStateReader Updated live nodes from ZooKeeper... (0) -> (4)
   [junit4]   2> 1131588 INFO  (qtp1427236150-13140) [    ] o.a.s.h.a.CollectionsHandler Invoked Collection Action :create with params replicationFactor=2&collection.configName=conf&maxShardsPerNode=4&name=addReplicaColl&nrtReplicas=2&action=CREATE&numShards=2&wt=javabin&version=2 and sendToOCPQueue=true
   [junit4]   2> 1131589 INFO  (OverseerThreadFactory-3919-thread-1) [    ] o.a.s.c.CreateCollectionCmd Create collection addReplicaColl
   [junit4]   2> 1131692 INFO  (OverseerStateUpdate-99211587311960075-127.0.0.1:43503_solr-n_0000000000) [    ] o.a.s.c.o.SliceMutator createReplica() {
   [junit4]   2>   "operation":"ADDREPLICA",
   [junit4]   2>   "collection":"addReplicaColl",
   [junit4]   2>   "shard":"shard1",
   [junit4]   2>   "core":"addReplicaColl_shard1_replica_n1",
   [junit4]   2>   "state":"down",
   [junit4]   2>   "base_url":"https://127.0.0.1:43503/solr",
   [junit4]   2>   "type":"NRT",
   [junit4]   2>   "waitForFinalState":"false"} 
   [junit4]   2> 1131693 INFO  (OverseerStateUpdate-99211587311960075-127.0.0.1:43503_solr-n_0000000000) [    ] o.a.s.c.o.SliceMutator createReplica() {
   [junit4]   2>   "operation":"ADDREPLICA",
   [junit4]   2>   "collection":"addReplicaColl",
   [junit4]   2>   "shard":"shard1",
   [junit4]   2>   "core":"addReplicaColl_shard1_replica_n2",
   [junit4]   2>   "state":"down",
   [junit4]   2>   "base_url":"https://127.0.0.1:42821/solr",
   [junit4]   2>   "type":"NRT",
   [junit4]   2>   "waitForFinalState":"false"} 
   [junit4]   2> 1131694 INFO  (OverseerStateUpdate-99211587311960075-127.0.0.1:43503_solr-n_0000000000) [    ] o.a.s.c.o.SliceMutator createReplica() {
   [junit4]   2>   "operation":"ADDREPLICA",
   [junit4]   2>   "collection":"addReplicaColl",
   [junit4]   2>   "shard":"shard2",
   [junit4]   2>   "core":"addReplicaColl_shard2_replica_n4",
   [junit4]   2>   "state":"down",
   [junit4]   2>   "base_url":"https://127.0.0.1:39525/solr",
   [junit4]   2>   "type":"NRT",
   [junit4]   2>   "waitForFinalState":"false"} 
   [junit4]   2> 1131694 INFO  (OverseerStateUpdate-99211587311960075-127.0.0.1:43503_solr-n_0000000000) [    ] o.a.s.c.o.SliceMutator createReplica() {
   [junit4]   2>   "operation":"ADDREPLICA",
   [junit4]   2>   "collection":"addReplicaColl",
   [junit4]   2>   "shard":"shard2",
   [junit4]   2>   "core":"addReplicaColl_shard2_replica_n6",
   [junit4]   2>   "state":"down",
   [junit4]   2>   "base_url":"https://127.0.0.1:35395/solr",
   [junit4]   2>   "type":"NRT",
   [junit4]   2>   "waitForFinalState":"false"} 
   [junit4]   2> 1131905 INFO  (qtp1427236150-13136) [    ] o.a.s.u.TestInjection Inject random core creation delay of 0s
   [junit4]   2> 1131905 INFO  (qtp1427236150-13136) [    ] o.a.s.h.a.CoreAdminOperation core create command qt=/admin/cores&coreNodeName=core_node3&collection.configName=conf&newCollection=true&name=addReplicaColl_shard1_replica_n1&action=CREATE&numShards=2&collection=addReplicaColl&shard=shard1&wt=javabin&version=2&replicaType=NRT
   [junit4]   2> 1131906 INFO  (qtp1427236150-13136) [    ] o.a.s.c.TransientSolrCoreCacheDefault Allocating transient cache for 2147483647 transient cores
   [junit4]   2> 1131916 INFO  (qtp334735332-13139) [    ] o.a.s.u.TestInjection Inject random core creation delay of 0s
   [junit4]   2> 1131916 INFO  (qtp334735332-13139) [    ] o.a.s.h.a.CoreAdminOperation core create command qt=/admin/cores&coreNodeName=core_node7&collection.configName=conf&newCollection=true&name=addReplicaColl_shard2_replica_n4&action=CREATE&numShards=2&collection=addReplicaColl&shard=shard2&wt=javabin&version=2&replicaType=NRT
   [junit4]   2> 1131917 INFO  (qtp334735332-13139) [    ] o.a.s.c.TransientSolrCoreCacheDefault Allocating transient cache for 2147483647 transient cores
   [junit4]   2> 1131918 INFO  (qtp998976227-13142) [    ] o.a.s.u.TestInjection Inject random core creation delay of 0s
   [junit4]   2> 1131918 INFO  (qtp998976227-13142) [    ] o.a.s.h.a.CoreAdminOperation core create command qt=/admin/cores&coreNodeName=core_node5&collection.configName=conf&newCollection=true&name=addReplicaColl_shard1_replica_n2&action=CREATE&numShards=2&collection=addReplicaColl&shard=shard1&wt=javabin&version=2&replicaType=NRT
   [junit4]   2> 1131919 INFO  (qtp998976227-13142) [    ] o.a.s.c.TransientSolrCoreCacheDefault Allocating transient cache for 2147483647 transient cores
   [junit4]   2> 1131920 INFO  (qtp634117126-13116) [    ] o.a.s.u.TestInjection Inject random core creation delay of 0s
   [junit4]   2> 1131920 INFO  (qtp634117126-13116) [    ] o.a.s.h.a.CoreAdminOperation core create command qt=/admin/cores&coreNodeName=core_node8&collection.configName=conf&newCollection=true&name=addReplicaColl_shard2_replica_n6&action=CREATE&numShards=2&collection=addReplicaCol

[...truncated too long message...]

847-thread-3) [    ] o.a.s.c.Overseer Overseer (id=99211587311960076-127.0.0.1:42821_solr-n_0000000001) closing
   [junit4]   2> 1257887 INFO  (OverseerStateUpdate-99211587311960076-127.0.0.1:42821_solr-n_0000000001) [    ] o.a.s.c.Overseer Overseer Loop exiting : 127.0.0.1:42821_solr
   [junit4]   2> 1257888 WARN  (OverseerAutoScalingTriggerThread-99211587311960076-127.0.0.1:42821_solr-n_0000000001) [    ] o.a.s.c.a.OverseerTriggerThread OverseerTriggerThread woken up but we are closed, exiting.
   [junit4]   2> 1257889 INFO  (jetty-closer-3847-thread-1) [    ] o.a.s.m.SolrMetricManager Closing metric reporters for registry=solr.jetty, tag=null
   [junit4]   2> 1257889 INFO  (jetty-closer-3847-thread-1) [    ] o.a.s.m.r.SolrJmxReporter Closing reporter [org.apache.solr.metrics.reporters.SolrJmxReporter@360c45f7: rootName = null, domain = solr.jetty, service url = null, agent id = null] for registry solr.jetty / com.codahale.metrics.MetricRegistry@702d016f
   [junit4]   2> 1257889 INFO  (jetty-closer-3847-thread-3) [    ] o.e.j.s.h.ContextHandler Stopped o.e.j.s.ServletContextHandler@3fc283ab{/solr,null,UNAVAILABLE}
   [junit4]   2> 1257889 INFO  (zkCallback-3907-thread-5) [    ] o.a.s.c.OverseerElectionContext I am going to be the leader 127.0.0.1:43503_solr
   [junit4]   2> 1257890 INFO  (jetty-closer-3847-thread-1) [    ] o.a.s.c.ZkController Remove node as live in ZooKeeper:/live_nodes/127.0.0.1:43503_solr
   [junit4]   2> 1257890 INFO  (jetty-closer-3847-thread-1) [    ] o.a.s.m.SolrMetricManager Closing metric reporters for registry=solr.cluster, tag=null
   [junit4]   2> 1257890 INFO  (zkCallback-3907-thread-5) [    ] o.a.s.c.c.ZkStateReader Updated live nodes from ZooKeeper... (1) -> (0)
   [junit4]   2> 1259391 WARN  (zkCallback-3907-thread-5) [    ] o.a.s.c.ZkController Unable to register nodeLost path for 127.0.0.1:43503_solr
   [junit4]   2> org.apache.zookeeper.KeeperException$SessionExpiredException: KeeperErrorCode = Session expired for /autoscaling/nodeLost/127.0.0.1:43503_solr
   [junit4]   2> 	at org.apache.zookeeper.KeeperException.create(KeeperException.java:127)
   [junit4]   2> 	at org.apache.zookeeper.KeeperException.create(KeeperException.java:51)
   [junit4]   2> 	at org.apache.zookeeper.ZooKeeper.create(ZooKeeper.java:783)
   [junit4]   2> 	at org.apache.solr.common.cloud.SolrZkClient.lambda$create$7(SolrZkClient.java:364)
   [junit4]   2> 	at org.apache.solr.common.cloud.ZkCmdExecutor.retryOperation(ZkCmdExecutor.java:60)
   [junit4]   2> 	at org.apache.solr.common.cloud.SolrZkClient.create(SolrZkClient.java:364)
   [junit4]   2> 	at org.apache.solr.cloud.ZkController.lambda$registerLiveNodesListener$2(ZkController.java:879)
   [junit4]   2> 	at org.apache.solr.common.cloud.ZkStateReader.lambda$refreshLiveNodes$1(ZkStateReader.java:704)
   [junit4]   2> 	at java.base/java.util.concurrent.ConcurrentHashMap$KeySetView.forEach(ConcurrentHashMap.java:4717)
   [junit4]   2> 	at org.apache.solr.common.cloud.ZkStateReader.refreshLiveNodes(ZkStateReader.java:703)
   [junit4]   2> 	at org.apache.solr.common.cloud.ZkStateReader.access$900(ZkStateReader.java:72)
   [junit4]   2> 	at org.apache.solr.common.cloud.ZkStateReader$LiveNodeWatcher.refreshAndWatch(ZkStateReader.java:1090)
   [junit4]   2> 	at org.apache.solr.common.cloud.ZkStateReader$LiveNodeWatcher.process(ZkStateReader.java:1085)
   [junit4]   2> 	at org.apache.solr.common.cloud.SolrZkClient$1.lambda$process$1(SolrZkClient.java:268)
   [junit4]   2> 	at java.base/java.util.concurrent.Executors$RunnableAdapter.call(Executors.java:514)
   [junit4]   2> 	at java.base/java.util.concurrent.FutureTask.run(FutureTask.java:264)
   [junit4]   2> 	at org.apache.solr.common.util.ExecutorUtil$MDCAwareThreadPoolExecutor.lambda$execute$0(ExecutorUtil.java:188)
   [junit4]   2> 	at java.base/java.util.concurrent.ThreadPoolExecutor.runWorker(ThreadPoolExecutor.java:1135)
   [junit4]   2> 	at java.base/java.util.concurrent.ThreadPoolExecutor$Worker.run(ThreadPoolExecutor.java:635)
   [junit4]   2> 	at java.base/java.lang.Thread.run(Thread.java:844)
   [junit4]   2> 1259392 INFO  (jetty-closer-3847-thread-1) [    ] o.e.j.s.h.ContextHandler Stopped o.e.j.s.ServletContextHandler@259d9e03{/solr,null,UNAVAILABLE}
   [junit4]   2> 1259393 ERROR (SUITE-CollectionsAPIDistributedZkTest-seed#[C24F81FE41E820F8]-worker) [    ] o.a.z.s.ZooKeeperServer ZKShutdownHandler is not registered, so ZooKeeper server won't take any action on ERROR or SHUTDOWN server state changes
   [junit4]   2> 1259393 INFO  (SUITE-CollectionsAPIDistributedZkTest-seed#[C24F81FE41E820F8]-worker) [    ] o.a.s.c.ZkTestServer connecting to 127.0.0.1:40029 40029
   [junit4]   2> 1261731 INFO  (Thread-3413) [    ] o.a.s.c.ZkTestServer connecting to 127.0.0.1:40029 40029
   [junit4]   2> 1261731 WARN  (Thread-3413) [    ] o.a.s.c.ZkTestServer Watch limit violations: 
   [junit4]   2> Maximum concurrent create/delete watches above limit:
   [junit4]   2> 
   [junit4]   2> 	18	/solr/configs/conf
   [junit4]   2> 	17	/solr/aliases.json
   [junit4]   2> 
   [junit4]   2> Maximum concurrent data watches above limit:
   [junit4]   2> 
   [junit4]   2> 	41	/solr/collections/reloaded_collection/state.json
   [junit4]   2> 	38	/solr/collections/nodes_used_collection/state.json
   [junit4]   2> 	17	/solr/clusterprops.json
   [junit4]   2> 	17	/solr/clusterstate.json
   [junit4]   2> 	14	/solr/collections/halfdeletedcollection/state.json
   [junit4]   2> 	13	/solr/collections/onlyinzk/state.json
   [junit4]   2> 	13	/solr/collections/acollectionafterbaddelete/state.json
   [junit4]   2> 	5	/solr/collections/withconfigset2/state.json
   [junit4]   2> 	5	/solr/collections/created_and_deleted/state.json
   [junit4]   2> 	4	/solr/collections/halfcollectionblocker/state.json
   [junit4]   2> 	4	/solr/collections/halfcollection/state.json
   [junit4]   2> 	4	/solr/collections/halfcollectionblocker2/state.json
   [junit4]   2> 	3	/solr/collections/awhollynewcollection_0/state.json
   [junit4]   2> 
   [junit4]   2> Maximum concurrent children watches above limit:
   [junit4]   2> 
   [junit4]   2> 	299	/solr/collections
   [junit4]   2> 	17	/solr/live_nodes
   [junit4]   2> 
   [junit4]   2> NOTE: leaving temporary files on disk at: /home/jenkins/workspace/Lucene-Solr-7.x-Linux/solr/build/solr-core/test/J1/temp/solr.cloud.CollectionsAPIDistributedZkTest_C24F81FE41E820F8-001
   [junit4]   2> NOTE: test params are: codec=Asserting(Lucene70): {id=PostingsFormat(name=Asserting)}, docValues:{}, maxPointsInLeafNode=985, maxMBSortInHeap=5.509155215961767, sim=RandomSimilarity(queryNorm=false): {}, locale=nus-SS, timezone=Pacific/Johnston
   [junit4]   2> NOTE: Linux 4.10.0-40-generic amd64/Oracle Corporation 10-ea (64-bit)/cpus=8,threads=1,free=163258240,total=518979584
   [junit4]   2> NOTE: All tests run in this JVM: [SampleTest, CreateCollectionCleanupTest, TestLazyCores, TestHalfAndHalfDocValues, OverriddenZkACLAndCredentialsProvidersTest, ClassificationUpdateProcessorIntegrationTest, BadIndexSchemaTest, DocumentAnalysisRequestHandlerTest, ChaosMonkeySafeLeaderTest, BadCopyFieldTest, SolrIndexConfigTest, SynonymTokenizerTest, TestFileDictionaryLookup, TestTolerantUpdateProcessorCloud, RollingRestartTest, ZkStateReaderTest, JvmMetricsTest, TestSurroundQueryParser, TestJmxIntegration, TlogReplayBufferedWhileIndexingTest, SchemaVersionSpecificBehaviorTest, AtomicUpdateProcessorFactoryTest, TestCollationField, HttpSolrCallGetCoreTest, NodeLostTriggerTest, InfixSuggestersTest, TestConfigSets, DocValuesMultiTest, ShardRoutingCustomTest, LeaderFailureAfterFreshStartTest, TestPivotHelperCode, TestHdfsUpdateLog, TestSchemalessBufferedUpdates, DistributedFacetPivotSmallTest, TestReplicationHandlerBackup, ZkSolrClientTest, DirectUpdateHandlerTest, SmileWriterTest, TestRestManager, OpenCloseCoreStressTest, HdfsDirectoryFactoryTest, TestGenericDistributedQueue, AnalyticsMergeStrategyTest, CloudExitableDirectoryReaderTest, TestReloadDeadlock, TestComputePlanAction, SortSpecParsingTest, HdfsBasicDistributedZkTest, TestLegacyFieldCache, CoreSorterTest, TestClassicSimilarityFactory, TestSimpleTrackingShardHandler, SolrJmxReporterTest, HttpPartitionTest, SuggesterTSTTest, MoveReplicaHDFSFailoverTest, HighlighterMaxOffsetTest, HLLSerializationTest, SolrGangliaReporterTest, TestMinMaxOnMultiValuedField, UninvertDocValuesMergePolicyTest, TestFieldCache, DistributedTermsComponentTest, SolrShardReporterTest, TestAtomicUpdateErrorCases, TestConfigSetsAPIExclusivity, TestNamedUpdateProcessors, BJQParserTest, TestRandomFlRTGCloud, SpellingQueryConverterTest, PreAnalyzedFieldTest, LargeFieldTest, TestSQLHandler, MoreLikeThisHandlerTest, DeleteShardTest, AssignTest, TestTriggerIntegration, TestPayloadScoreQParserPlugin, TestSchemaNameResource, ClusterStateUpdateTest, TestRangeQuery, TestJettySolrRunner, TestHashQParserPlugin, TestExclusionRuleCollectionAccess, HighlighterConfigTest, TestLRUStatsCache, TestNumericRangeQuery64, TestExportWriter, TestLegacyTerms, TestFastLRUCache, NumericFieldsTest, TestFieldSortValues, OutputWriterTest, TestSolrCloudWithKerberosAlt, BlockCacheTest, DistributedDebugComponentTest, TestTrieFacet, TestInitParams, TestBM25SimilarityFactory, TestShardHandlerFactory, TestMaxTokenLenTokenizer, LegacyCloudClusterPropTest, TestDocumentBuilder, TestDynamicFieldCollectionResource, TestQuerySenderNoQuery, TestSolr4Spatial, ReplaceNodeTest, TestFieldCacheSortRandom, TestSolrCLIRunExample, SOLR749Test, DistributedVersionInfoTest, TestXIncludeConfig, TestCloudManagedSchema, SegmentsInfoRequestHandlerTest, TestNestedDocsSort, TestEmbeddedSolrServerAdminHandler, HdfsWriteToMultipleCollectionsTest, HdfsDirectoryTest, TestLeaderElectionZkExpiry, TestLockTree, TestSSLRandomization, CircularListTest, PrimUtilsTest, UpdateLogTest, TestJavabinTupleStreamParser, BasicDistributedZkTest, CollectionsAPIDistributedZkTest]
   [junit4] Completed [370/763 (2!)] on J1 in 130.45s, 19 tests, 1 error <<< FAILURES!

[...truncated 42218 lines...]

Mime
View raw message