lucene-dev mailing list archives

Site index · List index
Message view « Date » · « Thread »
Top « Date » · « Thread »
From Policeman Jenkins Server <jenk...@thetaphi.de>
Subject [JENKINS] Lucene-Solr-master-Windows (32bit/jdk1.8.0_144) - Build # 7071 - Still Unstable!
Date Mon, 25 Dec 2017 15:44:15 GMT
Build: https://jenkins.thetaphi.de/job/Lucene-Solr-master-Windows/7071/
Java: 32bit/jdk1.8.0_144 -server -XX:+UseParallelGC

5 tests failed.
FAILED:  junit.framework.TestSuite.org.apache.lucene.store.TestMultiMMap

Error Message:
Could not remove the following files (in the order of attempts):    C:\Users\jenkins\workspace\Lucene-Solr-master-Windows\lucene\build\core\test\J0\temp\lucene.store.TestMultiMMap_CF3623B9BFF8E31F-001\tempDir-004: java.nio.file.AccessDeniedException: C:\Users\jenkins\workspace\Lucene-Solr-master-Windows\lucene\build\core\test\J0\temp\lucene.store.TestMultiMMap_CF3623B9BFF8E31F-001\tempDir-004    C:\Users\jenkins\workspace\Lucene-Solr-master-Windows\lucene\build\core\test\J0\temp\lucene.store.TestMultiMMap_CF3623B9BFF8E31F-001: java.nio.file.DirectoryNotEmptyException: C:\Users\jenkins\workspace\Lucene-Solr-master-Windows\lucene\build\core\test\J0\temp\lucene.store.TestMultiMMap_CF3623B9BFF8E31F-001 

Stack Trace:
java.io.IOException: Could not remove the following files (in the order of attempts):
   C:\Users\jenkins\workspace\Lucene-Solr-master-Windows\lucene\build\core\test\J0\temp\lucene.store.TestMultiMMap_CF3623B9BFF8E31F-001\tempDir-004: java.nio.file.AccessDeniedException: C:\Users\jenkins\workspace\Lucene-Solr-master-Windows\lucene\build\core\test\J0\temp\lucene.store.TestMultiMMap_CF3623B9BFF8E31F-001\tempDir-004
   C:\Users\jenkins\workspace\Lucene-Solr-master-Windows\lucene\build\core\test\J0\temp\lucene.store.TestMultiMMap_CF3623B9BFF8E31F-001: java.nio.file.DirectoryNotEmptyException: C:\Users\jenkins\workspace\Lucene-Solr-master-Windows\lucene\build\core\test\J0\temp\lucene.store.TestMultiMMap_CF3623B9BFF8E31F-001

	at __randomizedtesting.SeedInfo.seed([CF3623B9BFF8E31F]:0)
	at org.apache.lucene.util.IOUtils.rm(IOUtils.java:329)
	at org.apache.lucene.util.TestRuleTemporaryFilesCleanup.afterAlways(TestRuleTemporaryFilesCleanup.java:216)
	at com.carrotsearch.randomizedtesting.rules.TestRuleAdapter$1.afterAlways(TestRuleAdapter.java:31)
	at com.carrotsearch.randomizedtesting.rules.StatementAdapter.evaluate(StatementAdapter.java:43)
	at com.carrotsearch.randomizedtesting.rules.StatementAdapter.evaluate(StatementAdapter.java:36)
	at org.apache.lucene.util.TestRuleAssertionsRequired$1.evaluate(TestRuleAssertionsRequired.java:53)
	at org.apache.lucene.util.TestRuleMarkFailure$1.evaluate(TestRuleMarkFailure.java:47)
	at org.apache.lucene.util.TestRuleIgnoreAfterMaxFailures$1.evaluate(TestRuleIgnoreAfterMaxFailures.java:64)
	at org.apache.lucene.util.TestRuleIgnoreTestSuites$1.evaluate(TestRuleIgnoreTestSuites.java:54)
	at com.carrotsearch.randomizedtesting.rules.StatementAdapter.evaluate(StatementAdapter.java:36)
	at com.carrotsearch.randomizedtesting.ThreadLeakControl$StatementRunner.run(ThreadLeakControl.java:368)
	at java.lang.Thread.run(Thread.java:748)


FAILED:  org.apache.solr.cloud.autoscaling.sim.TestGenericDistributedQueue.testDistributedQueue

Error Message:
Test abandoned because suite timeout was reached.

Stack Trace:
java.lang.Exception: Test abandoned because suite timeout was reached.
	at __randomizedtesting.SeedInfo.seed([E4F043B520CB031A]:0)


FAILED:  junit.framework.TestSuite.org.apache.solr.core.TestLazyCores

Error Message:
Could not remove the following files (in the order of attempts):    C:\Users\jenkins\workspace\Lucene-Solr-master-Windows\solr\build\solr-core\test\J0\temp\solr.core.TestLazyCores_E4F043B520CB031A-001\tempDir-008: java.nio.file.DirectoryNotEmptyException: C:\Users\jenkins\workspace\Lucene-Solr-master-Windows\solr\build\solr-core\test\J0\temp\solr.core.TestLazyCores_E4F043B520CB031A-001\tempDir-008 

Stack Trace:
java.io.IOException: Could not remove the following files (in the order of attempts):
   C:\Users\jenkins\workspace\Lucene-Solr-master-Windows\solr\build\solr-core\test\J0\temp\solr.core.TestLazyCores_E4F043B520CB031A-001\tempDir-008: java.nio.file.DirectoryNotEmptyException: C:\Users\jenkins\workspace\Lucene-Solr-master-Windows\solr\build\solr-core\test\J0\temp\solr.core.TestLazyCores_E4F043B520CB031A-001\tempDir-008

	at __randomizedtesting.SeedInfo.seed([E4F043B520CB031A]:0)
	at org.apache.lucene.util.IOUtils.rm(IOUtils.java:329)
	at org.apache.lucene.util.TestRuleTemporaryFilesCleanup.afterAlways(TestRuleTemporaryFilesCleanup.java:216)
	at com.carrotsearch.randomizedtesting.rules.TestRuleAdapter$1.afterAlways(TestRuleAdapter.java:31)
	at com.carrotsearch.randomizedtesting.rules.StatementAdapter.evaluate(StatementAdapter.java:43)
	at com.carrotsearch.randomizedtesting.rules.StatementAdapter.evaluate(StatementAdapter.java:36)
	at org.apache.lucene.util.TestRuleAssertionsRequired$1.evaluate(TestRuleAssertionsRequired.java:53)
	at org.apache.lucene.util.TestRuleMarkFailure$1.evaluate(TestRuleMarkFailure.java:47)
	at org.apache.lucene.util.TestRuleIgnoreAfterMaxFailures$1.evaluate(TestRuleIgnoreAfterMaxFailures.java:64)
	at org.apache.lucene.util.TestRuleIgnoreTestSuites$1.evaluate(TestRuleIgnoreTestSuites.java:54)
	at com.carrotsearch.randomizedtesting.rules.StatementAdapter.evaluate(StatementAdapter.java:36)
	at com.carrotsearch.randomizedtesting.ThreadLeakControl$StatementRunner.run(ThreadLeakControl.java:368)
	at java.lang.Thread.run(Thread.java:748)


FAILED:  junit.framework.TestSuite.org.apache.solr.cloud.autoscaling.sim.TestGenericDistributedQueue

Error Message:
Suite timeout exceeded (>= 7200000 msec).

Stack Trace:
java.lang.Exception: Suite timeout exceeded (>= 7200000 msec).
	at __randomizedtesting.SeedInfo.seed([E4F043B520CB031A]:0)


FAILED:  junit.framework.TestSuite.org.apache.solr.update.processor.TestOpenNLPExtractNamedEntitiesUpdateProcessorFactory

Error Message:
Could not remove the following files (in the order of attempts):    C:\Users\jenkins\workspace\Lucene-Solr-master-Windows\solr\build\contrib\solr-analysis-extras\test\J1\temp\solr.update.processor.TestOpenNLPExtractNamedEntitiesUpdateProcessorFactory_597D9275E59D9228-001\tempDir-001\collection1\conf: java.nio.file.DirectoryNotEmptyException: C:\Users\jenkins\workspace\Lucene-Solr-master-Windows\solr\build\contrib\solr-analysis-extras\test\J1\temp\solr.update.processor.TestOpenNLPExtractNamedEntitiesUpdateProcessorFactory_597D9275E59D9228-001\tempDir-001\collection1\conf    C:\Users\jenkins\workspace\Lucene-Solr-master-Windows\solr\build\contrib\solr-analysis-extras\test\J1\temp\solr.update.processor.TestOpenNLPExtractNamedEntitiesUpdateProcessorFactory_597D9275E59D9228-001\tempDir-001\collection1: java.nio.file.DirectoryNotEmptyException: C:\Users\jenkins\workspace\Lucene-Solr-master-Windows\solr\build\contrib\solr-analysis-extras\test\J1\temp\solr.update.processor.TestOpenNLPExtractNamedEntitiesUpdateProcessorFactory_597D9275E59D9228-001\tempDir-001\collection1    C:\Users\jenkins\workspace\Lucene-Solr-master-Windows\solr\build\contrib\solr-analysis-extras\test\J1\temp\solr.update.processor.TestOpenNLPExtractNamedEntitiesUpdateProcessorFactory_597D9275E59D9228-001\tempDir-001: java.nio.file.DirectoryNotEmptyException: C:\Users\jenkins\workspace\Lucene-Solr-master-Windows\solr\build\contrib\solr-analysis-extras\test\J1\temp\solr.update.processor.TestOpenNLPExtractNamedEntitiesUpdateProcessorFactory_597D9275E59D9228-001\tempDir-001    C:\Users\jenkins\workspace\Lucene-Solr-master-Windows\solr\build\contrib\solr-analysis-extras\test\J1\temp\solr.update.processor.TestOpenNLPExtractNamedEntitiesUpdateProcessorFactory_597D9275E59D9228-001\tempDir-001\collection1\conf\en-test-sent.bin: java.nio.file.AccessDeniedException: C:\Users\jenkins\workspace\Lucene-Solr-master-Windows\solr\build\contrib\solr-analysis-extras\test\J1\temp\solr.update.processor.TestOpenNLPExtractNamedEntitiesUpdateProcessorFactory_597D9275E59D9228-001\tempDir-001\collection1\conf\en-test-sent.bin    C:\Users\jenkins\workspace\Lucene-Solr-master-Windows\solr\build\contrib\solr-analysis-extras\test\J1\temp\solr.update.processor.TestOpenNLPExtractNamedEntitiesUpdateProcessorFactory_597D9275E59D9228-001\tempDir-001\collection1\conf\en-test-tokenizer.bin: java.nio.file.AccessDeniedException: C:\Users\jenkins\workspace\Lucene-Solr-master-Windows\solr\build\contrib\solr-analysis-extras\test\J1\temp\solr.update.processor.TestOpenNLPExtractNamedEntitiesUpdateProcessorFactory_597D9275E59D9228-001\tempDir-001\collection1\conf\en-test-tokenizer.bin    C:\Users\jenkins\workspace\Lucene-Solr-master-Windows\solr\build\contrib\solr-analysis-extras\test\J1\temp\solr.update.processor.TestOpenNLPExtractNamedEntitiesUpdateProcessorFactory_597D9275E59D9228-001\tempDir-001\collection1\conf\en-test-ner-person.bin: java.nio.file.AccessDeniedException: C:\Users\jenkins\workspace\Lucene-Solr-master-Windows\solr\build\contrib\solr-analysis-extras\test\J1\temp\solr.update.processor.TestOpenNLPExtractNamedEntitiesUpdateProcessorFactory_597D9275E59D9228-001\tempDir-001\collection1\conf\en-test-ner-person.bin    C:\Users\jenkins\workspace\Lucene-Solr-master-Windows\solr\build\contrib\solr-analysis-extras\test\J1\temp\solr.update.processor.TestOpenNLPExtractNamedEntitiesUpdateProcessorFactory_597D9275E59D9228-001: java.nio.file.DirectoryNotEmptyException: C:\Users\jenkins\workspace\Lucene-Solr-master-Windows\solr\build\contrib\solr-analysis-extras\test\J1\temp\solr.update.processor.TestOpenNLPExtractNamedEntitiesUpdateProcessorFactory_597D9275E59D9228-001 

Stack Trace:
java.io.IOException: Could not remove the following files (in the order of attempts):
   C:\Users\jenkins\workspace\Lucene-Solr-master-Windows\solr\build\contrib\solr-analysis-extras\test\J1\temp\solr.update.processor.TestOpenNLPExtractNamedEntitiesUpdateProcessorFactory_597D9275E59D9228-001\tempDir-001\collection1\conf: java.nio.file.DirectoryNotEmptyException: C:\Users\jenkins\workspace\Lucene-Solr-master-Windows\solr\build\contrib\solr-analysis-extras\test\J1\temp\solr.update.processor.TestOpenNLPExtractNamedEntitiesUpdateProcessorFactory_597D9275E59D9228-001\tempDir-001\collection1\conf
   C:\Users\jenkins\workspace\Lucene-Solr-master-Windows\solr\build\contrib\solr-analysis-extras\test\J1\temp\solr.update.processor.TestOpenNLPExtractNamedEntitiesUpdateProcessorFactory_597D9275E59D9228-001\tempDir-001\collection1: java.nio.file.DirectoryNotEmptyException: C:\Users\jenkins\workspace\Lucene-Solr-master-Windows\solr\build\contrib\solr-analysis-extras\test\J1\temp\solr.update.processor.TestOpenNLPExtractNamedEntitiesUpdateProcessorFactory_597D9275E59D9228-001\tempDir-001\collection1
   C:\Users\jenkins\workspace\Lucene-Solr-master-Windows\solr\build\contrib\solr-analysis-extras\test\J1\temp\solr.update.processor.TestOpenNLPExtractNamedEntitiesUpdateProcessorFactory_597D9275E59D9228-001\tempDir-001: java.nio.file.DirectoryNotEmptyException: C:\Users\jenkins\workspace\Lucene-Solr-master-Windows\solr\build\contrib\solr-analysis-extras\test\J1\temp\solr.update.processor.TestOpenNLPExtractNamedEntitiesUpdateProcessorFactory_597D9275E59D9228-001\tempDir-001
   C:\Users\jenkins\workspace\Lucene-Solr-master-Windows\solr\build\contrib\solr-analysis-extras\test\J1\temp\solr.update.processor.TestOpenNLPExtractNamedEntitiesUpdateProcessorFactory_597D9275E59D9228-001\tempDir-001\collection1\conf\en-test-sent.bin: java.nio.file.AccessDeniedException: C:\Users\jenkins\workspace\Lucene-Solr-master-Windows\solr\build\contrib\solr-analysis-extras\test\J1\temp\solr.update.processor.TestOpenNLPExtractNamedEntitiesUpdateProcessorFactory_597D9275E59D9228-001\tempDir-001\collection1\conf\en-test-sent.bin
   C:\Users\jenkins\workspace\Lucene-Solr-master-Windows\solr\build\contrib\solr-analysis-extras\test\J1\temp\solr.update.processor.TestOpenNLPExtractNamedEntitiesUpdateProcessorFactory_597D9275E59D9228-001\tempDir-001\collection1\conf\en-test-tokenizer.bin: java.nio.file.AccessDeniedException: C:\Users\jenkins\workspace\Lucene-Solr-master-Windows\solr\build\contrib\solr-analysis-extras\test\J1\temp\solr.update.processor.TestOpenNLPExtractNamedEntitiesUpdateProcessorFactory_597D9275E59D9228-001\tempDir-001\collection1\conf\en-test-tokenizer.bin
   C:\Users\jenkins\workspace\Lucene-Solr-master-Windows\solr\build\contrib\solr-analysis-extras\test\J1\temp\solr.update.processor.TestOpenNLPExtractNamedEntitiesUpdateProcessorFactory_597D9275E59D9228-001\tempDir-001\collection1\conf\en-test-ner-person.bin: java.nio.file.AccessDeniedException: C:\Users\jenkins\workspace\Lucene-Solr-master-Windows\solr\build\contrib\solr-analysis-extras\test\J1\temp\solr.update.processor.TestOpenNLPExtractNamedEntitiesUpdateProcessorFactory_597D9275E59D9228-001\tempDir-001\collection1\conf\en-test-ner-person.bin
   C:\Users\jenkins\workspace\Lucene-Solr-master-Windows\solr\build\contrib\solr-analysis-extras\test\J1\temp\solr.update.processor.TestOpenNLPExtractNamedEntitiesUpdateProcessorFactory_597D9275E59D9228-001: java.nio.file.DirectoryNotEmptyException: C:\Users\jenkins\workspace\Lucene-Solr-master-Windows\solr\build\contrib\solr-analysis-extras\test\J1\temp\solr.update.processor.TestOpenNLPExtractNamedEntitiesUpdateProcessorFactory_597D9275E59D9228-001

	at __randomizedtesting.SeedInfo.seed([597D9275E59D9228]:0)
	at org.apache.lucene.util.IOUtils.rm(IOUtils.java:329)
	at org.apache.lucene.util.TestRuleTemporaryFilesCleanup.afterAlways(TestRuleTemporaryFilesCleanup.java:216)
	at com.carrotsearch.randomizedtesting.rules.TestRuleAdapter$1.afterAlways(TestRuleAdapter.java:31)
	at com.carrotsearch.randomizedtesting.rules.StatementAdapter.evaluate(StatementAdapter.java:43)
	at com.carrotsearch.randomizedtesting.rules.StatementAdapter.evaluate(StatementAdapter.java:36)
	at org.apache.lucene.util.TestRuleAssertionsRequired$1.evaluate(TestRuleAssertionsRequired.java:53)
	at org.apache.lucene.util.TestRuleMarkFailure$1.evaluate(TestRuleMarkFailure.java:47)
	at org.apache.lucene.util.TestRuleIgnoreAfterMaxFailures$1.evaluate(TestRuleIgnoreAfterMaxFailures.java:64)
	at org.apache.lucene.util.TestRuleIgnoreTestSuites$1.evaluate(TestRuleIgnoreTestSuites.java:54)
	at com.carrotsearch.randomizedtesting.rules.StatementAdapter.evaluate(StatementAdapter.java:36)
	at com.carrotsearch.randomizedtesting.ThreadLeakControl$StatementRunner.run(ThreadLeakControl.java:368)
	at java.lang.Thread.run(Thread.java:748)




Build Log:
[...truncated 279 lines...]
   [junit4] Suite: org.apache.lucene.store.TestMultiMMap
   [junit4]   2> NOTE: test params are: codec=Asserting(Lucene70): {docid=PostingsFormat(name=Direct), junk=BlockTreeOrds(blocksize=128)}, docValues:{}, maxPointsInLeafNode=606, maxMBSortInHeap=6.423207980819782, sim=Asserting(org.apache.lucene.search.similarities.AssertingSimilarity@b6fc3a), locale=es-CL, timezone=Etc/GMT0
   [junit4]   2> NOTE: Windows 10 10.0 x86/Oracle Corporation 1.8.0_144 (32-bit)/cpus=3,threads=1,free=48484240,total=220987392
   [junit4]   2> NOTE: All tests run in this JVM: [TestByteArrayDataInput, TestSpanTermQuery, TestForceMergeForever, TestPriorityQueue, TestFieldInvertState, TestMultiMMap]
   [junit4]   2> NOTE: reproduce with: ant test  -Dtestcase=TestMultiMMap -Dtests.seed=CF3623B9BFF8E31F -Dtests.slow=true -Dtests.locale=es-CL -Dtests.timezone=Etc/GMT0 -Dtests.asserts=true -Dtests.file.encoding=ISO-8859-1
   [junit4] ERROR   0.00s J0 | TestMultiMMap (suite) <<<
   [junit4]    > Throwable #1: java.io.IOException: Could not remove the following files (in the order of attempts):
   [junit4]    >    C:\Users\jenkins\workspace\Lucene-Solr-master-Windows\lucene\build\core\test\J0\temp\lucene.store.TestMultiMMap_CF3623B9BFF8E31F-001\tempDir-004: java.nio.file.AccessDeniedException: C:\Users\jenkins\workspace\Lucene-Solr-master-Windows\lucene\build\core\test\J0\temp\lucene.store.TestMultiMMap_CF3623B9BFF8E31F-001\tempDir-004
   [junit4]    >    C:\Users\jenkins\workspace\Lucene-Solr-master-Windows\lucene\build\core\test\J0\temp\lucene.store.TestMultiMMap_CF3623B9BFF8E31F-001: java.nio.file.DirectoryNotEmptyException: C:\Users\jenkins\workspace\Lucene-Solr-master-Windows\lucene\build\core\test\J0\temp\lucene.store.TestMultiMMap_CF3623B9BFF8E31F-001
   [junit4]    > 	at __randomizedtesting.SeedInfo.seed([CF3623B9BFF8E31F]:0)
   [junit4]    > 	at org.apache.lucene.util.IOUtils.rm(IOUtils.java:329)
   [junit4]    > 	at java.lang.Thread.run(Thread.java:748)
   [junit4] Completed [20/475 (1!)] on J0 in 6.65s, 54 tests, 1 error <<< FAILURES!

[...truncated 11900 lines...]
   [junit4] Suite: org.apache.solr.core.TestLazyCores
   [junit4]   2> 906585 INFO  (SUITE-TestLazyCores-seed#[E4F043B520CB031A]-worker) [    ] o.a.s.SolrTestCaseJ4 SecureRandom sanity checks: test.solr.allowed.securerandom=null & java.security.egd=file:/dev/./urandom
   [junit4]   2> Creating dataDir: C:\Users\jenkins\workspace\Lucene-Solr-master-Windows\solr\build\solr-core\test\J0\temp\solr.core.TestLazyCores_E4F043B520CB031A-001\init-core-data-001
   [junit4]   2> 906586 WARN  (SUITE-TestLazyCores-seed#[E4F043B520CB031A]-worker) [    ] o.a.s.SolrTestCaseJ4 startTrackingSearchers: numOpens=56 numCloses=56
   [junit4]   2> 906586 INFO  (SUITE-TestLazyCores-seed#[E4F043B520CB031A]-worker) [    ] o.a.s.SolrTestCaseJ4 Using PointFields (NUMERIC_POINTS_SYSPROP=true) w/NUMERIC_DOCVALUES_SYSPROP=false
   [junit4]   2> 906590 INFO  (SUITE-TestLazyCores-seed#[E4F043B520CB031A]-worker) [    ] o.a.s.SolrTestCaseJ4 Randomized ssl (true) and clientAuth (false) via: @org.apache.solr.util.RandomizeSSL(reason=, value=NaN, ssl=NaN, clientAuth=NaN)
   [junit4]   2> 906591 INFO  (TEST-TestLazyCores.testCreateTransientFromAdmin-seed#[E4F043B520CB031A]) [    ] o.a.s.SolrTestCaseJ4 ###Starting testCreateTransientFromAdmin
   [junit4]   2> 906638 INFO  (TEST-TestLazyCores.testCreateTransientFromAdmin-seed#[E4F043B520CB031A]) [    ] o.a.s.c.SolrXmlConfig Loading container configuration from C:\Users\jenkins\workspace\Lucene-Solr-master-Windows\solr\build\solr-core\test\J0\temp\solr.core.TestLazyCores_E4F043B520CB031A-001\tempDir-001\solr.xml
   [junit4]   2> 906645 INFO  (TEST-TestLazyCores.testCreateTransientFromAdmin-seed#[E4F043B520CB031A]) [    ] o.a.s.c.SolrXmlConfig Configuration parameter autoReplicaFailoverWorkLoopDelay is ignored
   [junit4]   2> 906645 INFO  (TEST-TestLazyCores.testCreateTransientFromAdmin-seed#[E4F043B520CB031A]) [    ] o.a.s.c.SolrXmlConfig Configuration parameter autoReplicaFailoverBadNodeExpiration is ignored
   [junit4]   2> 906645 INFO  (TEST-TestLazyCores.testCreateTransientFromAdmin-seed#[E4F043B520CB031A]) [    ] o.a.s.c.SolrXmlConfig MBean server found: com.sun.jmx.mbeanserver.JmxMBeanServer@1a7305, but no JMX reporters were configured - adding default JMX reporter.
   [junit4]   2> 906712 INFO  (TEST-TestLazyCores.testCreateTransientFromAdmin-seed#[E4F043B520CB031A]) [    ] o.a.s.m.r.SolrJmxReporter JMX monitoring for 'solr.node' (registry 'solr.node') enabled at server: com.sun.jmx.mbeanserver.JmxMBeanServer@1a7305
   [junit4]   2> 906717 INFO  (TEST-TestLazyCores.testCreateTransientFromAdmin-seed#[E4F043B520CB031A]) [    ] o.a.s.m.r.SolrJmxReporter JMX monitoring for 'solr.jvm' (registry 'solr.jvm') enabled at server: com.sun.jmx.mbeanserver.JmxMBeanServer@1a7305
   [junit4]   2> 906717 INFO  (TEST-TestLazyCores.testCreateTransientFromAdmin-seed#[E4F043B520CB031A]) [    ] o.a.s.m.r.SolrJmxReporter JMX monitoring for 'solr.jetty' (registry 'solr.jetty') enabled at server: com.sun.jmx.mbeanserver.JmxMBeanServer@1a7305
   [junit4]   2> 906725 INFO  (TEST-TestLazyCores.testCreateTransientFromAdmin-seed#[E4F043B520CB031A]) [    ] o.a.s.c.TransientSolrCoreCacheDefault Allocating transient cache for 4 transient cores
   [junit4]   2> 906755 INFO  (coreLoadExecutor-2047-thread-1) [    x:collection1] o.a.s.c.SolrConfig Using Lucene MatchVersion: 8.0.0
   [junit4]   2> 906756 INFO  (coreLoadExecutor-2047-thread-2) [    x:collection2] o.a.s.c.SolrConfig Using Lucene MatchVersion: 8.0.0
   [junit4]   2> 906756 INFO  (coreLoadExecutor-2047-thread-3) [    x:collection5] o.a.s.c.SolrConfig Using Lucene MatchVersion: 8.0.0
   [junit4]   2> 906761 INFO  (coreLoadExecutor-2047-thread-1) [    x:collection1] o.a.s.s.IndexSchema [collection1] Schema name=tiny
   [junit4]   2> 906761 INFO  (coreLoadExecutor-2047-thread-3) [    x:collection5] o.a.s.s.IndexSchema [collection5] Schema name=tiny
   [junit4]   2> 906761 INFO  (coreLoadExecutor-2047-thread-2) [    x:collection2] o.a.s.s.IndexSchema [collection2] Schema name=tiny
   [junit4]   2> 906765 INFO  (coreLoadExecutor-2047-thread-2) [    x:collection2] o.a.s.s.IndexSchema Loaded schema tiny/1.1 with uniqueid field id
   [junit4]   2> 906765 INFO  (coreLoadExecutor-2047-thread-1) [    x:collection1] o.a.s.s.IndexSchema Loaded schema tiny/1.1 with uniqueid field id
   [junit4]   2> 906765 INFO  (coreLoadExecutor-2047-thread-2) [    x:collection2] o.a.s.c.CoreContainer Creating SolrCore 'collection2' using configuration from instancedir C:\Users\jenkins\workspace\Lucene-Solr-master-Windows\solr\build\solr-core\test\J0\temp\solr.core.TestLazyCores_E4F043B520CB031A-001\tempDir-001\.\collection2, trusted=true
   [junit4]   2> 906765 INFO  (coreLoadExecutor-2047-thread-1) [    x:collection1] o.a.s.c.CoreContainer Creating SolrCore 'collection1' using configuration from instancedir C:\Users\jenkins\workspace\Lucene-Solr-master-Windows\solr\build\solr-core\test\J0\temp\solr.core.TestLazyCores_E4F043B520CB031A-001\tempDir-001\.\collection1, trusted=true
   [junit4]   2> 906765 INFO  (coreLoadExecutor-2047-thread-3) [    x:collection5] o.a.s.s.IndexSchema Loaded schema tiny/1.1 with uniqueid field id
   [junit4]   2> 906766 INFO  (coreLoadExecutor-2047-thread-3) [    x:collection5] o.a.s.c.CoreContainer Creating SolrCore 'collection5' using configuration from instancedir C:\Users\jenkins\workspace\Lucene-Solr-master-Windows\solr\build\solr-core\test\J0\temp\solr.core.TestLazyCores_E4F043B520CB031A-001\tempDir-001\.\collection5, trusted=true
   [junit4]   2> 906766 INFO  (coreLoadExecutor-2047-thread-3) [    x:collection5] o.a.s.m.r.SolrJmxReporter JMX monitoring for 'solr.core.collection5' (registry 'solr.core.collection5') enabled at server: com.sun.jmx.mbeanserver.JmxMBeanServer@1a7305
   [junit4]   2> 906766 INFO  (coreLoadExecutor-2047-thread-2) [    x:collection2] o.a.s.m.r.SolrJmxReporter JMX monitoring for 'solr.core.collection2' (registry 'solr.core.collection2') enabled at server: com.sun.jmx.mbeanserver.JmxMBeanServer@1a7305
   [junit4]   2> 906766 INFO  (coreLoadExecutor-2047-thread-1) [    x:collection1] o.a.s.m.r.SolrJmxReporter JMX monitoring for 'solr.core.collection1' (registry 'solr.core.collection1') enabled at server: com.sun.jmx.mbeanserver.JmxMBeanServer@1a7305
   [junit4]   2> 906787 INFO  (coreLoadExecutor-2047-thread-3) [    x:collection5] o.a.s.c.SolrCore solr.RecoveryStrategy.Builder
   [junit4]   2> 906787 INFO  (coreLoadExecutor-2047-thread-3) [    x:collection5] o.a.s.c.SolrCore [[collection5] ] Opening new SolrCore at [C:\Users\jenkins\workspace\Lucene-Solr-master-Windows\solr\build\solr-core\test\J0\temp\solr.core.TestLazyCores_E4F043B520CB031A-001\tempDir-001\collection5], dataDir=[C:\Users\jenkins\workspace\Lucene-Solr-master-Windows\solr\build\solr-core\test\J0\temp\solr.core.TestLazyCores_E4F043B520CB031A-001\tempDir-001\.\collection5\data\]
   [junit4]   2> 906787 INFO  (coreLoadExecutor-2047-thread-1) [    x:collection1] o.a.s.c.SolrCore solr.RecoveryStrategy.Builder
   [junit4]   2> 906787 INFO  (coreLoadExecutor-2047-thread-1) [    x:collection1] o.a.s.c.SolrCore [[collection1] ] Opening new SolrCore at [C:\Users\jenkins\workspace\Lucene-Solr-master-Windows\solr\build\solr-core\test\J0\temp\solr.core.TestLazyCores_E4F043B520CB031A-001\tempDir-001\collection1], dataDir=[C:\Users\jenkins\workspace\Lucene-Solr-master-Windows\solr\build\solr-core\test\J0\temp\solr.core.TestLazyCores_E4F043B520CB031A-001\tempDir-001\.\collection1\data\]
   [junit4]   2> 906788 INFO  (coreLoadExecutor-2047-thread-2) [    x:collection2] o.a.s.c.SolrCore solr.RecoveryStrategy.Builder
   [junit4]   2> 906788 INFO  (coreLoadExecutor-2047-thread-2) [    x:collection2] o.a.s.c.SolrCore [[collection2] ] Opening new SolrCore at [C:\Users\jenkins\workspace\Lucene-Solr-master-Windows\solr\build\solr-core\test\J0\temp\solr.core.TestLazyCores_E4F043B520CB031A-001\tempDir-001\collection2], dataDir=[C:\Users\jenkins\workspace\Lucene-Solr-master-Windows\solr\build\solr-core\test\J0\temp\solr.core.TestLazyCores_E4F043B520CB031A-001\tempDir-001\.\collection2\data\]
   [junit4]   2> 906793 INFO  (coreLoadExecutor-2047-thread-1) [    x:collection1] o.a.s.u.RandomMergePolicy RandomMergePolicy wrapping class org.apache.lucene.index.LogDocMergePolicy: [LogDocMergePolicy: minMergeSize=1000, mergeFactor=26, maxMergeSize=9223372036854775807, maxMergeSizeForForcedMerge=9223372036854775807, calibrateSizeByDeletes=true, maxMergeDocs=2147483647, maxCFSSegmentSizeMB=8.796093022207999E12, noCFSRatio=0.0]
   [junit4]   2> 906793 INFO  (coreLoadExecutor-2047-thread-3) [    x:collection5] o.a.s.u.RandomMergePolicy RandomMergePolicy wrapping class org.apache.lucene.index.LogDocMergePolicy: [LogDocMergePolicy: minMergeSize=1000, mergeFactor=26, maxMergeSize=9223372036854775807, maxMergeSizeForForcedMerge=9223372036854775807, calibrateSizeByDeletes=true, maxMergeDocs=2147483647, maxCFSSegmentSizeMB=8.796093022207999E12, noCFSRatio=0.0]
   [junit4]   2> 906793 INFO  (coreLoadExecutor-2047-thread-2) [    x:collection2] o.a.s.u.RandomMergePolicy RandomMergePolicy wrapping class org.apache.lucene.index.LogDocMergePolicy: [LogDocMergePolicy: minMergeSize=1000, mergeFactor=26, maxMergeSize=9223372036854775807, maxMergeSizeForForcedMerge=9223372036854775807, calibrateSizeByDeletes=true, maxMergeDocs=2147483647, maxCFSSegmentSizeMB=8.796093022207999E12, noCFSRatio=0.0]
   [junit4]   2> 906889 INFO  (coreLoadExecutor-2047-thread-1) [    x:collection1] o.a.s.u.CommitTracker Hard AutoCommit: disabled
   [junit4]   2> 906889 INFO  (coreLoadExecutor-2047-thread-3) [    x:collection5] o.a.s.u.CommitTracker Hard AutoCommit: disabled
   [junit4]   2> 906889 INFO  (coreLoadExecutor-2047-thread-3) [    x:collection5] o.a.s.u.CommitTracker Soft AutoCommit: disabled
   [junit4]   2> 906889 INFO  (coreLoadExecutor-2047-thread-2) [    x:collection2] o.a.s.u.CommitTracker Hard AutoCommit: disabled
   [junit4]   2> 906889 INFO  (coreLoadExecutor-2047-thread-2) [    x:collection2] o.a.s.u.CommitTracker Soft AutoCommit: disabled
   [junit4]   2> 906889 INFO  (coreLoadExecutor-2047-thread-1) [    x:collection1] o.a.s.u.CommitTracker Soft AutoCommit: disabled
   [junit4]   2> 906890 INFO  (coreLoadExecutor-2047-thread-3) [    x:collection5] o.a.s.u.RandomMergePolicy RandomMergePolicy wrapping class org.apache.lucene.index.LogByteSizeMergePolicy: [LogByteSizeMergePolicy: minMergeSize=1677721, mergeFactor=28, maxMergeSize=2147483648, maxMergeSizeForForcedMerge=9223372036854775807, calibrateSizeByDeletes=true, maxMergeDocs=2147483647, maxCFSSegmentSizeMB=8.796093022207999E12, noCFSRatio=0.0]
   [junit4]   2> 906890 INFO  (coreLoadExecutor-2047-thread-2) [    x:collection2] o.a.s.u.RandomMergePolicy RandomMergePolicy wrapping class org.apache.lucene.index.LogByteSizeMergePolicy: [LogByteSizeMergePolicy: minMergeSize=1677721, mergeFactor=28, maxMergeSize=2147483648, maxMergeSizeForForcedMerge=9223372036854775807, calibrateSizeByDeletes=true, maxMergeDocs=2147483647, maxCFSSegmentSizeMB=8.796093022207999E12, noCFSRatio=0.0]
   [junit4]   2> 906890 INFO  (coreLoadExecutor-2047-thread-1) [    x:collection1] o.a.s.u.RandomMergePolicy RandomMergePolicy wrapping class org.apache.lucene.index.LogByteSizeMergePolicy: [LogByteSizeMergePolicy: minMergeSize=1677721, mergeFactor=28, maxMergeSize=2147483648, maxMergeSizeForForcedMerge=9223372036854775807, calibrateSizeByDeletes=true, maxMergeDocs=2147483647, maxCFSSegmentSizeMB=8.796093022207999E12, noCFSRatio=0.0]
   [junit4]   2> 906890 INFO  (coreLoadExecutor-2047-thread-2) [    x:collection2] o.a.s.s.SolrIndexSearcher Opening [Searcher@1c1c626[collection2] main]
   [junit4]   2> 906890 INFO  (coreLoadExecutor-2047-thread-1) [    x:collection1] o.a.s.s.SolrIndexSearcher Opening [Searcher@98381d[collection1] main]
   [junit4]   2> 906890 INFO  (coreLoadExecutor-2047-thread-3) [    x:collection5] o.a.s.s.SolrIndexSearcher Opening [Searcher@1d3fb0f[collection5] main]
   [junit4]   2> 906891 INFO  (coreLoadExecutor-2047-thread-1) [    x:collection1] o.a.s.r.ManagedResourceStorage File-based storage initialized to use dir: C:\Users\jenkins\workspace\Lucene-Solr-master-Windows\solr\build\solr-core\test\J0\temp\solr.core.TestLazyCores_E4F043B520CB031A-001\tempDir-001\collection1\conf
   [junit4]   2> 906891 INFO  (coreLoadExecutor-2047-thread-2) [    x:collection2] o.a.s.r.ManagedResourceStorage File-based storage initialized to use dir: C:\Users\jenkins\workspace\Lucene-Solr-master-Windows\solr\build\solr-core\test\J0\temp\solr.core.TestLazyCores_E4F043B520CB031A-001\tempDir-001\collection2\conf
   [junit4]   2> 906892 INFO  (coreLoadExecutor-2047-thread-2) [    x:collection2] o.a.s.h.ReplicationHandler Commits will be reserved for 10000ms.
   [junit4]   2> 906892 INFO  (coreLoadExecutor-2047-thread-1) [    x:collection1] o.a.s.h.ReplicationHandler Commits will be reserved for 10000ms.
   [junit4]   2> 906891 INFO  (coreLoadExecutor-2047-thread-3) [    x:collection5] o.a.s.r.ManagedResourceStorage File-based storage initialized to use dir: C:\Users\jenkins\workspace\Lucene-Solr-master-Windows\solr\build\solr-core\test\J0\temp\solr.core.TestLazyCores_E4F043B520CB031A-001\tempDir-001\collection5\conf
   [junit4]   2> 906892 INFO  (coreLoadExecutor-2047-thread-3) [    x:collection5] o.a.s.h.ReplicationHandler Commits will be reserved for 10000ms.
   [junit4]   2> 906893 INFO  (searcherExecutor-2048-thread-1-processing-x:collection2) [    x:collection2] o.a.s.c.SolrCore [collection2] Registered new searcher Searcher@1c1c626[collection2] main{ExitableDirectoryReader(UninvertingDirectoryReader())}
   [junit4]   2> 906893 INFO  (searcherExecutor-2049-thread-1-processing-x:collection1) [    x:collection1] o.a.s.c.SolrCore [collection1] Registered new searcher Searcher@98381d[collection1] main{ExitableDirectoryReader(UninvertingDirectoryReader())}
   [junit4]   2> 906893 INFO  (searcherExecutor-2050-thread-1-processing-x:collection5) [    x:collection5] o.a.s.c.SolrCore [collection5] Registered new searcher Searcher@1d3fb0f[collection5] main{ExitableDirectoryReader(UninvertingDirectoryReader())}
   [junit4]   2> 906915 INFO  (TEST-TestLazyCores.testCreateTransientFromAdmin-seed#[E4F043B520CB031A]) [    ] o.a.s.h.a.CoreAdminOperation core create command loadOnStartup=true&transient=true&name=core1&action=CREATE&wt=xml
   [junit4]   2> 906942 INFO  (TEST-TestLazyCores.testCreateTransientFromAdmin-seed#[E4F043B520CB031A]) [    x:core1] o.a.s.c.SolrConfig Using Lucene MatchVersion: 8.0.0
   [junit4]   2> 906947 INFO  (TEST-TestLazyCores.testCreateTransientFromAdmin-seed#[E4F043B520CB031A]) [    x:core1] o.a.s.s.IndexSchema [core1] Schema name=tiny
   [junit4]   2> 906950 INFO  (TEST-TestLazyCores.testCreateTransientFromAdmin-seed#[E4F043B520CB031A]) [    x:core1] o.a.s.s.IndexSchema Loaded schema tiny/1.1 with uniqueid field id
   [junit4]   2> 906950 INFO  (TEST-TestLazyCores.testCreateTransientFromAdmin-seed#[E4F043B520CB031A]) [    x:core1] o.a.s.c.CoreContainer Creating SolrCore 'core1' using configuration from instancedir C:\Users\jenkins\workspace\Lucene-Solr-master-Windows\solr\build\solr-core\test\J0\temp\solr.core.TestLazyCores_E4F043B520CB031A-001\tempDir-001\.\core1, trusted=true
   [junit4]   2> 906951 INFO  (TEST-TestLazyCores.testCreateTransientFromAdmin-seed#[E4F043B520CB031A]) [    x:core1] o.a.s.m.r.SolrJmxReporter JMX monitoring for 'solr.core.core1' (registry 'solr.core.core1') enabled at server: com.sun.jmx.mbeanserver.JmxMBeanServer@1a7305
   [junit4]   2> 906951 INFO  (TEST-TestLazyCores.testCreateTransientFromAdmin-seed#[E4F043B520CB031A]) [    x:core1] o.a.s.c.SolrCore solr.RecoveryStrategy.Builder
   [junit4]   2> 906951 INFO  (TEST-TestLazyCores.testCreateTransientFromAdmin-seed#[E4F043B520CB031A]) [    x:core1] o.a.s.c.SolrCore [[core1] ] Opening new SolrCore at [C:\Users\jenkins\workspace\Lucene-Solr-master-Windows\solr\build\solr-core\test\J0\temp\solr.core.TestLazyCores_E4F043B520CB031A-001\tempDir-001\core1], dataDir=[C:\Users\jenkins\workspace\Lucene-Solr-master-Windows\solr\build\solr-core\test\J0\temp\solr.core.TestLazyCores_E4F043B520CB031A-001\tempDir-001\.\core1\data\]
   [junit4]   2> 906957 INFO  (TEST-TestLazyCores.testCreateTransientFromAdmin-seed#[E4F043B520CB031A]) [    x:core1] o.a.s.u.RandomMergePolicy RandomMergePolicy wrapping class org.apache.lucene.index.LogByteSizeMergePolicy: [LogByteSizeMergePolicy: minMergeSize=1677721, mergeFactor=29, maxMergeSize=2147483648, maxMergeSizeForForcedMerge=9223372036854775807, calibrateSizeByDeletes=true, maxMergeDocs=2147483647, maxCFSSegmentSizeMB=8.796093022207999E12, noCFSRatio=0.8110893646610626]
   [junit4]   2> 907031 INFO  (TEST-TestLazyCores.testCreateTransientFromAdmin-seed#[E4F043B520CB031A]) [    x:core1] o.a.s.u.CommitTracker Hard AutoCommit: disabled
   [junit4]   2> 907031 INFO  (TEST-TestLazyCores.testCreateTransientFromAdmin-seed#[E4F043B520CB031A]) [    x:core1] o.a.s.u.CommitTracker Soft AutoCommit: disabled
   [junit4]   2> 907032 INFO  (TEST-TestLazyCores.testCreateTransientFromAdmin-seed#[E4F043B520CB031A]) [    x:core1] o.a.s.u.RandomMergePolicy RandomMergePolicy wrapping class org.apache.lucene.index.AlcoholicMergePolicy: [AlcoholicMergePolicy: minMergeSize=0, mergeFactor=10, maxMergeSize=1945221991, maxMergeSizeForForcedMerge=9223372036854775807, calibrateSizeByDeletes=true, maxMergeDocs=2147483647, maxCFSSegmentSizeMB=8.796093022207999E12, noCFSRatio=0.1]
   [junit4]   2> 907032 INFO  (TEST-TestLazyCores.testCreateTransientFromAdmin-seed#[E4F043B520CB031A]) [    x:core1] o.a.s.s.SolrIndexSearcher Opening [Searcher@59cffb[core1] main]
   [junit4]   2> 907033 INFO  (TEST-TestLazyCores.testCreateTransientFromAdmin-seed#[E4F043B520CB031A]) [    x:core1] o.a.s.r.ManagedResourceStorage File-based storage initialized to use dir: C:\Users\jenkins\workspace\Lucene-Solr-master-Windows\solr\build\solr-core\test\J0\temp\solr.core.TestLazyCores_E4F043B520CB031A-001\tempDir-001\core1\conf
   [junit4]   2> 907034 INFO  (TEST-TestLazyCores.testCreateTransientFromAdmin-seed#[E4F043B520CB031A]) [    x:core1] o.a.s.h.ReplicationHandler Commits will be reserved for 10000ms.
   [junit4]   2> 907034 INFO  (TEST-TestLazyCores.testCreateTransientFromAdmin-seed#[E4F043B520CB031A]) [    x:core1] o.a.s.h.a.CoreAdminOperation core create command loadOnStartup=false&transient=true&name=core2&action=CREATE&wt=xml
   [junit4]   2> 907034 INFO  (searcherExecutor-2061-thread-1-processing-x:core1) [    x:core1] o.a.s.c.SolrCore [core1] Registered new searcher Searcher@59cffb[core1] main{ExitableDirectoryReader(UninvertingDirectoryReader())}
   [junit4]   2> 907060 INFO  (TEST-TestLazyCores.testCreateTransientFromAdmin-seed#[E4F043B520CB031A]) [    x:core1] o.a.s.c.SolrConfig Using Lucene MatchVersion: 8.0.0
   [junit4]   2> 907066 INFO  (TEST-TestLazyCores.testCreateTransientFromAdmin-seed#[E4F043B520CB031A]) [    x:core1] o.a.s.s.IndexSchema [core2] Schema name=tiny
   [junit4]   2> 907069 INFO  (TEST-TestLazyCores.testCreateTransientFromAdmin-seed#[E4F043B520CB031A]) [    x:core1] o.a.s.s.IndexSchema Loaded schema tiny/1.1 with uniqueid field id
   [junit4]   2> 907069 INFO  (TEST-TestLazyCores.testCreateTransientFromAdmin-seed#[E4F043B520CB031A]) [    x:core1] o.a.s.c.CoreContainer Creating SolrCore 'core2' using configuration from instancedir C:\Users\jenkins\workspace\Lucene-Solr-master-Windows\solr\build\solr-core\test\J0\temp\solr.core.TestLazyCores_E4F043B520CB031A-001\tempDir-001\.\core2, trusted=true
   [junit4]   2> 907069 INFO  (TEST-TestLazyCores.testCreateTransientFromAdmin-seed#[E4F043B520CB031A]) [    x:core1] o.a.s.m.r.SolrJmxReporter JMX monitoring for 'solr.core.core2' (registry 'solr.core.core2') enabled at server: com.sun.jmx.mbeanserver.JmxMBeanServer@1a7305
   [junit4]   2> 907070 INFO  (TEST-TestLazyCores.testCreateTransientFromAdmin-seed#[E4F043B520CB031A]) [    x:core1] o.a.s.c.SolrCore solr.RecoveryStrategy.Builder
   [junit4]   2> 907070 INFO  (TEST-TestLazyCores.testCreateTransientFromAdmin-seed#[E4F043B520CB031A]) [    x:core1] o.a.s.c.SolrCore [[core2] ] Opening new SolrCore at [C:\Users\jenkins\workspace\Lucene-Solr-master-Windows\solr\build\solr-core\test\J0\temp\solr.core.TestLazyCores_E4F043B520CB031A-001\tempDir-001\core2], dataDir=[C:\Users\jenkins\workspace\Lucene-Solr-master-Windows\solr\build\solr-core\test\J0\temp\solr.core.TestLazyCores_E4F043B520CB031A-001\tempDir-001\.\core2\data\]
   [junit4]   2> 907076 INFO  (TEST-TestLazyCores.testCreateTransientFromAdmin-seed#[E4F043B520CB031A]) [    x:core1] o.a.s.u.RandomMergePolicy RandomMergePolicy wrapping class org.apache.lucene.index.AlcoholicMergePolicy: [AlcoholicMergePolicy: minMergeSize=0, mergeFactor=10, maxMergeSize=954480272, maxMergeSizeForForcedMerge=9223372036854775807, calibrateSizeByDeletes=true, maxMergeDocs=2147483647, maxCFSSegmentSizeMB=8.796093022207999E12, noCFSRatio=0.1]
   [junit4]   2> 907151 INFO  (TEST-TestLazyCores.testCreateTransientFromAdmin-seed#[E4F043B520CB031A]) [    x:core1] o.a.s.u.CommitTracker Hard AutoCommit: disabled
   [junit4]   2> 907151 INFO  (TEST-TestLazyCores.testCreateTransientFromAdmin-seed#[E4F043B520CB031A]) [    x:core1] o.a.s.u.CommitTracker Soft AutoCommit: disabled
   [junit4]   2> 907153 INFO  (TEST-TestLazyCores.testCreateTransientFromAdmin-seed#[E4F043B520CB031A]) [    x:core1] o.a.s.u.RandomMergePolicy RandomMergePolicy wrapping class org.apache.lucene.index.LogByteSizeMergePolicy: [LogByteSizeMergePolicy: minMergeSize=1677721, mergeFactor=24, maxMergeSize=2147483648, maxMergeSizeForForcedMerge=9223372036854775807, calibrateSizeByDeletes=true, maxMergeDocs=2147483647, maxCFSSegmentSizeMB=8.796093022207999E12, noCFSRatio=0.0]
   [junit4]   2> 907153 INFO  (TEST-TestLazyCores.testCreateTransientFromAdmin-seed#[E4F043B520CB031A]) [    x:core1] o.a.s.s.SolrIndexSearcher Opening [Searcher@dd8534[core2] main]
   [junit4]   2> 907154 INFO  (TEST-TestLazyCores.testCreateTransientFromAdmin-seed#[E4F043B520CB031A]) [    x:core1] o.a.s.r.ManagedResourceStorage File-based storage initialized to use dir: C:\Users\jenkins\workspace\Lucene-Solr-master-Windows\solr\build\solr-core\test\J0\temp\solr.core.TestLazyCores_E4F043B520CB031A-001\tempDir-001\core2\conf
   [junit4]   2> 907155 INFO  (TEST-TestLazyCores.testCreateTransientFromAdmin-seed#[E4F043B520CB031A]) [    x:core1] o.a.s.h.ReplicationHandler Commits will be reserved for 10000ms.
   [junit4]   2> 907155 INFO  (TEST-TestLazyCores.testCreateTransientFromAdmin-seed#[E4F043B520CB031A]) [    x:core1] o.a.s.h.a.CoreAdminOperation core create command loadOnStartup=true&transient=true&name=core3&action=CREATE&wt=xml
   [junit4]   2> 907155 INFO  (searcherExecutor-2066-thread-1-processing-x:core1) [    x:core1] o.a.s.c.SolrCore [core2] Registered new searcher Searcher@dd8534[core2] main{ExitableDirectoryReader(UninvertingDirectoryReader())}
   [junit4]   2> 907189 INFO  (TEST-TestLazyCores.testCreateTransientFromAdmin-seed#[E4F043B520CB031A]) [    x:core1] o.a.s.c.SolrConfig Using Lucene MatchVersion: 8.0.0
   [junit4]   2> 907200 INFO  (TEST-TestLazyCores.testCreateTransientFromAdmin-seed#[E4F043B520CB031A]) [    x:core1] o.a.s.s.IndexSchema [core3] Schema name=tiny
   [junit4]   2> 907204 INFO  (TEST-TestLazyCores.testCreateTransientFromAdmin-seed#[E4F043B520CB031A]) [    x:core1] o.a.s.s.IndexSchema Loaded schema tiny/1.1 with uniqueid field id
   [junit4]   2> 907204 INFO  (TEST-TestLazyCores.testCreateTransientFromAdmin-seed#[E4F043B520CB031A]) [    x:core1] o.a.s.c.CoreContainer Creating SolrCore 'core3' using configuration from instancedir C:\Users\jenkins\workspace\Lucene-Solr-master-Windows\solr\build\solr-core\test\J0\temp\solr.core.TestLazyCores_E4F043B520CB031A-001\tempDir-001\.\core3, trusted=true
   [junit4]   2> 907204 INFO  (TEST-TestLazyCores.testCreateTransientFromAdmin-seed#[E4F043B520CB031A]) [    x:core1] o.a.s.m.r.SolrJmxReporter JMX monitoring for 'solr.core.core3' (registry 'solr.core.core3') enabled at server: com.sun.jmx.mbeanserver.JmxMBeanServer@1a7305
   [junit4]   2> 907204 INFO  (TEST-TestLazyCores.testCreateTransientFromAdmin-seed#[E4F043B520CB031A]) [    x:core1] o.a.s.c.SolrCore solr.RecoveryStrategy.Builder
   [junit4]   2> 907204 INFO  (TEST-TestLazyCores.testCreateTransientFromAdmin-seed#[E4F043B520CB031A]) [    x:core1] o.a.s.c.SolrCore [[core3] ] Opening new SolrCore at [C:\Users\jenkins\workspace\Lucene-Solr-master-Windows\solr\build\solr-core\test\J0\temp\solr.core.TestLazyCores_E4F043B520CB031A-001\tempDir-001\core3], dataDir=[C:\Users\jenkins\workspace\Lucene-Solr-master-Windows\solr\build\solr-core\test\J0\temp\solr.core.TestLazyCores_E4F043B520CB031A-001\tempDir-001\.\core3\data\]
   [junit4]   2> 907211 INFO  (TEST-TestLazyCores.testCreateTransientFromAdmin-seed#[E4F043B520CB031A]) [    x:core1] o.a.s.u.RandomMergePolicy RandomMergePolicy wrapping class org.apache.lucene.index.TieredMergePolicy: [TieredMergePolicy: maxMergeAtOnce=22, maxMergeAtOnceExplicit=10, maxMergedSegmentMB=14.6494140625, floorSegmentMB=0.8486328125, forceMergeDeletesPctAllowed=6.653908801952762, segmentsPerTier=26.0, maxCFSSegmentSizeMB=8.796093022207999E12, noCFSRatio=1.0
   [junit4]   2> 907289 INFO  (TEST-TestLazyCores.testCreateTransientFromAdmin-seed#[E4F043B520CB031A]) [    x:core1] o.a.s.u.CommitTracker Hard AutoCommit: disabled
   [junit4]   2> 907289 INFO  (TEST-TestLazyCores.testCreateTransientFromAdmin-seed#[E4F043B520CB031A]) [    x:core1] o.a.s.u.CommitTracker Soft AutoCommit: disabled
   [junit4]   2> 907290 INFO  (TEST-TestLazyCores.testCreateTransientFromAdmin-seed#[E4F043B520CB031A]) [    x:core1] o.a.s.u.RandomMergePolicy RandomMergePolicy wrapping class org.apache.lucene.index.TieredMergePolicy: [TieredMergePolicy: maxMergeAtOnce=4, maxMergeAtOnceExplicit=2, maxMergedSegmentMB=56.564453125, floorSegmentMB=1.0654296875, forceMergeDeletesPctAllowed=5.217409629353316, segmentsPerTier=11.0, maxCFSSegmentSizeMB=8.796093022207999E12, noCFSRatio=1.0
   [junit4]   2> 907291 INFO  (TEST-TestLazyCores.testCreateTransientFromAdmin-seed#[E4F043B520CB031A]) [    x:core1] o.a.s.s.SolrIndexSearcher Opening [Searcher@1af87ad[core3] main]
   [junit4]   2> 907292 INFO  (TEST-TestLazyCores.testCreateTransientFromAdmin-seed#[E4F043B520CB031A]) [    x:core1] o.a.s.r.ManagedResourceStorage File-based storage initialized to use dir: C:\Users\jenkins\workspace\Lucene-Solr-master-Windows\solr\build\solr-core\test\J0\temp\solr.core.TestLazyCores_E4F043B520CB031A-001\tempDir-001\core3\conf
   [junit4]   2> 907292 INFO  (TEST-TestLazyCores.testCreateTransientFromAdmin-seed#[E4F043B520CB031A]) [    x:core1] o.a.s.h.ReplicationHandler Commits will be reserved for 10000ms.
   [junit4]   2> 907293 INFO  (TEST-TestLazyCores.testCreateTransientFromAdmin-seed#[E4F043B520CB031A]) [    x:core1] o.a.s.h.a.CoreAdminOperation core create command loadOnStartup=false&transient=true&name=core4&action=CREATE&wt=xml
   [junit4]   2> 907293 INFO  (searcherExecutor-2071-thread-1-processing-x:core1) [    x:core1] o.a.s.c.SolrCore [core3] Registered new searcher Searcher@1af87ad[core3] main{ExitableDirectoryReader(UninvertingDirectoryReader())}
   [junit4]   2> 907320 INFO  (TEST-TestLazyCores.testCreateTransientFromAdmin-seed#[E4F043B520CB031A]) [    x:core1] o.a.s.c.SolrConfig Using Lucene MatchVersion: 8.0.0
   [junit4]   2> 907325 INFO  (TEST-TestLazyCores.testCreateTransientFromAdmin-seed#[E4F043B520CB031A]) [    x:core1] o.a.s.s.IndexSchema [core4] Schema name=tiny
   [junit4]   2> 907328 INFO  (TEST-TestLazyCores.testCreateTransientFromAdmin-seed#[E4F043B520CB031A]) [    x:core1] o.a.s.s.IndexSchema Loaded schema tiny/1.1 with uniqueid field id
   [junit4]   2> 907328 INFO  (TEST-TestLazyCores.testCreateTransientFromAdmin-seed#[E4F043B520CB031A]) [    x:core1] o.a.s.c.CoreContainer Creating SolrCore 'core4' using configuration from instancedir C:\Users\jenkins\workspace\Lucene-Solr-master-Windows\solr\build\solr-core\test\J0\temp\solr.core.TestLazyCores_E4F043B520CB031A-001\tempDir-001\.\core4, trusted=true
   [junit4]   2> 907329 INFO  (TEST-TestLazyCores.testCreateTransientFromAdmin-seed#[E4F043B520CB031A]) [    x:core1] o.a.s.m.r.SolrJmxReporter JMX monitoring for 'solr.core.core4' (registry 'solr.core.core4') enabled at server: com.sun.jmx.mbeanserver.JmxMBeanServer@1a7305
   [junit4]   2> 907329 INFO  (TEST-TestLazyCores.testCreateTransientFromAdmin-seed#[E4F043B520CB031A]) [    x:core1] o.a.s.c.SolrCore solr.RecoveryStrategy.Builder
   [junit4]   2> 907329 INFO  (TEST-TestLazyCores.testCreateTransientFromAdmin-seed#[E4F043B520CB031A]) [    x:core1] o.a.s.c.SolrCore [[core4] ] Opening new SolrCore at [C:\Users\jenkins\workspace\Lucene-Solr-master-Windows\solr\build\solr-core\test\J0\temp\solr.core.TestLazyCores_E4F043B520CB031A-001\tempDir-001\core4], dataDir=[C:\Users\jenkins\workspace\Lucene-Solr-master-Windows\solr\build\solr-core\test\J0\temp\solr.core.TestLazyCores_E4F043B520CB031A-001\tempDir-001\.\core4\data\]
   [junit4]   2> 907335 INFO  (TEST-TestLazyCores.testCreateTransientFromAdmin-seed#[E4F043B520CB031A]) [    x:core1] o.a.s.u.RandomMergePolicy RandomMergePolicy wrapping class org.apache.lucene.index.TieredMergePolicy: [TieredMergePolicy: maxMergeAtOnce=43, maxMergeAtOnceExplicit=33, maxMergedSegmentMB=86.1318359375, floorSegmentMB=1.0732421875, forceMergeDeletesPctAllowed=22.487309823967355, segmentsPerTier=21.0, maxCFSSegmentSizeMB=8.796093022207999E12, noCFSRatio=1.0
   [junit4]   2> 907406 INFO  (TEST-TestLazyCores.testCreateTransientFromAdmin-seed#[E4F043B520CB031A]) [    x:core1] o.a.s.u.CommitTracker Hard AutoCommit: disabled
   [junit4]   2> 907406 INFO  (TEST-TestLazyCores.testCreateTransientFromAdmin-seed#[E4F043B520CB031A]) [    x:core1] o.a.s.u.CommitTracker Soft AutoCommit: disabled
   [junit4]   2> 907407 INFO  (TEST-TestLazyCores.testCreateTransientFromAdmin-seed#[E4F043B520CB031A]) [    x:core1] o.a.s.u.RandomMergePolicy RandomMergePolicy wrapping class org.apache.lucene.index.TieredMergePolicy: [TieredMergePolicy: maxMergeAtOnce=20, maxMergeAtOnceExplicit=38, maxMergedSegmentMB=19.791015625, floorSegmentMB=0.7587890625, forceMergeDeletesPctAllowed=26.985118857878877, segmentsPerTier=10.0, maxCFSSegmentSizeMB=0.755859375, noCFSRatio=0.6022006422967844
   [junit4]   2> 907408 INFO  (TEST-TestLazyCores.testCreateTransientFromAdmin-seed#[E4F043B520CB031A]) [    x:core1] o.a.s.s.SolrIndexSearcher Opening [Searcher@12bea09[core4] main]
   [junit4]   2> 907408 INFO  (TEST-TestLazyCores.testCreateTransientFromAdmin-seed#[E4F043B520CB031A]) [    x:core1] o.a.s.r.ManagedResourceStorage File-based storage initialized to use dir: C:\Users\jenkins\workspace\Lucene-Solr-master-Windows\solr\build\solr-core\test\J0\temp\solr.core.TestLazyCores_E4F043B520CB031A-001\tempDir-001\core4\conf
   [junit4]   2> 907409 INFO  (TEST-TestLazyCores.testCreateTransientFromAdmin-seed#[E4F043B520CB031A]) [    x:core1] o.a.s.h.ReplicationHandler Commits will be reserved for 10000ms.
   [junit4]   2> 907409 INFO  (TEST-TestLazyCores.testCreateTransientFromAdmin-seed#[E4F043B520CB031A]) [    x:core1] o.a.s.c.TransientSolrCoreCacheDefault Closing transient core [collection2]
   [junit4]   2> 907409 INFO  (Thread-879) [    ] o.a.s.c.SolrCore [collection2]  CLOSING SolrCore org.apache.solr.core.SolrCore@5381e
   [junit4]   2> 907410 INFO  (TEST-TestLazyCores.testCreateTransientFromAdmin-seed#[E4F043B520CB031A]) [    x:core1] o.a.s.h.a.CoreAdminOperation core create command loadOnStartup=false&transient=true&name=core5&action=CREATE&wt=xml
   [junit4]   2> 907410 INFO  (Thread-879) [    ] o.a.s.m.SolrMetricManager Closing metric reporters for registry=solr.core.collection2, tag=342046
   [junit4]   2> 907410 INFO  (searcherExecutor-2076-thread-1-processing-x:core1) [    x:core1] o.a.s.c.SolrCore [core4] Registered new searcher Searcher@12bea09[core4] main{ExitableDirectoryReader(UninvertingDirectoryReader())}
   [junit4]   2> 907410 INFO  (Thread-879) [    ] o.a.s.m.r.SolrJmxReporter Closing reporter [org.apache.solr.metrics.reporters.SolrJmxReporter@a377c: rootName = null, domain = solr.core.collection2, service url = null, agent id = null] for registry solr.core.collection2 / com.codahale.metrics.MetricRegistry@90cd9
   [junit4]   2> 907437 INFO  (TEST-TestLazyCores.testCreateTransientFromAdmin-seed#[E4F043B520CB031A]) [    x:core1] o.a.s.c.SolrConfig Using Lucene MatchVersion: 8.0.0
   [junit4]   2> 907442 INFO  (TEST-TestLazyCores.testCreateTransientFromAdmin-seed#[E4F043B520CB031A]) [    x:core1] o.a.s.s.IndexSchema [core5] Schema name=tiny
   [junit4]   2> 907446 INFO  (TEST-TestLazyCores.testCreateTransientFromAdmin-seed#[E4F043B520CB031A]) [    x:core1] o.a.s.s.IndexSchema Loaded schema tiny/1.1 with uniqueid field id
   [junit4]   2> 907446 INFO  (TEST-TestLazyCores.testCreateTransientFromAdmin-seed#[E4F043B520CB031A]) [    x:core1] o.a.s.c.CoreContainer Creating SolrCore 'core5' using configuration from instancedir C:\Users\jenkins\workspace\Lucene-Solr-master-Windows\solr\build\solr-core\test\J0\temp\solr.core.TestLazyCores_E4F043B520CB031A-001\tempDir-001\.\core5, trusted=true
   [junit4]   2> 907447 INFO  (TEST-TestLazyCores.testCreateTransientFromAdmin-seed#[E4F043B520CB031A]) [    x:core1] o.a.s.m.r.SolrJmxReporter JMX monitoring for 'solr.core.core5' (registry 'solr.core.core5') enabled at server: com.sun.jmx.mbeanserver.JmxMBeanServer@1a7305
   [junit4]   2> 907447 INFO  (TEST-TestLazyCores.testCreateTransientFromAdmin-seed#[E4F043B520CB031A]) [    x:core1] o.a.s.c.SolrCore solr.RecoveryStrategy.Builder
   [junit4]   2> 907447 INFO  (TEST-TestLazyCores.testCreateTransientFromAdmin-seed#[E4F043B520CB031A]) [    x:core1] o.a.s.c.SolrCore [[core5] ] Opening new SolrCore at [C:\Users\jenkins\workspace\Lucene-Solr-master-Windows\solr\build\solr-core\test\J0\temp\solr.core.TestLazyCores_E4F043B520CB031A-001\tempDir-001\core5], dataDir=[C:\Users\jenkins\workspace\Lucene-Solr-master-Windows\solr\build\solr-core\test\J0\temp\solr.core.TestLazyCores_E4F043B520CB031A-001\tempDir-001\.\core5\data\]
   [junit4]   2> 907454 INFO  (TEST-TestLazyCores.testCreateTransientFromAdmin-seed#[E4F043B520CB031A]) [    x:core1] o.a.s.u.RandomMergePolicy RandomMergePolicy wrapping class org.apache.lucene.index.LogDocMergePolicy: [LogDocMergePolicy: minMergeSize=1000, mergeFactor=21, maxMergeSize=9223372036854775807, maxMergeSizeForForcedMerge=9223372036854775807, calibrateSizeByDeletes=false, maxMergeDocs=2147483647, maxCFSSegmentSizeMB=8.796093022207999E12, noCFSRatio=1.0]
   [junit4]   2> 907539 INFO  (TEST-TestLazyCores.testCreateTransientFromAdmin-seed#[E4F043B520CB031A]) [    x:core1] o.a.s.u.CommitTracker Hard AutoCommit: disabled
   [junit4]   2> 907539 INFO  (TEST-TestLazyCores.testCreateTransientFromAdmin-seed#[E4F043B520CB031A]) [    x:core1] o.a.s.u.CommitTracker Soft AutoCommit: disabled
   [junit4]   2> 907540 INFO  (TEST-TestLazyCores.testCreateTransientFromAdmin-seed#[E4F043B520CB031A]) [    x:core1] o.a.s.u.RandomMergePolicy RandomMergePolicy wrapping class org.apache.lucene.index.LogByteSizeMergePolicy: [LogByteSizeMergePolicy: minMergeSize=1677721, mergeFactor=18, maxMergeSize=2147483648, maxMergeSizeForForcedMerge=9223372036854775807, calibrateSizeByDeletes=true, maxMergeDocs=2147483647, maxCFSSegmentSizeMB=8.796093022207999E12, noCFSRatio=0.6535377540602503]
   [junit4]   2> 907540 INFO  (TEST-TestLazyCores.testCreateTransientFromAdmin-seed#[E4F043B520CB031A]) [    x:core1] o.a.s.s.SolrIndexSearcher Opening [Searcher@1cfcb7d[core5] main]
   [junit4]   2> 907541 INFO  (TEST-TestLazyCores.testCreateTransientFromAdmin-seed#[E4F043B520CB031A]) [    x:core1] o.a.s.r.ManagedResourceStorage File-based storage initialized to use dir: C:\Users\jenkins\workspace\Lucene-Solr-master-Windows\solr\build\solr-core\test\J0\temp\solr.core.TestLazyCores_E4F043B520CB031A-001\tempDir-001\core5\conf
   [junit4]   2> 907542 INFO  (TEST-TestLazyCores.testCreateTransientFromAdmin-seed#[E4F043B520CB031A]) [    x:core1] o.a.s.h.ReplicationHandler Commits will be reserved for 10000ms.
   [junit4]   2> 907542 INFO  (TEST-TestLazyCores.testCreateTransientFromAdmin-seed#[E4F043B520CB031A]) [    x:core1] o.a.s.c.TransientSolrCoreCacheDefault Closing transient core [core1]
   [junit4]   2> 907542 INFO  (Thread-879) [    ] o.a.s.c.SolrCore [core1]  CLOSING SolrCore org.apache.solr.core.SolrCore@1a8b9e4
   [junit4]   2> 907542 INFO  (Thread-879) [    ] o.a.s.m.SolrMetricManager Closing metric reporters for registry=solr.core.core1, tag=27834852
   [junit4]   2> 907542 INFO  (Thread-879) [    ] o.a.s.m.r.SolrJmxReporter Closing reporter [org.apache.solr.metrics.reporters.SolrJmxReporter@901b29: rootName = null, domain = solr.core.core1, service url = null, agent id = null] for registry solr.core.core1 / com.codahale.metrics.MetricRegistry@f167a9
   [junit4]   2> 907543 INFO  (searcherExecutor-2081-thread-1-processing-x:core1) [    x:core1] o.a.s.c.SolrCore [core5] Registered new searcher Searcher@1cfcb7d[core5] main{ExitableDirectoryReader(UninvertingDirectoryReader())}
   [junit4]   2> 907576 INFO  (TEST-TestLazyCores.testCreateTransientFromAdmin-seed#[E4F043B520CB031A]) [    x:core1] o.a.s.c.SolrConfig Using Lucene MatchVersion: 8.0.0
   [junit4]   2> 907590 INFO  (TEST-TestLazyCores.testCreateTransientFromAdmin-seed#[E4F043B520CB031A]) [    x:core1] o.a.s.s.IndexSchema [core1] Schema name=tiny
   [junit4]   2> 907594 INFO  (TEST-TestLazyCores.testCreateTransientFromAdmin-seed#[E4F043B520CB031A]) [    x:core1] o.a.s.s.IndexSchema Loaded schema tiny/1.1 with uniqueid field id
   [junit4]   2> 907594 INFO  (TEST-TestLazyCores.testCreateTransientFromAdmin-seed#[E4F043B520CB031A]) [    x:core1] o.a.s.c.CoreContainer Creating SolrCore 'core1' using configuration from instancedir C:\Users\jenkins\workspace\Lucene-Solr-master-Windows\solr\build\solr-core\test\J0\temp\solr.core.TestLazyCores_E4F043B520CB031A-001\tempDir-001\.\core1, trusted=true
   [junit4]   2> 907609 INFO  (TEST-TestLazyCores.testCreateTransientFromAdmin-seed#[E4F043B520CB031A]) [    x:core1] o.a.s.m.r.SolrJmxReporter JMX monitoring for 'solr.core.core1' (registry 'solr.core.core1') enabled at server: com.sun.jmx.mbeanserver.JmxMBeanServer@1a7305
   [junit4]   2> 907609 INFO  (TEST-TestLazyCores.testCreateTransientFromAdmin-seed#[E4F043B520CB031A]) [    x:core1] o.a.s.c.SolrCore solr.RecoveryStrategy.Builder
   [junit4]   2> 907609 INFO  (TEST-TestLazyCores.testCreateTransientFromAdmin-seed#[E4F043B520CB031A]) [    x:core1] o.a.s.c.SolrCore [[core1] ] Opening new SolrCore at [C:\Users\jenkins\workspace\Lucene-Solr-master-Windows\solr\build\solr-core\test\J0\temp\solr.core.TestLazyCores_E4F043B520CB031A-001\tempDir-001\core1], dataDir=[C:\Users\jenkins\workspace\Lucene-Solr-master-Windows\solr\build\solr-core\test\J0\temp\solr.core.TestLazyCores_E4F043B520CB031A-001\tempDir-001\.\core1\data\]
   [junit4]   2> 907683 INFO  (TEST-TestLazyCores.testCreateTransientFromAdmin-seed#[E4F043B520CB031A]) [    x:core1] o.a.s.u.CommitTracker Hard AutoCommit: disabled
   [junit4]   2> 907683 INFO  (TEST-TestLazyCores.testCreateTransientFromAdmin-seed#[E4F043B520CB031A]) [    x:core1] o.a.s.u.CommitTracker Soft AutoCommit: disabled
   [junit4]   2> 907687 INFO  (TEST-TestLazyCores.testCreateTransientFromAdmin-seed#[E4F043B520CB031A]) [    x:core1] o.a.s.u.RandomMergePolicy RandomMergePolicy wrapping class org.apache.lucene.index.LogDocMergePolicy: [LogDocMergePolicy: minMergeSize=1000, mergeFactor=35, maxMergeSize=9223372036854775807, maxMergeSizeForForcedMerge=9223372036854775807, calibrateSizeByDeletes=false, maxMergeDocs=2147483647, maxCFSSegmentSizeMB=8.796093022207999E12, noCFSRatio=0.2537305360127089]
   [junit4]   2> 907688 INFO  (TEST-TestLazyCores.testCreateTransientFromAdmin-seed#[E4F043B520CB031A]) [    x:core1] o.a.s.s.SolrIndexSearcher Opening [Searcher@778af4[core1] main]
   [junit4]   2> 907689 INFO  (TEST-TestLazyCores.testCreateTransientFromAdmin-seed#[E4F043B520CB031A]) [    x:core1] o.a.s.r.ManagedResourceStorage File-based storage initialized to use dir: C:\Users\jenkins\workspace\Lucene-Solr-master-Windows\solr\build\solr-core\test\J0\temp\solr.core.TestLazyCores_E4F043B520CB031A-001\tempDir-001\core1\conf
   [junit4]   2> 907689 INFO  (TEST-TestLazyCores.testCreateTransientFromAdmin-seed#[E4F043B520CB031A]) [    x:core1] o.a.s.h.ReplicationHandler Commits will be reserved for 10000ms.
   [junit4]   2> 907690 INFO  (TEST-TestLazyCores.testCreateTransientFromAdmin-seed#[E4F043B520CB031A]) [    x:core1] o.a.s.c.TransientSolrCoreCacheDefault Closing transient core [core2]
   [junit4]   2> 907691 INFO  (searcherExecutor-2085-thread-1-processing-x:core1) [    x:core1] o.a.s.c.SolrCore [core1] Registered new searcher Searcher@778af4[core1] main{ExitableDirectoryReader(UninvertingDirectoryReader())}
   [junit4]   2> 907691 INFO  (Thread-879) [    ] o.a.s.c.SolrCore [core2]  CLOSING SolrCore org.apache.solr.core.SolrCore@4d8c71
   [junit4]   2> 907691 INFO  (Thread-879) [    ] o.a.s.m.SolrMetricManager Closing metric reporters for registry=solr.core.core2, tag=5082225
   [junit4]   2> 907691 INFO  (Thread-879) [    ] o.a.s.m.r.SolrJmxReporter Closing reporter [org.apache.solr.metrics.reporters.SolrJmxReporter@a210b2: rootName = null, domain = solr.core.core2, service url = null, agent id = null] for registry solr.core.core2 / com.codahale.metrics.MetricRegistry@1344a70
   [junit4]   2> 907724 INFO  (TEST-TestLazyCores.testCreateTransientFromAdmin-seed#[E4F043B520CB031A]) [    x:core1] o.a.s.c.SolrConfig Using Lucene MatchVersion: 8.0.0
   [junit4]   2> 907729 INFO  (TEST-TestLazyCores.testCreateTransientFromAdmin-seed#[E4F043B520CB031A]) [    x:core1] o.a.s.s.IndexSchema [core2] Schema name=tiny
   [junit4]   2> 907733 INFO  (TEST-TestLazyCores.testCreateTransientFromAdmin-seed#[E4F043B520CB031A]) [    x:core1] o.a.s.s.IndexSchema Loaded schema tiny/1.1 with uniqueid field id
   [junit4]   2> 907733 INFO  (TEST-TestLazyCores.testCreateTransientFromAdmin-seed#[E4F043B520CB031A]) [    x:core1] o.a.s.c.CoreContainer Creating SolrCore 'core2' using configuration from instancedir C:\Users\jenkins\workspace\Lucene-Solr-master-Windows\solr\build\solr-core\test\J0\temp\solr.core.TestLazyCores_E4F043B520CB031A-001\tempDir-001\.\core2, trusted=true
   [junit4]   2> 907747 INFO  (TEST-TestLazyCores.testCreateTransientFromAdmin-seed#[E4F043B520CB031A]) [    x:core1] o.a.s.m.r.SolrJmxReporter JMX monitoring for 'solr.core.core2' (registry 'solr.core.core2') enabled at server: com.sun.jmx.mbeanserver.JmxMBeanServer@1a7305
   [junit4]   2> 907747 INFO  (TEST-TestLazyCores.testCreateTransientFromAdmin-seed#[E4F043B520CB031A]) [    x:core1] o.a.s.c.SolrCore solr.RecoveryStrategy.Builder
   [junit4]   2> 907747 INFO  (TEST-TestLazyCores.testCreateTransientFromAdmin-seed#[E4F043B520CB031A]) [    x:core1] o.a.s.c.SolrCore [[core2] ] Opening new SolrCore at [C:\Users\jenkins\workspace\Lucene-Solr-master-Windows\solr\build\solr-core\test\J0\temp\solr.core.TestLazyCores_E4F043B520CB031A-001\tempDir-001\core2], dataDir=[C:\Users\jenkins\workspace\Lucene-Solr-master-Windows\solr\build\solr-core\test\J0\temp\solr.core.TestLazyCores_E4F043B520CB031A-001\tempDir-001\.\core2\data\]
   [junit4]   2> 907820 INFO  (TEST-TestLazyCores.testCreateTransientFromAdmin-seed#[E4F043B520CB031A]) [    x:core1] o.a.s.u.CommitTracker Hard AutoCommit: disabled
   [junit4]   2> 907820 INFO  (TEST-TestLazyCores.testCreateTransientFromAdmin-seed#[E4F043B520CB031A]) [    x:core1] o.a.s.u.CommitTracker Soft AutoCommit: disabled
   [junit4]   2> 907824 INFO  (TEST-TestLazyCores.testCreateTransientFromAdmin-seed#[E4F043B520CB031A]) [    x:core1] o.a.s.u.RandomMergePolicy RandomMergePolicy wrapping class org.apache.lucene.index.TieredMergePolicy: [TieredMergePolicy: maxMergeAtOnce=29, maxMergeAtOnceExplicit=44, maxMergedSegmentMB=27.1337890625, floorSegmentMB=1.5703125, forceMergeDeletesPctAllowed=19.648390694282085, segmentsPerTier=34.0, maxCFSSegmentSizeMB=8.796093022207999E12, noCFSRatio=0.0
   [junit4]   2> 907825 INFO  (TEST-TestLazyCores.testCreateTransientFromAdmin-seed#[E4F043B520CB031A]) [    x:core1] o.a.s.s.SolrIndexSearcher Opening [Searcher@61a701[core2] main]
   [junit4]   2> 907826 INFO  (TEST-TestLazyCores.testCreateTransientFromAdmin-seed#[E4F043B520CB031A]) [    x:core1] o.a.s.r.ManagedResourceStorage File-based storage initialized to use dir: C:\Users\jenkins\workspace\Lucene-Solr-master-Windows\solr\build\solr-core\test\J0\temp\solr.core.TestLazyCores_E4F043B520CB031A-001\tempDir-001\core2\conf
   [junit4]   2> 907827 INFO  (TEST-TestLazyCores.testCreateTransientFromAdmin-seed#[E4F043B520CB031A]) [    x:core1] o.a.s.h.ReplicationHandler Commits will be reserved for 10000ms.
   [junit4]   2> 907827 INFO  (TEST-TestLazyCores.testCreateTransientFromAdmin-seed#[E4F043B520CB031A]) [    x:core1] o.a.s.c.TransientSolrCoreCacheDefault Closing transient core [core3]
   [junit4]   2> 907827 INFO  (Thread-879) [    ] o.a.s.c.SolrCore [core3]  CLOSING SolrCore org.apache.solr.core.SolrCore@53c10
   [junit4]   2> 907827 INFO  (Thread-879) [    ] o.a.s.m.SolrMetricManager Closing metric reporters for registry=solr.core.core3, tag=343056
   [junit4]   2> 907827 INFO  (Thread-879) [    ] o.a.s.m.r.SolrJmxReporter Closing reporter [org.apache.solr.metrics.reporters.SolrJmxReporter@1f8cb77: rootName = null, domain = solr.core.core3, service url = null, agent id = null] for registry solr.core.core3 / com.codahale.metrics.MetricRegistry@1bbbfc4
   [junit4]   2> 907828 INFO  (searcherExecutor-2089-thread-1-processing-x:core1) [    x:core1] o.a.s.c.SolrCore [core2] Registered new searcher Searcher@61a701[core2] main{ExitableDirectoryReader(UninvertingDirectoryReader())}
   [junit4]   2> 907860 INFO  (TEST-TestLazyCores.testCreateTransientFromAdmin-seed#[E4F043B520CB031A]) [    x:core1] o.a.s.c.SolrConfig Using Lucene MatchVersion: 8.0.0
   [junit4]   2> 907866 INFO  (TEST-TestLazyCores.testCreateTransientFromAdmin-seed#[E4F043B520CB031A]) [    x:core1] o.a.s.s.IndexSchema [core3] Schema name=tiny
   [junit4]   2> 907870 INFO  (TEST-TestLazyCores.testCreateTransientFromAdmin-seed#[E4F043B520CB031A]) [    x:core1] o.a.s.s.IndexSchema Loaded schema tiny/1.1 with uniqueid field id
   [junit4]   2> 907870 INFO  (TEST-TestLazyCores.testCreateTransientFromAdmin-seed#[E4F043B520CB031A]) [    x:core1] o.a.s.c.CoreContainer Creating SolrCore 'core3' using configuration from instancedir C:\Users\jenkins\workspace\Lucene-Solr-master-Windows\solr\build\solr-core\test\J0\temp\solr.core.TestLazyCores_E4F043B520CB031A-001\tempDir-001\.\core3, trusted=true
   [junit4]   2> 907883 INFO  (TEST-TestLazyCores.testCreateTransientFromAdmin-seed#[E4F043B520CB031A]) [    x:core1] o.a.s.m.r.SolrJmxReporter JMX monitoring for 'solr.core.core3' (registry 'solr.core.core3') enabled at server: com.sun.jmx.mbeanserver.JmxMBeanServer@1a7305
   [junit4]   2> 907883 INFO  (TEST-TestLazyCores.testCreateTransientFromAdmin-seed#[E4F043B520CB031A]) [    x:core1] o.a.s.c.SolrCore solr.RecoveryStrategy.Builder
   [junit4]   2> 907883 INFO  (TEST-TestLazyCores.testCreateTransientFromAdmin-seed#[E4F043B520CB031A]) [    x:core1] o.a.s.c.SolrCore [[core3] ] Opening new SolrCore at [C:\Users\jenkins\workspace\Lucene-Solr-master-Windows\solr\build\solr-core\test\J0\temp\solr.core.TestLazyCores_E4F043B520CB031A-001\tempDir-001\core3], dataDir=[C:\Users\jenkins\workspace\Lucene-Solr-master-Windows\solr\build\solr-core\test\J0\temp\solr.core.TestLazyCores_E4F043B520CB031A-001\tempDir-001\.\core3\data\]
   [junit4]   2> 907962 INFO  (TEST-TestLazyCores.testCreateTransientFromAdmin-seed#[E4F043B520CB031A]) [    x:core1] o.a.s.u.CommitTracker Hard AutoCommit: disabled
   [junit4]   2> 907962 INFO  (TEST-TestLazyCores.testCreateTransientFromAdmin-seed#[E4F043B520CB031A]) [    x:core1] o.a.s.u.CommitTracker Soft AutoCommit: disabled
   [junit4]   2> 907965 INFO  (TEST-TestLazyCores.testCreateTransientFromAdmin-seed#[E4F043B520CB031A]) [    x:core1] o.a.s.u.RandomMergePolicy RandomMergePolicy wrapping class org.apache.lucene.index.LogByteSizeMergePolicy: [LogByteSizeMergePolicy: minMergeSize=1677721, mergeFactor=13, maxMergeSize=2147483648, maxMergeSizeForForcedMerge=9223372036854775807, calibrateSizeByDeletes=false, maxMergeDocs=2147483647, maxCFSSegmentSizeMB=8.796093022207999E12, noCFSRatio=0.0]
   [junit4]   2> 907965 INFO  (TEST-TestLazyCores.testCreateTransientFromAdmin-seed#[E4F043B520CB031A]) [    x:core1] o.a.s.s.SolrIndexSearcher Opening [Searcher@3bd6dd[core3] main]
   [junit4]   2> 907966 INFO  (TEST-TestLazyCores.testCreateTransientFromAdmin-seed#[E4F043B520CB031A]) [    x:core1] o.a.s.r.ManagedResourceStorage File-based storage initialized to use dir: C:\Users\jenkins\workspace\Lucene-Solr-master-Windows\solr\build\solr-core\test\J0\temp\solr.core.TestLazyCores_E4F043B520CB031A-001\tempDir-001\core3\conf
   [junit4]   2> 907966 INFO  (TEST-TestLazyCores.testCreateTransientFromAdmin-seed#[E4F043B520CB031A]) [    x:core1] o.a.s.h.ReplicationHandler Commits will be reserved for 10000ms.
   [junit4]   2> 907967 INFO  (TEST-TestLazyCores.testCreateTransientFromAdmin-seed#[E4F043B520CB031A]) [    x:core1] o.a.s.c.TransientSolrCoreCacheDefault Closing transient core [core4]
   [junit4]   2> 907967 INFO  (Thread-879) [    ] o.a.s.c.SolrCore [core4]  CLOSING SolrCore org.apache.solr.core.SolrCore@83d7fb
   [junit4]   2> 907967 INFO  (Thread-879) [    ] o.a.s.m.SolrMetricManager Closing metric reporters for registry=solr.core.core4, tag=8640507
   [junit4]   2> 907967 INFO  (Thread-879) [    ] o.a.s.m.r.SolrJmxReporter Closing reporter [org.apache.solr.metrics.reporters.SolrJmxReporter@5384f6: rootName = null, domain = solr.core.core4, service url = null, agent id = null] for registry solr.core.core4 / com.codahale.metrics.MetricRegistry@9eaf9d
   [junit4]   2> 907968 INFO  (searcherExecutor-2093-thread-1-processing-x:core1) [    x:core1] o.a.s.c.SolrCore [core3] Registered new searcher Searcher@3bd6dd[core3] main{ExitableDirectoryReader(UninvertingDirectoryReader())}
   [junit4]   2> 908005 INFO  (TEST-TestLazyCores.testCreateTransientFromAdmin-seed#[E4F043B520CB031A]) [    x:core1] o.a.s.c.SolrConfig Using Lucene MatchVersion: 8.0.0
   [junit4]   2> 908010 INFO  (TEST-TestLazyCores.testCreateTransientFromAdmin-seed#[E4F043B520CB031A]) [    x:core1] o.a.s.s.IndexSchema [core4] Schema name=tiny
   [junit4]   2> 908014 INFO  (TEST-TestLazyCores.testCreateTransientFromAdmin-seed#[E4F043B520CB031A]) [    x:core1] o.a.s.s.IndexSchema Loaded schema tiny/1.1 with uniqueid field id
   [junit4]   2> 908014 INFO  (TEST-TestLazyCores.testCreateTransientFromAdmin-seed#[E4F043B520CB031A]) [    x:core1] o.a.s.c.CoreContainer Creating SolrCore 'core4' using configuration from instancedir C:\Users\jenkins\workspace\Lucene-Solr-master-Windows\solr\build\solr-core\test\J0\temp\solr.core.TestLazyCores_E4F043B520CB031A-001\tempDir-001\.\core4, trusted=true
   [junit4]   2> 908026 INFO  (TEST-TestLazyCores.testCreateTransientFromAdmin-seed#[E4F043B520CB031A]) [    x:core1] o.a.s.m.r.SolrJmxReporter JMX monitoring for 'solr.core.core4' (registry 'solr.core.core4') enabled at server: com.sun.jmx.mbeanserver.JmxMBeanServer@1a7305
   [junit4]   2> 908026 INFO  (TEST-TestLazyCores.testCreateTransientFromAdmin-seed#[E4F043B520CB031A]) [    x:core1] o.a.s.c.SolrCore solr.RecoveryStrategy.Builder
   [junit4]   2> 908027 INFO  (TEST-TestLazyCores.testCreateTransientFromAdmin-seed#[E4F043B520CB031A]) [    x:core1] o.a.s.c.SolrCore [[core4] ] Opening new SolrCore at [C:\Users\jenkins\workspace\Lucene-Solr-master-Windows\solr\build\solr-core\test\J0\temp\solr.core.TestLazyCores_E4F043B520CB031A-001\tempDir-001\core4], dataDir=[C:\Users\jenkins\workspace\Lucene-Solr-master-Windows\solr\build\solr-core\test\J0\temp\solr.core.TestLazyCores_E4F043B520CB031A-001\tempDir-001\.\core4\data\]
   [junit4]   2> 908098 INFO  (TEST-TestLazyCores.testCreateTransientFromAdmin-seed#[E4F043B520CB031A]) [    x:core1] o.a.s.u.CommitTracker Hard AutoCommit: disabled
   [junit4]   2> 908098 INFO  (TEST-TestLazyCores.testCreateTransientFromAdmin-seed#[E4F043B520CB031A]) [    x:core1] o.a.s.u.CommitTracker Soft AutoCommit: disabled
   [junit4]   2> 908101 INFO  (TEST-TestLazyCores.testCreateTransientFromAdmin-seed#[E4F043B520CB031A]) [    x:core1] o.a.s.u.RandomMergePolicy RandomMergePolicy wrapping class org.apache.lucene.index.TieredMergePolicy: [TieredMergePolicy: maxMergeAtOnce=34, maxMergeAtOnceExplicit=18, maxMergedSegmentMB=48.33984375, floorSegmentMB=1.1123046875, forceMergeDeletesPctAllowed=11.499519282053773, segmentsPerTier=28.0, maxCFSSegmentSizeMB=8.796093022207999E12, noCFSRatio=1.0
   [junit4]   2> 908102 INFO  (TEST-TestLazyCores.testCreateTransientFromAdmin-seed#[E4F043B520CB031A]) [    x:core1] o.a.s.s.SolrIndexSearcher Opening [Searcher@b1a88d[core4] main]
   [junit4]   2> 908103 INFO  (TEST-TestLazyCores.testCreateTransientFromAdmin-seed#[E4F043B520CB031A]) [    x:core1] o.a.s.r.ManagedResourceStorage File-based storage initialized to use dir: C:\Users\jenkins\workspace\Lucene-Solr-master-Windows\solr\build\solr-core\test\J0\temp\solr.core.TestLazyCores_E4F043B520CB031A-001\tempDir-001\core4\conf
   [junit4]   2> 908103 INFO  (TEST-TestLazyCores.testCreateTransientFromAdmin-seed#[E4F043B520CB031A]) [    x:core1] o.a.s.h.ReplicationHandler Commits will be reserved for 10000ms.
   [junit4]   2> 908104 INFO  (TEST-TestLazyCores.testCreateTransientFromAdmin-seed#[E4F043B520CB031A]) [    x:core1] o.a.s.c.TransientSolrCoreCacheDefault Closing transient core [core5]
   [junit4]   2> 908104 INFO  (Thread-879) [    ] o.a.s.c.SolrCore [core5]  CLOSING SolrCore org.apache.solr.core.SolrCore@18463e0
   [junit4]   2> 908104 INFO  (Thread-879) [    ] o.a.s.m.SolrMetricManager Closing metric reporters for registry=solr.core.core5, tag=25453536
   [junit4]   2> 908104 INFO  (Thread-879) [    ] o.a.s.m.r.SolrJmxReporter Closing reporter [org.apache.solr.metrics.reporters.SolrJmxReporter@141591a: rootName = null, domain = solr.core.core5, service url = null, agent id = null] for registry solr.core.core5 / com.codahale.metrics.MetricRegistry@bf5501
   [junit4]   2> 908104 INFO  (searcherExecutor-2097-thread-1-processing-x:core1) [    x:core1] o.a.s.c.SolrCore [core4] Registered new searcher Searcher@b1a88d[core4] main{ExitableDirectoryReader(UninvertingDirectoryReader())}
   [junit4]   2> 908135 INFO  (TEST-TestLazyCores.testCreateTransientFromAdmin-seed#[E4F043B520CB031A]) [    x:core1] o.a.s.c.SolrConfig Using Lucene MatchVersion: 8.0.0
   [junit4]   2> 908140 INFO  (TEST-TestLazyCores.testCreateTransientFromAdmin-seed#[E4F043B520CB031A]) [    x:core1] o.a.s.s.IndexSchema [core5] Schema name=tiny
   [junit4]   2> 908143 INFO  (TEST-TestLazyCores.testCreateTransientFromAdmin-seed#[E4F043B520CB031A]) [    x:core1] o.a.s.s.IndexSchema Loaded schema tiny/1.1 with uniqueid field id
   [junit4]   2> 908143 INFO  (TEST-TestLazyCores.testCreateTransientFromAdmin-seed#[E4F043B520CB031A]) [    x:core1] o.a.s.c.CoreContainer Creating SolrCore 'core5' using configuration from instancedir C:\Users\jenkins\workspace\Lucene-Solr-master-Windows\solr\build\solr-core\test\J0\temp\solr.core.TestLazyCores_E4F043B520CB031A-001\tempDir-001\.\core5, trusted=true
   [junit4]   2> 908156 INFO  (TEST-TestLazyCores.testCreateTransientFromAdmin-seed#[E4F043B520CB031A]) [    x:core1] o.a.s.m.r.SolrJmxReporter JMX monitoring for 'solr.core.core5' (registry 'solr.core.core5') enabled at server: com.sun.jmx.mbeanserver.JmxMBeanServer@1a7305
   [junit4]   2> 908156 INFO  (TEST-TestLazyCores.testCreateTransientFromAdmin-seed#[E4F043B520CB031A]) [    x:core1] o.a.s.c.SolrCore solr.RecoveryStrategy.Builder
   [junit4]   2> 908156 INFO  (TEST-TestLazyCores.testCreateTransientFromAdmin-seed#[E4F043B520CB031A]) [    x:core1] o.a.s.c.SolrCore [[core5] ] Opening new SolrCore at [C:\Users\jenkins\workspace\Lucene-Solr-master-Windows\solr\build\solr-core\test\J0\temp\solr.core.TestLazyCores_E4F043B520CB031A-001\tempDir-001\core5], dataDir=[C:\Users\jenkins\workspace\Lucene-Solr-master-Windows\solr\build\solr-core\test\J0\temp\solr.core.TestLazyCores_E4F043B520CB031A-001\tempDir-001\.\core5\data\]
   [junit4]   2> 908226 INFO  (TEST-TestLazyCores.testCreateTransientFromAdmin-seed#[E4F043B520CB031A]) [    x:core1] o.a.s.u.CommitTracker Hard AutoCommit: disabled
   [junit4]   2> 908226 INFO  (TEST-TestLazyCores.testCreateTransientFromAdmin-seed#[E4F043B520CB031A]) [    x:core1] o.a.s.u.CommitTracker Soft AutoCommit: disabled
   [junit4]   2> 908229 INFO  (TEST-TestLazyCores.testCreateTransientFromAdmin-seed#[E4F043B520CB031A]) [    x:core1] o.a.s.u.RandomMergePolicy RandomMergePolicy wrapping class org.apache.lucene.index.AlcoholicMergePolicy: [AlcoholicMergePolicy: minMergeSize=0, mergeFactor=10, maxMergeSize=1061166064, maxMergeSizeForForcedMerge=9223372036854775807, calibrateSizeByDeletes=true, maxMergeDocs=2147483647, maxCFSSegmentSizeMB=8.796093022207999E12, noCFSRatio=0.1]
   [junit4]   2> 908230 INFO  (TEST-TestLazyCores.testCreateTransientFromAdmin-seed#[E4F043B520CB031A]) [    x:core1] o.a.s.s.SolrIndexSearcher Opening [Searcher@1ed92e3[core5] main]
   [junit4]   2> 908230 INFO  (TEST-TestLazyCores.testCreateTransientFromAdmin-seed#[E4F043B520CB031A]) [    x:core1] o.a.s.r.ManagedResourceStorage File-based storage initialized to use dir: C:\Users\jenkins\workspace\Lucene-Solr-master-Windows\solr\build\solr-core\test\J0\temp\solr.core.TestLazyCores_E4F043B520CB031A-001\tempDir-001\core5\conf
   [junit4]   2> 908231 INFO  (TEST-TestLazyCores.testCreateTransientFromAdmin-seed#[E4F043B520CB031A]) [    x:core1] o.a.s.h.ReplicationHandler Commits will be reserved for 10000ms.
   [junit4]   2> 908231 INFO  (TEST-TestLazyCores.testCreateTransientFromAdmin-seed#[E4F043B520CB031A]) [    x:core1] o.a.s.c.TransientSolrCoreCacheDefault Closing transient core [core1]
   [junit4]   2> 908232 INFO  (searcherExecutor-2101-thread-1-processing-x:core1) [    x:core1] o.a.s.c.SolrCore [core5] Registered new searcher Searcher@1ed92e3[core5] main{ExitableDirectoryReader(UninvertingDirectoryReader())}
   [junit4]   2> 908232 INFO  (TEST-TestLazyCores.testCreateTransientFromAdmin-seed#[E4F043B520CB031A]) [    x:core1] o.a.s.m.SolrMetricManager Closing metric reporters for registry=solr.core.core2, tag=null
   [junit4]   2> 908232 INFO  (TEST-TestLazyCores.testCreateTransientFromAdmin-seed#[E4F043B520CB031A]) [    x:core1] o.a.s.m.r.SolrJmxReporter Closing reporter [org.apache.solr.metrics.reporters.SolrJmxReporter@9b0b9a: rootName = null, domain = solr.core.core2, service url = null, agent id = null] for registry solr.core.core2 / com.codahale.metrics.MetricRegistry@1344a70
   [junit4]   2> 908239 INFO  (TEST-TestLazyCores.testCreateTransientFromAdmin-seed#[E4F043B520CB031A]) [    x:core1] o.a.s.c.SolrCore Core core2 is not yet closed, waiting 100 ms before checking again.
   [junit4]   2> 908340 INFO  (TEST-TestLazyCores.testCreateTransientFromAdmin-seed#[E4F043B520CB031A]) [    x:core1] o.a.s.c.SolrCore Core core2 is not yet closed, waiting 100 ms before checking again.
   [junit4]   2> 908387 INFO  (Thread-880) [    x:core1] o.a.s.c.SolrCore [core1]  CLOSING SolrCore org.apache.solr.core.SolrCore@1705197
   [junit4]   2> 908387 INFO  (Thread-880) [    x:core1] o.a.s.m.SolrMetricManager Closing metric reporters for registry=solr.core.core1, tag=24138135
   [junit4]   2> 908387 INFO  (Thread-880) [    x:core1] o.a.s.m.r.SolrJmxReporter Closing reporter [org.apache.solr.metrics.reporters.SolrJmxReporter@f25801: rootName = null, domain = solr.core.core1, service url = null, agent id = null] for registry solr.core.core1 / com.codahale.metrics.MetricRegistry@f167a9
   [junit4]   2> 908392 INFO  (Thread-880) [    x:core1] o.a.s.c.SolrCore [core2]  CLOSING SolrCore org.apache.solr.core.SolrCore@1508986
   [junit4]   2> 908392 INFO  (Thread-880) [    x:core1] o.a.s.m.SolrMetricManager Closing metric reporters for registry=solr.core.core2, tag=22055302
   [junit4]   2> 908441 INFO  (TEST-TestLazyCores.testCreateTransientFromAdmin-seed#[E4F043B520CB031A]) [    x:core1] o.a.s.m.SolrMetricManager Closing metric reporters for registry=solr.core.core3, tag=null
   [junit4]   2> 908441 INFO  (TEST-TestLazyCores.testCreateTransientFromAdmin-seed#[E4F043B520CB031A]) [    x:core1] o.a.s.m.r.SolrJmxReporter Closing reporter [org.apache.solr.metrics.reporters.SolrJmxReporter@27de69: rootName = null, domain = solr.core.core3, service url = null, agent id = null] for registry solr.core.core3 / com.codahale.metrics.MetricRegistry@1bbbfc4
   [junit4]   2> 908443 INFO  (TEST-TestLazyCores.testCreateTransientFromAdmin-seed#[E4F043B520CB031A]) [    x:core1] o.a.s.c.SolrCore [core3]  CLOSING SolrCore org.apache.solr.core.SolrCore@1bfa247
   [junit4]   2> 908443 INFO  (TEST-TestLazyCores.testCreateTransientFromAdmin-seed#[E4F043B520CB031A]) [    x:core1] o.a.s.m.SolrMetricManager Closing metric reporters for registry=solr.core.core3, tag=29336135
   [junit4]   2> 908449 INFO  (TEST-TestLazyCores.testCreateTransientFromAdmin-seed#[E4F043B520CB031A]) [    x:core1] o.a.s.m.SolrMetricManager Closing metric reporters for registry=solr.core.core4, tag=null
   [junit4]   2> 908449 INFO  (TEST-TestLazyCores.testCreateTransientFromAdmin-seed#[E4F043B520CB031A]) [    x:core1] o.a.s.m.r.SolrJmxReporter Closing reporter [org.apache.solr.metrics.reporters.SolrJmxReporter@aead16: rootName = null, domain = solr.core.core4, service url = null, agent id = null] for registry solr.core.core4 / com.codahale.metrics.MetricRegistry@9eaf9d
   [junit4]   2> 908456 INFO  (TEST-TestLazyCores.testCreateTransientFromAdmin-seed#[E4F043B520CB031A]) [    x:core1] o.a.s.c.SolrCore [core4]  CLOSING SolrCore org.apache.solr.core.SolrCore@8d5f9f
   [junit4]   2> 908456 INFO  (TEST-TestLazyCores.testCreateTransientFromAdmin-seed#[E4F043B520CB031A]) [    x:core1] o.a.s.m.SolrMetricManager Closing metric reporters for registry=solr.core.core4, tag=9265055
   [junit4]   2> 908458 INFO  (TEST-TestLazyCores.testCreateTransientFromAdmin-seed#[E4F043B520CB031A]) [    x:core1] o.a.s.m.SolrMetricManager Closing metric reporters for registry=solr.core.core5, tag=null
   [junit4]   2> 908458 INFO  (TEST-TestLazyCores.testCreateTransientFromAdmin-seed#[E4F043B520CB031A]) [    x:core1] o.a.s.m.r.SolrJmxReporter Closing reporter [org.apache.solr.metrics.reporters.SolrJmxReporter@2a436d: rootName = null, domain = solr.core.core5, service url = null, agent id = null] for registry solr.core.core5 / com.codahale.metrics.MetricRegistry@bf5501
   [junit4]   2> 908469 INFO  (TEST-TestLazyCores.testCreateTransientFromAdmin-seed#[E4F043B520CB031A]) [    x:core1] o.a.s.c.SolrCore [core5]  CLOSING SolrCore org.apache.solr.core.SolrCore@13335fc
   [junit4]   2> 908469 INFO  (TEST-TestLazyCores.testCreateTransientFromAdmin-seed#[E4F043B520CB031A]) [    x:core1] o.a.s.m.SolrMetricManager Closing metric reporters for registry=solr.core.core5, tag=20133372
   [junit4]   2> 908470 INFO  (TEST-TestLazyCores.testCreateTransientFromAdmin-seed#[E4F043B520CB031A]) [    x:core1] o.a.s.c.CoreContainer Shutting down CoreContainer instance=16891304
   [junit4]   2> 908470 INFO  (TEST-TestLazyCores.testCreateTransientFromAdmin-seed#[E4F043B520CB031A]) [    x:core1] o.a.s.m.SolrMetricManager Closing metric reporters for registry=solr.node, tag=null
   [junit4]   2> 908470 INFO  (TEST-TestLazyCores.testCreateTransientFromAdmin-seed#[E4F043B520CB031A]) [    x:core1] o.a.s.m.r.SolrJmxReporter Closing reporter [org.apache.solr.metrics.reporters.SolrJmxReporter@84fce5: rootName = null, domain = solr.node, service url = null, agent id = null] for registry solr.node / com.codahale.metrics.MetricRegistry@da909
   [junit4]   2> 908474 INFO  (TEST-TestLazyCores.testCreateTransientFromAdmin-seed#[E4F043B520CB031A]) [    x:core1] o.a.s.m.SolrMetricManager Closing metric reporters for registry=solr.jvm, tag=null
   [junit4]   2> 908474 INFO  (TEST-TestLazyCores.testCreateTransientFromAdmin-seed#[E4F043B520CB031A]) [    x:core1] o.a.s.m.r.SolrJmxReporter Closing reporter [org.apache.solr.metrics.reporters.SolrJmxReporter@42cdd1: rootName = null, domain = solr.jvm, service url = null, agent id = null] for registry solr.jvm / com.codahale.metrics.MetricRegistry@15a46cd
   [junit4]   2> 908477 INFO  (TEST-TestLazyCores.testCreateTransientFromAdmin-seed#[E4F043B520CB031A]) [    x:core1] o.a.s.m.SolrMetricManager Closing metric reporters for registry=solr.jetty, tag=null
   [junit4]   2> 908477 INFO  (TEST-TestLazyCores.testCreateTransientFromAdmin-seed#[E4F043B520CB031A]) [    x:core1] o.a.s.m.r.SolrJmxReporter Closing reporter [org.apache.solr.metrics.reporters.SolrJmxReporter@61b24f: rootName = null, domain = solr.jetty, service url = null, agent id = null] for registry solr.jetty / com.codahale.metrics.MetricRegistry@12b109a
   [junit4]   2> 908478 INFO  (coreCloseExecutor-2110-thread-1-processing-x:core1) [    x:collection1] o.a.s.c.SolrCore [collection1]  CLOSING SolrCore org.apache.solr.core.SolrCore@18498f2
   [junit4]   2> 908478 INFO  (coreCloseExecutor-2110-thread-2-processing-x:core1) [    x:collection5] o.a.s.c.SolrCore [collection5]  CLOSING SolrCore org.apache.solr.core.SolrCore@186f71c
   [junit4]   2> 908478 INFO  (coreCloseExecutor-2110-thread-1-processing-x:core1) [    x:collection1] o.a.s.m.SolrMetricManager Closing metric reporters for registry=solr.core.collection1, tag=25467122
   [junit4]   2> 908478 INFO  (coreCloseExecutor-2110-thread-1-processing-x:core1) [    x:collection1] o.a.s.m.r.SolrJmxReporter Closing reporter [org.apache.solr.metrics.reporters.SolrJmxReporter@faf54a: rootName = null, domain = solr.core.collection1, service url = null, agent id = null] for registry solr.core.collection1 / com.codahale.metrics.MetricRegistry@1e78be7
   [junit4]   2> 908482 INFO  (coreCloseExecutor-2110-thread-2-processing-x:core1) [    x:collection5] o.a.s.m.SolrMetricManager Closing metric reporters for registry=solr.core.collection5, tag=25622300
   [junit4]   2> 908482 INFO  (coreCloseExecutor-2110-thread-2-processing-x:core1) [    x:collection5] o.a.s.m.r.SolrJmxReporter Closing reporter [org.apache.solr.metrics.reporters.SolrJmxReporter@6d2326: rootName = null, domain = solr.core.collection5, service url = null, agent id = null] for registry solr.core.collection5 / com.codahale.metrics.MetricRegistry@4fe0a2
   [junit4]   2> 908490 INFO  (TEST-TestLazyCores.testCreateTransientFromAdmin-seed#[E4F043B520CB031A]) [    x:core1] o.a.s.SolrTestCaseJ4 ###Ending testCreateTransientFromAdmin
   [junit4]   2> 908493 INFO  (TEST-TestLazyCores.testCreateSame-seed#[E4F043B520CB031A]) [    x:core1] o.a.s.SolrTestCaseJ4 ###Starting testCreateSame
   [junit4]   2> 908538 INFO  (TEST-TestLazyCores.testCreateSame-seed#[E4F043B520CB031A]) [    x:core1] o.a.s.c.SolrXmlConfig Loading container configuration from C:\Users\jenkins\workspace\Lucene-Solr-master-Windows\solr\build\solr-core\test\J0\temp\solr.core.TestLazyCores_E4F043B520CB031A-001\tempDir-002\solr.xml
   [junit4]   2> 908545 INFO  (TEST-TestLazyCores.testCreateSame-seed#[E4F043B520CB031A]) [    x:core1] o.a.s.c.SolrXmlConfig Configuration parameter autoReplicaFailoverWorkLoopDelay is ignored
   [junit4]   2> 908545 INFO  (TEST-TestLazyCores.testCreateSame-seed#[E4F043B520CB031A]) [    x:core1] o.a.s.c.SolrXmlConfig Configuration parameter autoReplicaFailoverBadNodeExpiration is ignored
   [junit4]   2> 908550 INFO  (TEST-TestLazyCores.testCreateSame-seed#[E4F043B520CB031A]) [    x:core1] o.a.s.c.SolrXmlConfig MBean server found: com.sun.jmx.mbeanserver.JmxMBeanServer@1a7305, but no JMX reporters were configured - adding default JMX reporter.
   [junit4]   2> 908669 INFO  (TEST-TestLazyCores.testCreateSame-seed#[E4F043B520CB031A]) [    x:core1] o.a.s.m.r.SolrJmxReporter JMX monitoring for 'solr.node' (registry 'solr.node') enabled at server: com.sun.jmx.mbeanserver.JmxMBeanServer@1a7305
   [junit4]   2> 908674 INFO  (TEST-TestLazyCores.testCreateSame-seed#[E4F043B520CB031A]) [    x:core1] o.a.s.m.r.SolrJmxReporter JMX monitoring for 'solr.jvm' (registry 'solr.jvm') enabled at server: com.sun.jmx.mbeanserver.JmxMBeanServer@1a7305
   [junit4]   2> 908674 INFO  (TEST-TestLazyCores.testCreateSame-seed#[E4F043B520CB031A]) [    x:core1] o.a.s.m.r.SolrJmxReporter JMX monitoring for 'solr.jetty' (registry 'solr.jetty') enabled at server: com.sun.jmx.mbeanserver.JmxMBeanServer@1a7305
   [junit4]   2> 908685 INFO  (TEST-TestLazyCores.testCreateSame-seed#[E4F043B520CB031A]) [    x:core1] o.a.s.c.TransientSolrCoreCacheDefault Allocating transient cache for 4 transient cores
   [junit4]   2> 908734 INFO  (coreLoadExecutor-2117-thread-2-processing-x:core1) [    x:collection2] o.a.s.c.SolrConfig Using Lucene MatchVersion: 8.0.0
   [junit4]   2> 908736 INFO  (coreLoadExecutor-2117-thread-1-processing-x:core1) [    x:collection1] o.a.s.c.SolrConfig Using Lucene MatchVersion: 8.0.0
   [junit4]   2> 908737 INFO  (coreLoadExecutor-2117-thread-3-processing-x:core1) [    x:collection5] o.a.s.c.SolrConfig Using Lucene MatchVersion: 8.0.0
   [junit4]   2> 908744 INFO  (coreLoadExecutor-2117-thread-1-processing-x:core1) [    x:collection1] o.a.s.s.IndexSchema [collection1] Schema name=tiny
   [junit4]   2> 908745 INFO  (coreLoadExecutor-2117-thread-2-processing-x:core1) [    x:collection2] o.a.s.s.IndexSchema [collection2] Schema name=tiny
   [junit4]   2> 908745 INFO  (coreLoadExecutor-2117-thread-3-processing-x:core1) [    x:collection5] o.a.s.s.IndexSchema [collection5] Schema name=tiny
   [junit4]   2> 908750 INFO  (coreLoadExecutor-2117-thread-3-processing-x:core1) [    x:collection5] o.a.s.s.IndexSchema Loaded schema tiny/1.1 with uniqueid field id
   [junit4]   2> 908750 INFO  (coreLoadExecutor-2117-thread-3-processing-x:core1) [    x:collection5] o.a.s.c.CoreContainer Creating SolrCore 'collection5' using configuration from instancedir C:\Users\jenkins\workspace\Lucene-Solr-master-Windows\solr\build\solr-core\test\J0\temp\solr.core.TestLazyCores_E4F043B520CB031A-001\tempDir-002\.\collection5, trusted=true
   [junit4]   2> 908750 INFO  (coreLoadExecutor-2117-thread-3-processing-x:core1) [    x:collection5] o.a.s.m.r.SolrJmxReporter JMX monitoring for 'solr.core.collection5' (registry 'solr.core.collection5') enabled at server: com.sun.jmx.mbeanserver.JmxMBeanServer@1a7305
   [junit4]   2> 908750 INFO  (coreLoadExecutor-2117-thread-3-processing-x:core1) [    x:collection5] o.a.s.c.SolrCore solr.RecoveryStrategy.Builder
   [junit4]   2> 908750 INFO  (coreLoadExecutor-2117-thread-3-processing-x:core1) [    x:collection5] o.a.s.c.SolrCore [[collection5] ] Opening new SolrCore at [C:\Users\jenkins\workspace\Lucene-Solr-master-Windows\solr\build\solr-core\test\J0\temp\solr.core.TestLazyCores_E4F043B520CB031A-001\tempDir-002\collection5], dataDir=[C:\Users\jenkins\workspace\Lucene-Solr-master-Windows\solr\build\solr-core\test\J0\temp\solr.core.TestLazyCores_E4F043B520CB031A-001\tempDir-002\.\collection5\data\]
   [junit4]   2> 908750 INFO  (coreLoadExecutor-2117-thread-2-processing-x:core1) [    x:collection2] o.a.s.s.IndexSchema Loaded schema tiny/1.1 with uniqueid field id
   [junit4]   2> 908750 INFO  (coreLoadExecutor-2117-thread-2-processing-x:core1) [    x:collection2] o.a.s.c.CoreContainer Creating SolrCore 'collection2' using configuration from instancedir C:\Users\jenkins\workspace\Lucene-Solr-master-Windows\solr\build\solr-core\test\J0\temp\solr.core.TestLazyCores_E4F043B520CB031A-001\tempDir-002\.\collection2, trusted=true
   [junit4]   2> 908750 INFO  (coreLoadExecutor-2117-thread-2-processing-x:core1) [    x:collection2] o.a.s.m.r.SolrJmxReporter JMX monitoring for 'solr.core.collection2' (registry 'solr.core.collection2') enabled at server: com.sun.jmx.mbeanserver.JmxMBeanServer@1a7305
   [junit4]   2> 908750 INFO  (coreLoadExecutor-2117-thread-2-processing-x:core1) [    x:collection2] o.a.s.c.SolrCore solr.RecoveryStrategy.Builder
   [junit4]   2> 908750 INFO  (coreLoadExecutor-2117-thread-2-processing-x:core1) [    x:collection2] o.a.s.c.SolrCore [[collection2] ] Opening new SolrCore at [C:\Users\jenkins\workspace\Lucene-Solr-master-Windows\solr\build\solr-core\test\J0\temp\solr.core.TestLazyCores_E4F043B520CB031A-001\tempDir-002\collection2], dataDir=[C:\Users\jenkins\workspace\Lucene-Solr-master-Windows\solr\build\solr-core\test\J0\temp\solr.core.TestLazyCores_E4F043B520CB031A-001\tempDir-002\.\collection2\data\]
   [junit4]   2> 908753 INFO  (coreLoadExecutor-2117-thread-1-processing-x:core1) [    x:collection1] o.a.s.s.IndexSchema Loaded schema tiny/1.1 with uniqueid field id
   [junit4]   2> 908753 INFO  (coreLoadExecutor-2117-thread-1-processing-x:core1) [    x:collection1] o.a.s.c.CoreContainer Creating SolrCore 'collection1' using configuration from instancedir C:\Users\jenkins\workspace\Lucene-Solr-master-Windows\solr\build\solr-core\test\J0\temp\solr.core.TestLazyCores_E4F043B520CB031A-001\tempDir-002\.\collection1, trusted=true
   [junit4]   2> 908754 INFO  (coreLoadExecutor-2117-thread-1-processing-x:core1) [    x:collection1] o.a.s.m.r.SolrJmxReporter JMX monitoring for 'solr.core.collection1' (registry 'solr.core.collection1') enabled at server: com.sun.jmx.mbeanserver.JmxMBeanServer@1a7305
   [junit4]   2> 908754 INFO  (coreLoadExecutor-2117-thread-1-processing-x:core1) [    x:collection1] o.a.s.c.SolrCore solr.RecoveryStrategy.Bui

[...truncated too long message...]

DFRSimilarityFactory, SolrCmdDistributorTest, CursorPagingTest, TestCoreDiscovery, TestManagedResource, StatsComponentTest, AddReplicaTest, TestExclusionRuleCollectionAccess, HdfsAutoAddReplicasIntegrationTest, BigEndianAscendingWordSerializerTest, SSLMigrationTest, RequiredFieldsTest, SpatialRPTFieldTypeTest, SuggesterFSTTest, TestStressCloudBlindAtomicUpdates, TestLeaderElectionWithEmptyReplica, DistributedSpellCheckComponentTest, DisMaxRequestHandlerTest, TestRandomDVFaceting, ComputePlanActionTest, SuggestComponentContextFilterQueryTest, InfixSuggestersTest, SuggesterTSTTest, TestNumericRangeQuery64, SolrCloudExampleTest, TestNRTOpen, TestNumericTerms64, TestClusterProperties, SimpleCollectionCreateDeleteTest, ReplaceNodeTest, SpellCheckCollatorWithCollapseTest, TestRestoreCore, TestSolrCloudWithKerberosAlt, BaseCdcrDistributedZkTest, TestTolerantUpdateProcessorCloud, TestSolrFieldCacheBean, SortByFunctionTest, HighlighterMaxOffsetTest, TestSchemaVersionResource, MergeStrategyTest, TestFieldSortValues, FastVectorHighlighterTest, TestSolrCloudSnapshots, DistributedQueryComponentCustomSortTest, TestFieldTypeResource, OutOfBoxZkACLAndCredentialsProvidersTest, XmlUpdateRequestHandlerTest, DistributedTermsComponentTest, TestDistribDocBasedVersion, DistanceFunctionTest, TestEmbeddedSolrServerAdminHandler, TestBlobHandler, DistributedFacetPivotLongTailTest, PreAnalyzedFieldManagedSchemaCloudTest, ChaosMonkeyNothingIsSafeTest, SegmentsInfoRequestHandlerTest, NodeLostTriggerTest, TestRawResponseWriter, NotRequiredUniqueKeyTest, CdcrBootstrapTest, NoCacheHeaderTest, TestStressRecovery, RecoveryAfterSoftCommitTest, DistributedFacetExistsSmallTest, ScriptEngineTest, TestCryptoKeys, TestXmlQParser, CollectionsAPISolrJTest, AsyncCallRequestStatusResponseTest, TestCursorMarkWithoutUniqueKey, MetricsConfigTest, HttpPartitionTest, TestOverriddenPrefixQueryForCustomFieldType, SliceStateTest, RestartWhileUpdatingTest, TestNamedUpdateProcessors, ClusterStateTest, TestUseDocValuesAsStored, TestStreamBody, TestDistributedSearch, BufferStoreTest, ClusterStateUpdateTest, SuggesterTest, TestRandomFlRTGCloud, LeaderFailoverAfterPartitionTest, TestFreeTextSuggestions, TestCoreBackup, IndexSchemaTest, HdfsTlogReplayBufferedWhileIndexingTest, TestManagedSchema, TestLeaderInitiatedRecoveryThread, TestCloudPivotFacet, TestFieldResource, TestQuerySenderNoQuery, ResponseLogComponentTest, SolrIndexConfigTest, MultiTermTest, TestBinaryField, TestConfig, TestPostingsSolrHighlighter, DirectSolrConnectionTest, TestLuceneMatchVersion, TestCodecSupport, TestIBSimilarityFactory, ResourceLoaderTest, OpenExchangeRatesOrgProviderTest, TestFastLRUCache, PreAnalyzedFieldTest, DOMUtilTest, TestSolrJ, TestUtils, DistributedMLTComponentTest, SolrTestCaseJ4Test, TestCrossCoreJoin, TestHighlightDedupGrouping, TestLuceneIndexBackCompat, TestEmbeddedSolrServerConstructors, ConnectionReuseTest, ChaosMonkeyNothingIsSafeWithPullReplicasTest, CloudExitableDirectoryReaderTest, CollectionReloadTest, CollectionStateFormat2Test, ConcurrentDeleteAndCreateCollectionTest, ConfigSetsAPITest, CreateCollectionCleanupTest, DeleteNodeTest, DeleteShardTest, DistribCursorPagingTest, HealthCheckHandlerTest, LeaderElectionContextKeyTest, LeaderInitiatedRecoveryOnCommitTest, LegacyCloudClusterPropTest, MoveReplicaHDFSFailoverTest, MoveReplicaHDFSTest, MoveReplicaTest, NodeMutatorTest, OverriddenZkACLAndCredentialsProvidersTest, OverseerCollectionConfigSetProcessorTest, OverseerModifyCollectionTest, OverseerRolesTest, OverseerTaskQueueTest, RemoteQueryErrorTest, SaslZkACLProviderTest, ShardSplitTest, TestCloudInspectUtil, TestCloudRecovery, TestCollectionsAPIViaSolrCloudCluster, TestConfigSetsAPI, TestPrepRecovery, TestPullReplicaErrorHandling, TestTolerantUpdateProcessorRandomCloud, VMParamsZkACLAndCredentialsProvidersTest, ZkFailoverTest, MetricTriggerTest, SearchRateTriggerTest, TestComputePlanAction, TestGenericDistributedQueue]
   [junit4]   2> NOTE: reproduce with: ant test  -Dtestcase=TestGenericDistributedQueue -Dtests.seed=E4F043B520CB031A -Dtests.slow=true -Dtests.locale=es-AR -Dtests.timezone=Asia/Samarkand -Dtests.asserts=true -Dtests.file.encoding=ISO-8859-1
   [junit4] ERROR   0.00s J0 | TestGenericDistributedQueue (suite) <<<
   [junit4]    > Throwable #1: java.lang.Exception: Suite timeout exceeded (>= 7200000 msec).
   [junit4]    > 	at __randomizedtesting.SeedInfo.seed([E4F043B520CB031A]:0)
   [junit4] Completed [765/765 (2!)] on J0 in 7220.27s, 4 tests, 2 errors <<< FAILURES!

[...truncated 2375 lines...]
   [junit4] Suite: org.apache.solr.update.processor.TestOpenNLPExtractNamedEntitiesUpdateProcessorFactory
   [junit4]   2> Creating dataDir: C:\Users\jenkins\workspace\Lucene-Solr-master-Windows\solr\build\contrib\solr-analysis-extras\test\J1\temp\solr.update.processor.TestOpenNLPExtractNamedEntitiesUpdateProcessorFactory_597D9275E59D9228-001\init-core-data-001
   [junit4]   2> NOTE: test params are: codec=Asserting(Lucene70): {}, docValues:{}, maxPointsInLeafNode=366, maxMBSortInHeap=7.940279205860454, sim=Asserting(org.apache.lucene.search.similarities.AssertingSimilarity@1b0412f), locale=es-CR, timezone=Europe/Uzhgorod
   [junit4]   2> NOTE: Windows 10 10.0 x86/Oracle Corporation 1.8.0_144 (32-bit)/cpus=3,threads=1,free=19084352,total=142606336
   [junit4]   2> NOTE: All tests run in this JVM: [TestICUCollationFieldOptions, TestFoldingMultitermExtrasQuery, TestOpenNLPExtractNamedEntitiesUpdateProcessorFactory]
   [junit4]   2> NOTE: reproduce with: ant test  -Dtestcase=TestOpenNLPExtractNamedEntitiesUpdateProcessorFactory -Dtests.seed=597D9275E59D9228 -Dtests.slow=true -Dtests.locale=es-CR -Dtests.timezone=Europe/Uzhgorod -Dtests.asserts=true -Dtests.file.encoding=Cp1252
   [junit4] ERROR   0.00s J1 | TestOpenNLPExtractNamedEntitiesUpdateProcessorFactory (suite) <<<
   [junit4]    > Throwable #1: java.io.IOException: Could not remove the following files (in the order of attempts):
   [junit4]    >    C:\Users\jenkins\workspace\Lucene-Solr-master-Windows\solr\build\contrib\solr-analysis-extras\test\J1\temp\solr.update.processor.TestOpenNLPExtractNamedEntitiesUpdateProcessorFactory_597D9275E59D9228-001\tempDir-001\collection1\conf: java.nio.file.DirectoryNotEmptyException: C:\Users\jenkins\workspace\Lucene-Solr-master-Windows\solr\build\contrib\solr-analysis-extras\test\J1\temp\solr.update.processor.TestOpenNLPExtractNamedEntitiesUpdateProcessorFactory_597D9275E59D9228-001\tempDir-001\collection1\conf
   [junit4]    >    C:\Users\jenkins\workspace\Lucene-Solr-master-Windows\solr\build\contrib\solr-analysis-extras\test\J1\temp\solr.update.processor.TestOpenNLPExtractNamedEntitiesUpdateProcessorFactory_597D9275E59D9228-001\tempDir-001\collection1: java.nio.file.DirectoryNotEmptyException: C:\Users\jenkins\workspace\Lucene-Solr-master-Windows\solr\build\contrib\solr-analysis-extras\test\J1\temp\solr.update.processor.TestOpenNLPExtractNamedEntitiesUpdateProcessorFactory_597D9275E59D9228-001\tempDir-001\collection1
   [junit4]    >    C:\Users\jenkins\workspace\Lucene-Solr-master-Windows\solr\build\contrib\solr-analysis-extras\test\J1\temp\solr.update.processor.TestOpenNLPExtractNamedEntitiesUpdateProcessorFactory_597D9275E59D9228-001\tempDir-001: java.nio.file.DirectoryNotEmptyException: C:\Users\jenkins\workspace\Lucene-Solr-master-Windows\solr\build\contrib\solr-analysis-extras\test\J1\temp\solr.update.processor.TestOpenNLPExtractNamedEntitiesUpdateProcessorFactory_597D9275E59D9228-001\tempDir-001
   [junit4]    >    C:\Users\jenkins\workspace\Lucene-Solr-master-Windows\solr\build\contrib\solr-analysis-extras\test\J1\temp\solr.update.processor.TestOpenNLPExtractNamedEntitiesUpdateProcessorFactory_597D9275E59D9228-001\tempDir-001\collection1\conf\en-test-sent.bin: java.nio.file.AccessDeniedException: C:\Users\jenkins\workspace\Lucene-Solr-master-Windows\solr\build\contrib\solr-analysis-extras\test\J1\temp\solr.update.processor.TestOpenNLPExtractNamedEntitiesUpdateProcessorFactory_597D9275E59D9228-001\tempDir-001\collection1\conf\en-test-sent.bin
   [junit4]    >    C:\Users\jenkins\workspace\Lucene-Solr-master-Windows\solr\build\contrib\solr-analysis-extras\test\J1\temp\solr.update.processor.TestOpenNLPExtractNamedEntitiesUpdateProcessorFactory_597D9275E59D9228-001\tempDir-001\collection1\conf\en-test-tokenizer.bin: java.nio.file.AccessDeniedException: C:\Users\jenkins\workspace\Lucene-Solr-master-Windows\solr\build\contrib\solr-analysis-extras\test\J1\temp\solr.update.processor.TestOpenNLPExtractNamedEntitiesUpdateProcessorFactory_597D9275E59D9228-001\tempDir-001\collection1\conf\en-test-tokenizer.bin
   [junit4]    >    C:\Users\jenkins\workspace\Lucene-Solr-master-Windows\solr\build\contrib\solr-analysis-extras\test\J1\temp\solr.update.processor.TestOpenNLPExtractNamedEntitiesUpdateProcessorFactory_597D9275E59D9228-001\tempDir-001\collection1\conf\en-test-ner-person.bin: java.nio.file.AccessDeniedException: C:\Users\jenkins\workspace\Lucene-Solr-master-Windows\solr\build\contrib\solr-analysis-extras\test\J1\temp\solr.update.processor.TestOpenNLPExtractNamedEntitiesUpdateProcessorFactory_597D9275E59D9228-001\tempDir-001\collection1\conf\en-test-ner-person.bin
   [junit4]    >    C:\Users\jenkins\workspace\Lucene-Solr-master-Windows\solr\build\contrib\solr-analysis-extras\test\J1\temp\solr.update.processor.TestOpenNLPExtractNamedEntitiesUpdateProcessorFactory_597D9275E59D9228-001: java.nio.file.DirectoryNotEmptyException: C:\Users\jenkins\workspace\Lucene-Solr-master-Windows\solr\build\contrib\solr-analysis-extras\test\J1\temp\solr.update.processor.TestOpenNLPExtractNamedEntitiesUpdateProcessorFactory_597D9275E59D9228-001
   [junit4]    > 	at __randomizedtesting.SeedInfo.seed([597D9275E59D9228]:0)
   [junit4]    > 	at org.apache.lucene.util.IOUtils.rm(IOUtils.java:329)
   [junit4]    > 	at java.lang.Thread.run(Thread.java:748)
   [junit4] Completed [5/5 (1!)] on J1 in 1.04s, 8 tests, 1 error <<< FAILURES!

[...truncated 41430 lines...]

Mime
View raw message