lucene-dev mailing list archives

Site index · List index
Message view « Date » · « Thread »
Top « Date » · « Thread »
From Policeman Jenkins Server <jenk...@thetaphi.de>
Subject [JENKINS] Lucene-Solr-master-MacOSX (64bit/jdk1.8.0) - Build # 4344 - Still Unstable!
Date Tue, 26 Dec 2017 06:12:49 GMT
Build: https://jenkins.thetaphi.de/job/Lucene-Solr-master-MacOSX/4344/
Java: 64bit/jdk1.8.0 -XX:+UseCompressedOops -XX:+UseSerialGC

1 tests failed.
FAILED:  org.apache.solr.cloud.FullSolrCloudDistribCmdsTest.test

Error Message:
Could not find collection:collection2

Stack Trace:
java.lang.AssertionError: Could not find collection:collection2
	at __randomizedtesting.SeedInfo.seed([360B0EFFF82D08C5:BE5F312556D1653D]:0)
	at org.junit.Assert.fail(Assert.java:93)
	at org.junit.Assert.assertTrue(Assert.java:43)
	at org.junit.Assert.assertNotNull(Assert.java:526)
	at org.apache.solr.cloud.AbstractDistribZkTestBase.waitForRecoveriesToFinish(AbstractDistribZkTestBase.java:155)
	at org.apache.solr.cloud.AbstractDistribZkTestBase.waitForRecoveriesToFinish(AbstractDistribZkTestBase.java:140)
	at org.apache.solr.cloud.AbstractDistribZkTestBase.waitForRecoveriesToFinish(AbstractDistribZkTestBase.java:135)
	at org.apache.solr.cloud.AbstractFullDistribZkTestBase.waitForRecoveriesToFinish(AbstractFullDistribZkTestBase.java:908)
	at org.apache.solr.cloud.FullSolrCloudDistribCmdsTest.testIndexingBatchPerRequestWithHttpSolrClient(FullSolrCloudDistribCmdsTest.java:612)
	at org.apache.solr.cloud.FullSolrCloudDistribCmdsTest.test(FullSolrCloudDistribCmdsTest.java:152)
	at sun.reflect.NativeMethodAccessorImpl.invoke0(Native Method)
	at sun.reflect.NativeMethodAccessorImpl.invoke(NativeMethodAccessorImpl.java:62)
	at sun.reflect.DelegatingMethodAccessorImpl.invoke(DelegatingMethodAccessorImpl.java:43)
	at java.lang.reflect.Method.invoke(Method.java:498)
	at com.carrotsearch.randomizedtesting.RandomizedRunner.invoke(RandomizedRunner.java:1737)
	at com.carrotsearch.randomizedtesting.RandomizedRunner$8.evaluate(RandomizedRunner.java:934)
	at com.carrotsearch.randomizedtesting.RandomizedRunner$9.evaluate(RandomizedRunner.java:970)
	at com.carrotsearch.randomizedtesting.RandomizedRunner$10.evaluate(RandomizedRunner.java:984)
	at org.apache.solr.BaseDistributedSearchTestCase$ShardsRepeatRule$ShardsFixedStatement.callStatement(BaseDistributedSearchTestCase.java:993)
	at org.apache.solr.BaseDistributedSearchTestCase$ShardsRepeatRule$ShardsStatement.evaluate(BaseDistributedSearchTestCase.java:968)
	at com.carrotsearch.randomizedtesting.rules.SystemPropertiesRestoreRule$1.evaluate(SystemPropertiesRestoreRule.java:57)
	at org.apache.lucene.util.TestRuleSetupTeardownChained$1.evaluate(TestRuleSetupTeardownChained.java:49)
	at org.apache.lucene.util.AbstractBeforeAfterRule$1.evaluate(AbstractBeforeAfterRule.java:45)
	at org.apache.lucene.util.TestRuleThreadAndTestName$1.evaluate(TestRuleThreadAndTestName.java:48)
	at org.apache.lucene.util.TestRuleIgnoreAfterMaxFailures$1.evaluate(TestRuleIgnoreAfterMaxFailures.java:64)
	at org.apache.lucene.util.TestRuleMarkFailure$1.evaluate(TestRuleMarkFailure.java:47)
	at com.carrotsearch.randomizedtesting.rules.StatementAdapter.evaluate(StatementAdapter.java:36)
	at com.carrotsearch.randomizedtesting.ThreadLeakControl$StatementRunner.run(ThreadLeakControl.java:368)
	at com.carrotsearch.randomizedtesting.ThreadLeakControl.forkTimeoutingTask(ThreadLeakControl.java:817)
	at com.carrotsearch.randomizedtesting.ThreadLeakControl$3.evaluate(ThreadLeakControl.java:468)
	at com.carrotsearch.randomizedtesting.RandomizedRunner.runSingleTest(RandomizedRunner.java:943)
	at com.carrotsearch.randomizedtesting.RandomizedRunner$5.evaluate(RandomizedRunner.java:829)
	at com.carrotsearch.randomizedtesting.RandomizedRunner$6.evaluate(RandomizedRunner.java:879)
	at com.carrotsearch.randomizedtesting.RandomizedRunner$7.evaluate(RandomizedRunner.java:890)
	at com.carrotsearch.randomizedtesting.rules.StatementAdapter.evaluate(StatementAdapter.java:36)
	at com.carrotsearch.randomizedtesting.rules.SystemPropertiesRestoreRule$1.evaluate(SystemPropertiesRestoreRule.java:57)
	at org.apache.lucene.util.AbstractBeforeAfterRule$1.evaluate(AbstractBeforeAfterRule.java:45)
	at com.carrotsearch.randomizedtesting.rules.StatementAdapter.evaluate(StatementAdapter.java:36)
	at org.apache.lucene.util.TestRuleStoreClassName$1.evaluate(TestRuleStoreClassName.java:41)
	at com.carrotsearch.randomizedtesting.rules.NoShadowingOrOverridesOnMethodsRule$1.evaluate(NoShadowingOrOverridesOnMethodsRule.java:40)
	at com.carrotsearch.randomizedtesting.rules.NoShadowingOrOverridesOnMethodsRule$1.evaluate(NoShadowingOrOverridesOnMethodsRule.java:40)
	at com.carrotsearch.randomizedtesting.rules.StatementAdapter.evaluate(StatementAdapter.java:36)
	at com.carrotsearch.randomizedtesting.rules.StatementAdapter.evaluate(StatementAdapter.java:36)
	at com.carrotsearch.randomizedtesting.rules.StatementAdapter.evaluate(StatementAdapter.java:36)
	at org.apache.lucene.util.TestRuleAssertionsRequired$1.evaluate(TestRuleAssertionsRequired.java:53)
	at org.apache.lucene.util.TestRuleMarkFailure$1.evaluate(TestRuleMarkFailure.java:47)
	at org.apache.lucene.util.TestRuleIgnoreAfterMaxFailures$1.evaluate(TestRuleIgnoreAfterMaxFailures.java:64)
	at org.apache.lucene.util.TestRuleIgnoreTestSuites$1.evaluate(TestRuleIgnoreTestSuites.java:54)
	at com.carrotsearch.randomizedtesting.rules.StatementAdapter.evaluate(StatementAdapter.java:36)
	at com.carrotsearch.randomizedtesting.ThreadLeakControl$StatementRunner.run(ThreadLeakControl.java:368)
	at java.lang.Thread.run(Thread.java:748)




Build Log:
[...truncated 12898 lines...]
   [junit4] Suite: org.apache.solr.cloud.FullSolrCloudDistribCmdsTest
   [junit4]   2> Creating dataDir: /Users/jenkins/workspace/Lucene-Solr-master-MacOSX/solr/build/solr-core/test/J0/temp/solr.cloud.FullSolrCloudDistribCmdsTest_360B0EFFF82D08C5-001/init-core-data-001
   [junit4]   2> 1461920 WARN  (SUITE-FullSolrCloudDistribCmdsTest-seed#[360B0EFFF82D08C5]-worker) [    ] o.a.s.SolrTestCaseJ4 startTrackingSearchers: numOpens=16 numCloses=16
   [junit4]   2> 1461920 INFO  (SUITE-FullSolrCloudDistribCmdsTest-seed#[360B0EFFF82D08C5]-worker) [    ] o.a.s.SolrTestCaseJ4 Using TrieFields (NUMERIC_POINTS_SYSPROP=false) w/NUMERIC_DOCVALUES_SYSPROP=false
   [junit4]   2> 1461923 INFO  (SUITE-FullSolrCloudDistribCmdsTest-seed#[360B0EFFF82D08C5]-worker) [    ] o.a.s.SolrTestCaseJ4 Randomized ssl (false) and clientAuth (false) via: @org.apache.solr.SolrTestCaseJ4$SuppressSSL(bugUrl=https://issues.apache.org/jira/browse/SOLR-5776) w/ MAC_OS_X supressed clientAuth
   [junit4]   2> 1461923 INFO  (SUITE-FullSolrCloudDistribCmdsTest-seed#[360B0EFFF82D08C5]-worker) [    ] o.a.s.SolrTestCaseJ4 SecureRandom sanity checks: test.solr.allowed.securerandom=null & java.security.egd=file:/dev/./urandom
   [junit4]   2> 1461923 INFO  (SUITE-FullSolrCloudDistribCmdsTest-seed#[360B0EFFF82D08C5]-worker) [    ] o.a.s.BaseDistributedSearchTestCase Setting hostContext system property: /
   [junit4]   2> 1461924 INFO  (TEST-FullSolrCloudDistribCmdsTest.test-seed#[360B0EFFF82D08C5]) [    ] o.a.s.c.ZkTestServer STARTING ZK TEST SERVER
   [junit4]   2> 1461925 INFO  (Thread-3397) [    ] o.a.s.c.ZkTestServer client port:0.0.0.0/0.0.0.0:0
   [junit4]   2> 1461925 INFO  (Thread-3397) [    ] o.a.s.c.ZkTestServer Starting server
   [junit4]   2> 1461927 ERROR (Thread-3397) [    ] o.a.z.s.ZooKeeperServer ZKShutdownHandler is not registered, so ZooKeeper server won't take any action on ERROR or SHUTDOWN server state changes
   [junit4]   2> 1462035 INFO  (TEST-FullSolrCloudDistribCmdsTest.test-seed#[360B0EFFF82D08C5]) [    ] o.a.s.c.ZkTestServer start zk server on port:61637
   [junit4]   2> 1462072 INFO  (zkConnectionManagerCallback-4960-thread-1) [    ] o.a.s.c.c.ConnectionManager zkClient has connected
   [junit4]   2> 1462077 WARN  (NIOServerCxn.Factory:0.0.0.0/0.0.0.0:0) [    ] o.a.z.s.NIOServerCnxn caught end of stream exception
   [junit4]   2> EndOfStreamException: Unable to read additional data from client sessionid 0x16091472c5e0000, likely client has closed socket
   [junit4]   2> 	at org.apache.zookeeper.server.NIOServerCnxn.doIO(NIOServerCnxn.java:239)
   [junit4]   2> 	at org.apache.zookeeper.server.NIOServerCnxnFactory.run(NIOServerCnxnFactory.java:203)
   [junit4]   2> 	at java.lang.Thread.run(Thread.java:748)
   [junit4]   2> 1462080 INFO  (zkConnectionManagerCallback-4962-thread-1) [    ] o.a.s.c.c.ConnectionManager zkClient has connected
   [junit4]   2> 1462091 INFO  (TEST-FullSolrCloudDistribCmdsTest.test-seed#[360B0EFFF82D08C5]) [    ] o.a.s.c.AbstractZkTestCase put /Users/jenkins/workspace/Lucene-Solr-master-MacOSX/solr/core/src/test-files/solr/collection1/conf/solrconfig-tlog.xml to /configs/conf1/solrconfig.xml
   [junit4]   2> 1462094 INFO  (TEST-FullSolrCloudDistribCmdsTest.test-seed#[360B0EFFF82D08C5]) [    ] o.a.s.c.AbstractZkTestCase put /Users/jenkins/workspace/Lucene-Solr-master-MacOSX/solr/core/src/test-files/solr/collection1/conf/schema15.xml to /configs/conf1/schema.xml
   [junit4]   2> 1462097 INFO  (TEST-FullSolrCloudDistribCmdsTest.test-seed#[360B0EFFF82D08C5]) [    ] o.a.s.c.AbstractZkTestCase put /Users/jenkins/workspace/Lucene-Solr-master-MacOSX/solr/core/src/test-files/solr/collection1/conf/solrconfig.snippet.randomindexconfig.xml to /configs/conf1/solrconfig.snippet.randomindexconfig.xml
   [junit4]   2> 1462100 INFO  (TEST-FullSolrCloudDistribCmdsTest.test-seed#[360B0EFFF82D08C5]) [    ] o.a.s.c.AbstractZkTestCase put /Users/jenkins/workspace/Lucene-Solr-master-MacOSX/solr/core/src/test-files/solr/collection1/conf/stopwords.txt to /configs/conf1/stopwords.txt
   [junit4]   2> 1462103 INFO  (TEST-FullSolrCloudDistribCmdsTest.test-seed#[360B0EFFF82D08C5]) [    ] o.a.s.c.AbstractZkTestCase put /Users/jenkins/workspace/Lucene-Solr-master-MacOSX/solr/core/src/test-files/solr/collection1/conf/protwords.txt to /configs/conf1/protwords.txt
   [junit4]   2> 1462106 INFO  (TEST-FullSolrCloudDistribCmdsTest.test-seed#[360B0EFFF82D08C5]) [    ] o.a.s.c.AbstractZkTestCase put /Users/jenkins/workspace/Lucene-Solr-master-MacOSX/solr/core/src/test-files/solr/collection1/conf/currency.xml to /configs/conf1/currency.xml
   [junit4]   2> 1462107 INFO  (TEST-FullSolrCloudDistribCmdsTest.test-seed#[360B0EFFF82D08C5]) [    ] o.a.s.c.AbstractZkTestCase put /Users/jenkins/workspace/Lucene-Solr-master-MacOSX/solr/core/src/test-files/solr/collection1/conf/enumsConfig.xml to /configs/conf1/enumsConfig.xml
   [junit4]   2> 1462109 INFO  (TEST-FullSolrCloudDistribCmdsTest.test-seed#[360B0EFFF82D08C5]) [    ] o.a.s.c.AbstractZkTestCase put /Users/jenkins/workspace/Lucene-Solr-master-MacOSX/solr/core/src/test-files/solr/collection1/conf/open-exchange-rates.json to /configs/conf1/open-exchange-rates.json
   [junit4]   2> 1462111 INFO  (TEST-FullSolrCloudDistribCmdsTest.test-seed#[360B0EFFF82D08C5]) [    ] o.a.s.c.AbstractZkTestCase put /Users/jenkins/workspace/Lucene-Solr-master-MacOSX/solr/core/src/test-files/solr/collection1/conf/mapping-ISOLatin1Accent.txt to /configs/conf1/mapping-ISOLatin1Accent.txt
   [junit4]   2> 1462113 INFO  (TEST-FullSolrCloudDistribCmdsTest.test-seed#[360B0EFFF82D08C5]) [    ] o.a.s.c.AbstractZkTestCase put /Users/jenkins/workspace/Lucene-Solr-master-MacOSX/solr/core/src/test-files/solr/collection1/conf/old_synonyms.txt to /configs/conf1/old_synonyms.txt
   [junit4]   2> 1462115 INFO  (TEST-FullSolrCloudDistribCmdsTest.test-seed#[360B0EFFF82D08C5]) [    ] o.a.s.c.AbstractZkTestCase put /Users/jenkins/workspace/Lucene-Solr-master-MacOSX/solr/core/src/test-files/solr/collection1/conf/synonyms.txt to /configs/conf1/synonyms.txt
   [junit4]   2> 1462117 INFO  (TEST-FullSolrCloudDistribCmdsTest.test-seed#[360B0EFFF82D08C5]) [    ] o.a.s.c.AbstractFullDistribZkTestBase Will use NRT replicas unless explicitly asked otherwise
   [junit4]   2> 1462117 WARN  (NIOServerCxn.Factory:0.0.0.0/0.0.0.0:0) [    ] o.a.z.s.NIOServerCnxn caught end of stream exception
   [junit4]   2> EndOfStreamException: Unable to read additional data from client sessionid 0x16091472c5e0001, likely client has closed socket
   [junit4]   2> 	at org.apache.zookeeper.server.NIOServerCnxn.doIO(NIOServerCnxn.java:239)
   [junit4]   2> 	at org.apache.zookeeper.server.NIOServerCnxnFactory.run(NIOServerCnxnFactory.java:203)
   [junit4]   2> 	at java.lang.Thread.run(Thread.java:748)
   [junit4]   2> 1462380 INFO  (TEST-FullSolrCloudDistribCmdsTest.test-seed#[360B0EFFF82D08C5]) [    ] o.e.j.s.Server jetty-9.3.20.v20170531
   [junit4]   2> 1462382 INFO  (TEST-FullSolrCloudDistribCmdsTest.test-seed#[360B0EFFF82D08C5]) [    ] o.e.j.s.h.ContextHandler Started o.e.j.s.ServletContextHandler@56b135e0{/,null,AVAILABLE}
   [junit4]   2> 1462383 INFO  (TEST-FullSolrCloudDistribCmdsTest.test-seed#[360B0EFFF82D08C5]) [    ] o.e.j.s.AbstractConnector Started ServerConnector@1c306684{HTTP/1.1,[http/1.1]}{127.0.0.1:61649}
   [junit4]   2> 1462383 INFO  (TEST-FullSolrCloudDistribCmdsTest.test-seed#[360B0EFFF82D08C5]) [    ] o.e.j.s.Server Started @1465817ms
   [junit4]   2> 1462383 INFO  (TEST-FullSolrCloudDistribCmdsTest.test-seed#[360B0EFFF82D08C5]) [    ] o.a.s.c.s.e.JettySolrRunner Jetty properties: {solr.data.dir=/Users/jenkins/workspace/Lucene-Solr-master-MacOSX/solr/build/solr-core/test/J0/temp/solr.cloud.FullSolrCloudDistribCmdsTest_360B0EFFF82D08C5-001/tempDir-001/control/data, replicaType=NRT, hostContext=/, hostPort=61649, coreRootDirectory=/Users/jenkins/workspace/Lucene-Solr-master-MacOSX/solr/build/solr-core/test/J0/temp/solr.cloud.FullSolrCloudDistribCmdsTest_360B0EFFF82D08C5-001/control-001/cores}
   [junit4]   2> 1462384 ERROR (TEST-FullSolrCloudDistribCmdsTest.test-seed#[360B0EFFF82D08C5]) [    ] o.a.s.u.StartupLoggingUtils Missing Java Option solr.log.dir. Logging may be missing or incomplete.
   [junit4]   2> 1462384 INFO  (TEST-FullSolrCloudDistribCmdsTest.test-seed#[360B0EFFF82D08C5]) [    ] o.a.s.s.SolrDispatchFilter  ___      _       Welcome to Apache Solr™ version 8.0.0
   [junit4]   2> 1462384 INFO  (TEST-FullSolrCloudDistribCmdsTest.test-seed#[360B0EFFF82D08C5]) [    ] o.a.s.s.SolrDispatchFilter / __| ___| |_ _   Starting in cloud mode on port null
   [junit4]   2> 1462384 INFO  (TEST-FullSolrCloudDistribCmdsTest.test-seed#[360B0EFFF82D08C5]) [    ] o.a.s.s.SolrDispatchFilter \__ \/ _ \ | '_|  Install dir: null
   [junit4]   2> 1462384 INFO  (TEST-FullSolrCloudDistribCmdsTest.test-seed#[360B0EFFF82D08C5]) [    ] o.a.s.s.SolrDispatchFilter |___/\___/_|_|    Start time: 2017-12-26T05:24:09.384Z
   [junit4]   2> 1462386 INFO  (zkConnectionManagerCallback-4964-thread-1) [    ] o.a.s.c.c.ConnectionManager zkClient has connected
   [junit4]   2> 1462387 WARN  (NIOServerCxn.Factory:0.0.0.0/0.0.0.0:0) [    ] o.a.z.s.NIOServerCnxn caught end of stream exception
   [junit4]   2> EndOfStreamException: Unable to read additional data from client sessionid 0x16091472c5e0002, likely client has closed socket
   [junit4]   2> 	at org.apache.zookeeper.server.NIOServerCnxn.doIO(NIOServerCnxn.java:239)
   [junit4]   2> 	at org.apache.zookeeper.server.NIOServerCnxnFactory.run(NIOServerCnxnFactory.java:203)
   [junit4]   2> 	at java.lang.Thread.run(Thread.java:748)
   [junit4]   2> 1462387 INFO  (TEST-FullSolrCloudDistribCmdsTest.test-seed#[360B0EFFF82D08C5]) [    ] o.a.s.s.SolrDispatchFilter Loading solr.xml from SolrHome (not found in ZooKeeper)
   [junit4]   2> 1462388 INFO  (TEST-FullSolrCloudDistribCmdsTest.test-seed#[360B0EFFF82D08C5]) [    ] o.a.s.c.SolrXmlConfig Loading container configuration from /Users/jenkins/workspace/Lucene-Solr-master-MacOSX/solr/build/solr-core/test/J0/temp/solr.cloud.FullSolrCloudDistribCmdsTest_360B0EFFF82D08C5-001/control-001/solr.xml
   [junit4]   2> 1462393 INFO  (TEST-FullSolrCloudDistribCmdsTest.test-seed#[360B0EFFF82D08C5]) [    ] o.a.s.c.SolrXmlConfig Configuration parameter autoReplicaFailoverWorkLoopDelay is ignored
   [junit4]   2> 1462393 INFO  (TEST-FullSolrCloudDistribCmdsTest.test-seed#[360B0EFFF82D08C5]) [    ] o.a.s.c.SolrXmlConfig Configuration parameter autoReplicaFailoverBadNodeExpiration is ignored
   [junit4]   2> 1462394 INFO  (TEST-FullSolrCloudDistribCmdsTest.test-seed#[360B0EFFF82D08C5]) [    ] o.a.s.c.SolrXmlConfig MBean server found: com.sun.jmx.mbeanserver.JmxMBeanServer@475c2d0c, but no JMX reporters were configured - adding default JMX reporter.
   [junit4]   2> 1462398 INFO  (TEST-FullSolrCloudDistribCmdsTest.test-seed#[360B0EFFF82D08C5]) [    ] o.a.s.c.ZkContainer Zookeeper client=127.0.0.1:61637/solr
   [junit4]   2> 1462400 INFO  (zkConnectionManagerCallback-4968-thread-1) [    ] o.a.s.c.c.ConnectionManager zkClient has connected
   [junit4]   2> 1462402 INFO  (zkConnectionManagerCallback-4970-thread-1-processing-n:127.0.0.1:61649_) [n:127.0.0.1:61649_    ] o.a.s.c.c.ConnectionManager zkClient has connected
   [junit4]   2> 1462537 INFO  (TEST-FullSolrCloudDistribCmdsTest.test-seed#[360B0EFFF82D08C5]) [n:127.0.0.1:61649_    ] o.a.s.c.Overseer Overseer (id=null) closing
   [junit4]   2> 1462538 INFO  (TEST-FullSolrCloudDistribCmdsTest.test-seed#[360B0EFFF82D08C5]) [n:127.0.0.1:61649_    ] o.a.s.c.OverseerElectionContext I am going to be the leader 127.0.0.1:61649_
   [junit4]   2> 1462539 INFO  (TEST-FullSolrCloudDistribCmdsTest.test-seed#[360B0EFFF82D08C5]) [n:127.0.0.1:61649_    ] o.a.s.c.Overseer Overseer (id=99238926675214340-127.0.0.1:61649_-n_0000000000) starting
   [junit4]   2> 1462550 INFO  (TEST-FullSolrCloudDistribCmdsTest.test-seed#[360B0EFFF82D08C5]) [n:127.0.0.1:61649_    ] o.a.s.c.ZkController Register node as live in ZooKeeper:/live_nodes/127.0.0.1:61649_
   [junit4]   2> 1462552 INFO  (zkCallback-4969-thread-1-processing-n:127.0.0.1:61649_) [n:127.0.0.1:61649_    ] o.a.s.c.c.ZkStateReader Updated live nodes from ZooKeeper... (0) -> (1)
   [junit4]   2> 1462630 INFO  (TEST-FullSolrCloudDistribCmdsTest.test-seed#[360B0EFFF82D08C5]) [n:127.0.0.1:61649_    ] o.a.s.m.r.SolrJmxReporter JMX monitoring for 'solr.node' (registry 'solr.node') enabled at server: com.sun.jmx.mbeanserver.JmxMBeanServer@475c2d0c
   [junit4]   2> 1462636 INFO  (TEST-FullSolrCloudDistribCmdsTest.test-seed#[360B0EFFF82D08C5]) [n:127.0.0.1:61649_    ] o.a.s.m.r.SolrJmxReporter JMX monitoring for 'solr.jvm' (registry 'solr.jvm') enabled at server: com.sun.jmx.mbeanserver.JmxMBeanServer@475c2d0c
   [junit4]   2> 1462636 INFO  (TEST-FullSolrCloudDistribCmdsTest.test-seed#[360B0EFFF82D08C5]) [n:127.0.0.1:61649_    ] o.a.s.m.r.SolrJmxReporter JMX monitoring for 'solr.jetty' (registry 'solr.jetty') enabled at server: com.sun.jmx.mbeanserver.JmxMBeanServer@475c2d0c
   [junit4]   2> 1462638 INFO  (TEST-FullSolrCloudDistribCmdsTest.test-seed#[360B0EFFF82D08C5]) [n:127.0.0.1:61649_    ] o.a.s.c.CorePropertiesLocator Found 0 core definitions underneath /Users/jenkins/workspace/Lucene-Solr-master-MacOSX/solr/build/solr-core/test/J0/temp/solr.cloud.FullSolrCloudDistribCmdsTest_360B0EFFF82D08C5-001/control-001/cores
   [junit4]   2> 1462658 INFO  (zkConnectionManagerCallback-4976-thread-1) [    ] o.a.s.c.c.ConnectionManager zkClient has connected
   [junit4]   2> 1462660 INFO  (TEST-FullSolrCloudDistribCmdsTest.test-seed#[360B0EFFF82D08C5]) [    ] o.a.s.c.c.ZkStateReader Updated live nodes from ZooKeeper... (0) -> (1)
   [junit4]   2> 1462661 INFO  (TEST-FullSolrCloudDistribCmdsTest.test-seed#[360B0EFFF82D08C5]) [    ] o.a.s.c.s.i.ZkClientClusterStateProvider Cluster at 127.0.0.1:61637/solr ready
   [junit4]   2> 1462663 INFO  (qtp834587517-18263) [n:127.0.0.1:61649_    ] o.a.s.h.a.CollectionsHandler Invoked Collection Action :create with params replicationFactor=1&collection.configName=conf1&name=control_collection&nrtReplicas=1&action=CREATE&numShards=1&createNodeSet=127.0.0.1:61649_&wt=javabin&version=2 and sendToOCPQueue=true
   [junit4]   2> 1462665 INFO  (OverseerThreadFactory-7154-thread-1-processing-n:127.0.0.1:61649_) [n:127.0.0.1:61649_    ] o.a.s.c.CreateCollectionCmd Create collection control_collection
   [junit4]   2> 1462786 INFO  (qtp834587517-18264) [n:127.0.0.1:61649_    ] o.a.s.h.a.CoreAdminOperation core create command qt=/admin/cores&collection.configName=conf1&newCollection=true&name=control_collection_shard1_replica_n1&action=CREATE&numShards=1&collection=control_collection&shard=shard1&wt=javabin&version=2&replicaType=NRT
   [junit4]   2> 1462787 INFO  (qtp834587517-18264) [n:127.0.0.1:61649_    ] o.a.s.c.TransientSolrCoreCacheDefault Allocating transient cache for 4 transient cores
   [junit4]   2> 1462902 INFO  (zkCallback-4969-thread-1-processing-n:127.0.0.1:61649_) [n:127.0.0.1:61649_    ] o.a.s.c.c.ZkStateReader A cluster state change: [WatchedEvent state:SyncConnected type:NodeDataChanged path:/collections/control_collection/state.json] for collection [control_collection] has occurred - updating... (live nodes size: [1])
   [junit4]   2> 1463810 INFO  (qtp834587517-18264) [n:127.0.0.1:61649_ c:control_collection s:shard1  x:control_collection_shard1_replica_n1] o.a.s.c.SolrConfig Using Lucene MatchVersion: 8.0.0
   [junit4]   2> 1463818 INFO  (qtp834587517-18264) [n:127.0.0.1:61649_ c:control_collection s:shard1  x:control_collection_shard1_replica_n1] o.a.s.s.IndexSchema [control_collection_shard1_replica_n1] Schema name=test
   [junit4]   2> 1463886 INFO  (qtp834587517-18264) [n:127.0.0.1:61649_ c:control_collection s:shard1  x:control_collection_shard1_replica_n1] o.a.s.s.IndexSchema Loaded schema test/1.6 with uniqueid field id
   [junit4]   2> 1463906 INFO  (qtp834587517-18264) [n:127.0.0.1:61649_ c:control_collection s:shard1  x:control_collection_shard1_replica_n1] o.a.s.c.CoreContainer Creating SolrCore 'control_collection_shard1_replica_n1' using configuration from collection control_collection, trusted=true
   [junit4]   2> 1463906 INFO  (qtp834587517-18264) [n:127.0.0.1:61649_ c:control_collection s:shard1  x:control_collection_shard1_replica_n1] o.a.s.m.r.SolrJmxReporter JMX monitoring for 'solr.core.control_collection.shard1.replica_n1' (registry 'solr.core.control_collection.shard1.replica_n1') enabled at server: com.sun.jmx.mbeanserver.JmxMBeanServer@475c2d0c
   [junit4]   2> 1463906 INFO  (qtp834587517-18264) [n:127.0.0.1:61649_ c:control_collection s:shard1  x:control_collection_shard1_replica_n1] o.a.s.c.SolrCore solr.RecoveryStrategy.Builder
   [junit4]   2> 1463906 INFO  (qtp834587517-18264) [n:127.0.0.1:61649_ c:control_collection s:shard1  x:control_collection_shard1_replica_n1] o.a.s.c.SolrCore [[control_collection_shard1_replica_n1] ] Opening new SolrCore at [/Users/jenkins/workspace/Lucene-Solr-master-MacOSX/solr/build/solr-core/test/J0/temp/solr.cloud.FullSolrCloudDistribCmdsTest_360B0EFFF82D08C5-001/control-001/cores/control_collection_shard1_replica_n1], dataDir=[/Users/jenkins/workspace/Lucene-Solr-master-MacOSX/solr/build/solr-core/test/J0/temp/solr.cloud.FullSolrCloudDistribCmdsTest_360B0EFFF82D08C5-001/control-001/cores/control_collection_shard1_replica_n1/data/]
   [junit4]   2> 1463908 INFO  (qtp834587517-18264) [n:127.0.0.1:61649_ c:control_collection s:shard1  x:control_collection_shard1_replica_n1] o.a.s.u.RandomMergePolicy RandomMergePolicy wrapping class org.apache.lucene.index.LogByteSizeMergePolicy: [LogByteSizeMergePolicy: minMergeSize=1677721, mergeFactor=12, maxMergeSize=2147483648, maxMergeSizeForForcedMerge=9223372036854775807, calibrateSizeByDeletes=false, maxMergeDocs=2147483647, maxCFSSegmentSizeMB=8.796093022207999E12, noCFSRatio=0.0]
   [junit4]   2> 1463910 WARN  (qtp834587517-18264) [n:127.0.0.1:61649_ c:control_collection s:shard1  x:control_collection_shard1_replica_n1] o.a.s.c.RequestHandlers INVALID paramSet a in requestHandler {type = requestHandler,name = /dump,class = DumpRequestHandler,attributes = {initParams=a, name=/dump, class=DumpRequestHandler},args = {defaults={a=A,b=B}}}
   [junit4]   2> 1463959 INFO  (qtp834587517-18264) [n:127.0.0.1:61649_ c:control_collection s:shard1  x:control_collection_shard1_replica_n1] o.a.s.u.UpdateHandler Using UpdateLog implementation: org.apache.solr.update.UpdateLog
   [junit4]   2> 1463959 INFO  (qtp834587517-18264) [n:127.0.0.1:61649_ c:control_collection s:shard1  x:control_collection_shard1_replica_n1] o.a.s.u.UpdateLog Initializing UpdateLog: dataDir= defaultSyncLevel=FLUSH numRecordsToKeep=100 maxNumLogsToKeep=10 numVersionBuckets=65536
   [junit4]   2> 1463973 INFO  (qtp834587517-18264) [n:127.0.0.1:61649_ c:control_collection s:shard1  x:control_collection_shard1_replica_n1] o.a.s.u.CommitTracker Hard AutoCommit: disabled
   [junit4]   2> 1463973 INFO  (qtp834587517-18264) [n:127.0.0.1:61649_ c:control_collection s:shard1  x:control_collection_shard1_replica_n1] o.a.s.u.CommitTracker Soft AutoCommit: disabled
   [junit4]   2> 1463974 INFO  (qtp834587517-18264) [n:127.0.0.1:61649_ c:control_collection s:shard1  x:control_collection_shard1_replica_n1] o.a.s.u.RandomMergePolicy RandomMergePolicy wrapping class org.apache.lucene.index.LogDocMergePolicy: [LogDocMergePolicy: minMergeSize=1000, mergeFactor=41, maxMergeSize=9223372036854775807, maxMergeSizeForForcedMerge=9223372036854775807, calibrateSizeByDeletes=true, maxMergeDocs=2147483647, maxCFSSegmentSizeMB=8.796093022207999E12, noCFSRatio=0.0]
   [junit4]   2> 1463974 INFO  (qtp834587517-18264) [n:127.0.0.1:61649_ c:control_collection s:shard1  x:control_collection_shard1_replica_n1] o.a.s.s.SolrIndexSearcher Opening [Searcher@382a0045[control_collection_shard1_replica_n1] main]
   [junit4]   2> 1463976 INFO  (qtp834587517-18264) [n:127.0.0.1:61649_ c:control_collection s:shard1  x:control_collection_shard1_replica_n1] o.a.s.r.ManagedResourceStorage Configured ZooKeeperStorageIO with znodeBase: /configs/conf1
   [junit4]   2> 1463976 INFO  (qtp834587517-18264) [n:127.0.0.1:61649_ c:control_collection s:shard1  x:control_collection_shard1_replica_n1] o.a.s.r.ManagedResourceStorage Loaded null at path _rest_managed.json using ZooKeeperStorageIO:path=/configs/conf1
   [junit4]   2> 1463977 INFO  (qtp834587517-18264) [n:127.0.0.1:61649_ c:control_collection s:shard1  x:control_collection_shard1_replica_n1] o.a.s.h.ReplicationHandler Commits will be reserved for 10000ms.
   [junit4]   2> 1463977 INFO  (qtp834587517-18264) [n:127.0.0.1:61649_ c:control_collection s:shard1  x:control_collection_shard1_replica_n1] o.a.s.u.UpdateLog Could not find max version in index or recent updates, using new clock 1587822828954058752
   [junit4]   2> 1463978 INFO  (searcherExecutor-7157-thread-1-processing-n:127.0.0.1:61649_ x:control_collection_shard1_replica_n1 s:shard1 c:control_collection) [n:127.0.0.1:61649_ c:control_collection s:shard1  x:control_collection_shard1_replica_n1] o.a.s.c.SolrCore [control_collection_shard1_replica_n1] Registered new searcher Searcher@382a0045[control_collection_shard1_replica_n1] main{ExitableDirectoryReader(UninvertingDirectoryReader())}
   [junit4]   2> 1463983 INFO  (qtp834587517-18264) [n:127.0.0.1:61649_ c:control_collection s:shard1  x:control_collection_shard1_replica_n1] o.a.s.c.ShardLeaderElectionContext Enough replicas found to continue.
   [junit4]   2> 1463983 INFO  (qtp834587517-18264) [n:127.0.0.1:61649_ c:control_collection s:shard1  x:control_collection_shard1_replica_n1] o.a.s.c.ShardLeaderElectionContext I may be the new leader - try and sync
   [junit4]   2> 1463983 INFO  (qtp834587517-18264) [n:127.0.0.1:61649_ c:control_collection s:shard1  x:control_collection_shard1_replica_n1] o.a.s.c.SyncStrategy Sync replicas to http://127.0.0.1:61649/control_collection_shard1_replica_n1/
   [junit4]   2> 1463983 INFO  (qtp834587517-18264) [n:127.0.0.1:61649_ c:control_collection s:shard1  x:control_collection_shard1_replica_n1] o.a.s.c.SyncStrategy Sync Success - now sync replicas to me
   [junit4]   2> 1463983 INFO  (qtp834587517-18264) [n:127.0.0.1:61649_ c:control_collection s:shard1  x:control_collection_shard1_replica_n1] o.a.s.c.SyncStrategy http://127.0.0.1:61649/control_collection_shard1_replica_n1/ has no replicas
   [junit4]   2> 1463983 INFO  (qtp834587517-18264) [n:127.0.0.1:61649_ c:control_collection s:shard1  x:control_collection_shard1_replica_n1] o.a.s.c.ShardLeaderElectionContext Found all replicas participating in election, clear LIR
   [junit4]   2> 1463989 INFO  (qtp834587517-18264) [n:127.0.0.1:61649_ c:control_collection s:shard1  x:control_collection_shard1_replica_n1] o.a.s.c.ShardLeaderElectionContext I am the new leader: http://127.0.0.1:61649/control_collection_shard1_replica_n1/ shard1
   [junit4]   2> 1464092 INFO  (zkCallback-4969-thread-2-processing-n:127.0.0.1:61649_) [n:127.0.0.1:61649_    ] o.a.s.c.c.ZkStateReader A cluster state change: [WatchedEvent state:SyncConnected type:NodeDataChanged path:/collections/control_collection/state.json] for collection [control_collection] has occurred - updating... (live nodes size: [1])
   [junit4]   2> 1464150 INFO  (qtp834587517-18264) [n:127.0.0.1:61649_ c:control_collection s:shard1  x:control_collection_shard1_replica_n1] o.a.s.c.ZkController I am the leader, no recovery necessary
   [junit4]   2> 1464154 INFO  (qtp834587517-18264) [n:127.0.0.1:61649_ c:control_collection s:shard1  x:control_collection_shard1_replica_n1] o.a.s.s.HttpSolrCall [admin] webapp=null path=/admin/cores params={qt=/admin/cores&collection.configName=conf1&newCollection=true&name=control_collection_shard1_replica_n1&action=CREATE&numShards=1&collection=control_collection&shard=shard1&wt=javabin&version=2&replicaType=NRT} status=0 QTime=1368
   [junit4]   2> 1464160 INFO  (qtp834587517-18263) [n:127.0.0.1:61649_    ] o.a.s.h.a.CollectionsHandler Wait for new collection to be active for at most 30 seconds. Check all shard replicas
   [junit4]   2> 1464266 INFO  (zkCallback-4969-thread-2-processing-n:127.0.0.1:61649_) [n:127.0.0.1:61649_    ] o.a.s.c.c.ZkStateReader A cluster state change: [WatchedEvent state:SyncConnected type:NodeDataChanged path:/collections/control_collection/state.json] for collection [control_collection] has occurred - updating... (live nodes size: [1])
   [junit4]   2> 1464680 INFO  (OverseerCollectionConfigSetProcessor-99238926675214340-127.0.0.1:61649_-n_0000000000) [n:127.0.0.1:61649_    ] o.a.s.c.OverseerTaskQueue Response ZK path: /overseer/collection-queue-work/qnr-0000000000 doesn't exist.  Requestor may have disconnected from ZooKeeper
   [junit4]   2> 1465171 INFO  (qtp834587517-18263) [n:127.0.0.1:61649_    ] o.a.s.s.HttpSolrCall [admin] webapp=null path=/admin/collections params={replicationFactor=1&collection.configName=conf1&name=control_collection&nrtReplicas=1&action=CREATE&numShards=1&createNodeSet=127.0.0.1:61649_&wt=javabin&version=2} status=0 QTime=2508
   [junit4]   2> 1465179 INFO  (zkConnectionManagerCallback-4980-thread-1) [    ] o.a.s.c.c.ConnectionManager zkClient has connected
   [junit4]   2> 1465180 INFO  (TEST-FullSolrCloudDistribCmdsTest.test-seed#[360B0EFFF82D08C5]) [    ] o.a.s.c.c.ZkStateReader Updated live nodes from ZooKeeper... (0) -> (1)
   [junit4]   2> 1465181 INFO  (TEST-FullSolrCloudDistribCmdsTest.test-seed#[360B0EFFF82D08C5]) [    ] o.a.s.c.s.i.ZkClientClusterStateProvider Cluster at 127.0.0.1:61637/solr ready
   [junit4]   2> 1465181 INFO  (TEST-FullSolrCloudDistribCmdsTest.test-seed#[360B0EFFF82D08C5]) [    ] o.a.s.c.ChaosMonkey monkey: init - expire sessions:false cause connection loss:false
   [junit4]   2> 1465182 INFO  (qtp834587517-18268) [n:127.0.0.1:61649_    ] o.a.s.h.a.CollectionsHandler Invoked Collection Action :create with params replicationFactor=1&collection.configName=conf1&name=collection1&nrtReplicas=1&action=CREATE&numShards=3&createNodeSet=&stateFormat=1&wt=javabin&version=2 and sendToOCPQueue=true
   [junit4]   2> 1465185 INFO  (OverseerThreadFactory-7154-thread-2-processing-n:127.0.0.1:61649_) [n:127.0.0.1:61649_    ] o.a.s.c.CreateCollectionCmd Create collection collection1
   [junit4]   2> 1465186 WARN  (OverseerThreadFactory-7154-thread-2-processing-n:127.0.0.1:61649_) [n:127.0.0.1:61649_    ] o.a.s.c.CreateCollectionCmd It is unusual to create a collection (collection1) without cores.
   [junit4]   2> 1465406 INFO  (qtp834587517-18268) [n:127.0.0.1:61649_    ] o.a.s.h.a.CollectionsHandler Wait for new collection to be active for at most 30 seconds. Check all shard replicas
   [junit4]   2> 1465406 INFO  (qtp834587517-18268) [n:127.0.0.1:61649_    ] o.a.s.s.HttpSolrCall [admin] webapp=null path=/admin/collections params={replicationFactor=1&collection.configName=conf1&name=collection1&nrtReplicas=1&action=CREATE&numShards=3&createNodeSet=&stateFormat=1&wt=javabin&version=2} status=0 QTime=223
   [junit4]   2> 1465719 INFO  (TEST-FullSolrCloudDistribCmdsTest.test-seed#[360B0EFFF82D08C5]) [    ] o.a.s.c.AbstractFullDistribZkTestBase create jetty 1 in directory /Users/jenkins/workspace/Lucene-Solr-master-MacOSX/solr/build/solr-core/test/J0/temp/solr.cloud.FullSolrCloudDistribCmdsTest_360B0EFFF82D08C5-001/shard-1-001 of type NRT
   [junit4]   2> 1465719 INFO  (TEST-FullSolrCloudDistribCmdsTest.test-seed#[360B0EFFF82D08C5]) [    ] o.e.j.s.Server jetty-9.3.20.v20170531
   [junit4]   2> 1465720 INFO  (TEST-FullSolrCloudDistribCmdsTest.test-seed#[360B0EFFF82D08C5]) [    ] o.e.j.s.h.ContextHandler Started o.e.j.s.ServletContextHandler@4d156d29{/,null,AVAILABLE}
   [junit4]   2> 1465720 INFO  (TEST-FullSolrCloudDistribCmdsTest.test-seed#[360B0EFFF82D08C5]) [    ] o.e.j.s.AbstractConnector Started ServerConnector@17bc30c0{HTTP/1.1,[http/1.1]}{127.0.0.1:61658}
   [junit4]   2> 1465720 INFO  (TEST-FullSolrCloudDistribCmdsTest.test-seed#[360B0EFFF82D08C5]) [    ] o.e.j.s.Server Started @1469154ms
   [junit4]   2> 1465720 INFO  (TEST-FullSolrCloudDistribCmdsTest.test-seed#[360B0EFFF82D08C5]) [    ] o.a.s.c.s.e.JettySolrRunner Jetty properties: {solr.data.dir=/Users/jenkins/workspace/Lucene-Solr-master-MacOSX/solr/build/solr-core/test/J0/temp/solr.cloud.FullSolrCloudDistribCmdsTest_360B0EFFF82D08C5-001/tempDir-001/jetty1, solrconfig=solrconfig.xml, hostContext=/, hostPort=61658, coreRootDirectory=/Users/jenkins/workspace/Lucene-Solr-master-MacOSX/solr/build/solr-core/test/J0/../../../../../../../../../Users/jenkins/workspace/Lucene-Solr-master-MacOSX/solr/build/solr-core/test/J0/temp/solr.cloud.FullSolrCloudDistribCmdsTest_360B0EFFF82D08C5-001/shard-1-001/cores}
   [junit4]   2> 1465721 ERROR (TEST-FullSolrCloudDistribCmdsTest.test-seed#[360B0EFFF82D08C5]) [    ] o.a.s.u.StartupLoggingUtils Missing Java Option solr.log.dir. Logging may be missing or incomplete.
   [junit4]   2> 1465721 INFO  (TEST-FullSolrCloudDistribCmdsTest.test-seed#[360B0EFFF82D08C5]) [    ] o.a.s.s.SolrDispatchFilter  ___      _       Welcome to Apache Solr™ version 8.0.0
   [junit4]   2> 1465721 INFO  (TEST-FullSolrCloudDistribCmdsTest.test-seed#[360B0EFFF82D08C5]) [    ] o.a.s.s.SolrDispatchFilter / __| ___| |_ _   Starting in cloud mode on port null
   [junit4]   2> 1465721 INFO  (TEST-FullSolrCloudDistribCmdsTest.test-seed#[360B0EFFF82D08C5]) [    ] o.a.s.s.SolrDispatchFilter \__ \/ _ \ | '_|  Install dir: null
   [junit4]   2> 1465721 INFO  (TEST-FullSolrCloudDistribCmdsTest.test-seed#[360B0EFFF82D08C5]) [    ] o.a.s.s.SolrDispatchFilter |___/\___/_|_|    Start time: 2017-12-26T05:24:12.721Z
   [junit4]   2> 1465723 INFO  (zkConnectionManagerCallback-4982-thread-1) [    ] o.a.s.c.c.ConnectionManager zkClient has connected
   [junit4]   2> 1465724 INFO  (TEST-FullSolrCloudDistribCmdsTest.test-seed#[360B0EFFF82D08C5]) [    ] o.a.s.s.SolrDispatchFilter Loading solr.xml from SolrHome (not found in ZooKeeper)
   [junit4]   2> 1465725 INFO  (TEST-FullSolrCloudDistribCmdsTest.test-seed#[360B0EFFF82D08C5]) [    ] o.a.s.c.SolrXmlConfig Loading container configuration from /Users/jenkins/workspace/Lucene-Solr-master-MacOSX/solr/build/solr-core/test/J0/temp/solr.cloud.FullSolrCloudDistribCmdsTest_360B0EFFF82D08C5-001/shard-1-001/solr.xml
   [junit4]   2> 1465731 INFO  (TEST-FullSolrCloudDistribCmdsTest.test-seed#[360B0EFFF82D08C5]) [    ] o.a.s.c.SolrXmlConfig Configuration parameter autoReplicaFailoverWorkLoopDelay is ignored
   [junit4]   2> 1465731 INFO  (TEST-FullSolrCloudDistribCmdsTest.test-seed#[360B0EFFF82D08C5]) [    ] o.a.s.c.SolrXmlConfig Configuration parameter autoReplicaFailoverBadNodeExpiration is ignored
   [junit4]   2> 1465732 INFO  (TEST-FullSolrCloudDistribCmdsTest.test-seed#[360B0EFFF82D08C5]) [    ] o.a.s.c.SolrXmlConfig MBean server found: com.sun.jmx.mbeanserver.JmxMBeanServer@475c2d0c, but no JMX reporters were configured - adding default JMX reporter.
   [junit4]   2> 1465736 INFO  (TEST-FullSolrCloudDistribCmdsTest.test-seed#[360B0EFFF82D08C5]) [    ] o.a.s.c.ZkContainer Zookeeper client=127.0.0.1:61637/solr
   [junit4]   2> 1465738 INFO  (zkConnectionManagerCallback-4986-thread-1) [    ] o.a.s.c.c.ConnectionManager zkClient has connected
   [junit4]   2> 1465740 INFO  (zkConnectionManagerCallback-4988-thread-1-processing-n:127.0.0.1:61658_) [n:127.0.0.1:61658_    ] o.a.s.c.c.ConnectionManager zkClient has connected
   [junit4]   2> 1465750 INFO  (TEST-FullSolrCloudDistribCmdsTest.test-seed#[360B0EFFF82D08C5]) [n:127.0.0.1:61658_    ] o.a.s.c.c.ZkStateReader Updated live nodes from ZooKeeper... (0) -> (1)
   [junit4]   2> 1465753 INFO  (TEST-FullSolrCloudDistribCmdsTest.test-seed#[360B0EFFF82D08C5]) [n:127.0.0.1:61658_    ] o.a.s.c.Overseer Overseer (id=null) closing
   [junit4]   2> 1465757 INFO  (TEST-FullSolrCloudDistribCmdsTest.test-seed#[360B0EFFF82D08C5]) [n:127.0.0.1:61658_    ] o.a.s.c.ZkController Register node as live in ZooKeeper:/live_nodes/127.0.0.1:61658_
   [junit4]   2> 1465759 INFO  (zkCallback-4969-thread-2-processing-n:127.0.0.1:61649_) [n:127.0.0.1:61649_    ] o.a.s.c.c.ZkStateReader Updated live nodes from ZooKeeper... (1) -> (2)
   [junit4]   2> 1465759 INFO  (zkCallback-4987-thread-1-processing-n:127.0.0.1:61658_) [n:127.0.0.1:61658_    ] o.a.s.c.c.ZkStateReader Updated live nodes from ZooKeeper... (1) -> (2)
   [junit4]   2> 1465759 INFO  (zkCallback-4979-thread-1) [    ] o.a.s.c.c.ZkStateReader Updated live nodes from ZooKeeper... (1) -> (2)
   [junit4]   2> 1465847 INFO  (TEST-FullSolrCloudDistribCmdsTest.test-seed#[360B0EFFF82D08C5]) [n:127.0.0.1:61658_    ] o.a.s.m.r.SolrJmxReporter JMX monitoring for 'solr.node' (registry 'solr.node') enabled at server: com.sun.jmx.mbeanserver.JmxMBeanServer@475c2d0c
   [junit4]   2> 1465856 INFO  (TEST-FullSolrCloudDistribCmdsTest.test-seed#[360B0EFFF82D08C5]) [n:127.0.0.1:61658_    ] o.a.s.m.r.SolrJmxReporter JMX monitoring for 'solr.jvm' (registry 'solr.jvm') enabled at server: com.sun.jmx.mbeanserver.JmxMBeanServer@475c2d0c
   [junit4]   2> 1465856 INFO  (TEST-FullSolrCloudDistribCmdsTest.test-seed#[360B0EFFF82D08C5]) [n:127.0.0.1:61658_    ] o.a.s.m.r.SolrJmxReporter JMX monitoring for 'solr.jetty' (registry 'solr.jetty') enabled at server: com.sun.jmx.mbeanserver.JmxMBeanServer@475c2d0c
   [junit4]   2> 1465857 INFO  (TEST-FullSolrCloudDistribCmdsTest.test-seed#[360B0EFFF82D08C5]) [n:127.0.0.1:61658_    ] o.a.s.c.CorePropertiesLocator Found 0 core definitions underneath /Users/jenkins/workspace/Lucene-Solr-master-MacOSX/solr/build/solr-core/test/J0/../../../../../../../../../Users/jenkins/workspace/Lucene-Solr-master-MacOSX/solr/build/solr-core/test/J0/temp/solr.cloud.FullSolrCloudDistribCmdsTest_360B0EFFF82D08C5-001/shard-1-001/cores
   [junit4]   2> 1465893 INFO  (qtp834587517-18261) [n:127.0.0.1:61649_    ] o.a.s.h.a.CollectionsHandler Invoked Collection Action :addreplica with params node=127.0.0.1:61658_&action=ADDREPLICA&collection=collection1&shard=shard2&type=NRT&wt=javabin&version=2 and sendToOCPQueue=true
   [junit4]   2> 1465896 INFO  (OverseerCollectionConfigSetProcessor-99238926675214340-127.0.0.1:61649_-n_0000000000) [n:127.0.0.1:61649_    ] o.a.s.c.OverseerTaskQueue Response ZK path: /overseer/collection-queue-work/qnr-0000000002 doesn't exist.  Requestor may have disconnected from ZooKeeper
   [junit4]   2> 1465896 INFO  (OverseerThreadFactory-7154-thread-3-processing-n:127.0.0.1:61649_) [n:127.0.0.1:61649_    ] o.a.s.c.AddReplicaCmd Node Identified 127.0.0.1:61658_ for creating new replica
   [junit4]   2> 1465901 INFO  (qtp80464262-18312) [n:127.0.0.1:61658_    ] o.a.s.h.a.CoreAdminOperation core create command qt=/admin/cores&collection.configName=conf1&name=collection1_shard2_replica_n61&action=CREATE&collection=collection1&shard=shard2&wt=javabin&version=2&replicaType=NRT
   [junit4]   2> 1465901 INFO  (qtp80464262-18312) [n:127.0.0.1:61658_    ] o.a.s.c.TransientSolrCoreCacheDefault Allocating transient cache for 4 transient cores
   [junit4]   2> 1466926 INFO  (qtp80464262-18312) [n:127.0.0.1:61658_ c:collection1 s:shard2  x:collection1_shard2_replica_n61] o.a.s.c.SolrConfig Using Lucene MatchVersion: 8.0.0
   [junit4]   2> 1466935 INFO  (qtp80464262-18312) [n:127.0.0.1:61658_ c:collection1 s:shard2  x:collection1_shard2_replica_n61] o.a.s.s.IndexSchema [collection1_shard2_replica_n61] Schema name=test
   [junit4]   2> 1467006 INFO  (qtp80464262-18312) [n:127.0.0.1:61658_ c:collection1 s:shard2  x:collection1_shard2_replica_n61] o.a.s.s.IndexSchema Loaded schema test/1.6 with uniqueid field id
   [junit4]   2> 1467024 INFO  (qtp80464262-18312) [n:127.0.0.1:61658_ c:collection1 s:shard2  x:collection1_shard2_replica_n61] o.a.s.c.CoreContainer Creating SolrCore 'collection1_shard2_replica_n61' using configuration from collection collection1, trusted=true
   [junit4]   2> 1467025 INFO  (qtp80464262-18312) [n:127.0.0.1:61658_ c:collection1 s:shard2  x:collection1_shard2_replica_n61] o.a.s.m.r.SolrJmxReporter JMX monitoring for 'solr.core.collection1.shard2.replica_n61' (registry 'solr.core.collection1.shard2.replica_n61') enabled at server: com.sun.jmx.mbeanserver.JmxMBeanServer@475c2d0c
   [junit4]   2> 1467025 INFO  (qtp80464262-18312) [n:127.0.0.1:61658_ c:collection1 s:shard2  x:collection1_shard2_replica_n61] o.a.s.c.SolrCore solr.RecoveryStrategy.Builder
   [junit4]   2> 1467025 INFO  (qtp80464262-18312) [n:127.0.0.1:61658_ c:collection1 s:shard2  x:collection1_shard2_replica_n61] o.a.s.c.SolrCore [[collection1_shard2_replica_n61] ] Opening new SolrCore at [/Users/jenkins/workspace/Lucene-Solr-master-MacOSX/solr/build/solr-core/test/J0/temp/solr.cloud.FullSolrCloudDistribCmdsTest_360B0EFFF82D08C5-001/shard-1-001/cores/collection1_shard2_replica_n61], dataDir=[/Users/jenkins/workspace/Lucene-Solr-master-MacOSX/solr/build/solr-core/test/J0/../../../../../../../../../Users/jenkins/workspace/Lucene-Solr-master-MacOSX/solr/build/solr-core/test/J0/temp/solr.cloud.FullSolrCloudDistribCmdsTest_360B0EFFF82D08C5-001/shard-1-001/cores/collection1_shard2_replica_n61/data/]
   [junit4]   2> 1467027 INFO  (qtp80464262-18312) [n:127.0.0.1:61658_ c:collection1 s:shard2  x:collection1_shard2_replica_n61] o.a.s.u.RandomMergePolicy RandomMergePolicy wrapping class org.apache.lucene.index.LogByteSizeMergePolicy: [LogByteSizeMergePolicy: minMergeSize=1677721, mergeFactor=12, maxMergeSize=2147483648, maxMergeSizeForForcedMerge=9223372036854775807, calibrateSizeByDeletes=false, maxMergeDocs=2147483647, maxCFSSegmentSizeMB=8.796093022207999E12, noCFSRatio=0.0]
   [junit4]   2> 1467029 WARN  (qtp80464262-18312) [n:127.0.0.1:61658_ c:collection1 s:shard2  x:collection1_shard2_replica_n61] o.a.s.c.RequestHandlers INVALID paramSet a in requestHandler {type = requestHandler,name = /dump,class = DumpRequestHandler,attributes = {initParams=a, name=/dump, class=DumpRequestHandler},args = {defaults={a=A,b=B}}}
   [junit4]   2> 1467074 INFO  (qtp80464262-18312) [n:127.0.0.1:61658_ c:collection1 s:shard2  x:collection1_shard2_replica_n61] o.a.s.u.UpdateHandler Using UpdateLog implementation: org.apache.solr.update.UpdateLog
   [junit4]   2> 1467074 INFO  (qtp80464262-18312) [n:127.0.0.1:61658_ c:collection1 s:shard2  x:collection1_shard2_replica_n61] o.a.s.u.UpdateLog Initializing UpdateLog: dataDir= defaultSyncLevel=FLUSH numRecordsToKeep=100 maxNumLogsToKeep=10 numVersionBuckets=65536
   [junit4]   2> 1467075 INFO  (qtp80464262-18312) [n:127.0.0.1:61658_ c:collection1 s:shard2  x:collection1_shard2_replica_n61] o.a.s.u.CommitTracker Hard AutoCommit: disabled
   [junit4]   2> 1467075 INFO  (qtp80464262-18312) [n:127.0.0.1:61658_ c:collection1 s:shard2  x:collection1_shard2_replica_n61] o.a.s.u.CommitTracker Soft AutoCommit: disabled
   [junit4]   2> 1467076 INFO  (qtp80464262-18312) [n:127.0.0.1:61658_ c:collection1 s:shard2  x:collection1_shard2_replica_n61] o.a.s.u.RandomMergePolicy RandomMergePolicy wrapping class org.apache.lucene.index.LogDocMergePolicy: [LogDocMergePolicy: minMergeSize=1000, mergeFactor=41, maxMergeSize=9223372036854775807, maxMergeSizeForForcedMerge=9223372036854775807, calibrateSizeByDeletes=true, maxMergeDocs=2147483647, maxCFSSegmentSizeMB=8.796093022207999E12, noCFSRatio=0.0]
   [junit4]   2> 1467080 INFO  (qtp80464262-18312) [n:127.0.0.1:61658_ c:collection1 s:shard2  x:collection1_shard2_replica_n61] o.a.s.s.SolrIndexSearcher Opening [Searcher@4ba9c1a8[collection1_shard2_replica_n61] main]
   [junit4]   2> 1467081 INFO  (qtp80464262-18312) [n:127.0.0.1:61658_ c:collection1 s:shard2  x:collection1_shard2_replica_n61] o.a.s.r.ManagedResourceStorage Configured ZooKeeperStorageIO with znodeBase: /configs/conf1
   [junit4]   2> 1467081 INFO  (qtp80464262-18312) [n:127.0.0.1:61658_ c:collection1 s:shard2  x:collection1_shard2_replica_n61] o.a.s.r.ManagedResourceStorage Loaded null at path _rest_managed.json using ZooKeeperStorageIO:path=/configs/conf1
   [junit4]   2> 1467082 INFO  (qtp80464262-18312) [n:127.0.0.1:61658_ c:collection1 s:shard2  x:collection1_shard2_replica_n61] o.a.s.h.ReplicationHandler Commits will be reserved for 10000ms.
   [junit4]   2> 1467082 INFO  (qtp80464262-18312) [n:127.0.0.1:61658_ c:collection1 s:shard2  x:collection1_shard2_replica_n61] o.a.s.u.UpdateLog Could not find max version in index or recent updates, using new clock 1587822832209887232
   [junit4]   2> 1467083 INFO  (searcherExecutor-7168-thread-1-processing-n:127.0.0.1:61658_ x:collection1_shard2_replica_n61 s:shard2 c:collection1) [n:127.0.0.1:61658_ c:collection1 s:shard2  x:collection1_shard2_replica_n61] o.a.s.c.SolrCore [collection1_shard2_replica_n61] Registered new searcher Searcher@4ba9c1a8[collection1_shard2_replica_n61] main{ExitableDirectoryReader(UninvertingDirectoryReader())}
   [junit4]   2> 1467087 INFO  (qtp80464262-18312) [n:127.0.0.1:61658_ c:collection1 s:shard2  x:collection1_shard2_replica_n61] o.a.s.c.ShardLeaderElectionContext Enough replicas found to continue.
   [junit4]   2> 1467087 INFO  (qtp80464262-18312) [n:127.0.0.1:61658_ c:collection1 s:shard2  x:collection1_shard2_replica_n61] o.a.s.c.ShardLeaderElectionContext I may be the new leader - try and sync
   [junit4]   2> 1467087 INFO  (qtp80464262-18312) [n:127.0.0.1:61658_ c:collection1 s:shard2  x:collection1_shard2_replica_n61] o.a.s.c.SyncStrategy Sync replicas to http://127.0.0.1:61658/collection1_shard2_replica_n61/
   [junit4]   2> 1467087 INFO  (qtp80464262-18312) [n:127.0.0.1:61658_ c:collection1 s:shard2  x:collection1_shard2_replica_n61] o.a.s.c.SyncStrategy Sync Success - now sync replicas to me
   [junit4]   2> 1467087 INFO  (qtp80464262-18312) [n:127.0.0.1:61658_ c:collection1 s:shard2  x:collection1_shard2_replica_n61] o.a.s.c.SyncStrategy http://127.0.0.1:61658/collection1_shard2_replica_n61/ has no replicas
   [junit4]   2> 1467087 INFO  (qtp80464262-18312) [n:127.0.0.1:61658_ c:collection1 s:shard2  x:collection1_shard2_replica_n61] o.a.s.c.ShardLeaderElectionContext Found all replicas participating in election, clear LIR
   [junit4]   2> 1467091 INFO  (qtp80464262-18312) [n:127.0.0.1:61658_ c:collection1 s:shard2  x:collection1_shard2_replica_n61] o.a.s.c.ShardLeaderElectionContext I am the new leader: http://127.0.0.1:61658/collection1_shard2_replica_n61/ shard2
   [junit4]   2> 1467208 INFO  (qtp80464262-18312) [n:127.0.0.1:61658_ c:collection1 s:shard2  x:collection1_shard2_replica_n61] o.a.s.c.ZkController I am the leader, no recovery necessary
   [junit4]   2> 1467210 INFO  (qtp80464262-18312) [n:127.0.0.1:61658_ c:collection1 s:shard2  x:collection1_shard2_replica_n61] o.a.s.s.HttpSolrCall [admin] webapp=null path=/admin/cores params={qt=/admin/cores&collection.configName=conf1&name=collection1_shard2_replica_n61&action=CREATE&collection=collection1&shard=shard2&wt=javabin&version=2&replicaType=NRT} status=0 QTime=1309
   [junit4]   2> 1467212 INFO  (qtp834587517-18261) [n:127.0.0.1:61649_    ] o.a.s.s.HttpSolrCall [admin] webapp=null path=/admin/collections params={node=127.0.0.1:61658_&action=ADDREPLICA&collection=collection1&shard=shard2&type=NRT&wt=javabin&version=2} status=0 QTime=1319
   [junit4]   2> 1467470 INFO  (TEST-FullSolrCloudDistribCmdsTest.test-seed#[360B0EFFF82D08C5]) [    ] o.a.s.c.AbstractFullDistribZkTestBase create jetty 2 in directory /Users/jenkins/workspace/Lucene-Solr-master-MacOSX/solr/build/solr-core/test/J0/temp/solr.cloud.FullSolrCloudDistribCmdsTest_360B0EFFF82D08C5-001/shard-2-001 of type NRT
   [junit4]   2> 1467471 INFO  (TEST-FullSolrCloudDistribCmdsTest.test-seed#[360B0EFFF82D08C5]) [    ] o.e.j.s.Server jetty-9.3.20.v20170531
   [junit4]   2> 1467472 INFO  (TEST-FullSolrCloudDistribCmdsTest.test-seed#[360B0EFFF82D08C5]) [    ] o.e.j.s.h.ContextHandler Started o.e.j.s.ServletContextHandler@2064d5fb{/,null,AVAILABLE}
   [junit4]   2> 1467472 INFO  (TEST-FullSolrCloudDistribCmdsTest.test-seed#[360B0EFFF82D08C5]) [    ] o.e.j.s.AbstractConnector Started ServerConnector@669c883b{HTTP/1.1,[http/1.1]}{127.0.0.1:61663}
   [junit4]   2> 1467472 INFO  (TEST-FullSolrCloudDistribCmdsTest.test-seed#[360B0EFFF82D08C5]) [    ] o.e.j.s.Server Started @1470906ms
   [junit4]   2> 1467473 INFO  (TEST-FullSolrCloudDistribCmdsTest.test-seed#[360B0EFFF82D08C5]) [    ] o.a.s.c.s.e.JettySolrRunner Jetty properties: {solr.data.dir=/Users/jenkins/workspace/Lucene-Solr-master-MacOSX/solr/build/solr-core/test/J0/temp/solr.cloud.FullSolrCloudDistribCmdsTest_360B0EFFF82D08C5-001/tempDir-001/jetty2, solrconfig=solrconfig.xml, hostContext=/, hostPort=61663, coreRootDirectory=/Users/jenkins/workspace/Lucene-Solr-master-MacOSX/solr/build/solr-core/test/J0/temp/solr.cloud.FullSolrCloudDistribCmdsTest_360B0EFFF82D08C5-001/shard-2-001/cores}
   [junit4]   2> 1467473 ERROR (TEST-FullSolrCloudDistribCmdsTest.test-seed#[360B0EFFF82D08C5]) [    ] o.a.s.u.StartupLoggingUtils Missing Java Option solr.log.dir. Logging may be missing or incomplete.
   [junit4]   2> 1467473 INFO  (TEST-FullSolrCloudDistribCmdsTest.test-seed#[360B0EFFF82D08C5]) [    ] o.a.s.s.SolrDispatchFilter  ___      _       Welcome to Apache Solr™ version 8.0.0
   [junit4]   2> 1467473 INFO  (TEST-FullSolrCloudDistribCmdsTest.test-seed#[360B0EFFF82D08C5]) [    ] o.a.s.s.SolrDispatchFilter / __| ___| |_ _   Starting in cloud mode on port null
   [junit4]   2> 1467473 INFO  (TEST-FullSolrCloudDistribCmdsTest.test-seed#[360B0EFFF82D08C5]) [    ] o.a.s.s.SolrDispatchFilter \__ \/ _ \ | '_|  Install dir: null
   [junit4]   2> 1467473 INFO  (TEST-FullSolrCloudDistribCmdsTest.test-seed#[360B0EFFF82D08C5]) [    ] o.a.s.s.SolrDispatchFilter |___/\___/_|_|    Start time: 2017-12-26T05:24:14.473Z
   [junit4]   2> 1467475 INFO  (zkConnectionManagerCallback-4992-thread-1) [    ] o.a.s.c.c.ConnectionManager zkClient has connected
   [junit4]   2> 1467476 INFO  (TEST-FullSolrCloudDistribCmdsTest.test-seed#[360B0EFFF82D08C5]) [    ] o.a.s.s.SolrDispatchFilter Loading solr.xml from SolrHome (not found in ZooKeeper)
   [junit4]   2> 1467476 INFO  (TEST-FullSolrCloudDistribCmdsTest.test-seed#[360B0EFFF82D08C5]) [    ] o.a.s.c.SolrXmlConfig Loading container configuration from /Users/jenkins/workspace/Lucene-Solr-master-MacOSX/solr/build/solr-core/test/J0/temp/solr.cloud.FullSolrCloudDistribCmdsTest_360B0EFFF82D08C5-001/shard-2-001/solr.xml
   [junit4]   2> 1467481 INFO  (TEST-FullSolrCloudDistribCmdsTest.test-seed#[360B0EFFF82D08C5]) [    ] o.a.s.c.SolrXmlConfig Configuration parameter autoReplicaFailoverWorkLoopDelay is ignored
   [junit4]   2> 1467481 INFO  (TEST-FullSolrCloudDistribCmdsTest.test-seed#[360B0EFFF82D08C5]) [    ] o.a.s.c.SolrXmlConfig Configuration parameter autoReplicaFailoverBadNodeExpiration is ignored
   [junit4]   2> 1467481 INFO  (TEST-FullSolrCloudDistribCmdsTest.test-seed#[360B0EFFF82D08C5]) [    ] o.a.s.c.SolrXmlConfig MBean server found: com.sun.jmx.mbeanserver.JmxMBeanServer@475c2d0c, but no JMX reporters were configured - adding default JMX reporter.
   [junit4]   2> 1467485 INFO  (TEST-FullSolrCloudDistribCmdsTest.test-seed#[360B0EFFF82D08C5]) [    ] o.a.s.c.ZkContainer Zookeeper client=127.0.0.1:61637/solr
   [junit4]   2> 1467486 INFO  (zkConnectionManagerCallback-4996-thread-1) [    ] o.a.s.c.c.ConnectionManager zkClient has connected
   [junit4]   2> 1467488 INFO  (zkConnectionManagerCallback-4998-thread-1-processing-n:127.0.0.1:61663_) [n:127.0.0.1:61663_    ] o.a.s.c.c.ConnectionManager zkClient has connected
   [junit4]   2> 1467497 INFO  (TEST-FullSolrCloudDistribCmdsTest.test-seed#[360B0EFFF82D08C5]) [n:127.0.0.1:61663_    ] o.a.s.c.c.ZkStateReader Updated live nodes from ZooKeeper... (0) -> (2)
   [junit4]   2> 1467500 INFO  (TEST-FullSolrCloudDistribCmdsTest.test-seed#[360B0EFFF82D08C5]) [n:127.0.0.1:61663_    ] o.a.s.c.Overseer Overseer (id=null) closing
   [junit4]   2> 1467503 INFO  (TEST-FullSolrCloudDistribCmdsTest.test-seed#[360B0EFFF82D08C5]) [n:127.0.0.1:61663_    ] o.a.s.c.ZkController Register node as live in ZooKeeper:/live_nodes/127.0.0.1:61663_
   [junit4]   2> 1467505 INFO  (zkCallback-4987-thread-1-processing-n:127.0.0.1:61658_) [n:127.0.0.1:61658_    ] o.a.s.c.c.ZkStateReader Updated live nodes from ZooKeeper... (2) -> (3)
   [junit4]   2> 1467505 INFO  (zkCallback-4969-thread-2-processing-n:127.0.0.1:61649_) [n:127.0.0.1:61649_    ] o.a.s.c.c.ZkStateReader Updated live nodes from ZooKeeper... (2) -> (3)
   [junit4]   2> 1467505 INFO  (zkCallback-4979-thread-1) [    ] o.a.s.c.c.ZkStateReader Updated live nodes from ZooKeeper... (2) -> (3)
   [junit4]   2> 1467505 INFO  (zkCallback-4997-thread-1-processing-n:127.0.0.1:61663_) [n:127.0.0.1:61663_    ] o.a.s.c.c.ZkStateReader Updated live nodes from ZooKeeper... (2) -> (3)
   [junit4]   2> 1467610 INFO  (TEST-FullSolrCloudDistribCmdsTest.test-seed#[360B0EFFF82D08C5]) [n:127.0.0.1:61663_    ] o.a.s.m.r.SolrJmxReporter JMX monitoring for 'solr.node' (registry 'solr.node') enabled at server: com.sun.jmx.mbeanserver.JmxMBeanServer@475c2d0c
   [junit4]   2> 1467620 INFO  (TEST-FullSolrCloudDistribCmdsTest.test-seed#[360B0EFFF82D08C5]) [n:127.0.0.1:61663_    ] o.a.s.m.r.SolrJmxReporter JMX monitoring for 'solr.jvm' (registry 'solr.jvm') enabled at server: com.sun.jmx.mbeanserver.JmxMBeanServer@475c2d0c
   [junit4]   2> 1467620 INFO  (TEST-FullSolrCloudDistribCmdsTest.test-seed#[360B0EFFF82D08C5]) [n:127.0.0.1:61663_    ] o.a.s.m.r.SolrJmxReporter JMX monitoring for 'solr.jetty' (registry 'solr.jetty') enabled at server: com.sun.jmx.mbeanserver.JmxMBeanServer@475c2d0c
   [junit4]   2> 1467622 INFO  (TEST-FullSolrCloudDistribCmdsTest.test-seed#[360B0EFFF82D08C5]) [n:127.0.0.1:61663_    ] o.a.s.c.CorePropertiesLocator Found 0 core definitions underneath /Users/jenkins/workspace/Lucene-Solr-master-MacOSX/solr/build/solr-core/test/J0/temp/solr.cloud.FullSolrCloudDistribCmdsTest_360B0EFFF82D08C5-001/shard-2-001/cores
   [junit4]   2> 1467667 INFO  (qtp834587517-18264) [n:127.0.0.1:61649_    ] o.a.s.h.a.CollectionsHandler Invoked Collection Action :addreplica with params node=127.0.0.1:61663_&action=ADDREPLICA&collection=collection1&shard=shard3&type=NRT&wt=javabin&version=2 and sendToOCPQueue=true
   [junit4]   2> 1467670 INFO  (OverseerCollectionConfigSetProcessor-99238926675214340-127.0.0.1:61649_-n_0000000000) [n:127.0.0.1:61649_    ] o.a.s.c.OverseerTaskQueue Response ZK path: /overseer/collection-queue-work/qnr-0000000004 doesn't exist.  Requestor may have disconnected from ZooKeeper
   [junit4]   2> 1467670 INFO  (OverseerThreadFactory-7154-thread-4-processing-n:127.0.0.1:61649_) [n:127.0.0.1:61649_    ] o.a.s.c.AddReplicaCmd Node Identified 127.0.0.1:61663_ for creating new replica
   [junit4]   2> 1467674 INFO  (qtp323765625-18343) [n:127.0.0.1:61663_    ] o.a.s.h.a.CoreAdminOperation core create command qt=/admin/cores&collection.configName=conf1&name=collection1_shard3_replica_n63&action=CREATE&collection=collection1&shard=shard3&wt=javabin&version=2&replicaType=NRT
   [junit4]   2> 1467675 INFO  (qtp323765625-18343) [n:127.0.0.1:61663_    ] o.a.s.c.TransientSolrCoreCacheDefault Allocating transient cache for 4 transient cores
   [junit4]   2> 1468695 INFO  (qtp323765625-18343) [n:127.0.0.1:61663_ c:collection1 s:shard3  x:collection1_shard3_replica_n63] o.a.s.c.SolrConfig Using Lucene MatchVersion: 8.0.0
   [junit4]   2> 1468704 INFO  (qtp323765625-18343) [n:127.0.0.1:61663_ c:collection1 s:shard3  x:collection1_shard3_replica_n63] o.a.s.s.IndexSchema [collection1_shard3_replica_n63] Schema name=test
   [junit4]   2> 1468772 INFO  (qtp323765625-18343) [n:127.0.0.1:61663_ c:collection1 s:shard3  x:collection1_shard3_replica_n63] o.a.s.s.IndexSchema Loaded schema test/1.6 with uniqueid field id
   [junit4]   2> 1468793 INFO  (qtp323765625-18343) [n:127.0.0.1:61663_ c:collection1 s:shard3  x:collection1_shard3_replica_n63] o.a.s.c.CoreContainer Creating SolrCore 'collection1_shard3_replica_n63' using configuration from collection collection1, trusted=true
   [junit4]   2> 1468793 INFO  (qtp323765625-18343) [n:127.0.0.1:61663_ c:collection1 s:shard3  x:collection1_shard3_replica_n63] o.a.s.m.r.SolrJmxReporter JMX monitoring for 'solr.core.collection1.shard3.replica_n63' (registry 'solr.core.collection1.shard3.replica_n63') enabled at server: com.sun.jmx.mbeanserver.JmxMBeanServer@475c2d0c
   [junit4]   2> 1468794 INFO  (qtp323765625-18343) [n:127.0.0.1:61663_ c:collection1 s:shard3  x:collection1_shard3_replica_n63] o.a.s.c.SolrCore solr.RecoveryStrategy.Builder
   [junit4]   2> 1468794 INFO  (qtp323765625-18343) [n:127.0.0.1:61663_ c:collection1 s:shard3  x:collection1_shard3_replica_n63] o.a.s.c.SolrCore [[collection1_shard3_replica_n63] ] Opening new SolrCore at [/Users/jenkins/workspace/Lucene-Solr-master-MacOSX/solr/build/solr-core/test/J0/temp/solr.cloud.FullSolrCloudDistribCmdsTest_360B0EFFF82D08C5-001/shard-2-001/cores/collection1_shard3_replica_n63], dataDir=[/Users/jenkins/workspace/Lucene-Solr-master-MacOSX/solr/build/solr-core/test/J0/temp/solr.cloud.FullSolrCloudDistribCmdsTest_360B0EFFF82D08C5-001/shard-2-001/cores/collection1_shard3_replica_n63/data/]
   [junit4]   2> 1468795 INFO  (qtp323765625-18343) [n:127.0.0.1:61663_ c:collection1 s:shard3  x:collection1_shard3_replica_n63] o.a.s.u.RandomMergePolicy RandomMergePolicy wrapping class org.apache.lucene.index.LogByteSizeMergePolicy: [LogByteSizeMergePolicy: minMergeSize=1677721, mergeFactor=12, maxMergeSize=2147483648, maxMergeSizeForForcedMerge=9223372036854775807, calibrateSizeByDeletes=false, maxMergeDocs=2147483647, maxCFSSegmentSizeMB=8.796093022207999E12, noCFSRatio=0.0]
   [junit4]   2> 1468798 WARN  (qtp323765625-18343) [n:127.0.0.1:61663_ c:collection1 s:shard3  x:collection1_shard3_replica_n63] o.a.s.c.RequestHandlers INVALID paramSet a in requestHandler {type = requestHandler,name = /dump,class = DumpRequestHandler,attributes = {initParams=a, name=/dump, class=DumpRequestHandler},args = {defaults={a=A,b=B}}}
   [junit4]   2> 1468857 INFO  (qtp323765625-18343) [n:127.0.0.1:61663_ c:collection1 s:shard3  x:collection1_shard3_replica_n63] o.a.s.u.UpdateHandler Using UpdateLog implementation: org.apache.solr.update.UpdateLog
   [junit4]   2> 1468857 INFO  (qtp323765625-18343) [n:127.0.0.1:61663_ c:collection1 s:shard3  x:collection1_shard3_replica_n63] o.a.s.u.UpdateLog Initializing UpdateLog: dataDir= defaultSyncLevel=FLUSH numRecordsToKeep=100 maxNumLogsToKeep=10 numVersionBuckets=65536
   [junit4]   2> 1468858 INFO  (qtp323765625-18343) [n:127.0.0.1:61663_ c:collection1 s:shard3  x:collection1_shard3_replica_n63] o.a.s.u.CommitTracker Hard AutoCommit: disabled
   [junit4]   2> 1468858 INFO  (qtp323765625-18343) [n:127.0.0.1:61663_ c:collection1 s:shard3  x:collection1_shard3_replica_n63] o.a.s.u.CommitTracker Soft AutoCommit: disabled
   [junit4]   2> 1468859 INFO  (qtp323765625-18343) [n:127.0.0.1:61663_ c:collection1 s:shard3  x:collection1_shard3_replica_n63] o.a.s.u.RandomMergePolicy RandomMergePolicy wrapping class org.apache.lucene.index.LogDocMergePolicy: [LogDocMergePolicy: minMergeSize=1000, mergeFactor=41, maxMergeSize=9223372036854775807, maxMergeSizeForForcedMerge=9223372036854775807, calibrateSizeByDeletes=true, maxMergeDocs=2147483647, maxCFSSegmentSizeMB=8.796093022207999E12, noCFSRatio=0.0]
   [junit4]   2> 1468859 INFO  (qtp323765625-18343) [n:127.0.0.1:61663_ c:collection1 s:shard3  x:collection1_shard3_replica_n63] o.a.s.s.SolrIndexSearcher Opening [Searcher@5e625237[collection1_shard3_replica_n63] main]
   [junit4]   2> 1468860 INFO  (qtp323765625-18343) [n:127.0.0.1:61663_ c:collection1 s:shard3  x:collection1_shard3_replica_n63] o.a.s.r.ManagedResourceStorage Configured ZooKeeperStorageIO with znodeBase: /configs/conf1
   [junit4]   2> 1468861 INFO  (qtp323765625-18343) [n:127.0.0.1:61663_ c:collection1 s:shard3  x:collection1_shard3_replica_n63] o.a.s.r.ManagedResourceStorage Loaded null at path _rest_managed.json using ZooKeeperStorageIO:path=/configs/conf1
   [junit4]   2> 1468861 INFO  (qtp323765625-18343) [n:127.0.0.1:61663_ c:collection1 s:shard3  x:collection1_shard3_replica_n63] o.a.s.h.ReplicationHandler Commits will be reserved for 10000ms.
   [junit4]   2> 1468861 INFO  (qtp323765625-18343) [n:127.0.0.1:61663_ c:collection1 s:shard3  x:collection1_shard3_replica_n63] o.a.s.u.UpdateLog Could not find max version in index or recent updates, using new clock 1587822834075303936
   [junit4]   2> 1468862 INFO  (searcherExecutor-7179-thread-1-processing-n:127.0.0.1:61663_ x:collection1_shard3_replica_n63 s:shard3 c:collection1) [n:127.0.0.1:61663_ c:collection1 s:shard3  x:collection1_shard3_replica_n63] o.a.s.c.SolrCore [collection1_shard3_replica_n63] Registered new searcher Searcher@5e625237[collection1_shard3_replica_n63] main{ExitableDirectoryReader(UninvertingDirectoryReader())}
   [junit4]   2> 1468867 INFO  (qtp323765625-18343) [n:127.0.0.1:61663_ c:collection1 s:shard3  x:collection1_shard3_replica_n63] o.a.s.c.ShardLeaderElectionContext Enough replicas found to continue.
   [junit4]   2> 1468867 INFO  (qtp323765625-18343) [n:127.0.0.1:61663_ c:collection1 s:shard3  x:collection1_shard3_replica_n63] o.a.s.c.ShardLeaderElectionContext I may be the new leader - try and sync
   [junit4]   2> 1468867 INFO  (qtp323765625-18343) [n:127.0.0.1:61663_ c:collection1 s:shard3  x:collection1_shard3_replica_n63] o.a.s.c.SyncStrategy Sync replicas to http://127.0.0.1:61663/collection1_shard3_replica_n63/
   [junit4]   2> 1468867 INFO  (qtp323765625-18343) [n:127.0.0.1:61663_ c:collection1 s:shard3  x:collection1_shard3_replica_n63] o.a.s.c.SyncStrategy Sync Success - now sync replicas to me
   [junit4]   2> 1468867 INFO  (qtp323765625-18343) [n:127.0.0.1:61663_ c:collection1 s:shard3  x:collection1_shard3_replica_n63] o.a.s.c.SyncStrategy http://127.0.0.1:61663/collection1_shard3_replica_n63/ has no replicas
   [junit4]   2> 1468867 INFO  (qtp323765625-18343) [n:127.0.0.1:61663_ c:collection1 s:shard3  x:collection1_shard3_replica_n63] o.a.s.c.ShardLeaderElectionContext Found all replicas participating in election, clear LIR
   [junit4]   2> 1468871 INFO  (qtp323765625-18343) [n:127.0.0.1:61663_ c:collection1 s:shard3  x:collection1_shard3_replica_n63] o.a.s.c.ShardLeaderElectionContext I am the new leader: http://127.0.0.1:61663/collection1_shard3_replica_n63/ shard3
   [junit4]   2> 1469038 INFO  (qtp323765625-18343) [n:127.0.0.1:61663_ c:collection1 s:shard3  x:collection1_shard3_replica_n63] o.a.s.c.ZkController I am the leader, no recovery necessary
   [junit4]   2> 1469042 INFO  (qtp323765625-18343) [n:127.0.0.1:61663_ c:collection1 s:shard3  x:collection1_shard3_replica_n63] o.a.s.s.HttpSolrCall [admin] webapp=null path=/admin/cores params={qt=/admin/cores&collection.configName=conf1&name=collection1_shard3_replica_n63&action=CREATE&collection=collection1&shard=shard3&wt=javabin&version=2&replicaType=NRT} status=0 QTime=1367
   [junit4]   2> 1469046 INFO  (qtp834587517-18264) [n:127.0.0.1:61649_    ] o.a.s.s.HttpSolrCall [admin] webapp=null path=/admin/collections params={node=127.0.0.1:61663_&action=ADDREPLICA&collection=collection1&shard=shard3&type=NRT&wt=javabin&version=2} status=0 QTime=1379
   [junit4]   2> 1469327 INFO  (TEST-FullSolrCloudDistribCmdsTest.test-seed#[360B0EFFF82D08C5]) [    ] o.a.s.c.AbstractFullDistribZkTestBase create jetty 3 in directory /Users/jenkins/workspace/Lucene-Solr-master-MacOSX/solr/build/solr-core/test/J0/temp/solr.cloud.FullSolrCloudDistribCmdsTest_360B0EFFF82D08C5-001/shard-3-001 of type NRT
   [junit4]   2> 1469327 INFO  (TEST-FullSolrCloudDistribCmdsTest.test-seed#[360B0EFFF82D08C5]) [    ] o.e.j.s.Server jetty-9.3.20.v20170531
   [junit4]   2> 1469329 INFO  (TEST-FullSolrCloudDistribCmdsTest.test-seed#[360B0EFFF82D08C5]) [    ] o.e.j.s.h.ContextHandler Started o.e.j.s.ServletContextHandler@783417d1{/,null,AVAILABLE}
   [junit4]   2> 1469330 INFO  (TEST-FullSolrCloudDistribCmdsTest.test-seed#[360B0EFFF82D08C5]) [    ] o.e.j.s.AbstractConnector Started ServerConnector@5d97e1e3{HTTP/1.1,[http/1.1]}{127.0.0.1:61687}
   [junit4]   2> 1469330 INFO  (TEST-FullSolrCloudDistribCmdsTest.test-seed#[360B0EFFF82D08C5]) [    ] o.e.j.s.Server Started @1472763ms
   [junit4]   2> 1469330 INFO  (TEST-FullSolrCloudDistribCmdsTest.test-seed#[360B0EFFF82D08C5]) [    ] o.a.s.c.s.e.JettySolrRunner Jetty properties: {solr.data.dir=/Users/jenkins/workspace/Lucene-Solr-master-MacOSX/solr/build/solr-core/test/J0/temp/solr.cloud.FullSolrCloudDistribCmdsTest_360B0EFFF82D08C5-001/tempDir-001/jetty3, replicaType=NRT, solrconfig=solrconfig.xml, hostContext=/, hostPort=61687, coreRootDirectory=/Users/jenkins/workspace/Lucene-Solr-master-MacOSX/solr/build/solr-core/test/J0/temp/solr.cloud.FullSolrCloudDistribCmdsTest_360B0EFFF82D08C5-001/shard-3-001/cores}
   [junit4]   2> 1469330 ERROR (TEST-FullSolrCloudDistribCmdsTest.test-seed#[360B0EFFF82D08C5]) [    ] o.a.s.u.StartupLoggingUtils Missing Java Option solr.log.dir. Logging may be missing or incomplete.
   [junit4]   2> 1469330 INFO  (TEST-FullSolrCloudDistribCmdsTest.test-seed#[360B0EFFF82D08C5]) [    ] o.a.s.s.SolrDispatchFilter  ___      _       Welcome to Apache Solr™ version 8.0.0
   [junit4]   2> 1469330 INFO  (TEST-FullSolrCloudDistribCmdsTest.test-seed#[360B0EFFF82D08C5]) [    ] o.a.s.s.SolrDispatchFilter / __| ___| |_ _   Starting in cloud mode on port null
   [junit4]   2> 1469330 INFO  (TEST-FullSolrCloudDistribCmdsTest.test-seed#[360B0EFFF82D08C5]) [    ] o.a.s.s.SolrDispatchFilter \__ \/ _ \ | '_|  Install dir: null
   [junit4]   2> 1469330 INFO  (TEST-FullSolrCloudDistribCmdsTest.test-seed#[360B0EFFF82D08C5]) [    ] o.a.s.s.SolrDispatchFilter |___/\___/_|_|    Start time: 2017-12-26T05:24:16.330Z
   [junit4]   2> 1469332 INFO  (zkConnectionManagerCallback-5002-thread-1) [    ] o.a.s.c.c.ConnectionManager zkClient has connected
   [junit4]   2> 1469333 INFO  (TEST-FullSolrCloudDistribCmdsTest.test-seed#[360B0EFFF82D08C5]) [    ] o.a.s.s.SolrDispatchFilter Loading solr.xml from SolrHome (not found in ZooKeeper)
   [junit4]   2> 1469333 INFO  (TEST-FullSolrCloudDistribCmdsTest.test-seed#[360B0EFFF82D08C5]) [    ] o.a.s.c.SolrXmlConfig Loading container configuration from /Users/jenkins/workspace/Lucene-Solr-master-MacOSX/solr/build/solr-core/test/J0/temp/solr.cloud.FullSolrCloudDistribCmdsTest_360B0EFFF82D08C5-001/shard-3-001/solr.xml
   [junit4]   2> 1469338 INFO  (TEST-FullSolrCloudDistribCmdsTest.test-seed#[360B0EFFF82D08C5]) [    ] o.a.s.c.SolrXmlConfig Configuration parameter autoReplicaFailoverWorkLoopDelay is ignored
   [junit4]   2> 1469338 INFO  (TEST-FullSolrCloudDistribCmdsTest.test-seed#[360B0EFFF82D08C5]) [    ] o.a.s.c.SolrXmlConfig Configuration parameter autoReplicaFailoverBadNodeExpiration is ignored
   [junit4]   2> 1469338 INFO  (TEST-FullSolrCloudDistribCmdsTest.test-seed#[360B0EFFF82D08C5]) [    ] o.a.s.c.SolrXmlConfig MBean server found: com.sun.jmx.mbeanserver.JmxMBeanServer@475c2d0c, but no JMX reporters were configured - adding default JMX reporter.
   [junit4]   2> 1469342 INFO  (TEST-FullSolrCloudDistribCmdsTest.test-seed#[360B0EFFF82D08C5]) [    ] o.a.s.c.ZkContainer Zookeeper client=127.0.0.1:61637/solr
   [junit4]   2> 1469343 INFO  (zkConnectionManagerCallback-5006-thread-1) [    ] o.a.s.c.c.ConnectionManager zkClient has connected
   [junit4]   2> 1469346 INFO  (zkConnectionManagerCallback-5008-thread-1-processing-n:127.0.0.1:61687_) [n:127.0.0.1:61687_    ] o.a.s.c.c.ConnectionManager zkClient has connected
   [junit4]   2> 1469356 INFO  (TEST-FullSolrCloudDistribCmdsTest.test-seed#[360B0EFFF82D08C5]) [n:127.0.0.1:61687_    ] o.a.s.c.c.ZkStateReader Updated live nodes from ZooKeeper... (0) -> (3)
   [junit4]   2> 1469360 INFO  (TEST-FullSolrCloudDistribCmdsTest.test-seed#[360B0EFFF82D08C5]) [n:127.0.0.1:61687_    ] o.a.s.c.Overseer Overseer (id=null) closing
   [junit4]   2> 1469363 INFO  (TEST-FullSolrCloudDistribCmdsTest.test-seed#[360B0EFFF82D08C5]) [n:127.0.0.1:61687_    ] o.a.s.c.ZkController Register node as live in ZooKeeper:/live_nodes/127.0.0.1:61687_
   [junit4]   2> 1469363 INFO  (zkCallback-4969-thread-2-processing-n:127.0.0.1:61649_) [n:127.0.0.1:61649_    ] o.a.s.c.c.ZkStateReader Updated live nodes from ZooKeeper... (3) -> (4)
   [junit4]   2> 1469363 INFO  (zkCallback-4987-thread-1-processing-n:127.0.0.1:61658_) [n:127.0.0.1:61658_    ] o.a.s.c.c.ZkStateReader Updated live nodes from ZooKeeper... (3) -> (4)
   [junit4]   2> 1469363 INFO  (zkCallback-4979-thread-1) [    ] o.a.s.c.c.ZkStateReader Updated live nodes from ZooKeeper... (3) -> (4)
   [junit4]   2> 1469363 INFO  (zkCallback-4997-thread-1-processing-n:127.0.0.1:61663_) [n:127.0.0.1:61663_    ] o.a.s.c.c.ZkStateReader Updated live nodes from ZooKeeper... (3) -> (4)
   [junit4]   2> 1469363 INFO  (zkCallback-5007-thread-1-processing-n:127.0.0.1:61687_) [n:127.0.0.1:61687_    ] o.a.s.c.c.ZkStateReader Updated live nodes from ZooKeeper... (3) -> (4)
   [junit4]   2> 1469431 INFO  (TEST-FullSolrCloudDistribCmdsTest.test-seed#[360B0EFFF82D08C5]) [n:127.0.0.1:61687_    ] o.a.s.m.r.SolrJmxReporter JMX monitoring for 'solr.node' (registry 'solr.node') enabled at server: com.sun.jmx.mbeanserver.JmxMBeanServer@475c2d0c
   [junit4]   2> 1469438 INFO  (TEST-FullSolrCloudDistribCmdsTest.test-seed#[360B0EFFF82D08C5]) [n:127.0.0.1:61687_    ] o.a.s.m.r.SolrJmxReporter JMX monitoring for 'solr.jvm' (registry 'solr.jvm') enabled at server: com.sun.jmx.mbeanserver.JmxMBeanServer@475c2d0c
   [junit4]   2> 1469438 INFO  (TEST-FullSolrCloudDistribCmdsTest.test-seed#[360B0EFFF82D08C5]) [n:127.0.0.1:61687_    ] o.a.s.m.r.SolrJmxReporter JMX monitoring for 'solr.jetty' (registry 'solr.jetty') enabled at server: com.sun.jmx.mbeanserver.JmxMBeanServer@475c2d0c
   [junit4]   2> 1469439 INFO  (TEST-FullSolrCloudDistribCmdsTest.test-seed#[360B0EFFF82D08C5]) [n:127.0.0.1:61687_    ] o.a.s.c.CorePropertiesLocator Found 0 core definitions underneath /Users/jenkins/workspace/Lucene-Solr-master-MacOSX/solr/build/solr-core/test/J0/temp/solr.cloud.FullSolrCloudDistribCmdsTest_360B0EFFF82D08C5-001/shard-3-001/cores
   [junit4]   2> 1469502 INFO  (qtp834587517-18263) [n:127.0.0.1:61649_    ] o.a.s.h.a.CollectionsHandler Invoked Collection Action :addreplica with params node=127.0.0.1:61687_&action=ADDREPLICA&collection=collection1&shard=shard1&type=NRT&wt=javabin&version=2 and sendToOCPQueue=true
   [junit4]   2> 1469505 INFO  (OverseerCollectionConfigSetProcessor-99238926675214340-127.0.0.1:61649_-n_0000000000) [n:127.0.0.1:61649_    ] o.a.s.c.OverseerTaskQueue Response ZK path: /overseer/collection-queue-work/qnr-0000000006 doesn't exist.  Requestor may have disconnected from ZooKeeper
   [junit4]   2> 1469505 INFO  (OverseerThreadFactory-7154-thread-5-processing-n:127.0.0.1:61649_) [n:127.0.0.1:61649_    ] o.a.s.c.AddReplicaCmd Node Identified 127.0.0.1:61687_ for creating new replica
   [junit4]   2> 1469509 INFO  (qtp336743098-18374) [n:127.0.0.1:61687_    ] o.a.s.h.a.CoreAdminOperation core create command qt=/admin/cores&collection.configName=conf1&name=collection1_shard1_replica_n65&action=CREATE&collection=collection1&shard=shard1&wt=javabin&version=2&replicaType=NRT
   [junit4]   2> 1469510 INFO  (qtp336743098-18374) [n:127.0.0.1:61687_    ] o.a.s.c.TransientSolrCoreCacheDefault Allocating transient cache for 4 transient cores
   [junit4]   2> 1470551 INFO  (qtp336743098-18374) [n:127.0.0.1:61687_ c:collection1 s:shard1  x:collection1_shard1_replica_n65] o.a.s.c.SolrConfig Using Lucene MatchVersion: 8.0.0
   [junit4]   2> 1470567 INFO  (qtp336743098-18374) [n:127.0.0.1:61687_ c:collection1 s:shard1  x:collection1_shard1_replica_n65] o.a.s.s.IndexSchema [collection1_shard1_replica_n65] Schema name=test
   [junit4]   2> 1471214 INFO  (qtp336743098-18374) [n:127.0.0.1:61687_ c:collection1 s:shard1  x:collection1_shard1_replica_n65] o.a.s.s.IndexSchema Loaded schema test/1.6 with uniqueid field id
   [junit4]   2> 1471235 INFO  (qtp336743098-18374) [n:127.0.0.1:61687_ c:collection1 s:shard1  x:collection1_shard1_replica_n65] o.a.s.c.CoreContainer Creating SolrCore 'collection1_shard1_replica_n65' using configuration from collection collection1, trusted=true
   [junit4]   2> 1471235 INFO  (qtp336743098-18374) [n:127.0.0.1:61687_ c:collection1 s:shard1  x:collection1_shard1_replica_n65] o.a.s.m.r.SolrJmxReporter JMX monitoring for 'solr.core.collection1.shard1.replica_n65' (registry 'solr.core.collection1.shard1.replica_n65') enabled at server: com.sun.jmx.mbeanserver.JmxMBeanServer@475c2d0c
   [junit4]   2> 1471236 INFO  (qtp336743098-18374) [n:127.0.0.1:61687_ c:collection1 s:shard1  x:collection1_shard1_replica_n65] o.a.s.c.SolrCore solr.RecoveryStrategy.Builder
   [junit4]   2> 1471236 INFO  (qtp336743098-18374) [n:127.0.0.1:61687_ c:collection1 s:shard1  x:collection1_shard1_replica_n65] o.a.s.c.SolrCore [[collection1_shard1_replica_n65] ] Opening new SolrCore at [/Users/jenkins/workspace/Lucene-Solr-master-MacOSX/solr/build/solr-core/test/J0/temp/solr.cloud.FullSolrCloudDistribCmdsTest_360B0EFFF82D08C5-001/shard-3-001/cores/collection1_shard1_replica_n65], dataDir=[/Users/jenkins/workspace/Lucene-Solr-master-MacOSX/solr/build/solr-core/test/J0/temp/solr.cloud.FullSolrCloudDistribCmdsTest_360B0EFFF82D08C5-001/shard-3-001/cores/collection1_shard1_replica_n65/data/]
   [junit4]   2> 1471237 INFO  (qtp336743098-18374) [n:127.0.0.1:61687_ c:collection1 s:shard1  x:collection1_shard1_replica_n65] o.a.s.u.RandomMergePolicy RandomMergePolicy wrapping class org.apache.lucene.index.LogByteSizeMergePolicy: [LogByteSizeMergePolicy: minMergeSize=1677721, mergeFactor=12, maxMergeSize=2147483648, maxMergeSizeForForcedMerge=9223372036854775807, calibrateSizeByDeletes=false, maxMergeDocs=2147483647, maxCFSSegmentSizeMB=8.796093022207999E12, noCFSRatio=0.0]
   [junit4]   2> 1471240 WARN  (qtp336743098-18374) [n:127.0.0.1:61687_ c:collection1 s:shard1  x:collection1_shard1_replica_n65] o.a.s.c.RequestHandlers INVALID paramSet a in requestHandler {type = requestHandler,name = /dump,class = DumpRequestHandler,attributes = {initParams=a, name=/dump, class=DumpRequestHandler},args = {defaults={a=A,b=B}}}
   [junit4]   2> 1471289 INFO  (qtp336743098-18374) [n:127.0.0.1:61687_ c:collection1 s:shard1  x:collection1_shard1_replica_n65] o.a.s.u.UpdateHandler Using UpdateLog implementation: org.apache.solr.update.UpdateLog
   [junit4]   2> 1471289 INFO  (qtp336743098-18374) [n:127.0.0.1:61687_ c:collection1 s:shard1  x:collection1_shard1_replica_n65] o.a.s.u.UpdateLog Initializing UpdateLog: dataDir= defaultSyncLevel=FLUSH numRecordsToKeep=100 maxNumLogsToKeep=10 numVersionBuckets=65536
   [junit4]   2> 1471290 INFO  (qtp336743098-18374) [n:127.0.0.1:61687_ c:collection1 s:shard1  x:collection1_shard1_replica_n65] o.a.s.u.CommitTracker Hard AutoCommit: disabled
   [junit4]   2> 1471290 INFO  (qtp336743098-18374) [n:127.0.0.1:61687_ c:collection1 s:shard1  x:collection1_shard1_replica_n65] o.a.s.u.CommitTracker Soft AutoCommit: disabled
   [junit4]   2> 1471291 INFO  (qtp336743098-18374) [n:127.0.0.1:61687_ c:collection1 s:shard1  x:collection1_shard1_replica_n65] o.a.s.u.RandomMergePolicy RandomMergePolicy wrapping class org.apache.lucene.index.LogDocMergePolicy: [LogDocMergePolicy: minMergeSize=1000, mergeFactor=41, maxMergeSize=9223372036854775807, maxMergeSizeForForcedMerge=9223372036854775807, calibrateSizeByDeletes=true, maxMergeDocs=2147483647, maxCFSSegmentSizeMB=8.796093022207999E12, noCFSRatio=0.0]
   [junit4]   2> 1471291 INFO  (qtp336743098-18374) [n:127.0.0.1:61687_ c:collection1 s:shard1  x:collection1_shard1_replica_n65] o.a.s.s.SolrIndexSearcher Opening [Searcher@712d1223[collection1_shard1_replica_n65] main]
   [junit4]   2> 1471292 INFO  (qtp336743098-18374) [n:127.0.0.1:61687_ c:collection1 s:shard1  x:collection1_shard1_replica_n65] o.a.s.r.ManagedResourceStorage Configured ZooKeeperStorageIO with znodeBase: /configs/conf1
   [junit4]   2> 1471293 INFO  (qtp336743098-18374) [n:127.0.0.1:61687_ c:collection1 s:shard1  x:collection1_shard1_replica_n65] o.a.s.r.ManagedResourceStorage Loaded null at path _rest_managed.json using ZooKeeperStorageIO:path=/configs/conf1
   [junit4]   2> 1471293 INFO  (qtp336743098-18374) [n:127.0.0.1:61687_ c:collection1 s:shard1  x:collection1_shard1_replica_n65] o.a.s.h.ReplicationHandler Commits will be reserved for 10000ms.
   [junit4]   2> 1471293 INFO  (qtp336743098-18374) [n:127.0.0.1:61687_ c:collection1 s:shard1  x:collection1_shard1_replica_n65] o.a.s.u.UpdateLog Could not find max version in index or recent updates, using new clock 1587822836625440768
   [junit4]   2> 1471294 INFO  (searcherExecutor-7190-thread-1-processing-n:127.0.0.1:61687_ x:collection1_shard1_replica_n65 s:shard1 c:collection1) [n:127.0.0.1:61687_ c:collection1 s:shard1  x:collection1_shard1_replica_n65] o.a.s.c.SolrCore [collection1_shard1_replica_n65] Registered new searcher Searcher@712d1223[collection1_shard1_replica_n65] main{ExitableDirectoryReader(UninvertingDirectoryReader())}
   [junit4]   2> 1471298 INFO  (qtp336743098-18374) [n:127.0.0.1:61687_ c:collection1 s:shard1  x:collection1_shard1_replica_n65] o.a.s.c.ShardLeaderElectionContext Enough replicas found to continue.
   [junit4]   2> 1471298 INFO  (qtp336743098-18374) [n:127.0.0.1:61687_ c:collection1 s:shard1  x:collection1_shard1_replica_n65] o.a.s.c.ShardLeaderElectionContext I may be the new leader - try and sync
   [junit4]   2> 1471298 INFO  (qtp336743098-18374) [n:127.0.0.1:61687_ c:collection1 s:shard1  x:collection1_shard1_replica_n65] o.a.s.c.SyncStrategy Sync replicas to http://127.0.0.1:61687/collection1_shard1_replica_n65/
   [junit4]   2> 1471298 INFO  (qtp336743098-18374) [n:127.0.0.1:61687_ c:collection1 s:shard1  x:collection1_shard1_replica_n65] o.a.s.c.SyncStrategy Sync Success - now sync replicas to me
   [junit4]   2> 1471298 INFO  (qtp336743098-18374) [n:127.0.0.1:61687_ c:collection1 s:shard1  x:collection1_shard1_replica_n65] o.a.s.c.SyncStrategy http://127.0.0.1:61687/collection1_shard1_replica_n65/ has no replicas
   [junit4]   2> 1471298 INFO  (qtp336743098-18374) [n:127.0.0.1:61687_ c:collection1 s:shard1  x:collection1_shard1_replica_n65] o.a.s.c.ShardLeaderElectionContext Found all replicas participating in election, clear LIR
   [junit4]   2> 1471303 INFO  (qtp336743098-18374) [n:127.0.0.1:61687_ c:collection1 s:shard1  x:collection1_shard1_replica_n65] o.a.s.c.ShardLeaderElectionContext I am the new leader: http://127.0.0.1:61687/collection1_shard1_replica_n65/ shard1
   [junit4]   2> 1471412 INFO  (qtp336743098-18374) [n:127.0.0.1:61687_ c:collection1 s:shard1  x:collection1_shard1_replica_n65] o.a.s.c.ZkController I am the leader, no recovery necessary
   [junit4]   2> 1471415 INFO  (qtp336743098-18374) [n:127.0.0.1:61687_ c:collection1 s:shard1  x:collection1_shard1_replica_n65] o.a.s.s.HttpSolrCall [admin] webapp=null path=/admin/cores params={qt=/admin/cores&collection.configName=conf1&name=collection1_shard1_replica_n65&action=CREATE&collection=collection1&shard=shard1&wt=javabin&version=2&replicaType=NRT} status=0 QTime=1905
   [junit4]   2> 1471417 INFO  (qtp834587517-18263) [n:127.0.0.1:61649_    ] o.a.s.s.HttpSolrCall [admin] webapp=null path=/admin/collections params={node=127.0.0.1:61687_&action=ADDREPLICA&collection=collection1&shard=shard1&type=NRT&wt=javabin&version=2} status=0 QTime=1915
   [junit4]   2> 1471507 INFO  (OverseerCollectionConfigSetProcessor-99238926675214340-127.0.0.1:61649_-n_0000000000) [n:127.0.0.1:61649_    ] o.a.s.c.OverseerTaskQueue Response ZK path: /overseer/collection-queue-work/qnr-0000000008 doesn't exist.  Requestor may have disconnected from ZooKeeper
   [junit4]   2> 1471680 INFO  (TEST-FullSolrCloudDistribCmdsTest.test-seed#[360B0EFFF82D08C5]) [    ] o.a.s.c.AbstractFullDistribZkTestBase create jetty 4 in directory /Users/jenkins/workspace/Lucene-Solr-master-MacOSX/solr/build/solr-core/test/J0/temp/solr.cloud.FullSolrCloudDistribCmdsTest_360B0EFFF82D08C5-001/shard-4-001 of type NRT
   [junit4]   2> 1471681 INFO  (TEST-FullSolrCloudDistribCmdsTest.test-seed#[360B0EFFF82D08C5]) [    ] o.e.j.s.Server jetty-9.3.20.v20170531
   [junit4]   2> 1471682 INFO  (TEST-FullSolrCloudDistribCmdsTest.test-seed#[360B0EFFF82D08C5]) [    ] o.e.j.s.h.ContextHandler Started o.e.j.s.ServletContextHandler@2676501c{/,null,AVAILABLE}
   [junit4]   2> 1471683 INFO  (TEST-FullSolrCloudDistribCmdsTest.test-seed#[360B0EFFF82D08C5]) [    ] o.e.j.s.AbstractConnector Started ServerConnector@180e3486{HTTP/1.1,[http/1.1]}{127.0.0.1:61692}
   [junit4]   2> 1471683 INFO  (TEST-FullSolrCloudDistribCmdsTest.test-seed#[360B0EFFF82D08C5]) [    ] o.e.j.s.Server Started @1475116ms
   [junit4]   2> 1471683 INFO  (TEST-FullSolrCloudDistribCmdsTest.test-seed#[360B0EFFF82D08C5]) [    ] o.a.s.c.s.e.JettySolrRunner Jetty properties: {solr.data.dir=/Users/jenkins/workspace/Lucene-Solr-master-MacOSX/solr/build/solr-core/test/J0/temp/solr.cloud.FullSolrCloudDistribCmdsTest_360B0EFFF82D08C5-001/tempDir-001/jetty4, solrconfig=solrconfig.xml, hostContext=/, hostPort=61692, coreRootDirectory=/Users/jenkins/workspace/Lucene-Solr-master-MacOSX/solr/build/solr-core/test/J0/temp/solr.cloud.FullSolrCloudDistribCmdsTest_360B0EFFF82D08C5-001/shard-4-001/cores}
   [junit4]   2> 1471683 ERROR (TEST-FullSolrCloudDistribCmdsTest.test-seed#[360B0EFFF82D08C5]) [    ] o.a.s.u.StartupLoggingUtils Missing Java Option solr.log.dir. Logging may be missing or incomplete.
   [junit4]   2> 1471683 INFO  (TEST-FullSolrCloudDistribCmdsTest.test-seed#[360B0EFFF82D08C5]) [    ] o.a.s.s.SolrDispatchFilter  ___      _       Welcome to Apache Solr™ version 8.0.0
   [junit4]   2> 1471683 INFO  (TEST-FullSolrCloudDistribCmdsTest.test-seed#[360B0EFFF82D08C5]) [    ] o.a.s.s.SolrDispatchFilter / __| ___| |_ _   Starting in cloud mode on port null
   [junit4]   2> 1471684 INFO  (TEST-FullSolrCloudDistribCmdsTest.test-seed#[360B0EFFF82D08C5]) [    ] o.a.s.s.SolrDispatchFilter \__ \/ _ \ | '_|  Install dir: null
   [junit4]   2> 1471684 INFO  (TEST-FullSolrCloudDistribCmdsTest.test-seed#[360B0EFFF82D08C5]) [    ] o.a.s.s.SolrDispatchFilter |___/\___/_|_|    Start time: 2017-12-26T05:24:18.684Z
   [junit4]   2> 1471685 INFO  (zkConnectionManagerCallback-5012-thread-1) [    ] o.a.s.c.c.ConnectionManager zkClient has connected
   [junit4]   2> 1471686 INFO  (TEST-FullSolrCloudDistribCmdsTest.test-seed#[360B0EFFF82D08C5]) [    ] o.a.s.s.SolrDispatchFilter Loading solr.xml from SolrHome (not found in ZooKeeper)
   [junit4]   2> 1471686 INFO  (TEST-FullSolrCloudDistribCmdsTest.test-seed#[360B0EFFF82D08C5]) [    ] o.a.s.c.SolrXmlConfig Loading container configuration from /Users/jenkins/workspace/Lucene-Solr-master-MacOSX/solr/build/solr-core/test/J0/temp/solr.cloud.FullSolrCloudDistribCmdsTest_360B0EFFF82D08C5-001/shard-4-001/solr.xml
   [junit4]   2> 1471691 INFO  (TEST-FullSolrCloudDistribCmdsTest.test-seed#[360B0EFFF82D08C5]) [    ] o.a.s.c.SolrXmlConfig Configuration parameter autoReplicaFailoverWorkLoopDelay is ignored
   [junit4]   2> 1471691 INFO  (TEST-FullSolrCloudDistribCmdsTest.test-seed#[360B0EFFF82D08C5]) [    ] o.a.s.c.SolrXmlConfig Configuration parameter autoReplicaFailoverBadNodeExpiration is ignored
   [junit4]   2> 1471691 INFO  (TEST-FullSolrCloudDistribCmdsTest.test-seed#[360B0EFFF82D08C5]) [    ] o.a.s.c.SolrXmlConfig MBean server found: com.sun.jmx.mbeanserver.JmxMBeanServer@475c2d0c, but no JMX reporters were configured - adding default JMX reporter.
   [junit4]   2> 1471695 INFO  (TEST-FullSolrCloudDistribCmdsTest.test-seed#[360B0EFFF82D08C5]) [    ] o.a.s.c.ZkContainer Zookeeper client=127.0.0.1:61637/solr
   [junit4]   2> 1471696 INFO  (zkConnectionManagerCallback-5016-thread-1) [    ] o.a.s.c.c.ConnectionManager zkClient has connected
   [junit4]   2> 1471698 INFO  (zkConnectionManagerCallback-5018-thread-1-processing-n:127.0.0.1:61692_) [n:127.0.0.1:61692_    ] o.a.s.c.c.ConnectionManager zkClient has connected
   [junit4]   2> 1471706 INFO  (TEST-FullSolrCloudDistribCmdsTest.test-seed#[360B0EFFF82D08C5]) [n:127.0.0.1:61692_    ] o.a.s.c.c.ZkStateReader Updated live nodes from ZooKeeper... (0) -> (4)
   [junit4]   2> 1471710 INFO  (TEST-FullSolrCloudDistribCmdsTest.test-seed#[360B0EFFF82D08C5]) [n:127.0.0.1:61692_    ] o.a.s.c.Overseer Overseer (id=null) closing
   [junit4]   2> 1471713 INFO  (TEST-FullSolrCloudDistribCmdsTest.test-seed#[360B0EFFF82D08C5]) [n:127.0.0.1:61692_    ] o.a.s.c.ZkController Register node as live in ZooKeeper:/live_nodes/127.0.0.1:61692_
   [junit4]   2> 1471714 INFO  (zkCallback-4979-thread-1) [    ] o.a.s.c.c.ZkStateReader Updated live nodes from ZooKeeper... (4) -> (5)
   [junit4]   2> 1471715 INFO  (zkCallback-4997-thread-1-processing-n:127.0.0.1:61663_) [n:127.0.0.1:61663_    ] o.a.s.c.c.ZkStateReader Updated live nodes from ZooKeeper... (4) -> (5)
   [junit4]   2> 1471715 INFO  (zkCallback-5007-thread-1-processing-n:127.0.0.1:61687_) [n:127.0.0.1:61687_    ] o.a.s.c.c.ZkStateReader Updated live nodes from ZooKeeper... (4) -> (5)
   [junit4]   2> 1471715 INFO  (zkCallback-4969-thread-1-processing-n:127.0.0.1:61649_) [n:127.0.0.1:61649_    ] o.a.s.c.c.ZkStateReader Updated live nodes from ZooKeeper... (4) -> (5)
   [junit4]   2> 1471715 INFO  (zkCallback-4987-thread-1-processing-n:127.0.0.1:61658_) [n:127.0.0.1:61658_    ] o.a.s.c.c.ZkStateReader Updated live nodes from ZooKeeper... (4) -> (5)
   [junit4]   2> 1471715 INFO  (zkCallback-5017-thread-1-processing-n:127.0.0.1:61692_) [n:127.0.0.1:61692_    ] o.a.s.c.c.ZkStateReader Updated live nodes from ZooKeeper... (4) -> (5)
   [junit4]   2> 1471763 INFO  (TEST-FullSolrCloudDistribCmdsTest.test-seed#[360B0EFFF82D08C5]) [n:127.0.0.1:61692_    ] o.a.s.m.r.SolrJmxReporter JMX monitoring for 'solr.node' (registry 'solr.node') enabled at server: com.sun.jmx.mbeanserver.JmxMBeanServer@475c2d0c
   [junit4]   2> 1471771 INFO  (TEST-FullSolrCloudDistribCmdsTest.test-seed#[360B0EFFF82D08C5]) [n:127.0.0.1:61692_    ] o.a.s.m.r.SolrJmxReporter JMX monitoring for 'solr.jvm' (registry 'solr.jvm') enabled at server: com.sun.jmx.mbeanserver.JmxMBeanServer@475c2d0c
   [junit4]   2> 1471771 INFO  (TEST-FullSolrCloudDistribCmdsTest.test-seed#[360B0EFFF82D08C5]) [n:127.0.0.1:61692_    ] o.a.s.m.r.SolrJmxReporter JMX monitoring for 'solr.jetty' (registry 'solr.jetty') enabled at server: com.sun.jmx.mbeanserver.JmxMBeanServer@475c2d0c
   [junit4]   2> 1471772 INFO  (TEST-FullSolrCloudDistribCmdsTest.test-seed#[360B0EFFF82D08C5]) [n:127.0.0.1:61692_    ] o.a.s.c.CorePropertiesLocator Found 0 core definitions underneath /Users/jenkins/workspace/Lucene-Solr-master-MacOSX/solr/build/solr-core/test/J0/temp/solr.cloud.FullSolrCloudDistribCmdsTest_360B0EFFF82D08C5-001/shard-4-001/cores
   [junit4]   2> 1471816 INFO  (qtp834587517-18265) [n:127.0.0.1:61649_    ] o.a.s.h.a.CollectionsHandler Invoked Collection Action :addreplica with params node=127.0.0.1:61692_&action=ADDREPLICA&collection=collection1&shard=shard2&type=NRT&wt=javabin&version=2 and sendToOCPQueue=true
   [junit4]   2> 1471819 INFO  (OverseerThreadFactory-7154-thread-5-processing-n:127.0.0.1:61649_) [n:127.0.0.1:61649_    ] o.a.s.c.AddReplicaCmd Node Identified 127.0.0.1:61692_ for creating new replica
   [junit4]   2> 1471824 INFO  (qtp1414846111-18405) [n:127.0.0.1:61692_    ] o.a.s.h.a.CoreAdminOperation core create command qt=/admin/cores&collection.configName=conf1&name=collection1_shard2_replica_n67&action=CREATE&collection=collection1&shard=shard2&wt=javabin&version=2&replicaType=NRT
   [junit4]   2> 1471824 INFO  (qtp1414846111-18405) [n:127.0.0.1:61692_    ] o.a.s.c.TransientSolrCoreCacheDefault Allocating transient cache for 4 transient cores
   [junit4]   2> 1472840 INFO  (qtp1414846111-18405) [n:127.0.0.1:61692_ c:collection1 s:shard2  x:collection1_shard2_replica_n67] o.a.s.c.SolrConfig Using Lucene MatchVersion: 8.0.0
   [junit4]   2> 1472864 INFO  (qtp1414846111-18405) [n:127.0.0.1:61692_ c:collection1 s:shard2  x:collection1_shard2_replica_n67] o.a.s.s.IndexSchema [collection1_shard2_replica_n67] Schema name=test
   [junit4]   2> 1472906 INFO  (qtp1414846111-18405) [n:127.0.0.1:61692_ c:collection1 s:shard2  x:collection1_shard2_replica_n67] o.a.s.s.IndexSchema Loaded schema test/1.6 with uniqueid field id
   [junit4]   2> 1472925 INFO  (qtp1414846111-18405) [n:127.0.0.1:61692_ c:collection1 s:shard2  x:collection1_shard2_replica_n67] o.a.s.c.CoreContainer Creating SolrCore 'collection1_shard2_replica_n67' using configuration from collection collection1, trusted=true
   [junit4]   2> 1472925 INFO  (qtp1414846111-18405) [n:127.0.0.1:61692_ c:collection1 s:shard2  x:collection1_shard2_replica_n67] o.a.s.m.r.SolrJmxReporter JMX monitoring for 'solr.core.collection1.shard2.replica_n67' (registry 'solr.core.collection1.shard2.replica_n67') enabled at server: com.sun.jmx.mbeanserver.JmxMBeanServer@475c2d0c
   [junit4]  

[...truncated too long message...]

.a.s.c.a.OverseerTriggerThread OverseerTriggerThread woken up but we are closed, exiting.
   [junit4]   2> 1527159 INFO  (TEST-FullSolrCloudDistribCmdsTest.test-seed#[360B0EFFF82D08C5]) [    ] o.e.j.s.AbstractConnector Stopped ServerConnector@14e4a39{HTTP/1.1,[http/1.1]}{127.0.0.1:0}
   [junit4]   2> 1527159 INFO  (TEST-FullSolrCloudDistribCmdsTest.test-seed#[360B0EFFF82D08C5]) [    ] o.e.j.s.h.ContextHandler Stopped o.e.j.s.ServletContextHandler@604b81de{/,null,UNAVAILABLE}
   [junit4]   2> 1527160 INFO  (TEST-FullSolrCloudDistribCmdsTest.test-seed#[360B0EFFF82D08C5]) [    ] o.a.s.c.ChaosMonkey monkey: stop jetty! 61705
   [junit4]   2> 1527161 ERROR (TEST-FullSolrCloudDistribCmdsTest.test-seed#[360B0EFFF82D08C5]) [    ] o.a.z.s.ZooKeeperServer ZKShutdownHandler is not registered, so ZooKeeper server won't take any action on ERROR or SHUTDOWN server state changes
   [junit4]   2> 1527162 INFO  (TEST-FullSolrCloudDistribCmdsTest.test-seed#[360B0EFFF82D08C5]) [    ] o.a.s.c.ZkTestServer connecting to 127.0.0.1:61637 61637
   [junit4]   2> 1527194 INFO  (Thread-3397) [    ] o.a.s.c.ZkTestServer connecting to 127.0.0.1:61637 61637
   [junit4]   2> 1527563 WARN  (Thread-3397) [    ] o.a.s.c.ZkTestServer Watch limit violations: 
   [junit4]   2> Maximum concurrent create/delete watches above limit:
   [junit4]   2> 
   [junit4]   2> 	15	/solr/aliases.json
   [junit4]   2> 	11	/solr/configs/conf1
   [junit4]   2> 	7	/solr/security.json
   [junit4]   2> 	6	/solr/collections/collection1/state.json
   [junit4]   2> 	5	/solr/collections/collection2/state.json
   [junit4]   2> 
   [junit4]   2> Maximum concurrent data watches above limit:
   [junit4]   2> 
   [junit4]   2> 	15	/solr/clusterprops.json
   [junit4]   2> 	15	/solr/clusterstate.json
   [junit4]   2> 	3	/solr/autoscaling.json
   [junit4]   2> 	2	/solr/collections/collection2/leader_elect/shard5/election/99238926675214348-core_node36-n_0000000000
   [junit4]   2> 	2	/solr/overseer_elect/election/99238926675214348-127.0.0.1:61663_-n_0000000002
   [junit4]   2> 
   [junit4]   2> Maximum concurrent children watches above limit:
   [junit4]   2> 
   [junit4]   2> 	15	/solr/live_nodes
   [junit4]   2> 	15	/solr/collections
   [junit4]   2> 	3	/solr/overseer/queue
   [junit4]   2> 	3	/solr/overseer/collection-queue-work
   [junit4]   2> 	3	/solr/overseer/queue-work
   [junit4]   2> 	2	/solr/autoscaling/events/.auto_add_replicas
   [junit4]   2> 
   [junit4]   2> NOTE: reproduce with: ant test  -Dtestcase=FullSolrCloudDistribCmdsTest -Dtests.method=test -Dtests.seed=360B0EFFF82D08C5 -Dtests.slow=true -Dtests.locale=lt-LT -Dtests.timezone=Asia/Aden -Dtests.asserts=true -Dtests.file.encoding=UTF-8
   [junit4] FAILURE 65.7s J0 | FullSolrCloudDistribCmdsTest.test <<<
   [junit4]    > Throwable #1: java.lang.AssertionError: Could not find collection:collection2
   [junit4]    > 	at __randomizedtesting.SeedInfo.seed([360B0EFFF82D08C5:BE5F312556D1653D]:0)
   [junit4]    > 	at org.apache.solr.cloud.AbstractDistribZkTestBase.waitForRecoveriesToFinish(AbstractDistribZkTestBase.java:155)
   [junit4]    > 	at org.apache.solr.cloud.AbstractDistribZkTestBase.waitForRecoveriesToFinish(AbstractDistribZkTestBase.java:140)
   [junit4]    > 	at org.apache.solr.cloud.AbstractDistribZkTestBase.waitForRecoveriesToFinish(AbstractDistribZkTestBase.java:135)
   [junit4]    > 	at org.apache.solr.cloud.AbstractFullDistribZkTestBase.waitForRecoveriesToFinish(AbstractFullDistribZkTestBase.java:908)
   [junit4]    > 	at org.apache.solr.cloud.FullSolrCloudDistribCmdsTest.testIndexingBatchPerRequestWithHttpSolrClient(FullSolrCloudDistribCmdsTest.java:612)
   [junit4]    > 	at org.apache.solr.cloud.FullSolrCloudDistribCmdsTest.test(FullSolrCloudDistribCmdsTest.java:152)
   [junit4]    > 	at org.apache.solr.BaseDistributedSearchTestCase$ShardsRepeatRule$ShardsFixedStatement.callStatement(BaseDistributedSearchTestCase.java:993)
   [junit4]    > 	at org.apache.solr.BaseDistributedSearchTestCase$ShardsRepeatRule$ShardsStatement.evaluate(BaseDistributedSearchTestCase.java:968)
   [junit4]    > 	at java.lang.Thread.run(Thread.java:748)
   [junit4]   2> NOTE: leaving temporary files on disk at: /Users/jenkins/workspace/Lucene-Solr-master-MacOSX/solr/build/solr-core/test/J0/temp/solr.cloud.FullSolrCloudDistribCmdsTest_360B0EFFF82D08C5-001
   [junit4]   2> Dec 26, 2017 5:25:14 AM com.carrotsearch.randomizedtesting.ThreadLeakControl checkThreadLeaks
   [junit4]   2> WARNING: Will linger awaiting termination of 1 leaked thread(s).
   [junit4]   2> NOTE: test params are: codec=FastDecompressionCompressingStoredFields(storedFieldsFormat=CompressingStoredFieldsFormat(compressionMode=FAST_DECOMPRESSION, chunkSize=8, maxDocsPerChunk=517, blockSize=784), termVectorsFormat=CompressingTermVectorsFormat(compressionMode=FAST_DECOMPRESSION, chunkSize=8, blockSize=784)), sim=Asserting(org.apache.lucene.search.similarities.AssertingSimilarity@521e090e), locale=lt-LT, timezone=Asia/Aden
   [junit4]   2> NOTE: Mac OS X 10.11.6 x86_64/Oracle Corporation 1.8.0_144 (64-bit)/cpus=3,threads=1,free=103738144,total=518979584
   [junit4]   2> NOTE: All tests run in this JVM: [TestSimDistributedQueue, CoreSorterTest, ClassificationUpdateProcessorFactoryTest, RecoveryZkTest, DistanceFunctionTest, TestComplexPhraseQParserPlugin, HdfsChaosMonkeySafeLeaderTest, AutoscalingHistoryHandlerTest, AtomicUpdateProcessorFactoryTest, TestNRTOpen, TestCursorMarkWithoutUniqueKey, SolrMetricManagerTest, DistributedSuggestComponentTest, TestLockTree, SSLMigrationTest, BinaryUpdateRequestHandlerTest, TestRetrieveFieldsOptimizer, BJQParserTest, AddReplicaTest, TestUseDocValuesAsStored, TestComputePlanAction, TestRestManager, EnumFieldTest, TestTrackingShardHandlerFactory, IndexSchemaTest, HLLSerializationTest, HdfsAutoAddReplicasIntegrationTest, SolrGraphiteReporterTest, PreAnalyzedFieldManagedSchemaCloudTest, PropertiesRequestHandlerTest, SuggesterTest, ConvertedLegacyTest, SpatialFilterTest, TestConfigSetsAPIExclusivity, TestJavabinTupleStreamParser, MinimalSchemaTest, HdfsNNFailoverTest, AssignBackwardCompatibilityTest, TestFieldCacheSort, BigEndianAscendingWordSerializerTest, UnloadDistributedZkTest, ComputePlanActionTest, TestExactStatsCache, ShowFileRequestHandlerTest, CursorPagingTest, TriLevelCompositeIdRoutingTest, TestSubQueryTransformerCrossCore, DocExpirationUpdateProcessorFactoryTest, ClassificationUpdateProcessorTest, CreateCollectionCleanupTest, DeleteInactiveReplicaTest, TestRealTimeGet, CleanupOldIndexTest, ShardRoutingTest, TestConfigSetProperties, TimeZoneUtilsTest, TestIBSimilarityFactory, SortSpecParsingTest, TestFieldCache, ScriptEngineTest, TestLegacyField, WrapperMergePolicyFactoryTest, CursorMarkTest, AsyncCallRequestStatusResponseTest, FieldAnalysisRequestHandlerTest, TestStressLiveNodes, TestManagedSynonymFilterFactory, TestImpersonationWithHadoopAuth, DistributedSpellCheckComponentTest, HdfsLockFactoryTest, MergeStrategyTest, TestRawResponseWriter, SuggesterWFSTTest, TestShardHandlerFactory, TestMacros, TestXIncludeConfig, DistributedDebugComponentTest, CircularListTest, DistribCursorPagingTest, CloudMLTQParserTest, TestFieldCacheVsDocValues, TestReplicationHandler, NumericFieldsTest, TestDocBasedVersionConstraints, GraphQueryTest, TestNumericTerms64, TestCorePropertiesReload, TestFieldResource, TestFuzzyAnalyzedSuggestions, TestExecutePlanAction, TestDistribIDF, TestCollationFieldDocValues, PathHierarchyTokenizerFactoryTest, TestSurroundQueryParser, TestInitQParser, TestGeoJSONResponseWriter, PrimitiveFieldTypeTest, TestSchemaManager, TestCopyFieldCollectionResource, ExplicitHLLTest, BlockCacheTest, RequiredFieldsTest, ParsingFieldUpdateProcessorsTest, TestManagedSchema, SortByFunctionTest, StatsComponentTest, TestSimpleQParserPlugin, TestLegacyNumericUtils, TestReloadDeadlock, TestHttpShardHandlerFactory, XmlUpdateRequestHandlerTest, TestSolrCloudSnapshots, TestMaxTokenLenTokenizer, WordBreakSolrSpellCheckerTest, ClusterStateTest, CdcrBootstrapTest, OverseerTaskQueueTest, TestLeaderInitiatedRecoveryThread, ZkStateWriterTest, TolerantUpdateProcessorTest, TestNonDefinedSimilarityFactory, ClusterStateUpdateTest, SegmentsInfoRequestHandlerTest, BadIndexSchemaTest, TestDistributedSearch, TestJoin, TestSolrCoreProperties, AddBlockUpdateTest, TestRandomFlRTGCloud, TestCloudInspectUtil, SimpleCollectionCreateDeleteTest, TestMultiValuedNumericRangeQuery, InfoHandlerTest, TestFieldTypeResource, HdfsBasicDistributedZkTest, TestSolrFieldCacheBean, TestClusterStateMutator, SolrMetricsIntegrationTest, SolrInfoBeanTest, TestDynamicLoading, TestNodeLostTrigger, TestTolerantSearch, NotRequiredUniqueKeyTest, TestHighlightDedupGrouping, UUIDFieldTest, BadCopyFieldTest, DateRangeFieldTest, TestExclusionRuleCollectionAccess, TestZkAclsWithHadoopAuth, SolrCloudExampleTest, InfixSuggestersTest, SyncSliceTest, SignatureUpdateProcessorFactoryTest, MetricsConfigTest, TestSolrDeletionPolicy2, TestRTimerTree, TestDistributedStatsComponentCardinality, SpatialRPTFieldTypeTest, TestQuerySenderListener, TestOrdValues, DistributedTermsComponentTest, TestManagedResource, IndexBasedSpellCheckerTest, TestLegacyFieldCache, TestSweetSpotSimilarityFactory, TestNamedUpdateProcessors, HighlighterConfigTest, TestNumericRangeQuery64, AutoAddReplicasPlanActionTest, BaseCdcrDistributedZkTest, HdfsTlogReplayBufferedWhileIndexingTest, TestRangeQuery, TestWriterPerf, SpellCheckComponentTest, URLClassifyProcessorTest, TestManagedSchemaThreadSafety, SolrCmdDistributorTest, OverseerCollectionConfigSetProcessorTest, TestHdfsUpdateLog, TestUtilizeNode, DistributedFacetExistsSmallTest, VersionInfoTest, TestCoreBackup, NodeLostTriggerTest, ChaosMonkeyNothingIsSafeTest, ReplaceNodeTest, TestCSVResponseWriter, BasicDistributedZkTest, CollectionsAPIDistributedZkTest, OpenCloseCoreStressTest, OverseerTest, LeaderElectionIntegrationTest, FullSolrCloudDistribCmdsTest]
   [junit4] Completed [392/765 (1!)] on J0 in 66.18s, 1 test, 1 failure <<< FAILURES!

[...truncated 49297 lines...]

Mime
View raw message