lucene-dev mailing list archives

Site index · List index
Message view « Date » · « Thread »
Top « Date » · « Thread »
From Policeman Jenkins Server <jenk...@thetaphi.de>
Subject [JENKINS] Lucene-Solr-master-MacOSX (64bit/jdk-9) - Build # 4333 - Unstable!
Date Tue, 19 Dec 2017 02:18:55 GMT
Build: https://jenkins.thetaphi.de/job/Lucene-Solr-master-MacOSX/4333/
Java: 64bit/jdk-9 -XX:-UseCompressedOops -XX:+UseConcMarkSweepGC

1 tests failed.
FAILED:  org.apache.solr.handler.TestReplicationHandler.doTestIndexAndConfigReplication

Error Message:
Index 0 out-of-bounds for length 0

Stack Trace:
java.lang.IndexOutOfBoundsException: Index 0 out-of-bounds for length 0
	at __randomizedtesting.SeedInfo.seed([FB0E478E3EBACD4:1BF8BF2DC0EC11CA]:0)
	at java.base/jdk.internal.util.Preconditions.outOfBounds(Preconditions.java:64)
	at java.base/jdk.internal.util.Preconditions.outOfBoundsCheckIndex(Preconditions.java:70)
	at java.base/jdk.internal.util.Preconditions.checkIndex(Preconditions.java:248)
	at java.base/java.util.Objects.checkIndex(Objects.java:372)
	at java.base/java.util.ArrayList.get(ArrayList.java:439)
	at org.apache.solr.handler.TestReplicationHandler.doTestIndexAndConfigReplication(TestReplicationHandler.java:561)
	at java.base/jdk.internal.reflect.NativeMethodAccessorImpl.invoke0(Native Method)
	at java.base/jdk.internal.reflect.NativeMethodAccessorImpl.invoke(NativeMethodAccessorImpl.java:62)
	at java.base/jdk.internal.reflect.DelegatingMethodAccessorImpl.invoke(DelegatingMethodAccessorImpl.java:43)
	at java.base/java.lang.reflect.Method.invoke(Method.java:564)
	at com.carrotsearch.randomizedtesting.RandomizedRunner.invoke(RandomizedRunner.java:1737)
	at com.carrotsearch.randomizedtesting.RandomizedRunner$8.evaluate(RandomizedRunner.java:934)
	at com.carrotsearch.randomizedtesting.RandomizedRunner$9.evaluate(RandomizedRunner.java:970)
	at com.carrotsearch.randomizedtesting.RandomizedRunner$10.evaluate(RandomizedRunner.java:984)
	at com.carrotsearch.randomizedtesting.rules.SystemPropertiesRestoreRule$1.evaluate(SystemPropertiesRestoreRule.java:57)
	at org.apache.lucene.util.TestRuleSetupTeardownChained$1.evaluate(TestRuleSetupTeardownChained.java:49)
	at org.apache.lucene.util.AbstractBeforeAfterRule$1.evaluate(AbstractBeforeAfterRule.java:45)
	at org.apache.lucene.util.TestRuleThreadAndTestName$1.evaluate(TestRuleThreadAndTestName.java:48)
	at org.apache.lucene.util.TestRuleIgnoreAfterMaxFailures$1.evaluate(TestRuleIgnoreAfterMaxFailures.java:64)
	at org.apache.lucene.util.TestRuleMarkFailure$1.evaluate(TestRuleMarkFailure.java:47)
	at com.carrotsearch.randomizedtesting.rules.StatementAdapter.evaluate(StatementAdapter.java:36)
	at com.carrotsearch.randomizedtesting.ThreadLeakControl$StatementRunner.run(ThreadLeakControl.java:368)
	at com.carrotsearch.randomizedtesting.ThreadLeakControl.forkTimeoutingTask(ThreadLeakControl.java:817)
	at com.carrotsearch.randomizedtesting.ThreadLeakControl$3.evaluate(ThreadLeakControl.java:468)
	at com.carrotsearch.randomizedtesting.RandomizedRunner.runSingleTest(RandomizedRunner.java:943)
	at com.carrotsearch.randomizedtesting.RandomizedRunner$5.evaluate(RandomizedRunner.java:829)
	at com.carrotsearch.randomizedtesting.RandomizedRunner$6.evaluate(RandomizedRunner.java:879)
	at com.carrotsearch.randomizedtesting.RandomizedRunner$7.evaluate(RandomizedRunner.java:890)
	at com.carrotsearch.randomizedtesting.rules.StatementAdapter.evaluate(StatementAdapter.java:36)
	at com.carrotsearch.randomizedtesting.rules.SystemPropertiesRestoreRule$1.evaluate(SystemPropertiesRestoreRule.java:57)
	at org.apache.lucene.util.AbstractBeforeAfterRule$1.evaluate(AbstractBeforeAfterRule.java:45)
	at com.carrotsearch.randomizedtesting.rules.StatementAdapter.evaluate(StatementAdapter.java:36)
	at org.apache.lucene.util.TestRuleStoreClassName$1.evaluate(TestRuleStoreClassName.java:41)
	at com.carrotsearch.randomizedtesting.rules.NoShadowingOrOverridesOnMethodsRule$1.evaluate(NoShadowingOrOverridesOnMethodsRule.java:40)
	at com.carrotsearch.randomizedtesting.rules.NoShadowingOrOverridesOnMethodsRule$1.evaluate(NoShadowingOrOverridesOnMethodsRule.java:40)
	at com.carrotsearch.randomizedtesting.rules.StatementAdapter.evaluate(StatementAdapter.java:36)
	at com.carrotsearch.randomizedtesting.rules.StatementAdapter.evaluate(StatementAdapter.java:36)
	at org.apache.lucene.util.TestRuleAssertionsRequired$1.evaluate(TestRuleAssertionsRequired.java:53)
	at org.apache.lucene.util.TestRuleMarkFailure$1.evaluate(TestRuleMarkFailure.java:47)
	at org.apache.lucene.util.TestRuleIgnoreAfterMaxFailures$1.evaluate(TestRuleIgnoreAfterMaxFailures.java:64)
	at org.apache.lucene.util.TestRuleIgnoreTestSuites$1.evaluate(TestRuleIgnoreTestSuites.java:54)
	at com.carrotsearch.randomizedtesting.rules.StatementAdapter.evaluate(StatementAdapter.java:36)
	at com.carrotsearch.randomizedtesting.ThreadLeakControl$StatementRunner.run(ThreadLeakControl.java:368)
	at java.base/java.lang.Thread.run(Thread.java:844)




Build Log:
[...truncated 1792 lines...]
   [junit4] JVM J0: stderr was not empty, see: /Users/jenkins/workspace/Lucene-Solr-master-MacOSX/lucene/build/core/test/temp/junit4-J0-20171219_005529_75710596654885172870806.syserr
   [junit4] >>> JVM J0 emitted unexpected output (verbatim) ----
   [junit4] Java HotSpot(TM) 64-Bit Server VM warning: Option UseConcMarkSweepGC was deprecated in version 9.0 and will likely be removed in a future release.
   [junit4] <<< JVM J0: EOF ----

[...truncated 5 lines...]
   [junit4] JVM J1: stderr was not empty, see: /Users/jenkins/workspace/Lucene-Solr-master-MacOSX/lucene/build/core/test/temp/junit4-J1-20171219_005529_75715245941819002087963.syserr
   [junit4] >>> JVM J1 emitted unexpected output (verbatim) ----
   [junit4] Java HotSpot(TM) 64-Bit Server VM warning: Option UseConcMarkSweepGC was deprecated in version 9.0 and will likely be removed in a future release.
   [junit4] <<< JVM J1: EOF ----

[...truncated 291 lines...]
   [junit4] JVM J0: stderr was not empty, see: /Users/jenkins/workspace/Lucene-Solr-master-MacOSX/lucene/build/test-framework/test/temp/junit4-J0-20171219_010255_46013567842315027675674.syserr
   [junit4] >>> JVM J0 emitted unexpected output (verbatim) ----
   [junit4] Java HotSpot(TM) 64-Bit Server VM warning: Option UseConcMarkSweepGC was deprecated in version 9.0 and will likely be removed in a future release.
   [junit4] <<< JVM J0: EOF ----

   [junit4] JVM J1: stderr was not empty, see: /Users/jenkins/workspace/Lucene-Solr-master-MacOSX/lucene/build/test-framework/test/temp/junit4-J1-20171219_010255_4604385771167983649177.syserr
   [junit4] >>> JVM J1 emitted unexpected output (verbatim) ----
   [junit4] Java HotSpot(TM) 64-Bit Server VM warning: Option UseConcMarkSweepGC was deprecated in version 9.0 and will likely be removed in a future release.
   [junit4] <<< JVM J1: EOF ----

[...truncated 1057 lines...]
   [junit4] JVM J1: stderr was not empty, see: /Users/jenkins/workspace/Lucene-Solr-master-MacOSX/lucene/build/analysis/common/test/temp/junit4-J1-20171219_010354_91910733007397206640048.syserr
   [junit4] >>> JVM J1 emitted unexpected output (verbatim) ----
   [junit4] Java HotSpot(TM) 64-Bit Server VM warning: Option UseConcMarkSweepGC was deprecated in version 9.0 and will likely be removed in a future release.
   [junit4] <<< JVM J1: EOF ----

[...truncated 3 lines...]
   [junit4] JVM J0: stderr was not empty, see: /Users/jenkins/workspace/Lucene-Solr-master-MacOSX/lucene/build/analysis/common/test/temp/junit4-J0-20171219_010354_91916463359257767124888.syserr
   [junit4] >>> JVM J0 emitted unexpected output (verbatim) ----
   [junit4] Java HotSpot(TM) 64-Bit Server VM warning: Option UseConcMarkSweepGC was deprecated in version 9.0 and will likely be removed in a future release.
   [junit4] <<< JVM J0: EOF ----

[...truncated 224 lines...]
   [junit4] JVM J0: stderr was not empty, see: /Users/jenkins/workspace/Lucene-Solr-master-MacOSX/lucene/build/analysis/icu/test/temp/junit4-J0-20171219_010553_06711867215762299335161.syserr
   [junit4] >>> JVM J0 emitted unexpected output (verbatim) ----
   [junit4] Java HotSpot(TM) 64-Bit Server VM warning: Option UseConcMarkSweepGC was deprecated in version 9.0 and will likely be removed in a future release.
   [junit4] <<< JVM J0: EOF ----

[...truncated 5 lines...]
   [junit4] JVM J1: stderr was not empty, see: /Users/jenkins/workspace/Lucene-Solr-master-MacOSX/lucene/build/analysis/icu/test/temp/junit4-J1-20171219_010553_06710946458198113607315.syserr
   [junit4] >>> JVM J1 emitted unexpected output (verbatim) ----
   [junit4] Java HotSpot(TM) 64-Bit Server VM warning: Option UseConcMarkSweepGC was deprecated in version 9.0 and will likely be removed in a future release.
   [junit4] <<< JVM J1: EOF ----

[...truncated 249 lines...]
   [junit4] JVM J0: stderr was not empty, see: /Users/jenkins/workspace/Lucene-Solr-master-MacOSX/lucene/build/analysis/kuromoji/test/temp/junit4-J0-20171219_010602_98714806436379165251439.syserr
   [junit4] >>> JVM J0 emitted unexpected output (verbatim) ----
   [junit4] Java HotSpot(TM) 64-Bit Server VM warning: Option UseConcMarkSweepGC was deprecated in version 9.0 and will likely be removed in a future release.
   [junit4] <<< JVM J0: EOF ----

[...truncated 3 lines...]
   [junit4] JVM J1: stderr was not empty, see: /Users/jenkins/workspace/Lucene-Solr-master-MacOSX/lucene/build/analysis/kuromoji/test/temp/junit4-J1-20171219_010602_9876132041331654904769.syserr
   [junit4] >>> JVM J1 emitted unexpected output (verbatim) ----
   [junit4] Java HotSpot(TM) 64-Bit Server VM warning: Option UseConcMarkSweepGC was deprecated in version 9.0 and will likely be removed in a future release.
   [junit4] <<< JVM J1: EOF ----

[...truncated 157 lines...]
   [junit4] JVM J1: stderr was not empty, see: /Users/jenkins/workspace/Lucene-Solr-master-MacOSX/lucene/build/analysis/morfologik/test/temp/junit4-J1-20171219_010631_63916566827281291972823.syserr
   [junit4] >>> JVM J1 emitted unexpected output (verbatim) ----
   [junit4] Java HotSpot(TM) 64-Bit Server VM warning: Option UseConcMarkSweepGC was deprecated in version 9.0 and will likely be removed in a future release.
   [junit4] <<< JVM J1: EOF ----

   [junit4] JVM J0: stderr was not empty, see: /Users/jenkins/workspace/Lucene-Solr-master-MacOSX/lucene/build/analysis/morfologik/test/temp/junit4-J0-20171219_010631_63915600836554680814477.syserr
   [junit4] >>> JVM J0 emitted unexpected output (verbatim) ----
   [junit4] Java HotSpot(TM) 64-Bit Server VM warning: Option UseConcMarkSweepGC was deprecated in version 9.0 and will likely be removed in a future release.
   [junit4] <<< JVM J0: EOF ----

[...truncated 161 lines...]
   [junit4] JVM J1: stderr was not empty, see: /Users/jenkins/workspace/Lucene-Solr-master-MacOSX/lucene/build/analysis/opennlp/test/temp/junit4-J1-20171219_010635_4138139791644409430100.syserr
   [junit4] >>> JVM J1 emitted unexpected output (verbatim) ----
   [junit4] Java HotSpot(TM) 64-Bit Server VM warning: Option UseConcMarkSweepGC was deprecated in version 9.0 and will likely be removed in a future release.
   [junit4] <<< JVM J1: EOF ----

   [junit4] JVM J0: stderr was not empty, see: /Users/jenkins/workspace/Lucene-Solr-master-MacOSX/lucene/build/analysis/opennlp/test/temp/junit4-J0-20171219_010635_4133898927397406390447.syserr
   [junit4] >>> JVM J0 emitted unexpected output (verbatim) ----
   [junit4] Java HotSpot(TM) 64-Bit Server VM warning: Option UseConcMarkSweepGC was deprecated in version 9.0 and will likely be removed in a future release.
   [junit4] <<< JVM J0: EOF ----

[...truncated 168 lines...]
   [junit4] JVM J1: stderr was not empty, see: /Users/jenkins/workspace/Lucene-Solr-master-MacOSX/lucene/build/analysis/phonetic/test/temp/junit4-J1-20171219_010638_5534266743822651194775.syserr
   [junit4] >>> JVM J1 emitted unexpected output (verbatim) ----
   [junit4] Java HotSpot(TM) 64-Bit Server VM warning: Option UseConcMarkSweepGC was deprecated in version 9.0 and will likely be removed in a future release.
   [junit4] <<< JVM J1: EOF ----

[...truncated 3 lines...]
   [junit4] JVM J0: stderr was not empty, see: /Users/jenkins/workspace/Lucene-Solr-master-MacOSX/lucene/build/analysis/phonetic/test/temp/junit4-J0-20171219_010638_5533342317355147968654.syserr
   [junit4] >>> JVM J0 emitted unexpected output (verbatim) ----
   [junit4] Java HotSpot(TM) 64-Bit Server VM warning: Option UseConcMarkSweepGC was deprecated in version 9.0 and will likely be removed in a future release.
   [junit4] <<< JVM J0: EOF ----

[...truncated 151 lines...]
   [junit4] JVM J0: stderr was not empty, see: /Users/jenkins/workspace/Lucene-Solr-master-MacOSX/lucene/build/analysis/smartcn/test/temp/junit4-J0-20171219_010645_9499774840098621929590.syserr
   [junit4] >>> JVM J0 emitted unexpected output (verbatim) ----
   [junit4] Java HotSpot(TM) 64-Bit Server VM warning: Option UseConcMarkSweepGC was deprecated in version 9.0 and will likely be removed in a future release.
   [junit4] <<< JVM J0: EOF ----

[...truncated 3 lines...]
   [junit4] JVM J1: stderr was not empty, see: /Users/jenkins/workspace/Lucene-Solr-master-MacOSX/lucene/build/analysis/smartcn/test/temp/junit4-J1-20171219_010645_9497891727585311566233.syserr
   [junit4] >>> JVM J1 emitted unexpected output (verbatim) ----
   [junit4] Java HotSpot(TM) 64-Bit Server VM warning: Option UseConcMarkSweepGC was deprecated in version 9.0 and will likely be removed in a future release.
   [junit4] <<< JVM J1: EOF ----

[...truncated 159 lines...]
   [junit4] JVM J0: stderr was not empty, see: /Users/jenkins/workspace/Lucene-Solr-master-MacOSX/lucene/build/analysis/stempel/test/temp/junit4-J0-20171219_010652_6186237765078741019481.syserr
   [junit4] >>> JVM J0 emitted unexpected output (verbatim) ----
   [junit4] Java HotSpot(TM) 64-Bit Server VM warning: Option UseConcMarkSweepGC was deprecated in version 9.0 and will likely be removed in a future release.
   [junit4] <<< JVM J0: EOF ----

   [junit4] JVM J1: stderr was not empty, see: /Users/jenkins/workspace/Lucene-Solr-master-MacOSX/lucene/build/analysis/stempel/test/temp/junit4-J1-20171219_010652_6194389224953726890273.syserr
   [junit4] >>> JVM J1 emitted unexpected output (verbatim) ----
   [junit4] Java HotSpot(TM) 64-Bit Server VM warning: Option UseConcMarkSweepGC was deprecated in version 9.0 and will likely be removed in a future release.
   [junit4] <<< JVM J1: EOF ----

[...truncated 167 lines...]
   [junit4] JVM J0: stderr was not empty, see: /Users/jenkins/workspace/Lucene-Solr-master-MacOSX/lucene/build/analysis/uima/test/temp/junit4-J0-20171219_010655_85013347245297346720441.syserr
   [junit4] >>> JVM J0 emitted unexpected output (verbatim) ----
   [junit4] Java HotSpot(TM) 64-Bit Server VM warning: Option UseConcMarkSweepGC was deprecated in version 9.0 and will likely be removed in a future release.
   [junit4] <<< JVM J0: EOF ----

[...truncated 152 lines...]
   [junit4] JVM J0: stderr was not empty, see: /Users/jenkins/workspace/Lucene-Solr-master-MacOSX/lucene/build/backward-codecs/test/temp/junit4-J0-20171219_010708_46314210024761808395273.syserr
   [junit4] >>> JVM J0 emitted unexpected output (verbatim) ----
   [junit4] Java HotSpot(TM) 64-Bit Server VM warning: Option UseConcMarkSweepGC was deprecated in version 9.0 and will likely be removed in a future release.
   [junit4] <<< JVM J0: EOF ----

[...truncated 19 lines...]
   [junit4] JVM J1: stderr was not empty, see: /Users/jenkins/workspace/Lucene-Solr-master-MacOSX/lucene/build/backward-codecs/test/temp/junit4-J1-20171219_010708_4633455153092507330597.syserr
   [junit4] >>> JVM J1 emitted unexpected output (verbatim) ----
   [junit4] Java HotSpot(TM) 64-Bit Server VM warning: Option UseConcMarkSweepGC was deprecated in version 9.0 and will likely be removed in a future release.
   [junit4] <<< JVM J1: EOF ----

[...truncated 1304 lines...]
   [junit4] JVM J0: stderr was not empty, see: /Users/jenkins/workspace/Lucene-Solr-master-MacOSX/lucene/build/benchmark/test/temp/junit4-J0-20171219_010728_07212005769133784762191.syserr
   [junit4] >>> JVM J0 emitted unexpected output (verbatim) ----
   [junit4] Java HotSpot(TM) 64-Bit Server VM warning: Option UseConcMarkSweepGC was deprecated in version 9.0 and will likely be removed in a future release.
   [junit4] <<< JVM J0: EOF ----

   [junit4] JVM J1: stderr was not empty, see: /Users/jenkins/workspace/Lucene-Solr-master-MacOSX/lucene/build/benchmark/test/temp/junit4-J1-20171219_010728_0726211726220998139808.syserr
   [junit4] >>> JVM J1 emitted unexpected output (verbatim) ----
   [junit4] Java HotSpot(TM) 64-Bit Server VM warning: Option UseConcMarkSweepGC was deprecated in version 9.0 and will likely be removed in a future release.
   [junit4] <<< JVM J1: EOF ----

[...truncated 231 lines...]
   [junit4] JVM J1: stderr was not empty, see: /Users/jenkins/workspace/Lucene-Solr-master-MacOSX/lucene/build/classification/test/temp/junit4-J1-20171219_010738_04310404925746079962594.syserr
   [junit4] >>> JVM J1 emitted unexpected output (verbatim) ----
   [junit4] Java HotSpot(TM) 64-Bit Server VM warning: Option UseConcMarkSweepGC was deprecated in version 9.0 and will likely be removed in a future release.
   [junit4] <<< JVM J1: EOF ----

[...truncated 3 lines...]
   [junit4] JVM J0: stderr was not empty, see: /Users/jenkins/workspace/Lucene-Solr-master-MacOSX/lucene/build/classification/test/temp/junit4-J0-20171219_010738_04315425063945827835916.syserr
   [junit4] >>> JVM J0 emitted unexpected output (verbatim) ----
   [junit4] Java HotSpot(TM) 64-Bit Server VM warning: Option UseConcMarkSweepGC was deprecated in version 9.0 and will likely be removed in a future release.
   [junit4] <<< JVM J0: EOF ----

[...truncated 259 lines...]
   [junit4] JVM J0: stderr was not empty, see: /Users/jenkins/workspace/Lucene-Solr-master-MacOSX/lucene/build/codecs/test/temp/junit4-J0-20171219_010754_17011798087733206872016.syserr
   [junit4] >>> JVM J0 emitted unexpected output (verbatim) ----
   [junit4] Java HotSpot(TM) 64-Bit Server VM warning: Option UseConcMarkSweepGC was deprecated in version 9.0 and will likely be removed in a future release.
   [junit4] <<< JVM J0: EOF ----

[...truncated 3 lines...]
   [junit4] JVM J1: stderr was not empty, see: /Users/jenkins/workspace/Lucene-Solr-master-MacOSX/lucene/build/codecs/test/temp/junit4-J1-20171219_010754_17010049996947269133995.syserr
   [junit4] >>> JVM J1 emitted unexpected output (verbatim) ----
   [junit4] Java HotSpot(TM) 64-Bit Server VM warning: Option UseConcMarkSweepGC was deprecated in version 9.0 and will likely be removed in a future release.
   [junit4] <<< JVM J1: EOF ----

[...truncated 212 lines...]
   [junit4] JVM J1: stderr was not empty, see: /Users/jenkins/workspace/Lucene-Solr-master-MacOSX/lucene/build/demo/test/temp/junit4-J1-20171219_010926_33015826905388082128830.syserr
   [junit4] >>> JVM J1 emitted unexpected output (verbatim) ----
   [junit4] Java HotSpot(TM) 64-Bit Server VM warning: Option UseConcMarkSweepGC was deprecated in version 9.0 and will likely be removed in a future release.
   [junit4] <<< JVM J1: EOF ----

   [junit4] JVM J0: stderr was not empty, see: /Users/jenkins/workspace/Lucene-Solr-master-MacOSX/lucene/build/demo/test/temp/junit4-J0-20171219_010926_33016387596565538154731.syserr
   [junit4] >>> JVM J0 emitted unexpected output (verbatim) ----
   [junit4] Java HotSpot(TM) 64-Bit Server VM warning: Option UseConcMarkSweepGC was deprecated in version 9.0 and will likely be removed in a future release.
   [junit4] <<< JVM J0: EOF ----

[...truncated 170 lines...]
   [junit4] JVM J0: stderr was not empty, see: /Users/jenkins/workspace/Lucene-Solr-master-MacOSX/lucene/build/expressions/test/temp/junit4-J0-20171219_010930_30112079243501666227999.syserr
   [junit4] >>> JVM J0 emitted unexpected output (verbatim) ----
   [junit4] Java HotSpot(TM) 64-Bit Server VM warning: Option UseConcMarkSweepGC was deprecated in version 9.0 and will likely be removed in a future release.
   [junit4] <<< JVM J0: EOF ----

[...truncated 3 lines...]
   [junit4] JVM J1: stderr was not empty, see: /Users/jenkins/workspace/Lucene-Solr-master-MacOSX/lucene/build/expressions/test/temp/junit4-J1-20171219_010930_3016442973009138654477.syserr
   [junit4] >>> JVM J1 emitted unexpected output (verbatim) ----
   [junit4] Java HotSpot(TM) 64-Bit Server VM warning: Option UseConcMarkSweepGC was deprecated in version 9.0 and will likely be removed in a future release.
   [junit4] <<< JVM J1: EOF ----

[...truncated 226 lines...]
   [junit4] JVM J0: stderr was not empty, see: /Users/jenkins/workspace/Lucene-Solr-master-MacOSX/lucene/build/facet/test/temp/junit4-J0-20171219_010936_2242728060859513197560.syserr
   [junit4] >>> JVM J0 emitted unexpected output (verbatim) ----
   [junit4] Java HotSpot(TM) 64-Bit Server VM warning: Option UseConcMarkSweepGC was deprecated in version 9.0 and will likely be removed in a future release.
   [junit4] <<< JVM J0: EOF ----

[...truncated 3 lines...]
   [junit4] JVM J1: stderr was not empty, see: /Users/jenkins/workspace/Lucene-Solr-master-MacOSX/lucene/build/facet/test/temp/junit4-J1-20171219_010936_2255899153154669677786.syserr
   [junit4] >>> JVM J1 emitted unexpected output (verbatim) ----
   [junit4] Java HotSpot(TM) 64-Bit Server VM warning: Option UseConcMarkSweepGC was deprecated in version 9.0 and will likely be removed in a future release.
   [junit4] <<< JVM J1: EOF ----

[...truncated 179 lines...]
   [junit4] JVM J1: stderr was not empty, see: /Users/jenkins/workspace/Lucene-Solr-master-MacOSX/lucene/build/grouping/test/temp/junit4-J1-20171219_011028_6518705573954442003036.syserr
   [junit4] >>> JVM J1 emitted unexpected output (verbatim) ----
   [junit4] Java HotSpot(TM) 64-Bit Server VM warning: Option UseConcMarkSweepGC was deprecated in version 9.0 and will likely be removed in a future release.
   [junit4] <<< JVM J1: EOF ----

[...truncated 3 lines...]
   [junit4] JVM J0: stderr was not empty, see: /Users/jenkins/workspace/Lucene-Solr-master-MacOSX/lucene/build/grouping/test/temp/junit4-J0-20171219_011028_65117437078712069410044.syserr
   [junit4] >>> JVM J0 emitted unexpected output (verbatim) ----
   [junit4] Java HotSpot(TM) 64-Bit Server VM warning: Option UseConcMarkSweepGC was deprecated in version 9.0 and will likely be removed in a future release.
   [junit4] <<< JVM J0: EOF ----

[...truncated 243 lines...]
   [junit4] JVM J1: stderr was not empty, see: /Users/jenkins/workspace/Lucene-Solr-master-MacOSX/lucene/build/highlighter/test/temp/junit4-J1-20171219_011042_32618317620210828816194.syserr
   [junit4] >>> JVM J1 emitted unexpected output (verbatim) ----
   [junit4] Java HotSpot(TM) 64-Bit Server VM warning: Option UseConcMarkSweepGC was deprecated in version 9.0 and will likely be removed in a future release.
   [junit4] <<< JVM J1: EOF ----

[...truncated 3 lines...]
   [junit4] JVM J0: stderr was not empty, see: /Users/jenkins/workspace/Lucene-Solr-master-MacOSX/lucene/build/highlighter/test/temp/junit4-J0-20171219_011042_32216820434524960986285.syserr
   [junit4] >>> JVM J0 emitted unexpected output (verbatim) ----
   [junit4] Java HotSpot(TM) 64-Bit Server VM warning: Option UseConcMarkSweepGC was deprecated in version 9.0 and will likely be removed in a future release.
   [junit4] <<< JVM J0: EOF ----

[...truncated 160 lines...]
   [junit4] JVM J1: stderr was not empty, see: /Users/jenkins/workspace/Lucene-Solr-master-MacOSX/lucene/build/join/test/temp/junit4-J1-20171219_011113_53510922926371463467322.syserr
   [junit4] >>> JVM J1 emitted unexpected output (verbatim) ----
   [junit4] Java HotSpot(TM) 64-Bit Server VM warning: Option UseConcMarkSweepGC was deprecated in version 9.0 and will likely be removed in a future release.
   [junit4] <<< JVM J1: EOF ----

[...truncated 6 lines...]
   [junit4] JVM J0: stderr was not empty, see: /Users/jenkins/workspace/Lucene-Solr-master-MacOSX/lucene/build/join/test/temp/junit4-J0-20171219_011113_5359260355073232163079.syserr
   [junit4] >>> JVM J0 emitted unexpected output (verbatim) ----
   [junit4] Java HotSpot(TM) 64-Bit Server VM warning: Option UseConcMarkSweepGC was deprecated in version 9.0 and will likely be removed in a future release.
   [junit4] <<< JVM J0: EOF ----

[...truncated 147 lines...]
   [junit4] JVM J0: stderr was not empty, see: /Users/jenkins/workspace/Lucene-Solr-master-MacOSX/lucene/build/memory/test/temp/junit4-J0-20171219_011139_51710979442866276748663.syserr
   [junit4] >>> JVM J0 emitted unexpected output (verbatim) ----
   [junit4] Java HotSpot(TM) 64-Bit Server VM warning: Option UseConcMarkSweepGC was deprecated in version 9.0 and will likely be removed in a future release.
   [junit4] <<< JVM J0: EOF ----

[...truncated 3 lines...]
   [junit4] JVM J1: stderr was not empty, see: /Users/jenkins/workspace/Lucene-Solr-master-MacOSX/lucene/build/memory/test/temp/junit4-J1-20171219_011139_51714511532895989692437.syserr
   [junit4] >>> JVM J1 emitted unexpected output (verbatim) ----
   [junit4] Java HotSpot(TM) 64-Bit Server VM warning: Option UseConcMarkSweepGC was deprecated in version 9.0 and will likely be removed in a future release.
   [junit4] <<< JVM J1: EOF ----

[...truncated 185 lines...]
   [junit4] JVM J0: stderr was not empty, see: /Users/jenkins/workspace/Lucene-Solr-master-MacOSX/lucene/build/misc/test/temp/junit4-J0-20171219_011145_855611650268467589869.syserr
   [junit4] >>> JVM J0 emitted unexpected output (verbatim) ----
   [junit4] Java HotSpot(TM) 64-Bit Server VM warning: Option UseConcMarkSweepGC was deprecated in version 9.0 and will likely be removed in a future release.
   [junit4] <<< JVM J0: EOF ----

   [junit4] JVM J1: stderr was not empty, see: /Users/jenkins/workspace/Lucene-Solr-master-MacOSX/lucene/build/misc/test/temp/junit4-J1-20171219_011145_85571953045689731466.syserr
   [junit4] >>> JVM J1 emitted unexpected output (verbatim) ----
   [junit4] Java HotSpot(TM) 64-Bit Server VM warning: Option UseConcMarkSweepGC was deprecated in version 9.0 and will likely be removed in a future release.
   [junit4] <<< JVM J1: EOF ----

[...truncated 295 lines...]
   [junit4] JVM J1: stderr was not empty, see: /Users/jenkins/workspace/Lucene-Solr-master-MacOSX/lucene/build/queries/test/temp/junit4-J1-20171219_011200_5757877108729522038481.syserr
   [junit4] >>> JVM J1 emitted unexpected output (verbatim) ----
   [junit4] Java HotSpot(TM) 64-Bit Server VM warning: Option UseConcMarkSweepGC was deprecated in version 9.0 and will likely be removed in a future release.
   [junit4] <<< JVM J1: EOF ----

[...truncated 3 lines...]
   [junit4] JVM J0: stderr was not empty, see: /Users/jenkins/workspace/Lucene-Solr-master-MacOSX/lucene/build/queries/test/temp/junit4-J0-20171219_011200_57516371309527155797644.syserr
   [junit4] >>> JVM J0 emitted unexpected output (verbatim) ----
   [junit4] Java HotSpot(TM) 64-Bit Server VM warning: Option UseConcMarkSweepGC was deprecated in version 9.0 and will likely be removed in a future release.
   [junit4] <<< JVM J0: EOF ----

[...truncated 224 lines...]
   [junit4] JVM J1: stderr was not empty, see: /Users/jenkins/workspace/Lucene-Solr-master-MacOSX/lucene/build/queryparser/test/temp/junit4-J1-20171219_011209_75810738364873454862426.syserr
   [junit4] >>> JVM J1 emitted unexpected output (verbatim) ----
   [junit4] Java HotSpot(TM) 64-Bit Server VM warning: Option UseConcMarkSweepGC was deprecated in version 9.0 and will likely be removed in a future release.
   [junit4] <<< JVM J1: EOF ----

[...truncated 3 lines...]
   [junit4] JVM J0: stderr was not empty, see: /Users/jenkins/workspace/Lucene-Solr-master-MacOSX/lucene/build/queryparser/test/temp/junit4-J0-20171219_011209_7586365646348091640936.syserr
   [junit4] >>> JVM J0 emitted unexpected output (verbatim) ----
   [junit4] Java HotSpot(TM) 64-Bit Server VM warning: Option UseConcMarkSweepGC was deprecated in version 9.0 and will likely be removed in a future release.
   [junit4] <<< JVM J0: EOF ----

[...truncated 207 lines...]
   [junit4] JVM J0: stderr was not empty, see: /Users/jenkins/workspace/Lucene-Solr-master-MacOSX/lucene/build/replicator/test/temp/junit4-J0-20171219_011218_2652597569436776227786.syserr
   [junit4] >>> JVM J0 emitted unexpected output (verbatim) ----
   [junit4] Java HotSpot(TM) 64-Bit Server VM warning: Option UseConcMarkSweepGC was deprecated in version 9.0 and will likely be removed in a future release.
   [junit4] <<< JVM J0: EOF ----

[...truncated 3 lines...]
   [junit4] JVM J1: stderr was not empty, see: /Users/jenkins/workspace/Lucene-Solr-master-MacOSX/lucene/build/replicator/test/temp/junit4-J1-20171219_011218_26510738923949481879766.syserr
   [junit4] >>> JVM J1 emitted unexpected output (verbatim) ----
   [junit4] Java HotSpot(TM) 64-Bit Server VM warning: Option UseConcMarkSweepGC was deprecated in version 9.0 and will likely be removed in a future release.
   [junit4] <<< JVM J1: EOF ----

[...truncated 216 lines...]
   [junit4] JVM J1: stderr was not empty, see: /Users/jenkins/workspace/Lucene-Solr-master-MacOSX/lucene/build/sandbox/test/temp/junit4-J1-20171219_011230_0351122116929289710070.syserr
   [junit4] >>> JVM J1 emitted unexpected output (verbatim) ----
   [junit4] Java HotSpot(TM) 64-Bit Server VM warning: Option UseConcMarkSweepGC was deprecated in version 9.0 and will likely be removed in a future release.
   [junit4] <<< JVM J1: EOF ----

[...truncated 7 lines...]
   [junit4] JVM J0: stderr was not empty, see: /Users/jenkins/workspace/Lucene-Solr-master-MacOSX/lucene/build/sandbox/test/temp/junit4-J0-20171219_011230_03515580463197239022640.syserr
   [junit4] >>> JVM J0 emitted unexpected output (verbatim) ----
   [junit4] Java HotSpot(TM) 64-Bit Server VM warning: Option UseConcMarkSweepGC was deprecated in version 9.0 and will likely be removed in a future release.
   [junit4] <<< JVM J0: EOF ----

[...truncated 317 lines...]
   [junit4] JVM J1: stderr was not empty, see: /Users/jenkins/workspace/Lucene-Solr-master-MacOSX/lucene/build/spatial-extras/test/temp/junit4-J1-20171219_011302_39913127457498386384389.syserr
   [junit4] >>> JVM J1 emitted unexpected output (verbatim) ----
   [junit4] Java HotSpot(TM) 64-Bit Server VM warning: Option UseConcMarkSweepGC was deprecated in version 9.0 and will likely be removed in a future release.
   [junit4] <<< JVM J1: EOF ----

[...truncated 3 lines...]
   [junit4] JVM J0: stderr was not empty, see: /Users/jenkins/workspace/Lucene-Solr-master-MacOSX/lucene/build/spatial-extras/test/temp/junit4-J0-20171219_011302_39912324969987472268591.syserr
   [junit4] >>> JVM J0 emitted unexpected output (verbatim) ----
   [junit4] Java HotSpot(TM) 64-Bit Server VM warning: Option UseConcMarkSweepGC was deprecated in version 9.0 and will likely be removed in a future release.
   [junit4] <<< JVM J0: EOF ----

[...truncated 146 lines...]
   [junit4] JVM J0: stderr was not empty, see: /Users/jenkins/workspace/Lucene-Solr-master-MacOSX/lucene/build/spatial/test/temp/junit4-J0-20171219_011318_4655908693237635019755.syserr
   [junit4] >>> JVM J0 emitted unexpected output (verbatim) ----
   [junit4] Java HotSpot(TM) 64-Bit Server VM warning: Option UseConcMarkSweepGC was deprecated in version 9.0 and will likely be removed in a future release.
   [junit4] <<< JVM J0: EOF ----

[...truncated 177 lines...]
   [junit4] JVM J0: stderr was not empty, see: /Users/jenkins/workspace/Lucene-Solr-master-MacOSX/lucene/build/spatial3d/test/temp/junit4-J0-20171219_011320_6934228011362536143477.syserr
   [junit4] >>> JVM J0 emitted unexpected output (verbatim) ----
   [junit4] Java HotSpot(TM) 64-Bit Server VM warning: Option UseConcMarkSweepGC was deprecated in version 9.0 and will likely be removed in a future release.
   [junit4] <<< JVM J0: EOF ----

[...truncated 5 lines...]
   [junit4] JVM J1: stderr was not empty, see: /Users/jenkins/workspace/Lucene-Solr-master-MacOSX/lucene/build/spatial3d/test/temp/junit4-J1-20171219_011320_693483576006993476415.syserr
   [junit4] >>> JVM J1 emitted unexpected output (verbatim) ----
   [junit4] Java HotSpot(TM) 64-Bit Server VM warning: Option UseConcMarkSweepGC was deprecated in version 9.0 and will likely be removed in a future release.
   [junit4] <<< JVM J1: EOF ----

[...truncated 247 lines...]
   [junit4] JVM J0: stderr was not empty, see: /Users/jenkins/workspace/Lucene-Solr-master-MacOSX/lucene/build/suggest/test/temp/junit4-J0-20171219_011335_8587459546475124625178.syserr
   [junit4] >>> JVM J0 emitted unexpected output (verbatim) ----
   [junit4] Java HotSpot(TM) 64-Bit Server VM warning: Option UseConcMarkSweepGC was deprecated in version 9.0 and will likely be removed in a future release.
   [junit4] <<< JVM J0: EOF ----

[...truncated 6 lines...]
   [junit4] JVM J1: stderr was not empty, see: /Users/jenkins/workspace/Lucene-Solr-master-MacOSX/lucene/build/suggest/test/temp/junit4-J1-20171219_011335_8589453673597208054614.syserr
   [junit4] >>> JVM J1 emitted unexpected output (verbatim) ----
   [junit4] Java HotSpot(TM) 64-Bit Server VM warning: Option UseConcMarkSweepGC was deprecated in version 9.0 and will likely be removed in a future release.
   [junit4] <<< JVM J1: EOF ----

[...truncated 2407 lines...]
   [junit4] Suite: org.apache.solr.handler.TestReplicationHandler
   [junit4]   2> Creating dataDir: /Users/jenkins/workspace/Lucene-Solr-master-MacOSX/solr/build/solr-core/test/J0/temp/solr.handler.TestReplicationHandler_FB0E478E3EBACD4-001/init-core-data-001
   [junit4]   2> 867925 WARN  (SUITE-TestReplicationHandler-seed#[FB0E478E3EBACD4]-worker) [    ] o.a.s.SolrTestCaseJ4 startTrackingSearchers: numOpens=7 numCloses=7
   [junit4]   2> 867926 INFO  (SUITE-TestReplicationHandler-seed#[FB0E478E3EBACD4]-worker) [    ] o.a.s.SolrTestCaseJ4 Using PointFields (NUMERIC_POINTS_SYSPROP=true) w/NUMERIC_DOCVALUES_SYSPROP=true
   [junit4]   2> 867927 INFO  (SUITE-TestReplicationHandler-seed#[FB0E478E3EBACD4]-worker) [    ] o.a.s.SolrTestCaseJ4 Randomized ssl (false) and clientAuth (false) via: @org.apache.solr.SolrTestCaseJ4$SuppressSSL(bugUrl="None") w/ MAC_OS_X supressed clientAuth
   [junit4]   2> 867927 INFO  (SUITE-TestReplicationHandler-seed#[FB0E478E3EBACD4]-worker) [    ] o.a.s.SolrTestCaseJ4 SecureRandom sanity checks: test.solr.allowed.securerandom=null & java.security.egd=file:/dev/./urandom
   [junit4]   2> 867928 INFO  (TEST-TestReplicationHandler.doTestHandlerPathUnchanged-seed#[FB0E478E3EBACD4]) [    ] o.a.s.SolrTestCaseJ4 ###Starting doTestHandlerPathUnchanged
   [junit4]   2> 867929 INFO  (TEST-TestReplicationHandler.doTestHandlerPathUnchanged-seed#[FB0E478E3EBACD4]) [    ] o.a.s.SolrTestCaseJ4 Writing core.properties file to /Users/jenkins/workspace/Lucene-Solr-master-MacOSX/solr/build/solr-core/test/J0/temp/solr.handler.TestReplicationHandler_FB0E478E3EBACD4-001/solr-instance-001/collection1
   [junit4]   2> 867941 INFO  (TEST-TestReplicationHandler.doTestHandlerPathUnchanged-seed#[FB0E478E3EBACD4]) [    ] o.e.j.s.Server jetty-9.3.20.v20170531
   [junit4]   2> 867943 INFO  (TEST-TestReplicationHandler.doTestHandlerPathUnchanged-seed#[FB0E478E3EBACD4]) [    ] o.e.j.s.h.ContextHandler Started o.e.j.s.ServletContextHandler@bbee722{/solr,null,AVAILABLE}
   [junit4]   2> 867944 INFO  (TEST-TestReplicationHandler.doTestHandlerPathUnchanged-seed#[FB0E478E3EBACD4]) [    ] o.e.j.s.AbstractConnector Started ServerConnector@3f4ed62c{HTTP/1.1,[http/1.1]}{127.0.0.1:57617}
   [junit4]   2> 867944 INFO  (TEST-TestReplicationHandler.doTestHandlerPathUnchanged-seed#[FB0E478E3EBACD4]) [    ] o.e.j.s.Server Started @869682ms
   [junit4]   2> 867944 INFO  (TEST-TestReplicationHandler.doTestHandlerPathUnchanged-seed#[FB0E478E3EBACD4]) [    ] o.a.s.c.s.e.JettySolrRunner Jetty properties: {hostContext=/solr, solr.data.dir=/Users/jenkins/workspace/Lucene-Solr-master-MacOSX/solr/build/solr-core/test/J0/temp/solr.handler.TestReplicationHandler_FB0E478E3EBACD4-001/solr-instance-001/collection1/data, hostPort=57617}
   [junit4]   2> 867944 ERROR (TEST-TestReplicationHandler.doTestHandlerPathUnchanged-seed#[FB0E478E3EBACD4]) [    ] o.a.s.u.StartupLoggingUtils Missing Java Option solr.log.dir. Logging may be missing or incomplete.
   [junit4]   2> 867944 INFO  (TEST-TestReplicationHandler.doTestHandlerPathUnchanged-seed#[FB0E478E3EBACD4]) [    ] o.a.s.s.SolrDispatchFilter  ___      _       Welcome to Apache Solr? version 8.0.0
   [junit4]   2> 867944 INFO  (TEST-TestReplicationHandler.doTestHandlerPathUnchanged-seed#[FB0E478E3EBACD4]) [    ] o.a.s.s.SolrDispatchFilter / __| ___| |_ _   Starting in standalone mode on port null
   [junit4]   2> 867945 INFO  (TEST-TestReplicationHandler.doTestHandlerPathUnchanged-seed#[FB0E478E3EBACD4]) [    ] o.a.s.s.SolrDispatchFilter \__ \/ _ \ | '_|  Install dir: null
   [junit4]   2> 867945 INFO  (TEST-TestReplicationHandler.doTestHandlerPathUnchanged-seed#[FB0E478E3EBACD4]) [    ] o.a.s.s.SolrDispatchFilter |___/\___/_|_|    Start time: 2017-12-19T01:29:08.227052Z
   [junit4]   2> 867945 INFO  (TEST-TestReplicationHandler.doTestHandlerPathUnchanged-seed#[FB0E478E3EBACD4]) [    ] o.a.s.c.SolrXmlConfig Loading container configuration from /Users/jenkins/workspace/Lucene-Solr-master-MacOSX/solr/build/solr-core/test/J0/temp/solr.handler.TestReplicationHandler_FB0E478E3EBACD4-001/solr-instance-001/solr.xml
   [junit4]   2> 867954 INFO  (TEST-TestReplicationHandler.doTestHandlerPathUnchanged-seed#[FB0E478E3EBACD4]) [    ] o.a.s.c.SolrXmlConfig Configuration parameter autoReplicaFailoverWorkLoopDelay is ignored
   [junit4]   2> 867954 INFO  (TEST-TestReplicationHandler.doTestHandlerPathUnchanged-seed#[FB0E478E3EBACD4]) [    ] o.a.s.c.SolrXmlConfig Configuration parameter autoReplicaFailoverBadNodeExpiration is ignored
   [junit4]   2> 867955 INFO  (TEST-TestReplicationHandler.doTestHandlerPathUnchanged-seed#[FB0E478E3EBACD4]) [    ] o.a.s.c.SolrXmlConfig MBean server found: com.sun.jmx.mbeanserver.JmxMBeanServer@38a3b585, but no JMX reporters were configured - adding default JMX reporter.
   [junit4]   2> 867982 INFO  (TEST-TestReplicationHandler.doTestHandlerPathUnchanged-seed#[FB0E478E3EBACD4]) [    ] o.a.s.m.r.SolrJmxReporter JMX monitoring for 'solr.node' (registry 'solr.node') enabled at server: com.sun.jmx.mbeanserver.JmxMBeanServer@38a3b585
   [junit4]   2> 867992 INFO  (TEST-TestReplicationHandler.doTestHandlerPathUnchanged-seed#[FB0E478E3EBACD4]) [    ] o.a.s.m.r.SolrJmxReporter JMX monitoring for 'solr.jvm' (registry 'solr.jvm') enabled at server: com.sun.jmx.mbeanserver.JmxMBeanServer@38a3b585
   [junit4]   2> 867992 INFO  (TEST-TestReplicationHandler.doTestHandlerPathUnchanged-seed#[FB0E478E3EBACD4]) [    ] o.a.s.m.r.SolrJmxReporter JMX monitoring for 'solr.jetty' (registry 'solr.jetty') enabled at server: com.sun.jmx.mbeanserver.JmxMBeanServer@38a3b585
   [junit4]   2> 867995 INFO  (TEST-TestReplicationHandler.doTestHandlerPathUnchanged-seed#[FB0E478E3EBACD4]) [    ] o.a.s.c.CorePropertiesLocator Found 1 core definitions underneath /Users/jenkins/workspace/Lucene-Solr-master-MacOSX/solr/build/solr-core/test/J0/temp/solr.handler.TestReplicationHandler_FB0E478E3EBACD4-001/solr-instance-001/.
   [junit4]   2> 867995 INFO  (TEST-TestReplicationHandler.doTestHandlerPathUnchanged-seed#[FB0E478E3EBACD4]) [    ] o.a.s.c.CorePropertiesLocator Cores are: [collection1]
   [junit4]   2> 867995 INFO  (coreLoadExecutor-3895-thread-1) [    ] o.a.s.c.TransientSolrCoreCacheDefault Allocating transient cache for 4 transient cores
   [junit4]   2> 868001 INFO  (coreLoadExecutor-3895-thread-1) [    ] o.a.s.c.SolrConfig Using Lucene MatchVersion: 8.0.0
   [junit4]   2> 868006 INFO  (coreLoadExecutor-3895-thread-1) [    ] o.a.s.s.IndexSchema [collection1] Schema name=test
   [junit4]   2> 868008 INFO  (coreLoadExecutor-3895-thread-1) [    ] o.a.s.s.IndexSchema Loaded schema test/1.2 with uniqueid field id
   [junit4]   2> 868008 INFO  (coreLoadExecutor-3895-thread-1) [    ] o.a.s.c.CoreContainer Creating SolrCore 'collection1' using configuration from instancedir /Users/jenkins/workspace/Lucene-Solr-master-MacOSX/solr/build/solr-core/test/J0/temp/solr.handler.TestReplicationHandler_FB0E478E3EBACD4-001/solr-instance-001/./collection1, trusted=true
   [junit4]   2> 868008 INFO  (coreLoadExecutor-3895-thread-1) [    ] o.a.s.m.r.SolrJmxReporter JMX monitoring for 'solr.core.collection1' (registry 'solr.core.collection1') enabled at server: com.sun.jmx.mbeanserver.JmxMBeanServer@38a3b585
   [junit4]   2> 868008 INFO  (coreLoadExecutor-3895-thread-1) [    ] o.a.s.c.SolrCore solr.RecoveryStrategy.Builder
   [junit4]   2> 868008 INFO  (coreLoadExecutor-3895-thread-1) [    ] o.a.s.c.SolrCore [[collection1] ] Opening new SolrCore at [/Users/jenkins/workspace/Lucene-Solr-master-MacOSX/solr/build/solr-core/test/J0/temp/solr.handler.TestReplicationHandler_FB0E478E3EBACD4-001/solr-instance-001/collection1], dataDir=[/Users/jenkins/workspace/Lucene-Solr-master-MacOSX/solr/build/solr-core/test/J0/temp/solr.handler.TestReplicationHandler_FB0E478E3EBACD4-001/solr-instance-001/./collection1/data/]
   [junit4]   2> 868020 INFO  (coreLoadExecutor-3895-thread-1) [    ] o.a.s.u.RandomMergePolicy RandomMergePolicy wrapping class org.apache.lucene.index.AlcoholicMergePolicy: [AlcoholicMergePolicy: minMergeSize=0, mergeFactor=10, maxMergeSize=2052693487, maxMergeSizeForForcedMerge=9223372036854775807, calibrateSizeByDeletes=true, maxMergeDocs=2147483647, maxCFSSegmentSizeMB=8.796093022207999E12, noCFSRatio=0.1]
   [junit4]   2> 868052 INFO  (coreLoadExecutor-3895-thread-1) [    ] o.a.s.u.CommitTracker Hard AutoCommit: disabled
   [junit4]   2> 868052 INFO  (coreLoadExecutor-3895-thread-1) [    ] o.a.s.u.CommitTracker Soft AutoCommit: disabled
   [junit4]   2> 868053 INFO  (coreLoadExecutor-3895-thread-1) [    ] o.a.s.u.RandomMergePolicy RandomMergePolicy wrapping class org.apache.lucene.index.LogDocMergePolicy: [LogDocMergePolicy: minMergeSize=1000, mergeFactor=17, maxMergeSize=9223372036854775807, maxMergeSizeForForcedMerge=9223372036854775807, calibrateSizeByDeletes=false, maxMergeDocs=2147483647, maxCFSSegmentSizeMB=8.796093022207999E12, noCFSRatio=1.0]
   [junit4]   2> 868053 INFO  (coreLoadExecutor-3895-thread-1) [    ] o.a.s.s.SolrIndexSearcher Opening [Searcher@7d6568e6[collection1] main]
   [junit4]   2> 868053 INFO  (coreLoadExecutor-3895-thread-1) [    ] o.a.s.r.ManagedResourceStorage File-based storage initialized to use dir: /Users/jenkins/workspace/Lucene-Solr-master-MacOSX/solr/build/solr-core/test/J0/temp/solr.handler.TestReplicationHandler_FB0E478E3EBACD4-001/solr-instance-001/collection1/conf
   [junit4]   2> 868054 INFO  (coreLoadExecutor-3895-thread-1) [    ] o.a.s.h.ReplicationHandler Replication enabled for following config files: schema.xml,xslt/dummy.xsl
   [junit4]   2> 868054 INFO  (coreLoadExecutor-3895-thread-1) [    ] o.a.s.h.ReplicationHandler Commits will be reserved for 10000ms.
   [junit4]   2> 868055 INFO  (searcherExecutor-3896-thread-1) [    ] o.a.s.c.SolrCore [collection1] Registered new searcher Searcher@7d6568e6[collection1] main{ExitableDirectoryReader(UninvertingDirectoryReader())}
   [junit4]   2> 868055 INFO  (TEST-TestReplicationHandler.doTestHandlerPathUnchanged-seed#[FB0E478E3EBACD4]) [    ] o.a.s.SolrTestCaseJ4 Writing core.properties file to /Users/jenkins/workspace/Lucene-Solr-master-MacOSX/solr/build/solr-core/test/J0/temp/solr.handler.TestReplicationHandler_FB0E478E3EBACD4-001/solr-instance-002/collection1
   [junit4]   2> 868058 INFO  (TEST-TestReplicationHandler.doTestHandlerPathUnchanged-seed#[FB0E478E3EBACD4]) [    ] o.e.j.s.Server jetty-9.3.20.v20170531
   [junit4]   2> 868059 INFO  (TEST-TestReplicationHandler.doTestHandlerPathUnchanged-seed#[FB0E478E3EBACD4]) [    ] o.e.j.s.h.ContextHandler Started o.e.j.s.ServletContextHandler@2c33c172{/solr,null,AVAILABLE}
   [junit4]   2> 868060 INFO  (TEST-TestReplicationHandler.doTestHandlerPathUnchanged-seed#[FB0E478E3EBACD4]) [    ] o.e.j.s.AbstractConnector Started ServerConnector@6c167ef4{HTTP/1.1,[http/1.1]}{127.0.0.1:57618}
   [junit4]   2> 868060 INFO  (TEST-TestReplicationHandler.doTestHandlerPathUnchanged-seed#[FB0E478E3EBACD4]) [    ] o.e.j.s.Server Started @869798ms
   [junit4]   2> 868060 INFO  (TEST-TestReplicationHandler.doTestHandlerPathUnchanged-seed#[FB0E478E3EBACD4]) [    ] o.a.s.c.s.e.JettySolrRunner Jetty properties: {hostContext=/solr, solr.data.dir=/Users/jenkins/workspace/Lucene-Solr-master-MacOSX/solr/build/solr-core/test/J0/temp/solr.handler.TestReplicationHandler_FB0E478E3EBACD4-001/solr-instance-002/collection1/data, hostPort=57618}
   [junit4]   2> 868060 ERROR (TEST-TestReplicationHandler.doTestHandlerPathUnchanged-seed#[FB0E478E3EBACD4]) [    ] o.a.s.u.StartupLoggingUtils Missing Java Option solr.log.dir. Logging may be missing or incomplete.
   [junit4]   2> 868060 INFO  (TEST-TestReplicationHandler.doTestHandlerPathUnchanged-seed#[FB0E478E3EBACD4]) [    ] o.a.s.s.SolrDispatchFilter  ___      _       Welcome to Apache Solr? version 8.0.0
   [junit4]   2> 868061 INFO  (TEST-TestReplicationHandler.doTestHandlerPathUnchanged-seed#[FB0E478E3EBACD4]) [    ] o.a.s.s.SolrDispatchFilter / __| ___| |_ _   Starting in standalone mode on port null
   [junit4]   2> 868061 INFO  (TEST-TestReplicationHandler.doTestHandlerPathUnchanged-seed#[FB0E478E3EBACD4]) [    ] o.a.s.s.SolrDispatchFilter \__ \/ _ \ | '_|  Install dir: null
   [junit4]   2> 868061 INFO  (TEST-TestReplicationHandler.doTestHandlerPathUnchanged-seed#[FB0E478E3EBACD4]) [    ] o.a.s.s.SolrDispatchFilter |___/\___/_|_|    Start time: 2017-12-19T01:29:08.343088Z
   [junit4]   2> 868061 INFO  (TEST-TestReplicationHandler.doTestHandlerPathUnchanged-seed#[FB0E478E3EBACD4]) [    ] o.a.s.c.SolrXmlConfig Loading container configuration from /Users/jenkins/workspace/Lucene-Solr-master-MacOSX/solr/build/solr-core/test/J0/temp/solr.handler.TestReplicationHandler_FB0E478E3EBACD4-001/solr-instance-002/solr.xml
   [junit4]   2> 868063 INFO  (TEST-TestReplicationHandler.doTestHandlerPathUnchanged-seed#[FB0E478E3EBACD4]) [    ] o.a.s.c.SolrXmlConfig Configuration parameter autoReplicaFailoverWorkLoopDelay is ignored
   [junit4]   2> 868063 INFO  (TEST-TestReplicationHandler.doTestHandlerPathUnchanged-seed#[FB0E478E3EBACD4]) [    ] o.a.s.c.SolrXmlConfig Configuration parameter autoReplicaFailoverBadNodeExpiration is ignored
   [junit4]   2> 868068 INFO  (TEST-TestReplicationHandler.doTestHandlerPathUnchanged-seed#[FB0E478E3EBACD4]) [    ] o.a.s.c.SolrXmlConfig MBean server found: com.sun.jmx.mbeanserver.JmxMBeanServer@38a3b585, but no JMX reporters were configured - adding default JMX reporter.
   [junit4]   2> 868102 INFO  (TEST-TestReplicationHandler.doTestHandlerPathUnchanged-seed#[FB0E478E3EBACD4]) [    ] o.a.s.m.r.SolrJmxReporter JMX monitoring for 'solr.node' (registry 'solr.node') enabled at server: com.sun.jmx.mbeanserver.JmxMBeanServer@38a3b585
   [junit4]   2> 868117 INFO  (TEST-TestReplicationHandler.doTestHandlerPathUnchanged-seed#[FB0E478E3EBACD4]) [    ] o.a.s.m.r.SolrJmxReporter JMX monitoring for 'solr.jvm' (registry 'solr.jvm') enabled at server: com.sun.jmx.mbeanserver.JmxMBeanServer@38a3b585
   [junit4]   2> 868117 INFO  (TEST-TestReplicationHandler.doTestHandlerPathUnchanged-seed#[FB0E478E3EBACD4]) [    ] o.a.s.m.r.SolrJmxReporter JMX monitoring for 'solr.jetty' (registry 'solr.jetty') enabled at server: com.sun.jmx.mbeanserver.JmxMBeanServer@38a3b585
   [junit4]   2> 868119 INFO  (TEST-TestReplicationHandler.doTestHandlerPathUnchanged-seed#[FB0E478E3EBACD4]) [    ] o.a.s.c.CorePropertiesLocator Found 1 core definitions underneath /Users/jenkins/workspace/Lucene-Solr-master-MacOSX/solr/build/solr-core/test/J0/temp/solr.handler.TestReplicationHandler_FB0E478E3EBACD4-001/solr-instance-002/.
   [junit4]   2> 868120 INFO  (TEST-TestReplicationHandler.doTestHandlerPathUnchanged-seed#[FB0E478E3EBACD4]) [    ] o.a.s.c.CorePropertiesLocator Cores are: [collection1]
   [junit4]   2> 868120 INFO  (coreLoadExecutor-3905-thread-1) [    ] o.a.s.c.TransientSolrCoreCacheDefault Allocating transient cache for 4 transient cores
   [junit4]   2> 868125 INFO  (coreLoadExecutor-3905-thread-1) [    ] o.a.s.c.SolrConfig Using Lucene MatchVersion: 8.0.0
   [junit4]   2> 868130 INFO  (coreLoadExecutor-3905-thread-1) [    ] o.a.s.s.IndexSchema [collection1] Schema name=test
   [junit4]   2> 868131 INFO  (coreLoadExecutor-3905-thread-1) [    ] o.a.s.s.IndexSchema Loaded schema test/1.2 with uniqueid field id
   [junit4]   2> 868131 INFO  (coreLoadExecutor-3905-thread-1) [    ] o.a.s.c.CoreContainer Creating SolrCore 'collection1' using configuration from instancedir /Users/jenkins/workspace/Lucene-Solr-master-MacOSX/solr/build/solr-core/test/J0/temp/solr.handler.TestReplicationHandler_FB0E478E3EBACD4-001/solr-instance-002/./collection1, trusted=true
   [junit4]   2> 868131 INFO  (coreLoadExecutor-3905-thread-1) [    ] o.a.s.m.r.SolrJmxReporter JMX monitoring for 'solr.core.collection1' (registry 'solr.core.collection1') enabled at server: com.sun.jmx.mbeanserver.JmxMBeanServer@38a3b585
   [junit4]   2> 868131 INFO  (coreLoadExecutor-3905-thread-1) [    ] o.a.s.c.SolrCore solr.RecoveryStrategy.Builder
   [junit4]   2> 868131 INFO  (coreLoadExecutor-3905-thread-1) [    ] o.a.s.c.SolrCore [[collection1] ] Opening new SolrCore at [/Users/jenkins/workspace/Lucene-Solr-master-MacOSX/solr/build/solr-core/test/J0/temp/solr.handler.TestReplicationHandler_FB0E478E3EBACD4-001/solr-instance-002/collection1], dataDir=[/Users/jenkins/workspace/Lucene-Solr-master-MacOSX/solr/build/solr-core/test/J0/temp/solr.handler.TestReplicationHandler_FB0E478E3EBACD4-001/solr-instance-002/./collection1/data/]
   [junit4]   2> 868133 INFO  (coreLoadExecutor-3905-thread-1) [    ] o.a.s.u.RandomMergePolicy RandomMergePolicy wrapping class org.apache.lucene.index.AlcoholicMergePolicy: [AlcoholicMergePolicy: minMergeSize=0, mergeFactor=10, maxMergeSize=2052693487, maxMergeSizeForForcedMerge=9223372036854775807, calibrateSizeByDeletes=true, maxMergeDocs=2147483647, maxCFSSegmentSizeMB=8.796093022207999E12, noCFSRatio=0.1]
   [junit4]   2> 868167 INFO  (coreLoadExecutor-3905-thread-1) [    ] o.a.s.u.CommitTracker Hard AutoCommit: disabled
   [junit4]   2> 868167 INFO  (coreLoadExecutor-3905-thread-1) [    ] o.a.s.u.CommitTracker Soft AutoCommit: disabled
   [junit4]   2> 868168 INFO  (coreLoadExecutor-3905-thread-1) [    ] o.a.s.u.RandomMergePolicy RandomMergePolicy wrapping class org.apache.lucene.index.LogDocMergePolicy: [LogDocMergePolicy: minMergeSize=1000, mergeFactor=17, maxMergeSize=9223372036854775807, maxMergeSizeForForcedMerge=9223372036854775807, calibrateSizeByDeletes=false, maxMergeDocs=2147483647, maxCFSSegmentSizeMB=8.796093022207999E12, noCFSRatio=1.0]
   [junit4]   2> 868168 INFO  (coreLoadExecutor-3905-thread-1) [    ] o.a.s.s.SolrIndexSearcher Opening [Searcher@19fb8473[collection1] main]
   [junit4]   2> 868168 INFO  (coreLoadExecutor-3905-thread-1) [    ] o.a.s.r.ManagedResourceStorage File-based storage initialized to use dir: /Users/jenkins/workspace/Lucene-Solr-master-MacOSX/solr/build/solr-core/test/J0/temp/solr.handler.TestReplicationHandler_FB0E478E3EBACD4-001/solr-instance-002/collection1/conf
   [junit4]   2> 868169 INFO  (coreLoadExecutor-3905-thread-1) [    ] o.a.s.h.ReplicationHandler Poll scheduled at an interval of 1000ms
   [junit4]   2> 868169 INFO  (coreLoadExecutor-3905-thread-1) [    ] o.a.s.h.ReplicationHandler Commits will be reserved for 10000ms.
   [junit4]   2> 868171 INFO  (searcherExecutor-3906-thread-1) [    ] o.a.s.c.SolrCore [collection1] Registered new searcher Searcher@19fb8473[collection1] main{ExitableDirectoryReader(UninvertingDirectoryReader())}
   [junit4]   2> 868171 INFO  (TEST-TestReplicationHandler.doTestHandlerPathUnchanged-seed#[FB0E478E3EBACD4]) [    ] o.a.s.SolrTestCaseJ4 ###Ending doTestHandlerPathUnchanged
   [junit4]   2> 868172 INFO  (indexFetcher-3910-thread-1) [    ] o.a.h.i.e.RetryExec I/O exception (org.apache.http.NoHttpResponseException) caught when processing request to {}->http://127.0.0.1:57617: The target server failed to respond
   [junit4]   2> 868172 INFO  (indexFetcher-3910-thread-1) [    ] o.a.h.i.e.RetryExec Retrying request to {}->http://127.0.0.1:57617
   [junit4]   2> 868172 INFO  (TEST-TestReplicationHandler.doTestHandlerPathUnchanged-seed#[FB0E478E3EBACD4]) [    ] o.e.j.s.AbstractConnector Stopped ServerConnector@3f4ed62c{HTTP/1.1,[http/1.1]}{127.0.0.1:0}
   [junit4]   2> 868172 INFO  (TEST-TestReplicationHandler.doTestHandlerPathUnchanged-seed#[FB0E478E3EBACD4]) [    ] o.a.s.c.CoreContainer Shutting down CoreContainer instance=1868214966
   [junit4]   2> 868173 INFO  (TEST-TestReplicationHandler.doTestHandlerPathUnchanged-seed#[FB0E478E3EBACD4]) [    ] o.a.s.m.SolrMetricManager Closing metric reporters for registry=solr.node, tag=null
   [junit4]   2> 868173 INFO  (TEST-TestReplicationHandler.doTestHandlerPathUnchanged-seed#[FB0E478E3EBACD4]) [    ] o.a.s.m.r.SolrJmxReporter Closing reporter [org.apache.solr.metrics.reporters.SolrJmxReporter@12a2b907: rootName = null, domain = solr.node, service url = null, agent id = null] for registry solr.node / com.codahale.metrics.MetricRegistry@279bb2d8
   [junit4]   2> 868173 WARN  (indexFetcher-3910-thread-1) [    ] o.a.s.h.IndexFetcher Master at: http://127.0.0.1:57617/solr/collection1 is not available. Index fetch failed by exception: org.apache.solr.common.SolrException: Server refused connection at: http://127.0.0.1:57617/solr/collection1
   [junit4]   2> 868177 INFO  (TEST-TestReplicationHandler.doTestHandlerPathUnchanged-seed#[FB0E478E3EBACD4]) [    ] o.a.s.m.SolrMetricManager Closing metric reporters for registry=solr.jvm, tag=null
   [junit4]   2> 868177 INFO  (TEST-TestReplicationHandler.doTestHandlerPathUnchanged-seed#[FB0E478E3EBACD4]) [    ] o.a.s.m.r.SolrJmxReporter Closing reporter [org.apache.solr.metrics.reporters.SolrJmxReporter@36bd3879: rootName = null, domain = solr.jvm, service url = null, agent id = null] for registry solr.jvm / com.codahale.metrics.MetricRegistry@7da2637c
   [junit4]   2> 868180 INFO  (TEST-TestReplicationHandler.doTestHandlerPathUnchanged-seed#[FB0E478E3EBACD4]) [    ] o.a.s.m.SolrMetricManager Closing metric reporters for registry=solr.jetty, tag=null
   [junit4]   2> 868180 INFO  (TEST-TestReplicationHandler.doTestHandlerPathUnchanged-seed#[FB0E478E3EBACD4]) [    ] o.a.s.m.r.SolrJmxReporter Closing reporter [org.apache.solr.metrics.reporters.SolrJmxReporter@708c879a: rootName = null, domain = solr.jetty, service url = null, agent id = null] for registry solr.jetty / com.codahale.metrics.MetricRegistry@38a0e2ac
   [junit4]   2> 868180 INFO  (coreCloseExecutor-3911-thread-1) [    ] o.a.s.c.SolrCore [collection1]  CLOSING SolrCore org.apache.solr.core.SolrCore@7b19669d
   [junit4]   2> 868181 INFO  (coreCloseExecutor-3911-thread-1) [    ] o.a.s.m.SolrMetricManager Closing metric reporters for registry=solr.core.collection1, tag=2065262237
   [junit4]   2> 868181 INFO  (coreCloseExecutor-3911-thread-1) [    ] o.a.s.m.r.SolrJmxReporter Closing reporter [org.apache.solr.metrics.reporters.SolrJmxReporter@53707c60: rootName = null, domain = solr.core.collection1, service url = null, agent id = null] for registry solr.core.collection1 / com.codahale.metrics.MetricRegistry@7d28d9d4
   [junit4]   2> 868186 INFO  (TEST-TestReplicationHandler.doTestHandlerPathUnchanged-seed#[FB0E478E3EBACD4]) [    ] o.e.j.s.h.ContextHandler Stopped o.e.j.s.ServletContextHandler@bbee722{/solr,null,UNAVAILABLE}
   [junit4]   2> 868187 INFO  (TEST-TestReplicationHandler.doTestHandlerPathUnchanged-seed#[FB0E478E3EBACD4]) [    ] o.e.j.s.AbstractConnector Stopped ServerConnector@6c167ef4{HTTP/1.1,[http/1.1]}{127.0.0.1:0}
   [junit4]   2> 868187 INFO  (TEST-TestReplicationHandler.doTestHandlerPathUnchanged-seed#[FB0E478E3EBACD4]) [    ] o.a.s.c.CoreContainer Shutting down CoreContainer instance=1177840932
   [junit4]   2> 868188 INFO  (TEST-TestReplicationHandler.doTestHandlerPathUnchanged-seed#[FB0E478E3EBACD4]) [    ] o.a.s.m.SolrMetricManager Closing metric reporters for registry=solr.node, tag=null
   [junit4]   2> 868188 INFO  (TEST-TestReplicationHandler.doTestHandlerPathUnchanged-seed#[FB0E478E3EBACD4]) [    ] o.a.s.m.r.SolrJmxReporter Closing reporter [org.apache.solr.metrics.reporters.SolrJmxReporter@2be885f2: rootName = null, domain = solr.node, service url = null, agent id = null] for registry solr.node / com.codahale.metrics.MetricRegistry@5caae46a
   [junit4]   2> 868193 INFO  (TEST-TestReplicationHandler.doTestHandlerPathUnchanged-seed#[FB0E478E3EBACD4]) [    ] o.a.s.m.SolrMetricManager Closing metric reporters for registry=solr.jvm, tag=null
   [junit4]   2> 868193 INFO  (TEST-TestReplicationHandler.doTestHandlerPathUnchanged-seed#[FB0E478E3EBACD4]) [    ] o.a.s.m.r.SolrJmxReporter Closing reporter [org.apache.solr.metrics.reporters.SolrJmxReporter@5e67735b: rootName = null, domain = solr.jvm, service url = null, agent id = null] for registry solr.jvm / com.codahale.metrics.MetricRegistry@7da2637c
   [junit4]   2> 868198 INFO  (TEST-TestReplicationHandler.doTestHandlerPathUnchanged-seed#[FB0E478E3EBACD4]) [    ] o.a.s.m.SolrMetricManager Closing metric reporters for registry=solr.jetty, tag=null
   [junit4]   2> 868198 INFO  (TEST-TestReplicationHandler.doTestHandlerPathUnchanged-seed#[FB0E478E3EBACD4]) [    ] o.a.s.m.r.SolrJmxReporter Closing reporter [org.apache.solr.metrics.reporters.SolrJmxReporter@6e623152: rootName = null, domain = solr.jetty, service url = null, agent id = null] for registry solr.jetty / com.codahale.metrics.MetricRegistry@38a0e2ac
   [junit4]   2> 868199 INFO  (coreCloseExecutor-3913-thread-1) [    ] o.a.s.c.SolrCore [collection1]  CLOSING SolrCore org.apache.solr.core.SolrCore@70e4b8af
   [junit4]   2> 868199 INFO  (coreCloseExecutor-3913-thread-1) [    ] o.a.s.m.SolrMetricManager Closing metric reporters for registry=solr.core.collection1, tag=1894037679
   [junit4]   2> 868199 INFO  (coreCloseExecutor-3913-thread-1) [    ] o.a.s.m.r.SolrJmxReporter Closing reporter [org.apache.solr.metrics.reporters.SolrJmxReporter@3d6f93c7: rootName = null, domain = solr.core.collection1, service url = null, agent id = null] for registry solr.core.collection1 / com.codahale.metrics.MetricRegistry@691a3795
   [junit4]   2> 868208 INFO  (TEST-TestReplicationHandler.doTestHandlerPathUnchanged-seed#[FB0E478E3EBACD4]) [    ] o.e.j.s.h.ContextHandler Stopped o.e.j.s.ServletContextHandler@2c33c172{/solr,null,UNAVAILABLE}
   [junit4]   2> 868210 INFO  (TEST-TestReplicationHandler.doTestIndexAndConfigReplication-seed#[FB0E478E3EBACD4]) [    ] o.a.s.SolrTestCaseJ4 ###Starting doTestIndexAndConfigReplication
   [junit4]   2> 868211 INFO  (TEST-TestReplicationHandler.doTestIndexAndConfigReplication-seed#[FB0E478E3EBACD4]) [    ] o.a.s.SolrTestCaseJ4 Writing core.properties file to /Users/jenkins/workspace/Lucene-Solr-master-MacOSX/solr/build/solr-core/test/J0/temp/solr.handler.TestReplicationHandler_FB0E478E3EBACD4-001/solr-instance-003/collection1
   [junit4]   2> 868222 INFO  (TEST-TestReplicationHandler.doTestIndexAndConfigReplication-seed#[FB0E478E3EBACD4]) [    ] o.e.j.s.Server jetty-9.3.20.v20170531
   [junit4]   2> 868223 INFO  (TEST-TestReplicationHandler.doTestIndexAndConfigReplication-seed#[FB0E478E3EBACD4]) [    ] o.e.j.s.h.ContextHandler Started o.e.j.s.ServletContextHandler@65b67d18{/solr,null,AVAILABLE}
   [junit4]   2> 868223 INFO  (TEST-TestReplicationHandler.doTestIndexAndConfigReplication-seed#[FB0E478E3EBACD4]) [    ] o.e.j.s.AbstractConnector Started ServerConnector@556b240c{HTTP/1.1,[http/1.1]}{127.0.0.1:57621}
   [junit4]   2> 868224 INFO  (TEST-TestReplicationHandler.doTestIndexAndConfigReplication-seed#[FB0E478E3EBACD4]) [    ] o.e.j.s.Server Started @869962ms
   [junit4]   2> 868224 INFO  (TEST-TestReplicationHandler.doTestIndexAndConfigReplication-seed#[FB0E478E3EBACD4]) [    ] o.a.s.c.s.e.JettySolrRunner Jetty properties: {hostContext=/solr, solr.data.dir=/Users/jenkins/workspace/Lucene-Solr-master-MacOSX/solr/build/solr-core/test/J0/temp/solr.handler.TestReplicationHandler_FB0E478E3EBACD4-001/solr-instance-003/collection1/data, hostPort=57621}
   [junit4]   2> 868224 ERROR (TEST-TestReplicationHandler.doTestIndexAndConfigReplication-seed#[FB0E478E3EBACD4]) [    ] o.a.s.u.StartupLoggingUtils Missing Java Option solr.log.dir. Logging may be missing or incomplete.
   [junit4]   2> 868224 INFO  (TEST-TestReplicationHandler.doTestIndexAndConfigReplication-seed#[FB0E478E3EBACD4]) [    ] o.a.s.s.SolrDispatchFilter  ___      _       Welcome to Apache Solr? version 8.0.0
   [junit4]   2> 868224 INFO  (TEST-TestReplicationHandler.doTestIndexAndConfigReplication-seed#[FB0E478E3EBACD4]) [    ] o.a.s.s.SolrDispatchFilter / __| ___| |_ _   Starting in standalone mode on port null
   [junit4]   2> 868224 INFO  (TEST-TestReplicationHandler.doTestIndexAndConfigReplication-seed#[FB0E478E3EBACD4]) [    ] o.a.s.s.SolrDispatchFilter \__ \/ _ \ | '_|  Install dir: null
   [junit4]   2> 868224 INFO  (TEST-TestReplicationHandler.doTestIndexAndConfigReplication-seed#[FB0E478E3EBACD4]) [    ] o.a.s.s.SolrDispatchFilter |___/\___/_|_|    Start time: 2017-12-19T01:29:08.506680Z
   [junit4]   2> 868224 INFO  (TEST-TestReplicationHandler.doTestIndexAndConfigReplication-seed#[FB0E478E3EBACD4]) [    ] o.a.s.c.SolrXmlConfig Loading container configuration from /Users/jenkins/workspace/Lucene-Solr-master-MacOSX/solr/build/solr-core/test/J0/temp/solr.handler.TestReplicationHandler_FB0E478E3EBACD4-001/solr-instance-003/solr.xml
   [junit4]   2> 868226 INFO  (TEST-TestReplicationHandler.doTestIndexAndConfigReplication-seed#[FB0E478E3EBACD4]) [    ] o.a.s.c.SolrXmlConfig Configuration parameter autoReplicaFailoverWorkLoopDelay is ignored
   [junit4]   2> 868226 INFO  (TEST-TestReplicationHandler.doTestIndexAndConfigReplication-seed#[FB0E478E3EBACD4]) [    ] o.a.s.c.SolrXmlConfig Configuration parameter autoReplicaFailoverBadNodeExpiration is ignored
   [junit4]   2> 868227 INFO  (TEST-TestReplicationHandler.doTestIndexAndConfigReplication-seed#[FB0E478E3EBACD4]) [    ] o.a.s.c.SolrXmlConfig MBean server found: com.sun.jmx.mbeanserver.JmxMBeanServer@38a3b585, but no JMX reporters were configured - adding default JMX reporter.
   [junit4]   2> 868256 INFO  (TEST-TestReplicationHandler.doTestIndexAndConfigReplication-seed#[FB0E478E3EBACD4]) [    ] o.a.s.m.r.SolrJmxReporter JMX monitoring for 'solr.node' (registry 'solr.node') enabled at server: com.sun.jmx.mbeanserver.JmxMBeanServer@38a3b585
   [junit4]   2> 868265 INFO  (TEST-TestReplicationHandler.doTestIndexAndConfigReplication-seed#[FB0E478E3EBACD4]) [    ] o.a.s.m.r.SolrJmxReporter JMX monitoring for 'solr.jvm' (registry 'solr.jvm') enabled at server: com.sun.jmx.mbeanserver.JmxMBeanServer@38a3b585
   [junit4]   2> 868265 INFO  (TEST-TestReplicationHandler.doTestIndexAndConfigReplication-seed#[FB0E478E3EBACD4]) [    ] o.a.s.m.r.SolrJmxReporter JMX monitoring for 'solr.jetty' (registry 'solr.jetty') enabled at server: com.sun.jmx.mbeanserver.JmxMBeanServer@38a3b585
   [junit4]   2> 868267 INFO  (TEST-TestReplicationHandler.doTestIndexAndConfigReplication-seed#[FB0E478E3EBACD4]) [    ] o.a.s.c.CorePropertiesLocator Found 1 core definitions underneath /Users/jenkins/workspace/Lucene-Solr-master-MacOSX/solr/build/solr-core/test/J0/temp/solr.handler.TestReplicationHandler_FB0E478E3EBACD4-001/solr-instance-003/.
   [junit4]   2> 868267 INFO  (TEST-TestReplicationHandler.doTestIndexAndConfigReplication-seed#[FB0E478E3EBACD4]) [    ] o.a.s.c.CorePropertiesLocator Cores are: [collection1]
   [junit4]   2> 868267 INFO  (coreLoadExecutor-3920-thread-1) [    ] o.a.s.c.TransientSolrCoreCacheDefault Allocating transient cache for 4 transient cores
   [junit4]   2> 868273 INFO  (coreLoadExecutor-3920-thread-1) [    ] o.a.s.c.SolrConfig Using Lucene MatchVersion: 8.0.0
   [junit4]   2> 868278 INFO  (coreLoadExecutor-3920-thread-1) [    ] o.a.s.s.IndexSchema [collection1] Schema name=test
   [junit4]   2> 868279 INFO  (coreLoadExecutor-3920-thread-1) [    ] o.a.s.s.IndexSchema Loaded schema test/1.2 with uniqueid field id
   [junit4]   2> 868279 INFO  (coreLoadExecutor-3920-thread-1) [    ] o.a.s.c.CoreContainer Creating SolrCore 'collection1' using configuration from instancedir /Users/jenkins/workspace/Lucene-Solr-master-MacOSX/solr/build/solr-core/test/J0/temp/solr.handler.TestReplicationHandler_FB0E478E3EBACD4-001/solr-instance-003/./collection1, trusted=true
   [junit4]   2> 868279 INFO  (coreLoadExecutor-3920-thread-1) [    ] o.a.s.m.r.SolrJmxReporter JMX monitoring for 'solr.core.collection1' (registry 'solr.core.collection1') enabled at server: com.sun.jmx.mbeanserver.JmxMBeanServer@38a3b585
   [junit4]   2> 868279 INFO  (coreLoadExecutor-3920-thread-1) [    ] o.a.s.c.SolrCore solr.RecoveryStrategy.Builder
   [junit4]   2> 868279 INFO  (coreLoadExecutor-3920-thread-1) [    ] o.a.s.c.SolrCore [[collection1] ] Opening new SolrCore at [/Users/jenkins/workspace/Lucene-Solr-master-MacOSX/solr/build/solr-core/test/J0/temp/solr.handler.TestReplicationHandler_FB0E478E3EBACD4-001/solr-instance-003/collection1], dataDir=[/Users/jenkins/workspace/Lucene-Solr-master-MacOSX/solr/build/solr-core/test/J0/temp/solr.handler.TestReplicationHandler_FB0E478E3EBACD4-001/solr-instance-003/./collection1/data/]
   [junit4]   2> 868281 INFO  (coreLoadExecutor-3920-thread-1) [    ] o.a.s.u.RandomMergePolicy RandomMergePolicy wrapping class org.apache.lucene.index.AlcoholicMergePolicy: [AlcoholicMergePolicy: minMergeSize=0, mergeFactor=10, maxMergeSize=2052693487, maxMergeSizeForForcedMerge=9223372036854775807, calibrateSizeByDeletes=true, maxMergeDocs=2147483647, maxCFSSegmentSizeMB=8.796093022207999E12, noCFSRatio=0.1]
   [junit4]   2> 868324 INFO  (coreLoadExecutor-3920-thread-1) [    ] o.a.s.u.CommitTracker Hard AutoCommit: disabled
   [junit4]   2> 868324 INFO  (coreLoadExecutor-3920-thread-1) [    ] o.a.s.u.CommitTracker Soft AutoCommit: disabled
   [junit4]   2> 868330 INFO  (coreLoadExecutor-3920-thread-1) [    ] o.a.s.u.RandomMergePolicy RandomMergePolicy wrapping class org.apache.lucene.index.LogDocMergePolicy: [LogDocMergePolicy: minMergeSize=1000, mergeFactor=17, maxMergeSize=9223372036854775807, maxMergeSizeForForcedMerge=9223372036854775807, calibrateSizeByDeletes=false, maxMergeDocs=2147483647, maxCFSSegmentSizeMB=8.796093022207999E12, noCFSRatio=1.0]
   [junit4]   2> 868330 INFO  (coreLoadExecutor-3920-thread-1) [    ] o.a.s.s.SolrIndexSearcher Opening [Searcher@44c5b6ce[collection1] main]
   [junit4]   2> 868331 INFO  (coreLoadExecutor-3920-thread-1) [    ] o.a.s.r.ManagedResourceStorage File-based storage initialized to use dir: /Users/jenkins/workspace/Lucene-Solr-master-MacOSX/solr/build/solr-core/test/J0/temp/solr.handler.TestReplicationHandler_FB0E478E3EBACD4-001/solr-instance-003/collection1/conf
   [junit4]   2> 868331 INFO  (coreLoadExecutor-3920-thread-1) [    ] o.a.s.h.ReplicationHandler Replication enabled for following config files: schema.xml,xslt/dummy.xsl
   [junit4]   2> 868331 INFO  (coreLoadExecutor-3920-thread-1) [    ] o.a.s.h.ReplicationHandler Commits will be reserved for 10000ms.
   [junit4]   2> 868332 INFO  (searcherExecutor-3921-thread-1) [    ] o.a.s.c.SolrCore [collection1] Registered new searcher Searcher@44c5b6ce[collection1] main{ExitableDirectoryReader(UninvertingDirectoryReader())}
   [junit4]   2> 868333 INFO  (TEST-TestReplicationHandler.doTestIndexAndConfigReplication-seed#[FB0E478E3EBACD4]) [    ] o.a.s.SolrTestCaseJ4 Writing core.properties file to /Users/jenkins/workspace/Lucene-Solr-master-MacOSX/solr/build/solr-core/test/J0/temp/solr.handler.TestReplicationHandler_FB0E478E3EBACD4-001/solr-instance-004/collection1
   [junit4]   2> 868336 INFO  (TEST-TestReplicationHandler.doTestIndexAndConfigReplication-seed#[FB0E478E3EBACD4]) [    ] o.e.j.s.Server jetty-9.3.20.v20170531
   [junit4]   2> 868337 INFO  (TEST-TestReplicationHandler.doTestIndexAndConfigReplication-seed#[FB0E478E3EBACD4]) [    ] o.e.j.s.h.ContextHandler Started o.e.j.s.ServletContextHandler@246c3eb3{/solr,null,AVAILABLE}
   [junit4]   2> 868338 INFO  (TEST-TestReplicationHandler.doTestIndexAndConfigReplication-seed#[FB0E478E3EBACD4]) [    ] o.e.j.s.AbstractConnector Started ServerConnector@15dcacd{HTTP/1.1,[http/1.1]}{127.0.0.1:57626}
   [junit4]   2> 868338 INFO  (TEST-TestReplicationHandler.doTestIndexAndConfigReplication-seed#[FB0E478E3EBACD4]) [    ] o.e.j.s.Server Started @870076ms
   [junit4]   2> 868338 INFO  (TEST-TestReplicationHandler.doTestIndexAndConfigReplication-seed#[FB0E478E3EBACD4]) [    ] o.a.s.c.s.e.JettySolrRunner Jetty properties: {hostContext=/solr, solr.data.dir=/Users/jenkins/workspace/Lucene-Solr-master-MacOSX/solr/build/solr-core/test/J0/temp/solr.handler.TestReplicationHandler_FB0E478E3EBACD4-001/solr-instance-004/collection1/data, hostPort=57626}
   [junit4]   2> 868338 ERROR (TEST-TestReplicationHandler.doTestIndexAndConfigReplication-seed#[FB0E478E3EBACD4]) [    ] o.a.s.u.StartupLoggingUtils Missing Java Option solr.log.dir. Logging may be missing or incomplete.
   [junit4]   2> 868338 INFO  (TEST-TestReplicationHandler.doTestIndexAndConfigReplication-seed#[FB0E478E3EBACD4]) [    ] o.a.s.s.SolrDispatchFilter  ___      _       Welcome to Apache Solr? version 8.0.0
   [junit4]   2> 868338 INFO  (TEST-TestReplicationHandler.doTestIndexAndConfigReplication-seed#[FB0E478E3EBACD4]) [    ] o.a.s.s.SolrDispatchFilter / __| ___| |_ _   Starting in standalone mode on port null
   [junit4]   2> 868338 INFO  (TEST-TestReplicationHandler.doTestIndexAndConfigReplication-seed#[FB0E478E3EBACD4]) [    ] o.a.s.s.SolrDispatchFilter \__ \/ _ \ | '_|  Install dir: null
   [junit4]   2> 868338 INFO  (TEST-TestReplicationHandler.doTestIndexAndConfigReplication-seed#[FB0E478E3EBACD4]) [    ] o.a.s.s.SolrDispatchFilter |___/\___/_|_|    Start time: 2017-12-19T01:29:08.620892Z
   [junit4]   2> 868339 INFO  (TEST-TestReplicationHandler.doTestIndexAndConfigReplication-seed#[FB0E478E3EBACD4]) [    ] o.a.s.c.SolrXmlConfig Loading container configuration from /Users/jenkins/workspace/Lucene-Solr-master-MacOSX/solr/build/solr-core/test/J0/temp/solr.handler.TestReplicationHandler_FB0E478E3EBACD4-001/solr-instance-004/solr.xml
   [junit4]   2> 868349 INFO  (TEST-TestReplicationHandler.doTestIndexAndConfigReplication-seed#[FB0E478E3EBACD4]) [    ] o.a.s.c.SolrXmlConfig Configuration parameter autoReplicaFailoverWorkLoopDelay is ignored
   [junit4]   2> 868349 INFO  (TEST-TestReplicationHandler.doTestIndexAndConfigReplication-seed#[FB0E478E3EBACD4]) [    ] o.a.s.c.SolrXmlConfig Configuration parameter autoReplicaFailoverBadNodeExpiration is ignored
   [junit4]   2> 868356 INFO  (TEST-TestReplicationHandler.doTestIndexAndConfigReplication-seed#[FB0E478E3EBACD4]) [    ] o.a.s.c.SolrXmlConfig MBean server found: com.sun.jmx.mbeanserver.JmxMBeanServer@38a3b585, but no JMX reporters were configured - adding default JMX reporter.
   [junit4]   2> 868387 INFO  (TEST-TestReplicationHandler.doTestIndexAndConfigReplication-seed#[FB0E478E3EBACD4]) [    ] o.a.s.m.r.SolrJmxReporter JMX monitoring for 'solr.node' (registry 'solr.node') enabled at server: com.sun.jmx.mbeanserver.JmxMBeanServer@38a3b585
   [junit4]   2> 868397 INFO  (TEST-TestReplicationHandler.doTestIndexAndConfigReplication-seed#[FB0E478E3EBACD4]) [    ] o.a.s.m.r.SolrJmxReporter JMX monitoring for 'solr.jvm' (registry 'solr.jvm') enabled at server: com.sun.jmx.mbeanserver.JmxMBeanServer@38a3b585
   [junit4]   2> 868397 INFO  (TEST-TestReplicationHandler.doTestIndexAndConfigReplication-seed#[FB0E478E3EBACD4]) [    ] o.a.s.m.r.SolrJmxReporter JMX monitoring for 'solr.jetty' (registry 'solr.jetty') enabled at server: com.sun.jmx.mbeanserver.JmxMBeanServer@38a3b585
   [junit4]   2> 868403 INFO  (TEST-TestReplicationHandler.doTestIndexAndConfigReplication-seed#[FB0E478E3EBACD4]) [    ] o.a.s.c.CorePropertiesLocator Found 1 core definitions underneath /Users/jenkins/workspace/Lucene-Solr-master-MacOSX/solr/build/solr-core/test/J0/temp/solr.handler.TestReplicationHandler_FB0E478E3EBACD4-001/solr-instance-004/.
   [junit4]   2> 868403 INFO  (TEST-TestReplicationHandler.doTestIndexAndConfigReplication-seed#[FB0E478E3EBACD4]) [    ] o.a.s.c.CorePropertiesLocator Cores are: [collection1]
   [junit4]   2> 868403 INFO  (coreLoadExecutor-3930-thread-1) [    ] o.a.s.c.TransientSolrCoreCacheDefault Allocating transient cache for 4 transient cores
   [junit4]   2> 868408 INFO  (coreLoadExecutor-3930-thread-1) [    ] o.a.s.c.SolrConfig Using Lucene MatchVersion: 8.0.0
   [junit4]   2> 868413 INFO  (coreLoadExecutor-3930-thread-1) [    ] o.a.s.s.IndexSchema [collection1] Schema name=test
   [junit4]   2> 868414 INFO  (coreLoadExecutor-3930-thread-1) [    ] o.a.s.s.IndexSchema Loaded schema test/1.2 with uniqueid field id
   [junit4]   2> 868414 INFO  (coreLoadExecutor-3930-thread-1) [    ] o.a.s.c.CoreContainer Creating SolrCore 'collection1' using configuration from instancedir /Users/jenkins/workspace/Lucene-Solr-master-MacOSX/solr/build/solr-core/test/J0/temp/solr.handler.TestReplicationHandler_FB0E478E3EBACD4-001/solr-instance-004/./collection1, trusted=true
   [junit4]   2> 868415 INFO  (coreLoadExecutor-3930-thread-1) [    ] o.a.s.m.r.SolrJmxReporter JMX monitoring for 'solr.core.collection1' (registry 'solr.core.collection1') enabled at server: com.sun.jmx.mbeanserver.JmxMBeanServer@38a3b585
   [junit4]   2> 868415 INFO  (coreLoadExecutor-3930-thread-1) [    ] o.a.s.c.SolrCore solr.RecoveryStrategy.Builder
   [junit4]   2> 868415 INFO  (coreLoadExecutor-3930-thread-1) [    ] o.a.s.c.SolrCore [[collection1] ] Opening new SolrCore at [/Users/jenkins/workspace/Lucene-Solr-master-MacOSX/solr/build/solr-core/test/J0/temp/solr.handler.TestReplicationHandler_FB0E478E3EBACD4-001/solr-instance-004/collection1], dataDir=[/Users/jenkins/workspace/Lucene-Solr-master-MacOSX/solr/build/solr-core/test/J0/temp/solr.handler.TestReplicationHandler_FB0E478E3EBACD4-001/solr-instance-004/./collection1/data/]
   [junit4]   2> 868427 INFO  (coreLoadExecutor-3930-thread-1) [    ] o.a.s.u.RandomMergePolicy RandomMergePolicy wrapping class org.apache.lucene.index.AlcoholicMergePolicy: [AlcoholicMergePolicy: minMergeSize=0, mergeFactor=10, maxMergeSize=2052693487, maxMergeSizeForForcedMerge=9223372036854775807, calibrateSizeByDeletes=true, maxMergeDocs=2147483647, maxCFSSegmentSizeMB=8.796093022207999E12, noCFSRatio=0.1]
   [junit4]   2> 868469 INFO  (coreLoadExecutor-3930-thread-1) [    ] o.a.s.u.CommitTracker Hard AutoCommit: disabled
   [junit4]   2> 868469 INFO  (coreLoadExecutor-3930-thread-1) [    ] o.a.s.u.CommitTracker Soft AutoCommit: disabled
   [junit4]   2> 868469 INFO  (coreLoadExecutor-3930-thread-1) [    ] o.a.s.u.RandomMergePolicy RandomMergePolicy wrapping class org.apache.lucene.index.LogDocMergePolicy: [LogDocMergePolicy: minMergeSize=1000, mergeFactor=17, maxMergeSize=9223372036854775807, maxMergeSizeForForcedMerge=9223372036854775807, calibrateSizeByDeletes=false, maxMergeDocs=2147483647, maxCFSSegmentSizeMB=8.796093022207999E12, noCFSRatio=1.0]
   [junit4]   2> 868469 INFO  (coreLoadExecutor-3930-thread-1) [    ] o.a.s.s.SolrIndexSearcher Opening [Searcher@6e5505d[collection1] main]
   [junit4]   2> 868470 INFO  (coreLoadExecutor-3930-thread-1) [    ] o.a.s.r.ManagedResourceStorage File-based storage initialized to use dir: /Users/jenkins/workspace/Lucene-Solr-master-MacOSX/solr/build/solr-core/test/J0/temp/solr.handler.TestReplicationHandler_FB0E478E3EBACD4-001/solr-instance-004/collection1/conf
   [junit4]   2> 868471 INFO  (coreLoadExecutor-3930-thread-1) [    ] o.a.s.h.ReplicationHandler Poll scheduled at an interval of 1000ms
   [junit4]   2> 868471 INFO  (coreLoadExecutor-3930-thread-1) [    ] o.a.s.h.ReplicationHandler Commits will be reserved for 10000ms.
   [junit4]   2> 868472 INFO  (searcherExecutor-3931-thread-1) [    ] o.a.s.c.SolrCore [collection1] Registered new searcher Searcher@6e5505d[collection1] main{ExitableDirectoryReader(UninvertingDirectoryReader())}
   [junit4]   2> 868473 INFO  (qtp911239835-11202) [    ] o.a.s.c.S.Request [collection1]  webapp=/solr path=/replication params={qt=/replication&wt=javabin&version=2&command=indexversion} status=0 QTime=0
   [junit4]   2> 868474 INFO  (indexFetcher-3935-thread-1) [    ] o.a.s.h.IndexFetcher Master's generation: 1
   [junit4]   2> 868474 INFO  (indexFetcher-3935-thread-1) [    ] o.a.s.h.IndexFetcher Master's version: 0
   [junit4]   2> 868474 INFO  (indexFetcher-3935-thread-1) [    ] o.a.s.h.IndexFetcher Slave's generation: 1
   [junit4]   2> 868474 INFO  (indexFetcher-3935-thread-1) [    ] o.a.s.h.IndexFetcher Slave's version: 0
   [junit4]   2> 868474 INFO  (indexFetcher-3935-thread-1) [    ] o.a.s.h.IndexFetcher New index in Master. Deleting mine...
   [junit4]   2> 868474 INFO  (indexFetcher-3935-thread-1) [    ] o.a.s.u.DirectUpdateHandler2 start commit{,optimize=false,openSearcher=true,waitSearcher=true,expungeDeletes=false,softCommit=false,prepareCommit=false}
   [junit4]   2> 868474 INFO  (indexFetcher-3935-thread-1) [    ] o.a.s.u.SolrIndexWriter Calling setCommitData with IW:org.apache.solr.update.SolrIndexWriter@7feae90b commitCommandVersion:0
   [junit4]   2> 868475 INFO  (qtp911239835-11203) [    ] o.a.s.c.S.Request [collection1]  webapp=/solr path=/select params={q=*:*&sort=id+desc&wt=javabin&version=2} hits=0 status=0 QTime=0
   [junit4]   2> 868476 INFO  (qtp911239835-11203) [    ] o.a.s.u.p.LogUpdateProcessorFactory [collection1]  webapp=/solr path=/update params={wt=javabin&version=2}{add=[0]} 0 0
   [junit4]   2> 868477 INFO  (qtp911239835-11203) [    ] o.a.s.u.p.LogUpdateProcessorFactory [collection1]  webapp=/solr path=/update params={wt=javabin&version=2}{add=[1]} 0 0
   [junit4]   2> 868477 INFO  (qtp911239835-11203) [    ] o.a.s.u.p.LogUpdateProcessorFactory [collection1]  webapp=/solr path=/update params={wt=javabin&version=2}{add=[2]} 0 0
   [junit4]   2> 868478 INFO  (qtp911239835-11203) [    ] o.a.s.u.p.LogUpdateProcessorFactory [collection1]  webapp=/solr path=/update params={wt=javabin&version=2}{add=[3]} 0 0
   [junit4]   2> 868478 INFO  (qtp911239835-11203) [    ] o.a.s.u.p.LogUpdateProcessorFactory [collection1]  webapp=/solr path=/update params={wt=javabin&version=2}{add=[4]} 0 0
   [junit4]   2> 868478 INFO  (qtp911239835-11203) [    ] o.a.s.u.p.LogUpdateProcessorFactory [collection1]  webapp=/solr path=/update params={wt=javabin&version=2}{add=[5]} 0 0
   [junit4]   2> 868479 INFO  (qtp911239835-11203) [    ] o.a.s.u.p.LogUpdateProcessorFactory [collection1]  webapp=/solr path=/update params={wt=javabin&version=2}{add=[6]} 0 0
   [junit4]   2> 868479 INFO  (qtp911239835-11203) [    ] o.a.s.u.p.LogUpdateProcessorFactory [collection1]  webapp=/solr path=/update params={wt=javabin&version=2}{add=[7]} 0 0
   [junit4]   2> 868482 INFO  (qtp911239835-11203) [    ] o.a.s.u.p.LogUpdateProcessorFactory [collection1]  webapp=/solr path=/update params={wt=javabin&version=2}{add=[8]} 0 0
   [junit4]   2> 868486 INFO  (qtp911239835-11203) [    ] o.a.s.u.p.LogUpdateProcessorFactory [collection1]  webapp=/solr path=/update params={wt=javabin&version=2}{add=[9]} 0 0
   [junit4]   2> 868486 INFO  (qtp911239835-11202) [    ] o.a.s.u.p.LogUpdateProcessorFactory [collection1]  webapp=/solr path=/update params={wt=javabin&version=2}{add=[10]} 0 0
   [junit4]   2> 868487 INFO  (qtp911239835-11202) [    ] o.a.s.u.p.LogUpdateProcessorFactory [collection1]  webapp=/solr path=/update params={wt=javabin&version=2}{add=[11]} 0 0
   [junit4]   2> 868487 INFO  (qtp911239835-11205) [    ] o.a.s.u.p.LogUpdateProcessorFactory [collection1]  webapp=/solr path=/update params={wt=javabin&version=2}{add=[12]} 0 0
   [junit4]   2> 868487 INFO  (qtp911239835-11205) [    ] o.a.s.u.p.LogUpdateProcessorFactory [collection1]  webapp=/solr path=/update params={wt=javabin&version=2}{add=[13]} 0 0
   [junit4]   2> 868488 INFO  (qtp911239835-11205) [    ] o.a.s.u.p.LogUpdateProcessorFactory [collection1]  webapp=/solr path=/update params={wt=javabin&version=2}{add=[14]} 0 0
   [junit4]   2> 868488 INFO  (qtp911239835-11205) [    ] o.a.s.u.p.LogUpdateProcessorFactory [collection1]  webapp=/solr path=/update params={wt=javabin&version=2}{add=[15]} 0 0
   [junit4]   2> 868489 INFO  (qtp911239835-11205) [    ] o.a.s.u.p.LogUpdateProcessorFactory [collection1]  webapp=/solr path=/update params={wt=javabin&version=2}{add=[16]} 0 0
   [junit4]   2> 868489 INFO  (qtp911239835-11205) [    ] o.a.s.u.p.LogUpdateProcessorFactory [collection1]  webapp=/solr path=/update params={wt=javabin&version=2}{add=[17]} 0 0
   [junit4]   2> 868489 INFO  (qtp911239835-11205) [    ] o.a.s.u.p.LogUpdateProcessorFactory [collection1]  webapp=/solr path=/update params={wt=javabin&version=2}{add=[18]} 0 0
   [junit4]   2> 868490 INFO  (qtp911239835-11205) [    ] o.a.s.u.p.LogUpdateProcessorFactory [collection1]  webapp=/solr path=/update params={wt=javabin&version=2}{add=[19]} 0 0
   [junit4]   2> 868490 INFO  (qtp911239835-11205) [    ] o.a.s.u.p.LogUpdateProcessorFactory [collection1]  webapp=/solr path=/update params={wt=javabin&version=2}{add=[20]} 0 0
   [junit4]   2> 868491 INFO  (qtp911239835-11205) [    ] o.a.s.u.p.LogUpdateProcessorFactory [collection1]  webapp=/solr path=/update params={wt=javabin&version=2}{add=[21]} 0 0
   [junit4]   2> 868491 INFO  (qtp911239835-11205) [    ] o.a.s.u.p.LogUpdateProcessorFactory [collection1]  webapp=/solr path=/update params={wt=javabin&version=2}{add=[22]} 0 0
   [junit4]   2> 868491 INFO  (qtp911239835-11205) [    ] o.a.s.u.p.LogUpdateProcessorFactory [collection1]  webapp=/solr path=/update params={wt=javabin&version=2}{add=[23]} 0 0
   [junit4]   2> 868492 INFO  (qtp911239835-11205) [    ] o.a.s.u.p.LogUpdateProcessorFactory [collection1]  webapp=/solr path=/update params={wt=javabin&version=2}{add=[24]} 0 0
   [junit4]   2> 868492 INFO  (qtp911239835-11205) [    ] o.a.s.u.p.LogUpdateProcessorFactory [collection1]  webapp=/solr path=/update params={wt=javabin&version=2}{add=[25]} 0 0
   [junit4]   2> 868492 INFO  (qtp911239835-11205) [    ] o.a.s.u.p.LogUpdateProcessorFactory [collection1]  webapp=/solr path=/update params={wt=javabin&version=2}{add=[26]} 0 0
   [junit4]   2> 868493 INFO  (qtp911239835-11205) [    ] o.a.s.u.p.LogUpdateProcessorFactory [collection1]  webapp=/solr path=/update params={wt=javabin&version=2}{add=[27]} 0 0
   [junit4]   2> 868493 INFO  (qtp911239835-11205) [    ] o.a.s.u.p.LogUpdateProcessorFactory [collection1]  webapp=/solr path=/update params={wt=javabin&version=2}{add=[28]} 0 0
   [junit4]   2> 868493 INFO  (qtp911239835-11205) [    ] o.a.s.u.p.LogUpdateProcessorFactory [collection1]  webapp=/solr path=/update params={wt=javabin&version=2}{add=[29]} 0 0
   [junit4]   2> 868494 INFO  (qtp911239835-11205) [    ] o.a.s.u.p.LogUpdateProcessorFactory [collection1]  webapp=/solr path=/update params={wt=javabin&version=2}{add=[30]} 0 0
   [junit4]   2> 868494 INFO  (qtp911239835-11205) [    ] o.a.s.u.p.LogUpdateProcessorFactory [collection1]  webapp=/solr path=/update params={wt=javabin&version=2}{add=[31]} 0 0
   [junit4]   2> 868494 INFO  (qtp911239835-11205) [    ] o.a.s.u.p.LogUpdateProcessorFactory [collection1]  webapp=/solr path=/update params={wt=javabin&version=2}{add=[32]} 0 0
   [junit4]   2> 868495 INFO  (qtp911239835-11205) [    ] o.a.s.u.p.LogUpdateProcessorFactory [collection1]  webapp=/solr path=/update params={wt=javabin&version=2}{add=[33]} 0 0
   [junit4]   2> 868495 INFO  (qtp911239835-11205) [    ] o.a.s.u.p.LogUpdateProcessorFactory [collection1]  webapp=/solr path=/update params={wt=javabin&version=2}{add=[34]} 0 0
   [junit4]   2> 868495 INFO  (qtp911239835-11205) [    ] o.a.s.u.p.LogUpdateProcessorFactory [collection1]  webapp=/solr path=/update params={wt=javabin&version=2}{add=[35]} 0 0
   [junit4]   2> 868496 INFO  (qtp911239835-11205) [    ] o.a.s.u.p.LogUpdateProcessorFactory [collection1]  webapp=/solr path=/update params={wt=javabin&version=2}{add=[36]} 0 0
   [junit4]   2> 868496 INFO  (indexFetcher-3935-thread-1) [    ] o.a.s.s.SolrIndexSearcher Opening [Searcher@2729fa5d[collection1] main]
   [junit4]   2> 868497 INFO  (indexFetcher-3935-thread-1) [    ] o.a.s.u.DirectUpdateHandler2 end_commit_flush
   [junit4]   2> 868497 INFO  (searcherExecutor-3931-thread-1) [    ] o.a.s.c.SolrCore [collection1] Registered new searcher Searcher@2729fa5d[collection1] main{ExitableDirectoryReader(UninvertingDirectoryReader())}
   [junit4]   2> 868498 INFO  (qtp911239835-11205) [    ] o.a.s.u.p.LogUpdateProcessorFactory [collection1]  webapp=/solr path=/update params={wt=javabin&version=2}{add=[37]} 0 0
   [junit4]   2> 868498 INFO  (qtp911239835-11205) [    ] o.a.s.u.p.LogUpdateProcessorFactory [collection1]  webapp=/solr path=/update params={wt=javabin&version=2}{add=[38]} 0 0
   [junit4]   2> 868499 INFO  (qtp911239835-11205) [    ] o.a.s.u.p.LogUpdateProcessorFactory [collection1]  webapp=/solr path=/update params={wt=javabin&version=2}{add=[39]} 0 0
   [junit4]   2> 868504 INFO  (qtp911239835-11205) [    ] o.a.s.u.p.LogUpdateProcessorFactory [collection1]  webapp=/solr path=/update params={wt=javabin&version=2}{add=[40]} 0 0
   [junit4]   2> 868505 INFO  (qtp911239835-11205) [    ] o.a.s.u.p.LogUpdateProcessorFactory [collection1]  webapp=/solr path=/update params={wt=javabin&version=2}{add=[41]} 0 0
   [junit4]   2> 868505 INFO  (qtp911239835-11205) [    ] o.a.s.u.p.LogUpdateProcessorFactory [collection1]  webapp=/solr path=/update params={wt=javabin&version=2}{add=[42]} 0 0
   [junit4]   2> 868505 INFO  (qtp911239835-11205) [    ] o.a.s.u.p.LogUpdateProcessorFactory [collection1]  webapp=/solr path=/update params={wt=javabin&version=2}{add=[43]} 0 0
   [junit4]   2> 868506 INFO  (qtp911239835-11205) [    ] o.a.s.u.p.LogUpdateProcessorFactory [collection1]  webapp=/solr path=/update params={wt=javabin&version=2}{add=[44]} 0 0
   [junit4]   2> 868506 INFO  (qtp911239835-11205) [    ] o.a.s.u.p.LogUpdateProcessorFactory [collection1]  webapp=/solr path=/update params={wt=javabin&version=2}{add=[45]} 0 0
   [junit4]   2> 868507 INFO  (qtp911239835-11205) [    ] o.a.s.u.p.LogUpdateProcessorFactory [collection1]  webapp=/solr path=/update params={wt=javabin&version=2}{add=[46]} 0 0
   [junit4]   2> 868507 INFO  (qtp911239835-11205) [    ] o.a.s.u.p.LogUpdateProcessorFactory [collection1]  webapp=/solr path=/update params={wt=javabin&version=2}{add=[47]} 0 0
   [junit4]   2> 868509 INFO  (qtp911239835-11205) [    ] o.a.s.u.p.LogUpdateProcessorFactory [collection1]  webapp=/solr path=/update params={wt=javabin&version=2}{add=[48]} 0 0
   [junit4]   2> 868509 INFO  (qtp911239835-11205) [    ] o.a.s.u.p.LogUpdateProcessorFactory [collection1]  webapp=/solr path=/update params={wt=javabin&version=2}{add=[49]} 0 0
   [junit4]   2> 868509 INFO  (qtp911239835-11205) [    ] o.a.s.u.p.LogUpdateProcessorFactory [collection1]  webapp=/solr path=/update params={wt=javabin&version=2}{add=[50]} 0 0
   [junit4]   2> 868510 INFO  (qtp911239835-11205) [    ] o.a.s.u.p.LogUpdateProcessorFactory [collection1]  webapp=/solr path=/update params={wt=javabin&version=2}{add=[51]} 0 0
   [junit4]   2> 868510 INFO  (qtp911239835-11205) [    ] o.a.s.u.p.LogUpdateProcessorFactory [collection1]  webapp=/solr path=/update params={wt=javabin&version=2}{add=[52]} 0 0
   [junit4]   2> 868511 INFO  (qtp911239835-11205) [    ] o.a.s.u.p.LogUpdateProcessorFactory [collection1]  webapp=/solr path=/update params={wt=javabin&version=2}{add=[53]} 0 0
   [junit4]   2> 868511 INFO  (qtp911239835-11205) [    ] o.a.s.u.p.LogUpdateProcessorFactory [collection1]  webapp=/solr path=/update params={wt=javabin&version=2}{add=[54]} 0 0
   [junit4]   2> 868511 INFO  (qtp911239835-11205) [    ] o.a.s.u.p.LogUpdateProcessorFactory [collection1]  webapp=/solr path=/update params={wt=javabin&version=2}{add=[55]} 0 0
   [junit4]   2> 868512 INFO  (qtp911239835-11205) [    ] o.a.s.u.p.LogUpdateProcessorFactory [collection1]  webapp=/solr path=/update params={wt=javabin&version=2}{add=[56]} 0 0
   [junit4]   2> 868512 INFO  (qtp911239835-11205) [    ] o.a.s.u.p.LogUpdateProcessorFactory [collection1]  webapp=/solr path=/update params={wt=javabin&version=2}{add=[57]} 0 0
   [junit4]   2> 868513 INFO  (qtp911239835-11205) [    ] o.a.s.u.p.LogUpdateProcessorFactory [collection1]  webapp=/solr path=/update params={wt=javabin&version=2}{add=[58]} 0 0
   [junit4]   2> 868513 INFO  (qtp911239835-11205) [    ] o.a.s.u.p.LogUpdateProcessorFactory [collection1]  webapp=/solr path=/update params={wt=javabin&version=2}{add=[59]} 0 0
   [junit4]   2> 868513 INFO  (qtp911239835-11205) [    ] o.a.s.u.p.LogUpdateProcessorFactory [collection1]  webapp=/solr path=/update params={wt=javabin&version=2}{add=[60]} 0 0
   [junit4]   2> 868514 INFO  (qtp911239835-11205) [    ] o.a.s.u.p.LogUpdateProcessorFactory [collection1]  webapp=/solr path=/update params={wt=javabin&version=2}{add=[61]} 0 0
   [junit4]   2> 868514 INFO  (qtp911239835-11205) [    ] o.a.s.u.p.LogUpdateProcessorFactory [collection1]  webapp=/solr path=/update params={wt=javabin&version=2}{add=[62]} 0 0
   [junit4]   2> 868514 INFO  (qtp911239835-11205) [    ] o.a.s.u.p.LogUpdateProcessorFactory [collection1]  webapp=/solr path=/update params={wt=javabin&version=2}{add=[63]} 0 0
   [junit4]   2> 868515 INFO  (qtp911239835-11205) [    ] o.a.s.u.p.LogUpdateProcessorFactory [collection1]  webapp=/solr path=/update params={wt=javabin&version=2}{add=[64]} 0 0
   [junit4]   2> 868515 INFO  (qtp911239835-11205) [    ] o.a.s.u.p.LogUpdateProcessorFactory [collection1]  webapp=/solr path=/update params={wt=javabin&version=2}{add=[65]} 0 0
   [junit4]   2> 868516 INFO  (qtp911239835-11205) [    ] o.a.s.u.p.LogUpdateProcessorFactory [collection1]  webapp=/solr path=/update params={wt=javabin&version=2}{add=[66]} 0 0
   [junit4]   2> 868516 INFO  (qtp911239835-11205) [    ] o.a.s.u.p.LogUpdateProcessorFactory [collection1]  webapp=/solr path=/update params={wt=javabin&version=2}{add=[67]} 0 0
   [junit4]   2> 868517 INFO  (qtp911239835-11205) [    ] o.a.s.u.p.LogUpdateProcessorFactory [collection1]  webapp=/solr path=/update params={wt=javabin&version=2}{add=[68]} 0 0
   [junit4]   

[...truncated too long message...]

/solr-solrj/test/temp/junit4-J1-20171219_020714_18416158961787514867557.syserr
   [junit4] >>> JVM J1 emitted unexpected output (verbatim) ----
   [junit4] Java HotSpot(TM) 64-Bit Server VM warning: Option UseConcMarkSweepGC was deprecated in version 9.0 and will likely be removed in a future release.
   [junit4] <<< JVM J1: EOF ----

[...truncated 21 lines...]
   [junit4] JVM J0: stderr was not empty, see: /Users/jenkins/workspace/Lucene-Solr-master-MacOSX/solr/build/solr-solrj/test/temp/junit4-J0-20171219_020714_1845402951541344074392.syserr
   [junit4] >>> JVM J0 emitted unexpected output (verbatim) ----
   [junit4] Java HotSpot(TM) 64-Bit Server VM warning: Option UseConcMarkSweepGC was deprecated in version 9.0 and will likely be removed in a future release.
   [junit4] <<< JVM J0: EOF ----

[...truncated 1463 lines...]
   [junit4] JVM J0: stderr was not empty, see: /Users/jenkins/workspace/Lucene-Solr-master-MacOSX/solr/build/contrib/solr-analysis-extras/test/temp/junit4-J0-20171219_021102_74314082171213296180434.syserr
   [junit4] >>> JVM J0 emitted unexpected output (verbatim) ----
   [junit4] Java HotSpot(TM) 64-Bit Server VM warning: Option UseConcMarkSweepGC was deprecated in version 9.0 and will likely be removed in a future release.
   [junit4] <<< JVM J0: EOF ----

   [junit4] JVM J1: stderr was not empty, see: /Users/jenkins/workspace/Lucene-Solr-master-MacOSX/solr/build/contrib/solr-analysis-extras/test/temp/junit4-J1-20171219_021102_74315976332637277209197.syserr
   [junit4] >>> JVM J1 emitted unexpected output (verbatim) ----
   [junit4] Java HotSpot(TM) 64-Bit Server VM warning: Option UseConcMarkSweepGC was deprecated in version 9.0 and will likely be removed in a future release.
   [junit4] <<< JVM J1: EOF ----

[...truncated 782 lines...]
   [junit4] JVM J0: stderr was not empty, see: /Users/jenkins/workspace/Lucene-Solr-master-MacOSX/solr/build/contrib/solr-analytics/test/temp/junit4-J0-20171219_021115_13410649867648883437841.syserr
   [junit4] >>> JVM J0 emitted unexpected output (verbatim) ----
   [junit4] Java HotSpot(TM) 64-Bit Server VM warning: Option UseConcMarkSweepGC was deprecated in version 9.0 and will likely be removed in a future release.
   [junit4] <<< JVM J0: EOF ----

[...truncated 3 lines...]
   [junit4] JVM J1: stderr was not empty, see: /Users/jenkins/workspace/Lucene-Solr-master-MacOSX/solr/build/contrib/solr-analytics/test/temp/junit4-J1-20171219_021115_13511300037655993126229.syserr
   [junit4] >>> JVM J1 emitted unexpected output (verbatim) ----
   [junit4] Java HotSpot(TM) 64-Bit Server VM warning: Option UseConcMarkSweepGC was deprecated in version 9.0 and will likely be removed in a future release.
   [junit4] <<< JVM J1: EOF ----

[...truncated 553 lines...]
   [junit4] JVM J1: stderr was not empty, see: /Users/jenkins/workspace/Lucene-Solr-master-MacOSX/solr/build/contrib/solr-clustering/test/temp/junit4-J1-20171219_021217_4186105787626541924437.syserr
   [junit4] >>> JVM J1 emitted unexpected output (verbatim) ----
   [junit4] Java HotSpot(TM) 64-Bit Server VM warning: Option UseConcMarkSweepGC was deprecated in version 9.0 and will likely be removed in a future release.
   [junit4] <<< JVM J1: EOF ----

[...truncated 3 lines...]
   [junit4] JVM J0: stderr was not empty, see: /Users/jenkins/workspace/Lucene-Solr-master-MacOSX/solr/build/contrib/solr-clustering/test/temp/junit4-J0-20171219_021217_41810170401160255277158.syserr
   [junit4] >>> JVM J0 emitted unexpected output (verbatim) ----
   [junit4] Java HotSpot(TM) 64-Bit Server VM warning: Option UseConcMarkSweepGC was deprecated in version 9.0 and will likely be removed in a future release.
   [junit4] <<< JVM J0: EOF ----

[...truncated 1257 lines...]
   [junit4] JVM J1: stderr was not empty, see: /Users/jenkins/workspace/Lucene-Solr-master-MacOSX/solr/build/contrib/solr-dataimporthandler-extras/test/temp/junit4-J1-20171219_021237_2559480551938696236799.syserr
   [junit4] >>> JVM J1 emitted unexpected output (verbatim) ----
   [junit4] Java HotSpot(TM) 64-Bit Server VM warning: Option UseConcMarkSweepGC was deprecated in version 9.0 and will likely be removed in a future release.
   [junit4] <<< JVM J1: EOF ----

[...truncated 3 lines...]
   [junit4] JVM J0: stderr was not empty, see: /Users/jenkins/workspace/Lucene-Solr-master-MacOSX/solr/build/contrib/solr-dataimporthandler-extras/test/temp/junit4-J0-20171219_021237_25516626361553315146943.syserr
   [junit4] >>> JVM J0 emitted unexpected output (verbatim) ----
   [junit4] Java HotSpot(TM) 64-Bit Server VM warning: Option UseConcMarkSweepGC was deprecated in version 9.0 and will likely be removed in a future release.
   [junit4] <<< JVM J0: EOF ----

[...truncated 649 lines...]
   [junit4] JVM J0: stderr was not empty, see: /Users/jenkins/workspace/Lucene-Solr-master-MacOSX/solr/build/contrib/solr-dataimporthandler/test/temp/junit4-J0-20171219_021247_08811474105726185468761.syserr
   [junit4] >>> JVM J0 emitted unexpected output (verbatim) ----
   [junit4] Java HotSpot(TM) 64-Bit Server VM warning: Option UseConcMarkSweepGC was deprecated in version 9.0 and will likely be removed in a future release.
   [junit4] <<< JVM J0: EOF ----

   [junit4] JVM J1: stderr was not empty, see: /Users/jenkins/workspace/Lucene-Solr-master-MacOSX/solr/build/contrib/solr-dataimporthandler/test/temp/junit4-J1-20171219_021247_08816771640907452280146.syserr
   [junit4] >>> JVM J1 emitted unexpected output (verbatim) ----
   [junit4] Java HotSpot(TM) 64-Bit Server VM warning: Option UseConcMarkSweepGC was deprecated in version 9.0 and will likely be removed in a future release.
   [junit4] <<< JVM J1: EOF ----

[...truncated 557 lines...]
   [junit4] JVM J0: stderr was not empty, see: /Users/jenkins/workspace/Lucene-Solr-master-MacOSX/solr/build/contrib/solr-cell/test/temp/junit4-J0-20171219_021313_53415954676251492643607.syserr
   [junit4] >>> JVM J0 emitted unexpected output (verbatim) ----
   [junit4] Java HotSpot(TM) 64-Bit Server VM warning: Option UseConcMarkSweepGC was deprecated in version 9.0 and will likely be removed in a future release.
   [junit4] <<< JVM J0: EOF ----

[...truncated 3 lines...]
   [junit4] JVM J1: stderr was not empty, see: /Users/jenkins/workspace/Lucene-Solr-master-MacOSX/solr/build/contrib/solr-cell/test/temp/junit4-J1-20171219_021313_534417414608689894134.syserr
   [junit4] >>> JVM J1 emitted unexpected output (verbatim) ----
   [junit4] Java HotSpot(TM) 64-Bit Server VM warning: Option UseConcMarkSweepGC was deprecated in version 9.0 and will likely be removed in a future release.
   [junit4] <<< JVM J1: EOF ----

[...truncated 558 lines...]
   [junit4] JVM J1: stderr was not empty, see: /Users/jenkins/workspace/Lucene-Solr-master-MacOSX/solr/build/contrib/solr-langid/test/temp/junit4-J1-20171219_021327_47017054692998768690491.syserr
   [junit4] >>> JVM J1 emitted unexpected output (verbatim) ----
   [junit4] Java HotSpot(TM) 64-Bit Server VM warning: Option UseConcMarkSweepGC was deprecated in version 9.0 and will likely be removed in a future release.
   [junit4] <<< JVM J1: EOF ----

[...truncated 3 lines...]
   [junit4] JVM J0: stderr was not empty, see: /Users/jenkins/workspace/Lucene-Solr-master-MacOSX/solr/build/contrib/solr-langid/test/temp/junit4-J0-20171219_021327_47014090295309789780119.syserr
   [junit4] >>> JVM J0 emitted unexpected output (verbatim) ----
   [junit4] Java HotSpot(TM) 64-Bit Server VM warning: Option UseConcMarkSweepGC was deprecated in version 9.0 and will likely be removed in a future release.
   [junit4] <<< JVM J0: EOF ----

[...truncated 654 lines...]
   [junit4] JVM J1: stderr was not empty, see: /Users/jenkins/workspace/Lucene-Solr-master-MacOSX/solr/build/contrib/solr-ltr/test/temp/junit4-J1-20171219_021337_18810195389414002770612.syserr
   [junit4] >>> JVM J1 emitted unexpected output (verbatim) ----
   [junit4] Java HotSpot(TM) 64-Bit Server VM warning: Option UseConcMarkSweepGC was deprecated in version 9.0 and will likely be removed in a future release.
   [junit4] <<< JVM J1: EOF ----

[...truncated 3 lines...]
   [junit4] JVM J0: stderr was not empty, see: /Users/jenkins/workspace/Lucene-Solr-master-MacOSX/solr/build/contrib/solr-ltr/test/temp/junit4-J0-20171219_021337_1888239919090274042167.syserr
   [junit4] >>> JVM J0 emitted unexpected output (verbatim) ----
   [junit4] Java HotSpot(TM) 64-Bit Server VM warning: Option UseConcMarkSweepGC was deprecated in version 9.0 and will likely be removed in a future release.
   [junit4] <<< JVM J0: EOF ----

[...truncated 595 lines...]
   [junit4] JVM J1: stderr was not empty, see: /Users/jenkins/workspace/Lucene-Solr-master-MacOSX/solr/build/contrib/solr-uima/test/temp/junit4-J1-20171219_021410_58210279095631283708536.syserr
   [junit4] >>> JVM J1 emitted unexpected output (verbatim) ----
   [junit4] Java HotSpot(TM) 64-Bit Server VM warning: Option UseConcMarkSweepGC was deprecated in version 9.0 and will likely be removed in a future release.
   [junit4] <<< JVM J1: EOF ----

[...truncated 3 lines...]
   [junit4] JVM J0: stderr was not empty, see: /Users/jenkins/workspace/Lucene-Solr-master-MacOSX/solr/build/contrib/solr-uima/test/temp/junit4-J0-20171219_021410_58214815865787927346824.syserr
   [junit4] >>> JVM J0 emitted unexpected output (verbatim) ----
   [junit4] Java HotSpot(TM) 64-Bit Server VM warning: Option UseConcMarkSweepGC was deprecated in version 9.0 and will likely be removed in a future release.
   [junit4] <<< JVM J0: EOF ----

[...truncated 548 lines...]
   [junit4] JVM J0: stderr was not empty, see: /Users/jenkins/workspace/Lucene-Solr-master-MacOSX/solr/build/contrib/solr-velocity/test/temp/junit4-J0-20171219_021426_55415807796132119661038.syserr
   [junit4] >>> JVM J0 emitted unexpected output (verbatim) ----
   [junit4] Java HotSpot(TM) 64-Bit Server VM warning: Option UseConcMarkSweepGC was deprecated in version 9.0 and will likely be removed in a future release.
   [junit4] <<< JVM J0: EOF ----

[...truncated 32201 lines...]

Mime
View raw message