lucene-dev mailing list archives

Site index · List index
Message view « Date » · « Thread »
Top « Date » · « Thread »
From Policeman Jenkins Server <jenk...@thetaphi.de>
Subject [JENKINS] Lucene-Solr-7.x-Windows (64bit/jdk1.8.0_144) - Build # 360 - Still Unstable!
Date Tue, 26 Dec 2017 04:38:47 GMT
Build: https://jenkins.thetaphi.de/job/Lucene-Solr-7.x-Windows/360/
Java: 64bit/jdk1.8.0_144 -XX:-UseCompressedOops -XX:+UseParallelGC

7 tests failed.
FAILED:  junit.framework.TestSuite.org.apache.lucene.benchmark.byTask.feeds.TrecContentSourceTest

Error Message:
Could not remove the following files (in the order of attempts):    C:\Users\jenkins\workspace\Lucene-Solr-7.x-Windows\lucene\build\benchmark\test\J0\temp\lucene.benchmark.byTask.feeds.TrecContentSourceTest_E3BEAD551E621898-001\trecFeedAllTypes-001\trecdocs: java.nio.file.DirectoryNotEmptyException: C:\Users\jenkins\workspace\Lucene-Solr-7.x-Windows\lucene\build\benchmark\test\J0\temp\lucene.benchmark.byTask.feeds.TrecContentSourceTest_E3BEAD551E621898-001\trecFeedAllTypes-001\trecdocs    C:\Users\jenkins\workspace\Lucene-Solr-7.x-Windows\lucene\build\benchmark\test\J0\temp\lucene.benchmark.byTask.feeds.TrecContentSourceTest_E3BEAD551E621898-001\trecFeedAllTypes-001: java.nio.file.DirectoryNotEmptyException: C:\Users\jenkins\workspace\Lucene-Solr-7.x-Windows\lucene\build\benchmark\test\J0\temp\lucene.benchmark.byTask.feeds.TrecContentSourceTest_E3BEAD551E621898-001\trecFeedAllTypes-001    C:\Users\jenkins\workspace\Lucene-Solr-7.x-Windows\lucene\build\benchmark\test\J0\temp\lucene.benchmark.byTask.feeds.TrecContentSourceTest_E3BEAD551E621898-001\trecFeedAllTypes-001\trecdocs\fr94: java.nio.file.AccessDeniedException: C:\Users\jenkins\workspace\Lucene-Solr-7.x-Windows\lucene\build\benchmark\test\J0\temp\lucene.benchmark.byTask.feeds.TrecContentSourceTest_E3BEAD551E621898-001\trecFeedAllTypes-001\trecdocs\fr94    C:\Users\jenkins\workspace\Lucene-Solr-7.x-Windows\lucene\build\benchmark\test\J0\temp\lucene.benchmark.byTask.feeds.TrecContentSourceTest_E3BEAD551E621898-001: java.nio.file.DirectoryNotEmptyException: C:\Users\jenkins\workspace\Lucene-Solr-7.x-Windows\lucene\build\benchmark\test\J0\temp\lucene.benchmark.byTask.feeds.TrecContentSourceTest_E3BEAD551E621898-001 

Stack Trace:
java.io.IOException: Could not remove the following files (in the order of attempts):
   C:\Users\jenkins\workspace\Lucene-Solr-7.x-Windows\lucene\build\benchmark\test\J0\temp\lucene.benchmark.byTask.feeds.TrecContentSourceTest_E3BEAD551E621898-001\trecFeedAllTypes-001\trecdocs: java.nio.file.DirectoryNotEmptyException: C:\Users\jenkins\workspace\Lucene-Solr-7.x-Windows\lucene\build\benchmark\test\J0\temp\lucene.benchmark.byTask.feeds.TrecContentSourceTest_E3BEAD551E621898-001\trecFeedAllTypes-001\trecdocs
   C:\Users\jenkins\workspace\Lucene-Solr-7.x-Windows\lucene\build\benchmark\test\J0\temp\lucene.benchmark.byTask.feeds.TrecContentSourceTest_E3BEAD551E621898-001\trecFeedAllTypes-001: java.nio.file.DirectoryNotEmptyException: C:\Users\jenkins\workspace\Lucene-Solr-7.x-Windows\lucene\build\benchmark\test\J0\temp\lucene.benchmark.byTask.feeds.TrecContentSourceTest_E3BEAD551E621898-001\trecFeedAllTypes-001
   C:\Users\jenkins\workspace\Lucene-Solr-7.x-Windows\lucene\build\benchmark\test\J0\temp\lucene.benchmark.byTask.feeds.TrecContentSourceTest_E3BEAD551E621898-001\trecFeedAllTypes-001\trecdocs\fr94: java.nio.file.AccessDeniedException: C:\Users\jenkins\workspace\Lucene-Solr-7.x-Windows\lucene\build\benchmark\test\J0\temp\lucene.benchmark.byTask.feeds.TrecContentSourceTest_E3BEAD551E621898-001\trecFeedAllTypes-001\trecdocs\fr94
   C:\Users\jenkins\workspace\Lucene-Solr-7.x-Windows\lucene\build\benchmark\test\J0\temp\lucene.benchmark.byTask.feeds.TrecContentSourceTest_E3BEAD551E621898-001: java.nio.file.DirectoryNotEmptyException: C:\Users\jenkins\workspace\Lucene-Solr-7.x-Windows\lucene\build\benchmark\test\J0\temp\lucene.benchmark.byTask.feeds.TrecContentSourceTest_E3BEAD551E621898-001

	at __randomizedtesting.SeedInfo.seed([E3BEAD551E621898]:0)
	at org.apache.lucene.util.IOUtils.rm(IOUtils.java:329)
	at org.apache.lucene.util.TestRuleTemporaryFilesCleanup.afterAlways(TestRuleTemporaryFilesCleanup.java:216)
	at com.carrotsearch.randomizedtesting.rules.TestRuleAdapter$1.afterAlways(TestRuleAdapter.java:31)
	at com.carrotsearch.randomizedtesting.rules.StatementAdapter.evaluate(StatementAdapter.java:43)
	at com.carrotsearch.randomizedtesting.rules.StatementAdapter.evaluate(StatementAdapter.java:36)
	at org.apache.lucene.util.TestRuleAssertionsRequired$1.evaluate(TestRuleAssertionsRequired.java:53)
	at org.apache.lucene.util.TestRuleMarkFailure$1.evaluate(TestRuleMarkFailure.java:47)
	at org.apache.lucene.util.TestRuleIgnoreAfterMaxFailures$1.evaluate(TestRuleIgnoreAfterMaxFailures.java:64)
	at org.apache.lucene.util.TestRuleIgnoreTestSuites$1.evaluate(TestRuleIgnoreTestSuites.java:54)
	at com.carrotsearch.randomizedtesting.rules.StatementAdapter.evaluate(StatementAdapter.java:36)
	at com.carrotsearch.randomizedtesting.ThreadLeakControl$StatementRunner.run(ThreadLeakControl.java:368)
	at java.lang.Thread.run(Thread.java:748)


FAILED:  junit.framework.TestSuite.org.apache.solr.TestDistributedSearch

Error Message:
Could not remove the following files (in the order of attempts):    C:\Users\jenkins\workspace\Lucene-Solr-7.x-Windows\solr\build\solr-core\test\J0\temp\solr.TestDistributedSearch_7BE9B4871C0BEFDB-001\tempDir-001\shard0\cores\collection1\data\spellcheckerFQCN: java.nio.file.DirectoryNotEmptyException: C:\Users\jenkins\workspace\Lucene-Solr-7.x-Windows\solr\build\solr-core\test\J0\temp\solr.TestDistributedSearch_7BE9B4871C0BEFDB-001\tempDir-001\shard0\cores\collection1\data\spellcheckerFQCN    C:\Users\jenkins\workspace\Lucene-Solr-7.x-Windows\solr\build\solr-core\test\J0\temp\solr.TestDistributedSearch_7BE9B4871C0BEFDB-001\tempDir-001\shard0\cores\collection1\data: java.nio.file.DirectoryNotEmptyException: C:\Users\jenkins\workspace\Lucene-Solr-7.x-Windows\solr\build\solr-core\test\J0\temp\solr.TestDistributedSearch_7BE9B4871C0BEFDB-001\tempDir-001\shard0\cores\collection1\data    C:\Users\jenkins\workspace\Lucene-Solr-7.x-Windows\solr\build\solr-core\test\J0\temp\solr.TestDistributedSearch_7BE9B4871C0BEFDB-001\tempDir-001\shard0\cores\collection1: java.nio.file.DirectoryNotEmptyException: C:\Users\jenkins\workspace\Lucene-Solr-7.x-Windows\solr\build\solr-core\test\J0\temp\solr.TestDistributedSearch_7BE9B4871C0BEFDB-001\tempDir-001\shard0\cores\collection1    C:\Users\jenkins\workspace\Lucene-Solr-7.x-Windows\solr\build\solr-core\test\J0\temp\solr.TestDistributedSearch_7BE9B4871C0BEFDB-001\tempDir-001\shard0\cores: java.nio.file.DirectoryNotEmptyException: C:\Users\jenkins\workspace\Lucene-Solr-7.x-Windows\solr\build\solr-core\test\J0\temp\solr.TestDistributedSearch_7BE9B4871C0BEFDB-001\tempDir-001\shard0\cores    C:\Users\jenkins\workspace\Lucene-Solr-7.x-Windows\solr\build\solr-core\test\J0\temp\solr.TestDistributedSearch_7BE9B4871C0BEFDB-001\tempDir-001\shard0: java.nio.file.DirectoryNotEmptyException: C:\Users\jenkins\workspace\Lucene-Solr-7.x-Windows\solr\build\solr-core\test\J0\temp\solr.TestDistributedSearch_7BE9B4871C0BEFDB-001\tempDir-001\shard0    C:\Users\jenkins\workspace\Lucene-Solr-7.x-Windows\solr\build\solr-core\test\J0\temp\solr.TestDistributedSearch_7BE9B4871C0BEFDB-001\tempDir-001: java.nio.file.DirectoryNotEmptyException: C:\Users\jenkins\workspace\Lucene-Solr-7.x-Windows\solr\build\solr-core\test\J0\temp\solr.TestDistributedSearch_7BE9B4871C0BEFDB-001\tempDir-001    C:\Users\jenkins\workspace\Lucene-Solr-7.x-Windows\solr\build\solr-core\test\J0\temp\solr.TestDistributedSearch_7BE9B4871C0BEFDB-001\tempDir-001\shard0\cores\collection1\data\spellcheckerFQCN\write.lock: java.nio.file.AccessDeniedException: C:\Users\jenkins\workspace\Lucene-Solr-7.x-Windows\solr\build\solr-core\test\J0\temp\solr.TestDistributedSearch_7BE9B4871C0BEFDB-001\tempDir-001\shard0\cores\collection1\data\spellcheckerFQCN\write.lock    C:\Users\jenkins\workspace\Lucene-Solr-7.x-Windows\solr\build\solr-core\test\J0\temp\solr.TestDistributedSearch_7BE9B4871C0BEFDB-001: java.nio.file.DirectoryNotEmptyException: C:\Users\jenkins\workspace\Lucene-Solr-7.x-Windows\solr\build\solr-core\test\J0\temp\solr.TestDistributedSearch_7BE9B4871C0BEFDB-001 

Stack Trace:
java.io.IOException: Could not remove the following files (in the order of attempts):
   C:\Users\jenkins\workspace\Lucene-Solr-7.x-Windows\solr\build\solr-core\test\J0\temp\solr.TestDistributedSearch_7BE9B4871C0BEFDB-001\tempDir-001\shard0\cores\collection1\data\spellcheckerFQCN: java.nio.file.DirectoryNotEmptyException: C:\Users\jenkins\workspace\Lucene-Solr-7.x-Windows\solr\build\solr-core\test\J0\temp\solr.TestDistributedSearch_7BE9B4871C0BEFDB-001\tempDir-001\shard0\cores\collection1\data\spellcheckerFQCN
   C:\Users\jenkins\workspace\Lucene-Solr-7.x-Windows\solr\build\solr-core\test\J0\temp\solr.TestDistributedSearch_7BE9B4871C0BEFDB-001\tempDir-001\shard0\cores\collection1\data: java.nio.file.DirectoryNotEmptyException: C:\Users\jenkins\workspace\Lucene-Solr-7.x-Windows\solr\build\solr-core\test\J0\temp\solr.TestDistributedSearch_7BE9B4871C0BEFDB-001\tempDir-001\shard0\cores\collection1\data
   C:\Users\jenkins\workspace\Lucene-Solr-7.x-Windows\solr\build\solr-core\test\J0\temp\solr.TestDistributedSearch_7BE9B4871C0BEFDB-001\tempDir-001\shard0\cores\collection1: java.nio.file.DirectoryNotEmptyException: C:\Users\jenkins\workspace\Lucene-Solr-7.x-Windows\solr\build\solr-core\test\J0\temp\solr.TestDistributedSearch_7BE9B4871C0BEFDB-001\tempDir-001\shard0\cores\collection1
   C:\Users\jenkins\workspace\Lucene-Solr-7.x-Windows\solr\build\solr-core\test\J0\temp\solr.TestDistributedSearch_7BE9B4871C0BEFDB-001\tempDir-001\shard0\cores: java.nio.file.DirectoryNotEmptyException: C:\Users\jenkins\workspace\Lucene-Solr-7.x-Windows\solr\build\solr-core\test\J0\temp\solr.TestDistributedSearch_7BE9B4871C0BEFDB-001\tempDir-001\shard0\cores
   C:\Users\jenkins\workspace\Lucene-Solr-7.x-Windows\solr\build\solr-core\test\J0\temp\solr.TestDistributedSearch_7BE9B4871C0BEFDB-001\tempDir-001\shard0: java.nio.file.DirectoryNotEmptyException: C:\Users\jenkins\workspace\Lucene-Solr-7.x-Windows\solr\build\solr-core\test\J0\temp\solr.TestDistributedSearch_7BE9B4871C0BEFDB-001\tempDir-001\shard0
   C:\Users\jenkins\workspace\Lucene-Solr-7.x-Windows\solr\build\solr-core\test\J0\temp\solr.TestDistributedSearch_7BE9B4871C0BEFDB-001\tempDir-001: java.nio.file.DirectoryNotEmptyException: C:\Users\jenkins\workspace\Lucene-Solr-7.x-Windows\solr\build\solr-core\test\J0\temp\solr.TestDistributedSearch_7BE9B4871C0BEFDB-001\tempDir-001
   C:\Users\jenkins\workspace\Lucene-Solr-7.x-Windows\solr\build\solr-core\test\J0\temp\solr.TestDistributedSearch_7BE9B4871C0BEFDB-001\tempDir-001\shard0\cores\collection1\data\spellcheckerFQCN\write.lock: java.nio.file.AccessDeniedException: C:\Users\jenkins\workspace\Lucene-Solr-7.x-Windows\solr\build\solr-core\test\J0\temp\solr.TestDistributedSearch_7BE9B4871C0BEFDB-001\tempDir-001\shard0\cores\collection1\data\spellcheckerFQCN\write.lock
   C:\Users\jenkins\workspace\Lucene-Solr-7.x-Windows\solr\build\solr-core\test\J0\temp\solr.TestDistributedSearch_7BE9B4871C0BEFDB-001: java.nio.file.DirectoryNotEmptyException: C:\Users\jenkins\workspace\Lucene-Solr-7.x-Windows\solr\build\solr-core\test\J0\temp\solr.TestDistributedSearch_7BE9B4871C0BEFDB-001

	at __randomizedtesting.SeedInfo.seed([7BE9B4871C0BEFDB]:0)
	at org.apache.lucene.util.IOUtils.rm(IOUtils.java:329)
	at org.apache.lucene.util.TestRuleTemporaryFilesCleanup.afterAlways(TestRuleTemporaryFilesCleanup.java:216)
	at com.carrotsearch.randomizedtesting.rules.TestRuleAdapter$1.afterAlways(TestRuleAdapter.java:31)
	at com.carrotsearch.randomizedtesting.rules.StatementAdapter.evaluate(StatementAdapter.java:43)
	at com.carrotsearch.randomizedtesting.rules.StatementAdapter.evaluate(StatementAdapter.java:36)
	at org.apache.lucene.util.TestRuleAssertionsRequired$1.evaluate(TestRuleAssertionsRequired.java:53)
	at org.apache.lucene.util.TestRuleMarkFailure$1.evaluate(TestRuleMarkFailure.java:47)
	at org.apache.lucene.util.TestRuleIgnoreAfterMaxFailures$1.evaluate(TestRuleIgnoreAfterMaxFailures.java:64)
	at org.apache.lucene.util.TestRuleIgnoreTestSuites$1.evaluate(TestRuleIgnoreTestSuites.java:54)
	at com.carrotsearch.randomizedtesting.rules.StatementAdapter.evaluate(StatementAdapter.java:36)
	at com.carrotsearch.randomizedtesting.ThreadLeakControl$StatementRunner.run(ThreadLeakControl.java:368)
	at java.lang.Thread.run(Thread.java:748)


FAILED:  org.apache.solr.cloud.autoscaling.sim.TestDistribStateManager.testGetSetRemoveData

Error Message:
Node watch should have fired!

Stack Trace:
java.lang.AssertionError: Node watch should have fired!
	at __randomizedtesting.SeedInfo.seed([7BE9B4871C0BEFDB:5D795BD5488529D1]:0)
	at org.junit.Assert.fail(Assert.java:93)
	at org.apache.solr.cloud.autoscaling.sim.TestDistribStateManager.testGetSetRemoveData(TestDistribStateManager.java:256)
	at sun.reflect.NativeMethodAccessorImpl.invoke0(Native Method)
	at sun.reflect.NativeMethodAccessorImpl.invoke(NativeMethodAccessorImpl.java:62)
	at sun.reflect.DelegatingMethodAccessorImpl.invoke(DelegatingMethodAccessorImpl.java:43)
	at java.lang.reflect.Method.invoke(Method.java:498)
	at com.carrotsearch.randomizedtesting.RandomizedRunner.invoke(RandomizedRunner.java:1737)
	at com.carrotsearch.randomizedtesting.RandomizedRunner$8.evaluate(RandomizedRunner.java:934)
	at com.carrotsearch.randomizedtesting.RandomizedRunner$9.evaluate(RandomizedRunner.java:970)
	at com.carrotsearch.randomizedtesting.RandomizedRunner$10.evaluate(RandomizedRunner.java:984)
	at com.carrotsearch.randomizedtesting.rules.SystemPropertiesRestoreRule$1.evaluate(SystemPropertiesRestoreRule.java:57)
	at org.apache.lucene.util.TestRuleSetupTeardownChained$1.evaluate(TestRuleSetupTeardownChained.java:49)
	at org.apache.lucene.util.AbstractBeforeAfterRule$1.evaluate(AbstractBeforeAfterRule.java:45)
	at org.apache.lucene.util.TestRuleThreadAndTestName$1.evaluate(TestRuleThreadAndTestName.java:48)
	at org.apache.lucene.util.TestRuleIgnoreAfterMaxFailures$1.evaluate(TestRuleIgnoreAfterMaxFailures.java:64)
	at org.apache.lucene.util.TestRuleMarkFailure$1.evaluate(TestRuleMarkFailure.java:47)
	at com.carrotsearch.randomizedtesting.rules.StatementAdapter.evaluate(StatementAdapter.java:36)
	at com.carrotsearch.randomizedtesting.ThreadLeakControl$StatementRunner.run(ThreadLeakControl.java:368)
	at com.carrotsearch.randomizedtesting.ThreadLeakControl.forkTimeoutingTask(ThreadLeakControl.java:817)
	at com.carrotsearch.randomizedtesting.ThreadLeakControl$3.evaluate(ThreadLeakControl.java:468)
	at com.carrotsearch.randomizedtesting.RandomizedRunner.runSingleTest(RandomizedRunner.java:943)
	at com.carrotsearch.randomizedtesting.RandomizedRunner$5.evaluate(RandomizedRunner.java:829)
	at com.carrotsearch.randomizedtesting.RandomizedRunner$6.evaluate(RandomizedRunner.java:879)
	at com.carrotsearch.randomizedtesting.RandomizedRunner$7.evaluate(RandomizedRunner.java:890)
	at com.carrotsearch.randomizedtesting.rules.StatementAdapter.evaluate(StatementAdapter.java:36)
	at com.carrotsearch.randomizedtesting.rules.SystemPropertiesRestoreRule$1.evaluate(SystemPropertiesRestoreRule.java:57)
	at org.apache.lucene.util.AbstractBeforeAfterRule$1.evaluate(AbstractBeforeAfterRule.java:45)
	at com.carrotsearch.randomizedtesting.rules.StatementAdapter.evaluate(StatementAdapter.java:36)
	at org.apache.lucene.util.TestRuleStoreClassName$1.evaluate(TestRuleStoreClassName.java:41)
	at com.carrotsearch.randomizedtesting.rules.NoShadowingOrOverridesOnMethodsRule$1.evaluate(NoShadowingOrOverridesOnMethodsRule.java:40)
	at com.carrotsearch.randomizedtesting.rules.NoShadowingOrOverridesOnMethodsRule$1.evaluate(NoShadowingOrOverridesOnMethodsRule.java:40)
	at com.carrotsearch.randomizedtesting.rules.StatementAdapter.evaluate(StatementAdapter.java:36)
	at com.carrotsearch.randomizedtesting.rules.StatementAdapter.evaluate(StatementAdapter.java:36)
	at com.carrotsearch.randomizedtesting.rules.StatementAdapter.evaluate(StatementAdapter.java:36)
	at org.apache.lucene.util.TestRuleAssertionsRequired$1.evaluate(TestRuleAssertionsRequired.java:53)
	at org.apache.lucene.util.TestRuleMarkFailure$1.evaluate(TestRuleMarkFailure.java:47)
	at org.apache.lucene.util.TestRuleIgnoreAfterMaxFailures$1.evaluate(TestRuleIgnoreAfterMaxFailures.java:64)
	at org.apache.lucene.util.TestRuleIgnoreTestSuites$1.evaluate(TestRuleIgnoreTestSuites.java:54)
	at com.carrotsearch.randomizedtesting.rules.StatementAdapter.evaluate(StatementAdapter.java:36)
	at com.carrotsearch.randomizedtesting.ThreadLeakControl$StatementRunner.run(ThreadLeakControl.java:368)
	at java.lang.Thread.run(Thread.java:748)


FAILED:  junit.framework.TestSuite.org.apache.solr.handler.component.SpatialHeatmapFacetsTest

Error Message:
Could not remove the following files (in the order of attempts):    C:\Users\jenkins\workspace\Lucene-Solr-7.x-Windows\solr\build\solr-core\test\J0\temp\solr.handler.component.SpatialHeatmapFacetsTest_7BE9B4871C0BEFDB-001\tempDir-002\shard1\configsets: java.nio.file.DirectoryNotEmptyException: C:\Users\jenkins\workspace\Lucene-Solr-7.x-Windows\solr\build\solr-core\test\J0\temp\solr.handler.component.SpatialHeatmapFacetsTest_7BE9B4871C0BEFDB-001\tempDir-002\shard1\configsets    C:\Users\jenkins\workspace\Lucene-Solr-7.x-Windows\solr\build\solr-core\test\J0\temp\solr.handler.component.SpatialHeatmapFacetsTest_7BE9B4871C0BEFDB-001\tempDir-002\shard1: java.nio.file.DirectoryNotEmptyException: C:\Users\jenkins\workspace\Lucene-Solr-7.x-Windows\solr\build\solr-core\test\J0\temp\solr.handler.component.SpatialHeatmapFacetsTest_7BE9B4871C0BEFDB-001\tempDir-002\shard1    C:\Users\jenkins\workspace\Lucene-Solr-7.x-Windows\solr\build\solr-core\test\J0\temp\solr.handler.component.SpatialHeatmapFacetsTest_7BE9B4871C0BEFDB-001\tempDir-002: java.nio.file.DirectoryNotEmptyException: C:\Users\jenkins\workspace\Lucene-Solr-7.x-Windows\solr\build\solr-core\test\J0\temp\solr.handler.component.SpatialHeatmapFacetsTest_7BE9B4871C0BEFDB-001\tempDir-002 

Stack Trace:
java.io.IOException: Could not remove the following files (in the order of attempts):
   C:\Users\jenkins\workspace\Lucene-Solr-7.x-Windows\solr\build\solr-core\test\J0\temp\solr.handler.component.SpatialHeatmapFacetsTest_7BE9B4871C0BEFDB-001\tempDir-002\shard1\configsets: java.nio.file.DirectoryNotEmptyException: C:\Users\jenkins\workspace\Lucene-Solr-7.x-Windows\solr\build\solr-core\test\J0\temp\solr.handler.component.SpatialHeatmapFacetsTest_7BE9B4871C0BEFDB-001\tempDir-002\shard1\configsets
   C:\Users\jenkins\workspace\Lucene-Solr-7.x-Windows\solr\build\solr-core\test\J0\temp\solr.handler.component.SpatialHeatmapFacetsTest_7BE9B4871C0BEFDB-001\tempDir-002\shard1: java.nio.file.DirectoryNotEmptyException: C:\Users\jenkins\workspace\Lucene-Solr-7.x-Windows\solr\build\solr-core\test\J0\temp\solr.handler.component.SpatialHeatmapFacetsTest_7BE9B4871C0BEFDB-001\tempDir-002\shard1
   C:\Users\jenkins\workspace\Lucene-Solr-7.x-Windows\solr\build\solr-core\test\J0\temp\solr.handler.component.SpatialHeatmapFacetsTest_7BE9B4871C0BEFDB-001\tempDir-002: java.nio.file.DirectoryNotEmptyException: C:\Users\jenkins\workspace\Lucene-Solr-7.x-Windows\solr\build\solr-core\test\J0\temp\solr.handler.component.SpatialHeatmapFacetsTest_7BE9B4871C0BEFDB-001\tempDir-002

	at __randomizedtesting.SeedInfo.seed([7BE9B4871C0BEFDB]:0)
	at org.apache.lucene.util.IOUtils.rm(IOUtils.java:329)
	at org.apache.lucene.util.TestRuleTemporaryFilesCleanup.afterAlways(TestRuleTemporaryFilesCleanup.java:216)
	at com.carrotsearch.randomizedtesting.rules.TestRuleAdapter$1.afterAlways(TestRuleAdapter.java:31)
	at com.carrotsearch.randomizedtesting.rules.StatementAdapter.evaluate(StatementAdapter.java:43)
	at com.carrotsearch.randomizedtesting.rules.StatementAdapter.evaluate(StatementAdapter.java:36)
	at org.apache.lucene.util.TestRuleAssertionsRequired$1.evaluate(TestRuleAssertionsRequired.java:53)
	at org.apache.lucene.util.TestRuleMarkFailure$1.evaluate(TestRuleMarkFailure.java:47)
	at org.apache.lucene.util.TestRuleIgnoreAfterMaxFailures$1.evaluate(TestRuleIgnoreAfterMaxFailures.java:64)
	at org.apache.lucene.util.TestRuleIgnoreTestSuites$1.evaluate(TestRuleIgnoreTestSuites.java:54)
	at com.carrotsearch.randomizedtesting.rules.StatementAdapter.evaluate(StatementAdapter.java:36)
	at com.carrotsearch.randomizedtesting.ThreadLeakControl$StatementRunner.run(ThreadLeakControl.java:368)
	at java.lang.Thread.run(Thread.java:748)


FAILED:  org.apache.solr.security.TestPKIAuthenticationPlugin.test

Error Message:


Stack Trace:
java.lang.NullPointerException
	at __randomizedtesting.SeedInfo.seed([7BE9B4871C0BEFDB:F3BD8B5DB2F78223]:0)
	at org.apache.solr.security.TestPKIAuthenticationPlugin.test(TestPKIAuthenticationPlugin.java:147)
	at sun.reflect.NativeMethodAccessorImpl.invoke0(Native Method)
	at sun.reflect.NativeMethodAccessorImpl.invoke(NativeMethodAccessorImpl.java:62)
	at sun.reflect.DelegatingMethodAccessorImpl.invoke(DelegatingMethodAccessorImpl.java:43)
	at java.lang.reflect.Method.invoke(Method.java:498)
	at com.carrotsearch.randomizedtesting.RandomizedRunner.invoke(RandomizedRunner.java:1737)
	at com.carrotsearch.randomizedtesting.RandomizedRunner$8.evaluate(RandomizedRunner.java:934)
	at com.carrotsearch.randomizedtesting.RandomizedRunner$9.evaluate(RandomizedRunner.java:970)
	at com.carrotsearch.randomizedtesting.RandomizedRunner$10.evaluate(RandomizedRunner.java:984)
	at com.carrotsearch.randomizedtesting.rules.SystemPropertiesRestoreRule$1.evaluate(SystemPropertiesRestoreRule.java:57)
	at org.apache.lucene.util.TestRuleSetupTeardownChained$1.evaluate(TestRuleSetupTeardownChained.java:49)
	at org.apache.lucene.util.AbstractBeforeAfterRule$1.evaluate(AbstractBeforeAfterRule.java:45)
	at org.apache.lucene.util.TestRuleThreadAndTestName$1.evaluate(TestRuleThreadAndTestName.java:48)
	at org.apache.lucene.util.TestRuleIgnoreAfterMaxFailures$1.evaluate(TestRuleIgnoreAfterMaxFailures.java:64)
	at org.apache.lucene.util.TestRuleMarkFailure$1.evaluate(TestRuleMarkFailure.java:47)
	at com.carrotsearch.randomizedtesting.rules.StatementAdapter.evaluate(StatementAdapter.java:36)
	at com.carrotsearch.randomizedtesting.ThreadLeakControl$StatementRunner.run(ThreadLeakControl.java:368)
	at com.carrotsearch.randomizedtesting.ThreadLeakControl.forkTimeoutingTask(ThreadLeakControl.java:817)
	at com.carrotsearch.randomizedtesting.ThreadLeakControl$3.evaluate(ThreadLeakControl.java:468)
	at com.carrotsearch.randomizedtesting.RandomizedRunner.runSingleTest(RandomizedRunner.java:943)
	at com.carrotsearch.randomizedtesting.RandomizedRunner$5.evaluate(RandomizedRunner.java:829)
	at com.carrotsearch.randomizedtesting.RandomizedRunner$6.evaluate(RandomizedRunner.java:879)
	at com.carrotsearch.randomizedtesting.RandomizedRunner$7.evaluate(RandomizedRunner.java:890)
	at com.carrotsearch.randomizedtesting.rules.StatementAdapter.evaluate(StatementAdapter.java:36)
	at com.carrotsearch.randomizedtesting.rules.SystemPropertiesRestoreRule$1.evaluate(SystemPropertiesRestoreRule.java:57)
	at org.apache.lucene.util.AbstractBeforeAfterRule$1.evaluate(AbstractBeforeAfterRule.java:45)
	at com.carrotsearch.randomizedtesting.rules.StatementAdapter.evaluate(StatementAdapter.java:36)
	at org.apache.lucene.util.TestRuleStoreClassName$1.evaluate(TestRuleStoreClassName.java:41)
	at com.carrotsearch.randomizedtesting.rules.NoShadowingOrOverridesOnMethodsRule$1.evaluate(NoShadowingOrOverridesOnMethodsRule.java:40)
	at com.carrotsearch.randomizedtesting.rules.NoShadowingOrOverridesOnMethodsRule$1.evaluate(NoShadowingOrOverridesOnMethodsRule.java:40)
	at com.carrotsearch.randomizedtesting.rules.StatementAdapter.evaluate(StatementAdapter.java:36)
	at com.carrotsearch.randomizedtesting.rules.StatementAdapter.evaluate(StatementAdapter.java:36)
	at com.carrotsearch.randomizedtesting.rules.StatementAdapter.evaluate(StatementAdapter.java:36)
	at org.apache.lucene.util.TestRuleAssertionsRequired$1.evaluate(TestRuleAssertionsRequired.java:53)
	at org.apache.lucene.util.TestRuleMarkFailure$1.evaluate(TestRuleMarkFailure.java:47)
	at org.apache.lucene.util.TestRuleIgnoreAfterMaxFailures$1.evaluate(TestRuleIgnoreAfterMaxFailures.java:64)
	at org.apache.lucene.util.TestRuleIgnoreTestSuites$1.evaluate(TestRuleIgnoreTestSuites.java:54)
	at com.carrotsearch.randomizedtesting.rules.StatementAdapter.evaluate(StatementAdapter.java:36)
	at com.carrotsearch.randomizedtesting.ThreadLeakControl$StatementRunner.run(ThreadLeakControl.java:368)
	at java.lang.Thread.run(Thread.java:748)


FAILED:  org.apache.solr.client.solrj.io.stream.StreamExpressionTest.testParallelTerminatingDaemonUpdateStream

Error Message:
--> http://127.0.0.1:56611/solr/collection1:java.util.ConcurrentModificationException

Stack Trace:
java.io.IOException: --> http://127.0.0.1:56611/solr/collection1:java.util.ConcurrentModificationException
	at __randomizedtesting.SeedInfo.seed([471708545E64CA78:B673D03C0A0E0566]:0)
	at org.apache.solr.client.solrj.io.stream.SolrStream.read(SolrStream.java:222)
	at org.apache.solr.client.solrj.io.stream.StreamExpressionTest.testParallelTerminatingDaemonUpdateStream(StreamExpressionTest.java:4376)
	at sun.reflect.NativeMethodAccessorImpl.invoke0(Native Method)
	at sun.reflect.NativeMethodAccessorImpl.invoke(NativeMethodAccessorImpl.java:62)
	at sun.reflect.DelegatingMethodAccessorImpl.invoke(DelegatingMethodAccessorImpl.java:43)
	at java.lang.reflect.Method.invoke(Method.java:498)
	at com.carrotsearch.randomizedtesting.RandomizedRunner.invoke(RandomizedRunner.java:1737)
	at com.carrotsearch.randomizedtesting.RandomizedRunner$8.evaluate(RandomizedRunner.java:934)
	at com.carrotsearch.randomizedtesting.RandomizedRunner$9.evaluate(RandomizedRunner.java:970)
	at com.carrotsearch.randomizedtesting.RandomizedRunner$10.evaluate(RandomizedRunner.java:984)
	at com.carrotsearch.randomizedtesting.rules.SystemPropertiesRestoreRule$1.evaluate(SystemPropertiesRestoreRule.java:57)
	at org.apache.lucene.util.TestRuleSetupTeardownChained$1.evaluate(TestRuleSetupTeardownChained.java:49)
	at org.apache.lucene.util.AbstractBeforeAfterRule$1.evaluate(AbstractBeforeAfterRule.java:45)
	at org.apache.lucene.util.TestRuleThreadAndTestName$1.evaluate(TestRuleThreadAndTestName.java:48)
	at org.apache.lucene.util.TestRuleIgnoreAfterMaxFailures$1.evaluate(TestRuleIgnoreAfterMaxFailures.java:64)
	at org.apache.lucene.util.TestRuleMarkFailure$1.evaluate(TestRuleMarkFailure.java:47)
	at com.carrotsearch.randomizedtesting.rules.StatementAdapter.evaluate(StatementAdapter.java:36)
	at com.carrotsearch.randomizedtesting.ThreadLeakControl$StatementRunner.run(ThreadLeakControl.java:368)
	at com.carrotsearch.randomizedtesting.ThreadLeakControl.forkTimeoutingTask(ThreadLeakControl.java:817)
	at com.carrotsearch.randomizedtesting.ThreadLeakControl$3.evaluate(ThreadLeakControl.java:468)
	at com.carrotsearch.randomizedtesting.RandomizedRunner.runSingleTest(RandomizedRunner.java:943)
	at com.carrotsearch.randomizedtesting.RandomizedRunner$5.evaluate(RandomizedRunner.java:829)
	at com.carrotsearch.randomizedtesting.RandomizedRunner$6.evaluate(RandomizedRunner.java:879)
	at com.carrotsearch.randomizedtesting.RandomizedRunner$7.evaluate(RandomizedRunner.java:890)
	at com.carrotsearch.randomizedtesting.rules.StatementAdapter.evaluate(StatementAdapter.java:36)
	at com.carrotsearch.randomizedtesting.rules.SystemPropertiesRestoreRule$1.evaluate(SystemPropertiesRestoreRule.java:57)
	at org.apache.lucene.util.AbstractBeforeAfterRule$1.evaluate(AbstractBeforeAfterRule.java:45)
	at com.carrotsearch.randomizedtesting.rules.StatementAdapter.evaluate(StatementAdapter.java:36)
	at org.apache.lucene.util.TestRuleStoreClassName$1.evaluate(TestRuleStoreClassName.java:41)
	at com.carrotsearch.randomizedtesting.rules.NoShadowingOrOverridesOnMethodsRule$1.evaluate(NoShadowingOrOverridesOnMethodsRule.java:40)
	at com.carrotsearch.randomizedtesting.rules.NoShadowingOrOverridesOnMethodsRule$1.evaluate(NoShadowingOrOverridesOnMethodsRule.java:40)
	at com.carrotsearch.randomizedtesting.rules.StatementAdapter.evaluate(StatementAdapter.java:36)
	at com.carrotsearch.randomizedtesting.rules.StatementAdapter.evaluate(StatementAdapter.java:36)
	at com.carrotsearch.randomizedtesting.rules.StatementAdapter.evaluate(StatementAdapter.java:36)
	at org.apache.lucene.util.TestRuleAssertionsRequired$1.evaluate(TestRuleAssertionsRequired.java:53)
	at org.apache.lucene.util.TestRuleMarkFailure$1.evaluate(TestRuleMarkFailure.java:47)
	at org.apache.lucene.util.TestRuleIgnoreAfterMaxFailures$1.evaluate(TestRuleIgnoreAfterMaxFailures.java:64)
	at org.apache.lucene.util.TestRuleIgnoreTestSuites$1.evaluate(TestRuleIgnoreTestSuites.java:54)
	at com.carrotsearch.randomizedtesting.rules.StatementAdapter.evaluate(StatementAdapter.java:36)
	at com.carrotsearch.randomizedtesting.ThreadLeakControl$StatementRunner.run(ThreadLeakControl.java:368)
	at java.lang.Thread.run(Thread.java:748)


FAILED:  junit.framework.TestSuite.org.apache.solr.update.processor.TestOpenNLPExtractNamedEntitiesUpdateProcessorFactory

Error Message:
Could not remove the following files (in the order of attempts):    C:\Users\jenkins\workspace\Lucene-Solr-7.x-Windows\solr\build\contrib\solr-analysis-extras\test\J1\temp\solr.update.processor.TestOpenNLPExtractNamedEntitiesUpdateProcessorFactory_EB9D7F05D38C9AE4-001\tempDir-001\collection1\conf: java.nio.file.DirectoryNotEmptyException: C:\Users\jenkins\workspace\Lucene-Solr-7.x-Windows\solr\build\contrib\solr-analysis-extras\test\J1\temp\solr.update.processor.TestOpenNLPExtractNamedEntitiesUpdateProcessorFactory_EB9D7F05D38C9AE4-001\tempDir-001\collection1\conf    C:\Users\jenkins\workspace\Lucene-Solr-7.x-Windows\solr\build\contrib\solr-analysis-extras\test\J1\temp\solr.update.processor.TestOpenNLPExtractNamedEntitiesUpdateProcessorFactory_EB9D7F05D38C9AE4-001\tempDir-001\collection1: java.nio.file.DirectoryNotEmptyException: C:\Users\jenkins\workspace\Lucene-Solr-7.x-Windows\solr\build\contrib\solr-analysis-extras\test\J1\temp\solr.update.processor.TestOpenNLPExtractNamedEntitiesUpdateProcessorFactory_EB9D7F05D38C9AE4-001\tempDir-001\collection1    C:\Users\jenkins\workspace\Lucene-Solr-7.x-Windows\solr\build\contrib\solr-analysis-extras\test\J1\temp\solr.update.processor.TestOpenNLPExtractNamedEntitiesUpdateProcessorFactory_EB9D7F05D38C9AE4-001\tempDir-001: java.nio.file.DirectoryNotEmptyException: C:\Users\jenkins\workspace\Lucene-Solr-7.x-Windows\solr\build\contrib\solr-analysis-extras\test\J1\temp\solr.update.processor.TestOpenNLPExtractNamedEntitiesUpdateProcessorFactory_EB9D7F05D38C9AE4-001\tempDir-001    C:\Users\jenkins\workspace\Lucene-Solr-7.x-Windows\solr\build\contrib\solr-analysis-extras\test\J1\temp\solr.update.processor.TestOpenNLPExtractNamedEntitiesUpdateProcessorFactory_EB9D7F05D38C9AE4-001\tempDir-001\collection1\conf\en-test-sent.bin: java.nio.file.AccessDeniedException: C:\Users\jenkins\workspace\Lucene-Solr-7.x-Windows\solr\build\contrib\solr-analysis-extras\test\J1\temp\solr.update.processor.TestOpenNLPExtractNamedEntitiesUpdateProcessorFactory_EB9D7F05D38C9AE4-001\tempDir-001\collection1\conf\en-test-sent.bin    C:\Users\jenkins\workspace\Lucene-Solr-7.x-Windows\solr\build\contrib\solr-analysis-extras\test\J1\temp\solr.update.processor.TestOpenNLPExtractNamedEntitiesUpdateProcessorFactory_EB9D7F05D38C9AE4-001\tempDir-001\collection1\conf\en-test-tokenizer.bin: java.nio.file.AccessDeniedException: C:\Users\jenkins\workspace\Lucene-Solr-7.x-Windows\solr\build\contrib\solr-analysis-extras\test\J1\temp\solr.update.processor.TestOpenNLPExtractNamedEntitiesUpdateProcessorFactory_EB9D7F05D38C9AE4-001\tempDir-001\collection1\conf\en-test-tokenizer.bin    C:\Users\jenkins\workspace\Lucene-Solr-7.x-Windows\solr\build\contrib\solr-analysis-extras\test\J1\temp\solr.update.processor.TestOpenNLPExtractNamedEntitiesUpdateProcessorFactory_EB9D7F05D38C9AE4-001\tempDir-001\collection1\conf\en-test-ner-person.bin: java.nio.file.AccessDeniedException: C:\Users\jenkins\workspace\Lucene-Solr-7.x-Windows\solr\build\contrib\solr-analysis-extras\test\J1\temp\solr.update.processor.TestOpenNLPExtractNamedEntitiesUpdateProcessorFactory_EB9D7F05D38C9AE4-001\tempDir-001\collection1\conf\en-test-ner-person.bin    C:\Users\jenkins\workspace\Lucene-Solr-7.x-Windows\solr\build\contrib\solr-analysis-extras\test\J1\temp\solr.update.processor.TestOpenNLPExtractNamedEntitiesUpdateProcessorFactory_EB9D7F05D38C9AE4-001: java.nio.file.DirectoryNotEmptyException: C:\Users\jenkins\workspace\Lucene-Solr-7.x-Windows\solr\build\contrib\solr-analysis-extras\test\J1\temp\solr.update.processor.TestOpenNLPExtractNamedEntitiesUpdateProcessorFactory_EB9D7F05D38C9AE4-001 

Stack Trace:
java.io.IOException: Could not remove the following files (in the order of attempts):
   C:\Users\jenkins\workspace\Lucene-Solr-7.x-Windows\solr\build\contrib\solr-analysis-extras\test\J1\temp\solr.update.processor.TestOpenNLPExtractNamedEntitiesUpdateProcessorFactory_EB9D7F05D38C9AE4-001\tempDir-001\collection1\conf: java.nio.file.DirectoryNotEmptyException: C:\Users\jenkins\workspace\Lucene-Solr-7.x-Windows\solr\build\contrib\solr-analysis-extras\test\J1\temp\solr.update.processor.TestOpenNLPExtractNamedEntitiesUpdateProcessorFactory_EB9D7F05D38C9AE4-001\tempDir-001\collection1\conf
   C:\Users\jenkins\workspace\Lucene-Solr-7.x-Windows\solr\build\contrib\solr-analysis-extras\test\J1\temp\solr.update.processor.TestOpenNLPExtractNamedEntitiesUpdateProcessorFactory_EB9D7F05D38C9AE4-001\tempDir-001\collection1: java.nio.file.DirectoryNotEmptyException: C:\Users\jenkins\workspace\Lucene-Solr-7.x-Windows\solr\build\contrib\solr-analysis-extras\test\J1\temp\solr.update.processor.TestOpenNLPExtractNamedEntitiesUpdateProcessorFactory_EB9D7F05D38C9AE4-001\tempDir-001\collection1
   C:\Users\jenkins\workspace\Lucene-Solr-7.x-Windows\solr\build\contrib\solr-analysis-extras\test\J1\temp\solr.update.processor.TestOpenNLPExtractNamedEntitiesUpdateProcessorFactory_EB9D7F05D38C9AE4-001\tempDir-001: java.nio.file.DirectoryNotEmptyException: C:\Users\jenkins\workspace\Lucene-Solr-7.x-Windows\solr\build\contrib\solr-analysis-extras\test\J1\temp\solr.update.processor.TestOpenNLPExtractNamedEntitiesUpdateProcessorFactory_EB9D7F05D38C9AE4-001\tempDir-001
   C:\Users\jenkins\workspace\Lucene-Solr-7.x-Windows\solr\build\contrib\solr-analysis-extras\test\J1\temp\solr.update.processor.TestOpenNLPExtractNamedEntitiesUpdateProcessorFactory_EB9D7F05D38C9AE4-001\tempDir-001\collection1\conf\en-test-sent.bin: java.nio.file.AccessDeniedException: C:\Users\jenkins\workspace\Lucene-Solr-7.x-Windows\solr\build\contrib\solr-analysis-extras\test\J1\temp\solr.update.processor.TestOpenNLPExtractNamedEntitiesUpdateProcessorFactory_EB9D7F05D38C9AE4-001\tempDir-001\collection1\conf\en-test-sent.bin
   C:\Users\jenkins\workspace\Lucene-Solr-7.x-Windows\solr\build\contrib\solr-analysis-extras\test\J1\temp\solr.update.processor.TestOpenNLPExtractNamedEntitiesUpdateProcessorFactory_EB9D7F05D38C9AE4-001\tempDir-001\collection1\conf\en-test-tokenizer.bin: java.nio.file.AccessDeniedException: C:\Users\jenkins\workspace\Lucene-Solr-7.x-Windows\solr\build\contrib\solr-analysis-extras\test\J1\temp\solr.update.processor.TestOpenNLPExtractNamedEntitiesUpdateProcessorFactory_EB9D7F05D38C9AE4-001\tempDir-001\collection1\conf\en-test-tokenizer.bin
   C:\Users\jenkins\workspace\Lucene-Solr-7.x-Windows\solr\build\contrib\solr-analysis-extras\test\J1\temp\solr.update.processor.TestOpenNLPExtractNamedEntitiesUpdateProcessorFactory_EB9D7F05D38C9AE4-001\tempDir-001\collection1\conf\en-test-ner-person.bin: java.nio.file.AccessDeniedException: C:\Users\jenkins\workspace\Lucene-Solr-7.x-Windows\solr\build\contrib\solr-analysis-extras\test\J1\temp\solr.update.processor.TestOpenNLPExtractNamedEntitiesUpdateProcessorFactory_EB9D7F05D38C9AE4-001\tempDir-001\collection1\conf\en-test-ner-person.bin
   C:\Users\jenkins\workspace\Lucene-Solr-7.x-Windows\solr\build\contrib\solr-analysis-extras\test\J1\temp\solr.update.processor.TestOpenNLPExtractNamedEntitiesUpdateProcessorFactory_EB9D7F05D38C9AE4-001: java.nio.file.DirectoryNotEmptyException: C:\Users\jenkins\workspace\Lucene-Solr-7.x-Windows\solr\build\contrib\solr-analysis-extras\test\J1\temp\solr.update.processor.TestOpenNLPExtractNamedEntitiesUpdateProcessorFactory_EB9D7F05D38C9AE4-001

	at __randomizedtesting.SeedInfo.seed([EB9D7F05D38C9AE4]:0)
	at org.apache.lucene.util.IOUtils.rm(IOUtils.java:329)
	at org.apache.lucene.util.TestRuleTemporaryFilesCleanup.afterAlways(TestRuleTemporaryFilesCleanup.java:216)
	at com.carrotsearch.randomizedtesting.rules.TestRuleAdapter$1.afterAlways(TestRuleAdapter.java:31)
	at com.carrotsearch.randomizedtesting.rules.StatementAdapter.evaluate(StatementAdapter.java:43)
	at com.carrotsearch.randomizedtesting.rules.StatementAdapter.evaluate(StatementAdapter.java:36)
	at org.apache.lucene.util.TestRuleAssertionsRequired$1.evaluate(TestRuleAssertionsRequired.java:53)
	at org.apache.lucene.util.TestRuleMarkFailure$1.evaluate(TestRuleMarkFailure.java:47)
	at org.apache.lucene.util.TestRuleIgnoreAfterMaxFailures$1.evaluate(TestRuleIgnoreAfterMaxFailures.java:64)
	at org.apache.lucene.util.TestRuleIgnoreTestSuites$1.evaluate(TestRuleIgnoreTestSuites.java:54)
	at com.carrotsearch.randomizedtesting.rules.StatementAdapter.evaluate(StatementAdapter.java:36)
	at com.carrotsearch.randomizedtesting.ThreadLeakControl$StatementRunner.run(ThreadLeakControl.java:368)
	at java.lang.Thread.run(Thread.java:748)




Build Log:
[...truncated 6089 lines...]
   [junit4] Suite: org.apache.lucene.benchmark.byTask.feeds.TrecContentSourceTest
   [junit4]   2> NOTE: test params are: codec=Asserting(Lucene70): {}, docValues:{}, maxPointsInLeafNode=1357, maxMBSortInHeap=6.627151966351251, sim=RandomSimilarity(queryNorm=true): {}, locale=uk, timezone=Etc/GMT-13
   [junit4]   2> NOTE: Windows 10 10.0 amd64/Oracle Corporation 1.8.0_144 (64-bit)/cpus=3,threads=1,free=198714416,total=244318208
   [junit4]   2> NOTE: All tests run in this JVM: [WriteEnwikiLineDocTaskTest, TestPerfTasksLogic, CreateIndexTaskTest, AddIndexesTaskTest, WriteLineDocTaskTest, TrecContentSourceTest]
   [junit4]   2> NOTE: reproduce with: ant test  -Dtestcase=TrecContentSourceTest -Dtests.seed=E3BEAD551E621898 -Dtests.slow=true -Dtests.locale=uk -Dtests.timezone=Etc/GMT-13 -Dtests.asserts=true -Dtests.file.encoding=UTF-8
   [junit4] ERROR   0.00s J0 | TrecContentSourceTest (suite) <<<
   [junit4]    > Throwable #1: java.io.IOException: Could not remove the following files (in the order of attempts):
   [junit4]    >    C:\Users\jenkins\workspace\Lucene-Solr-7.x-Windows\lucene\build\benchmark\test\J0\temp\lucene.benchmark.byTask.feeds.TrecContentSourceTest_E3BEAD551E621898-001\trecFeedAllTypes-001\trecdocs: java.nio.file.DirectoryNotEmptyException: C:\Users\jenkins\workspace\Lucene-Solr-7.x-Windows\lucene\build\benchmark\test\J0\temp\lucene.benchmark.byTask.feeds.TrecContentSourceTest_E3BEAD551E621898-001\trecFeedAllTypes-001\trecdocs
   [junit4]    >    C:\Users\jenkins\workspace\Lucene-Solr-7.x-Windows\lucene\build\benchmark\test\J0\temp\lucene.benchmark.byTask.feeds.TrecContentSourceTest_E3BEAD551E621898-001\trecFeedAllTypes-001: java.nio.file.DirectoryNotEmptyException: C:\Users\jenkins\workspace\Lucene-Solr-7.x-Windows\lucene\build\benchmark\test\J0\temp\lucene.benchmark.byTask.feeds.TrecContentSourceTest_E3BEAD551E621898-001\trecFeedAllTypes-001
   [junit4]    >    C:\Users\jenkins\workspace\Lucene-Solr-7.x-Windows\lucene\build\benchmark\test\J0\temp\lucene.benchmark.byTask.feeds.TrecContentSourceTest_E3BEAD551E621898-001\trecFeedAllTypes-001\trecdocs\fr94: java.nio.file.AccessDeniedException: C:\Users\jenkins\workspace\Lucene-Solr-7.x-Windows\lucene\build\benchmark\test\J0\temp\lucene.benchmark.byTask.feeds.TrecContentSourceTest_E3BEAD551E621898-001\trecFeedAllTypes-001\trecdocs\fr94
   [junit4]    >    C:\Users\jenkins\workspace\Lucene-Solr-7.x-Windows\lucene\build\benchmark\test\J0\temp\lucene.benchmark.byTask.feeds.TrecContentSourceTest_E3BEAD551E621898-001: java.nio.file.DirectoryNotEmptyException: C:\Users\jenkins\workspace\Lucene-Solr-7.x-Windows\lucene\build\benchmark\test\J0\temp\lucene.benchmark.byTask.feeds.TrecContentSourceTest_E3BEAD551E621898-001
   [junit4]    > 	at __randomizedtesting.SeedInfo.seed([E3BEAD551E621898]:0)
   [junit4]    > 	at org.apache.lucene.util.IOUtils.rm(IOUtils.java:329)
   [junit4]    > 	at java.lang.Thread.run(Thread.java:748)
   [junit4] Completed [14/18 (1!)] on J0 in 0.25s, 6 tests, 1 error <<< FAILURES!

[...truncated 5633 lines...]
   [junit4] Suite: org.apache.solr.handler.component.SpatialHeatmapFacetsTest
   [junit4]   2> Creating dataDir: C:\Users\jenkins\workspace\Lucene-Solr-7.x-Windows\solr\build\solr-core\test\J0\temp\solr.handler.component.SpatialHeatmapFacetsTest_7BE9B4871C0BEFDB-001\init-core-data-001
   [junit4]   2> 12487 WARN  (SUITE-SpatialHeatmapFacetsTest-seed#[7BE9B4871C0BEFDB]-worker) [    ] o.a.s.SolrTestCaseJ4 startTrackingSearchers: numOpens=1 numCloses=1
   [junit4]   2> 12487 INFO  (SUITE-SpatialHeatmapFacetsTest-seed#[7BE9B4871C0BEFDB]-worker) [    ] o.a.s.SolrTestCaseJ4 Using PointFields (NUMERIC_POINTS_SYSPROP=true) w/NUMERIC_DOCVALUES_SYSPROP=false
   [junit4]   2> 12487 INFO  (SUITE-SpatialHeatmapFacetsTest-seed#[7BE9B4871C0BEFDB]-worker) [    ] o.a.s.SolrTestCaseJ4 Randomized ssl (false) and clientAuth (false) via: @org.apache.solr.util.RandomizeSSL(reason=, value=NaN, ssl=NaN, clientAuth=NaN)
   [junit4]   2> 12487 INFO  (SUITE-SpatialHeatmapFacetsTest-seed#[7BE9B4871C0BEFDB]-worker) [    ] o.a.s.SolrTestCaseJ4 SecureRandom sanity checks: test.solr.allowed.securerandom=null & java.security.egd=file:/dev/./urandom
   [junit4]   2> 12487 INFO  (SUITE-SpatialHeatmapFacetsTest-seed#[7BE9B4871C0BEFDB]-worker) [    ] o.a.s.BaseDistributedSearchTestCase Setting hostContext system property: /
   [junit4]   2> 13222 INFO  (TEST-SpatialHeatmapFacetsTest.test-seed#[7BE9B4871C0BEFDB]) [    ] o.a.s.SolrTestCaseJ4 Writing core.properties file to C:\Users\jenkins\workspace\Lucene-Solr-7.x-Windows\solr\build\solr-core\test\J0\temp\solr.handler.component.SpatialHeatmapFacetsTest_7BE9B4871C0BEFDB-001\tempDir-001\control\cores\collection1
   [junit4]   2> 13222 INFO  (TEST-SpatialHeatmapFacetsTest.test-seed#[7BE9B4871C0BEFDB]) [    ] o.e.j.s.Server jetty-9.3.20.v20170531
   [junit4]   2> 13222 INFO  (TEST-SpatialHeatmapFacetsTest.test-seed#[7BE9B4871C0BEFDB]) [    ] o.e.j.s.h.ContextHandler Started o.e.j.s.ServletContextHandler@c54e299{/,null,AVAILABLE}
   [junit4]   2> 13222 INFO  (TEST-SpatialHeatmapFacetsTest.test-seed#[7BE9B4871C0BEFDB]) [    ] o.e.j.s.AbstractConnector Started ServerConnector@49a0bf21{HTTP/1.1,[http/1.1]}{127.0.0.1:59928}
   [junit4]   2> 13222 INFO  (TEST-SpatialHeatmapFacetsTest.test-seed#[7BE9B4871C0BEFDB]) [    ] o.e.j.s.Server Started @21613ms
   [junit4]   2> 13222 INFO  (TEST-SpatialHeatmapFacetsTest.test-seed#[7BE9B4871C0BEFDB]) [    ] o.a.s.c.s.e.JettySolrRunner Jetty properties: {schema=schema-spatial.xml, solrconfig=solrconfig-basic.xml, hostContext=/, hostPort=59928, coreRootDirectory=C:\Users\jenkins\workspace\Lucene-Solr-7.x-Windows\solr\build\solr-core\test\J0\temp\solr.handler.component.SpatialHeatmapFacetsTest_7BE9B4871C0BEFDB-001\tempDir-001\control\cores}
   [junit4]   2> 13222 ERROR (TEST-SpatialHeatmapFacetsTest.test-seed#[7BE9B4871C0BEFDB]) [    ] o.a.s.u.StartupLoggingUtils Missing Java Option solr.log.dir. Logging may be missing or incomplete.
   [junit4]   2> 13222 INFO  (TEST-SpatialHeatmapFacetsTest.test-seed#[7BE9B4871C0BEFDB]) [    ] o.a.s.s.SolrDispatchFilter  ___      _       Welcome to Apache Solr? version 7.3.0
   [junit4]   2> 13222 INFO  (TEST-SpatialHeatmapFacetsTest.test-seed#[7BE9B4871C0BEFDB]) [    ] o.a.s.s.SolrDispatchFilter / __| ___| |_ _   Starting in standalone mode on port null
   [junit4]   2> 13222 INFO  (TEST-SpatialHeatmapFacetsTest.test-seed#[7BE9B4871C0BEFDB]) [    ] o.a.s.s.SolrDispatchFilter \__ \/ _ \ | '_|  Install dir: null
   [junit4]   2> 13222 INFO  (TEST-SpatialHeatmapFacetsTest.test-seed#[7BE9B4871C0BEFDB]) [    ] o.a.s.s.SolrDispatchFilter |___/\___/_|_|    Start time: 2017-12-26T03:09:25.127Z
   [junit4]   2> 13222 INFO  (TEST-SpatialHeatmapFacetsTest.test-seed#[7BE9B4871C0BEFDB]) [    ] o.a.s.c.SolrXmlConfig Loading container configuration from C:\Users\jenkins\workspace\Lucene-Solr-7.x-Windows\solr\build\solr-core\test\J0\temp\solr.handler.component.SpatialHeatmapFacetsTest_7BE9B4871C0BEFDB-001\tempDir-001\control\solr.xml
   [junit4]   2> 13238 INFO  (TEST-SpatialHeatmapFacetsTest.test-seed#[7BE9B4871C0BEFDB]) [    ] o.a.s.c.SolrXmlConfig Configuration parameter autoReplicaFailoverWorkLoopDelay is ignored
   [junit4]   2> 13238 INFO  (TEST-SpatialHeatmapFacetsTest.test-seed#[7BE9B4871C0BEFDB]) [    ] o.a.s.c.SolrXmlConfig Configuration parameter autoReplicaFailoverBadNodeExpiration is ignored
   [junit4]   2> 13315 INFO  (TEST-SpatialHeatmapFacetsTest.test-seed#[7BE9B4871C0BEFDB]) [    ] o.a.s.c.CorePropertiesLocator Found 1 core definitions underneath C:\Users\jenkins\workspace\Lucene-Solr-7.x-Windows\solr\build\solr-core\test\J0\temp\solr.handler.component.SpatialHeatmapFacetsTest_7BE9B4871C0BEFDB-001\tempDir-001\control\cores
   [junit4]   2> 13315 INFO  (TEST-SpatialHeatmapFacetsTest.test-seed#[7BE9B4871C0BEFDB]) [    ] o.a.s.c.CorePropertiesLocator Cores are: [collection1]
   [junit4]   2> 13315 INFO  (coreLoadExecutor-37-thread-1) [    ] o.a.s.c.TransientSolrCoreCacheDefault Allocating transient cache for 4 transient cores
   [junit4]   2> 13315 INFO  (coreLoadExecutor-37-thread-1) [    x:collection1] o.a.s.c.SolrResourceLoader [null] Added 2 libs to classloader, from paths: [/C:/Users/jenkins/workspace/Lucene-Solr-7.x-Windows/solr/core/src/test-files/solr/collection1/lib, /C:/Users/jenkins/workspace/Lucene-Solr-7.x-Windows/solr/core/src/test-files/solr/collection1/lib/classes]
   [junit4]   2> 13425 INFO  (coreLoadExecutor-37-thread-1) [    x:collection1] o.a.s.c.SolrConfig Using Lucene MatchVersion: 7.3.0
   [junit4]   2> 13456 INFO  (coreLoadExecutor-37-thread-1) [    x:collection1] o.a.s.s.IndexSchema [collection1] Schema name=test
   [junit4]   2> 13472 WARN  (coreLoadExecutor-37-thread-1) [    x:collection1] o.a.s.c.SolrResourceLoader Solr loaded a deprecated plugin/analysis class [solr.TrieDoubleField]. Please consult documentation how to replace it accordingly.
   [junit4]   2> 13503 WARN  (coreLoadExecutor-37-thread-1) [    x:collection1] o.a.s.c.SolrResourceLoader Solr loaded a deprecated plugin/analysis class [solr.SpatialTermQueryPrefixTreeFieldType]. Please consult documentation how to replace it accordingly.
   [junit4]   2> 13519 WARN  (coreLoadExecutor-37-thread-1) [    x:collection1] o.a.s.c.SolrResourceLoader Solr loaded a deprecated plugin/analysis class [solr.SpatialPointVectorFieldType]. Please consult documentation how to replace it accordingly.
   [junit4]   2> 13644 INFO  (coreLoadExecutor-37-thread-1) [    x:collection1] o.a.s.s.IndexSchema Loaded schema test/1.4 with uniqueid field id
   [junit4]   2> 13644 INFO  (coreLoadExecutor-37-thread-1) [    x:collection1] o.a.s.c.CoreContainer Creating SolrCore 'collection1' using configuration from configset C:\Users\jenkins\workspace\Lucene-Solr-7.x-Windows\solr\core\src\test-files\solr\collection1, trusted=true
   [junit4]   2> 13644 INFO  (coreLoadExecutor-37-thread-1) [    x:collection1] o.a.s.c.SolrCore solr.RecoveryStrategy.Builder
   [junit4]   2> 13644 INFO  (coreLoadExecutor-37-thread-1) [    x:collection1] o.a.s.c.SolrCore [[collection1] ] Opening new SolrCore at [C:\Users\jenkins\workspace\Lucene-Solr-7.x-Windows\solr\core\src\test-files\solr\collection1], dataDir=[C:\Users\jenkins\workspace\Lucene-Solr-7.x-Windows\solr\build\solr-core\test\J0\temp\solr.handler.component.SpatialHeatmapFacetsTest_7BE9B4871C0BEFDB-001\tempDir-001\control\cores\collection1\data\]
   [junit4]   2> 13644 INFO  (coreLoadExecutor-37-thread-1) [    x:collection1] o.a.s.u.RandomMergePolicy RandomMergePolicy wrapping class org.apache.lucene.index.LogDocMergePolicy: [LogDocMergePolicy: minMergeSize=1000, mergeFactor=12, maxMergeSize=9223372036854775807, maxMergeSizeForForcedMerge=9223372036854775807, calibrateSizeByDeletes=false, maxMergeDocs=2147483647, maxCFSSegmentSizeMB=8.796093022207999E12, noCFSRatio=0.8327485359565938]
   [junit4]   2> 13722 INFO  (coreLoadExecutor-37-thread-1) [    x:collection1] o.a.s.u.CommitTracker Hard AutoCommit: disabled
   [junit4]   2> 13722 INFO  (coreLoadExecutor-37-thread-1) [    x:collection1] o.a.s.u.CommitTracker Soft AutoCommit: disabled
   [junit4]   2> 13722 INFO  (coreLoadExecutor-37-thread-1) [    x:collection1] o.a.s.u.RandomMergePolicy RandomMergePolicy wrapping class org.apache.lucene.index.LogByteSizeMergePolicy: [LogByteSizeMergePolicy: minMergeSize=1677721, mergeFactor=21, maxMergeSize=2147483648, maxMergeSizeForForcedMerge=9223372036854775807, calibrateSizeByDeletes=true, maxMergeDocs=2147483647, maxCFSSegmentSizeMB=8.796093022207999E12, noCFSRatio=0.563683334517811]
   [junit4]   2> 13737 INFO  (coreLoadExecutor-37-thread-1) [    x:collection1] o.a.s.s.SolrIndexSearcher Opening [Searcher@2ca4d2a9[collection1] main]
   [junit4]   2> 13737 WARN  (coreLoadExecutor-37-thread-1) [    x:collection1] o.a.s.r.ManagedResourceStorage Cannot write to config directory C:\Users\jenkins\workspace\Lucene-Solr-7.x-Windows\solr\core\src\test-files\solr\collection1\conf; switching to use InMemory storage instead.
   [junit4]   2> 13737 INFO  (coreLoadExecutor-37-thread-1) [    x:collection1] o.a.s.h.ReplicationHandler Commits will be reserved for 10000ms.
   [junit4]   2> 13737 INFO  (searcherExecutor-38-thread-1-processing-x:collection1) [    x:collection1] o.a.s.c.SolrCore [collection1] Registered new searcher Searcher@2ca4d2a9[collection1] main{ExitableDirectoryReader(UninvertingDirectoryReader())}
   [junit4]   2> 14205 INFO  (TEST-SpatialHeatmapFacetsTest.test-seed#[7BE9B4871C0BEFDB]) [    ] o.a.s.SolrTestCaseJ4 Writing core.properties file to C:\Users\jenkins\workspace\Lucene-Solr-7.x-Windows\solr\build\solr-core\test\J0\temp\solr.handler.component.SpatialHeatmapFacetsTest_7BE9B4871C0BEFDB-001\tempDir-001\shard0\cores\collection1
   [junit4]   2> 14205 INFO  (TEST-SpatialHeatmapFacetsTest.test-seed#[7BE9B4871C0BEFDB]) [    ] o.e.j.s.Server jetty-9.3.20.v20170531
   [junit4]   2> 14205 INFO  (TEST-SpatialHeatmapFacetsTest.test-seed#[7BE9B4871C0BEFDB]) [    ] o.e.j.s.h.ContextHandler Started o.e.j.s.ServletContextHandler@4f3872ba{/,null,AVAILABLE}
   [junit4]   2> 14205 INFO  (TEST-SpatialHeatmapFacetsTest.test-seed#[7BE9B4871C0BEFDB]) [    ] o.e.j.s.AbstractConnector Started ServerConnector@5fb0d48a{HTTP/1.1,[http/1.1]}{127.0.0.1:59931}
   [junit4]   2> 14205 INFO  (TEST-SpatialHeatmapFacetsTest.test-seed#[7BE9B4871C0BEFDB]) [    ] o.e.j.s.Server Started @22592ms
   [junit4]   2> 14205 INFO  (TEST-SpatialHeatmapFacetsTest.test-seed#[7BE9B4871C0BEFDB]) [    ] o.a.s.c.s.e.JettySolrRunner Jetty properties: {schema=schema-spatial.xml, solrconfig=solrconfig-basic.xml, hostContext=/, hostPort=59931, coreRootDirectory=C:\Users\jenkins\workspace\Lucene-Solr-7.x-Windows\solr\build\solr-core\test\J0\temp\solr.handler.component.SpatialHeatmapFacetsTest_7BE9B4871C0BEFDB-001\tempDir-001\shard0\cores}
   [junit4]   2> 14205 ERROR (TEST-SpatialHeatmapFacetsTest.test-seed#[7BE9B4871C0BEFDB]) [    ] o.a.s.u.StartupLoggingUtils Missing Java Option solr.log.dir. Logging may be missing or incomplete.
   [junit4]   2> 14205 INFO  (TEST-SpatialHeatmapFacetsTest.test-seed#[7BE9B4871C0BEFDB]) [    ] o.a.s.s.SolrDispatchFilter  ___      _       Welcome to Apache Solr? version 7.3.0
   [junit4]   2> 14205 INFO  (TEST-SpatialHeatmapFacetsTest.test-seed#[7BE9B4871C0BEFDB]) [    ] o.a.s.s.SolrDispatchFilter / __| ___| |_ _   Starting in standalone mode on port null
   [junit4]   2> 14205 INFO  (TEST-SpatialHeatmapFacetsTest.test-seed#[7BE9B4871C0BEFDB]) [    ] o.a.s.s.SolrDispatchFilter \__ \/ _ \ | '_|  Install dir: null
   [junit4]   2> 14205 INFO  (TEST-SpatialHeatmapFacetsTest.test-seed#[7BE9B4871C0BEFDB]) [    ] o.a.s.s.SolrDispatchFilter |___/\___/_|_|    Start time: 2017-12-26T03:09:26.110Z
   [junit4]   2> 14205 INFO  (TEST-SpatialHeatmapFacetsTest.test-seed#[7BE9B4871C0BEFDB]) [    ] o.a.s.c.SolrXmlConfig Loading container configuration from C:\Users\jenkins\workspace\Lucene-Solr-7.x-Windows\solr\build\solr-core\test\J0\temp\solr.handler.component.SpatialHeatmapFacetsTest_7BE9B4871C0BEFDB-001\tempDir-001\shard0\solr.xml
   [junit4]   2> 14220 INFO  (TEST-SpatialHeatmapFacetsTest.test-seed#[7BE9B4871C0BEFDB]) [    ] o.a.s.c.SolrXmlConfig Configuration parameter autoReplicaFailoverWorkLoopDelay is ignored
   [junit4]   2> 14220 INFO  (TEST-SpatialHeatmapFacetsTest.test-seed#[7BE9B4871C0BEFDB]) [    ] o.a.s.c.SolrXmlConfig Configuration parameter autoReplicaFailoverBadNodeExpiration is ignored
   [junit4]   2> 14283 INFO  (TEST-SpatialHeatmapFacetsTest.test-seed#[7BE9B4871C0BEFDB]) [    ] o.a.s.c.CorePropertiesLocator Found 1 core definitions underneath C:\Users\jenkins\workspace\Lucene-Solr-7.x-Windows\solr\build\solr-core\test\J0\temp\solr.handler.component.SpatialHeatmapFacetsTest_7BE9B4871C0BEFDB-001\tempDir-001\shard0\cores
   [junit4]   2> 14283 INFO  (TEST-SpatialHeatmapFacetsTest.test-seed#[7BE9B4871C0BEFDB]) [    ] o.a.s.c.CorePropertiesLocator Cores are: [collection1]
   [junit4]   2> 14298 INFO  (coreLoadExecutor-47-thread-1) [    ] o.a.s.c.TransientSolrCoreCacheDefault Allocating transient cache for 4 transient cores
   [junit4]   2> 14298 INFO  (coreLoadExecutor-47-thread-1) [    x:collection1] o.a.s.c.SolrResourceLoader [null] Added 2 libs to classloader, from paths: [/C:/Users/jenkins/workspace/Lucene-Solr-7.x-Windows/solr/core/src/test-files/solr/collection1/lib, /C:/Users/jenkins/workspace/Lucene-Solr-7.x-Windows/solr/core/src/test-files/solr/collection1/lib/classes]
   [junit4]   2> 14361 INFO  (coreLoadExecutor-47-thread-1) [    x:collection1] o.a.s.c.SolrConfig Using Lucene MatchVersion: 7.3.0
   [junit4]   2> 14376 INFO  (coreLoadExecutor-47-thread-1) [    x:collection1] o.a.s.s.IndexSchema [collection1] Schema name=test
   [junit4]   2> 14392 INFO  (coreLoadExecutor-47-thread-1) [    x:collection1] o.a.s.s.IndexSchema Loaded schema test/1.4 with uniqueid field id
   [junit4]   2> 14392 INFO  (coreLoadExecutor-47-thread-1) [    x:collection1] o.a.s.c.CoreContainer Creating SolrCore 'collection1' using configuration from configset C:\Users\jenkins\workspace\Lucene-Solr-7.x-Windows\solr\core\src\test-files\solr\collection1, trusted=true
   [junit4]   2> 14392 INFO  (coreLoadExecutor-47-thread-1) [    x:collection1] o.a.s.c.SolrCore solr.RecoveryStrategy.Builder
   [junit4]   2> 14392 INFO  (coreLoadExecutor-47-thread-1) [    x:collection1] o.a.s.c.SolrCore [[collection1] ] Opening new SolrCore at [C:\Users\jenkins\workspace\Lucene-Solr-7.x-Windows\solr\core\src\test-files\solr\collection1], dataDir=[C:\Users\jenkins\workspace\Lucene-Solr-7.x-Windows\solr\build\solr-core\test\J0\temp\solr.handler.component.SpatialHeatmapFacetsTest_7BE9B4871C0BEFDB-001\tempDir-001\shard0\cores\collection1\data\]
   [junit4]   2> 14392 INFO  (coreLoadExecutor-47-thread-1) [    x:collection1] o.a.s.u.RandomMergePolicy RandomMergePolicy wrapping class org.apache.lucene.index.LogDocMergePolicy: [LogDocMergePolicy: minMergeSize=1000, mergeFactor=12, maxMergeSize=9223372036854775807, maxMergeSizeForForcedMerge=9223372036854775807, calibrateSizeByDeletes=false, maxMergeDocs=2147483647, maxCFSSegmentSizeMB=8.796093022207999E12, noCFSRatio=0.8327485359565938]
   [junit4]   2> 14470 INFO  (coreLoadExecutor-47-thread-1) [    x:collection1] o.a.s.u.CommitTracker Hard AutoCommit: disabled
   [junit4]   2> 14470 INFO  (coreLoadExecutor-47-thread-1) [    x:collection1] o.a.s.u.CommitTracker Soft AutoCommit: disabled
   [junit4]   2> 14470 INFO  (coreLoadExecutor-47-thread-1) [    x:collection1] o.a.s.u.RandomMergePolicy RandomMergePolicy wrapping class org.apache.lucene.index.LogByteSizeMergePolicy: [LogByteSizeMergePolicy: minMergeSize=1677721, mergeFactor=21, maxMergeSize=2147483648, maxMergeSizeForForcedMerge=9223372036854775807, calibrateSizeByDeletes=true, maxMergeDocs=2147483647, maxCFSSegmentSizeMB=8.796093022207999E12, noCFSRatio=0.563683334517811]
   [junit4]   2> 14470 INFO  (coreLoadExecutor-47-thread-1) [    x:collection1] o.a.s.s.SolrIndexSearcher Opening [Searcher@7920dbba[collection1] main]
   [junit4]   2> 14470 WARN  (coreLoadExecutor-47-thread-1) [    x:collection1] o.a.s.r.ManagedResourceStorage Cannot write to config directory C:\Users\jenkins\workspace\Lucene-Solr-7.x-Windows\solr\core\src\test-files\solr\collection1\conf; switching to use InMemory storage instead.
   [junit4]   2> 14470 INFO  (coreLoadExecutor-47-thread-1) [    x:collection1] o.a.s.h.ReplicationHandler Commits will be reserved for 10000ms.
   [junit4]   2> 14470 INFO  (searcherExecutor-48-thread-1-processing-x:collection1) [    x:collection1] o.a.s.c.SolrCore [collection1] Registered new searcher Searcher@7920dbba[collection1] main{ExitableDirectoryReader(UninvertingDirectoryReader())}
   [junit4]   2> 14470 INFO  (TEST-SpatialHeatmapFacetsTest.test-seed#[7BE9B4871C0BEFDB]) [    ] o.a.s.SolrTestCaseJ4 ###Starting test
   [junit4]   2> 14579 INFO  (qtp490710789-95) [    x:collection1] o.a.s.s.AbstractSpatialPrefixTreeFieldType srpt_quad{class=org.apache.solr.schema.SpatialRecursivePrefixTreeFieldType,analyzer=org.apache.solr.schema.FieldType$DefaultAnalyzer,args={distanceUnits=degrees, class=solr.SpatialRecursivePrefixTreeFieldType, prefixTree=quad}} strat: RecursivePrefixTreeStrategy(SPG:(QuadPrefixTree(maxLevels:26,ctx:SpatialContext{geo=true, calculator=Haversine, worldBounds=Rect(minX=-180.0,maxX=180.0,minY=-90.0,maxY=90.0)})),pruneLeafyBranches) maxLevels: 26
   [junit4]   2> 14611 ERROR (qtp490710789-95) [    x:collection1] o.a.s.h.RequestHandlerBase org.apache.solr.common.SolrException: facet.heatmap.distErrPct or facet.heatmap.distErr should be > 0 or instead provide facet.heatmap.gridLevel=26 if you insist on maximum detail
   [junit4]   2> 	at org.apache.solr.handler.component.SpatialHeatmapFacets.getHeatmapForField(SpatialHeatmapFacets.java:130)
   [junit4]   2> 	at org.apache.solr.request.SimpleFacets.getHeatmapCounts(SimpleFacets.java:1193)
   [junit4]   2> 	at org.apache.solr.handler.component.FacetComponent.getFacetCounts(FacetComponent.java:333)
   [junit4]   2> 	at org.apache.solr.handler.component.FacetComponent.process(FacetComponent.java:273)
   [junit4]   2> 	at org.apache.solr.handler.component.SearchHandler.handleRequestBody(SearchHandler.java:295)
   [junit4]   2> 	at org.apache.solr.handler.RequestHandlerBase.handleRequest(RequestHandlerBase.java:177)
   [junit4]   2> 	at org.apache.solr.core.SolrCore.execute(SolrCore.java:2503)
   [junit4]   2> 	at org.apache.solr.servlet.HttpSolrCall.execute(HttpSolrCall.java:711)
   [junit4]   2> 	at org.apache.solr.servlet.HttpSolrCall.call(HttpSolrCall.java:517)
   [junit4]   2> 	at org.apache.solr.servlet.SolrDispatchFilter.doFilter(SolrDispatchFilter.java:382)
   [junit4]   2> 	at org.apache.solr.servlet.SolrDispatchFilter.doFilter(SolrDispatchFilter.java:326)
   [junit4]   2> 	at org.eclipse.jetty.servlet.ServletHandler$CachedChain.doFilter(ServletHandler.java:1759)
   [junit4]   2> 	at org.apache.solr.client.solrj.embedded.JettySolrRunner$DebugFilter.doFilter(JettySolrRunner.java:139)
   [junit4]   2> 	at org.eclipse.jetty.servlet.ServletHandler$CachedChain.doFilter(ServletHandler.java:1759)
   [junit4]   2> 	at org.eclipse.jetty.servlet.ServletHandler.doHandle(ServletHandler.java:582)
   [junit4]   2> 	at org.eclipse.jetty.server.session.SessionHandler.doHandle(SessionHandler.java:224)
   [junit4]   2> 	at org.eclipse.jetty.server.handler.ContextHandler.doHandle(ContextHandler.java:1180)
   [junit4]   2> 	at org.eclipse.jetty.servlet.ServletHandler.doScope(ServletHandler.java:512)
   [junit4]   2> 	at org.eclipse.jetty.server.session.SessionHandler.doScope(SessionHandler.java:185)
   [junit4]   2> 	at org.eclipse.jetty.server.handler.ContextHandler.doScope(ContextHandler.java:1112)
   [junit4]   2> 	at org.eclipse.jetty.server.handler.ScopedHandler.handle(ScopedHandler.java:141)
   [junit4]   2> 	at org.eclipse.jetty.server.handler.gzip.GzipHandler.handle(GzipHandler.java:493)
   [junit4]   2> 	at org.eclipse.jetty.server.handler.HandlerWrapper.handle(HandlerWrapper.java:134)
   [junit4]   2> 	at org.eclipse.jetty.server.Server.handle(Server.java:534)
   [junit4]   2> 	at org.eclipse.jetty.server.HttpChannel.handle(HttpChannel.java:320)
   [junit4]   2> 	at org.eclipse.jetty.server.HttpConnection.onFillable(HttpConnection.java:251)
   [junit4]   2> 	at org.eclipse.jetty.io.AbstractConnection$ReadCallback.succeeded(AbstractConnection.java:283)
   [junit4]   2> 	at org.eclipse.jetty.io.FillInterest.fillable(FillInterest.java:108)
   [junit4]   2> 	at org.eclipse.jetty.io.SelectChannelEndPoint$2.run(SelectChannelEndPoint.java:93)
   [junit4]   2> 	at org.eclipse.jetty.util.thread.strategy.ExecuteProduceConsume.executeProduceConsume(ExecuteProduceConsume.java:303)
   [junit4]   2> 	at org.eclipse.jetty.util.thread.strategy.ExecuteProduceConsume.produceConsume(ExecuteProduceConsume.java:148)
   [junit4]   2> 	at org.eclipse.jetty.util.thread.strategy.ExecuteProduceConsume.run(ExecuteProduceConsume.java:136)
   [junit4]   2> 	at org.eclipse.jetty.util.thread.QueuedThreadPool.runJob(QueuedThreadPool.java:671)
   [junit4]   2> 	at org.eclipse.jetty.util.thread.QueuedThreadPool$2.run(QueuedThreadPool.java:589)
   [junit4]   2> 	at java.lang.Thread.run(Thread.java:748)
   [junit4]   2> 
   [junit4]   2> 14611 INFO  (qtp490710789-95) [    x:collection1] o.a.s.c.S.Request [collection1]  webapp= path=/select params={q=*:*&distrib=false&facet.heatmap=srpt_quad&facet.heatmap.geom=["50+50"+TO+"180+90"]&facet.heatmap.distErr=0&rows=0&facet=true&wt=javabin&version=2} hits=0 status=400 QTime=123
   [junit4]   2> 14611 ERROR (qtp490710789-95) [    x:collection1] o.a.s.h.RequestHandlerBase org.apache.solr.common.SolrException: facet.heatmap.distErrPct or facet.heatmap.distErr should be > 0 or instead provide facet.heatmap.gridLevel=26 if you insist on maximum detail
   [junit4]   2> 	at org.apache.solr.handler.component.SpatialHeatmapFacets.getHeatmapForField(SpatialHeatmapFacets.java:130)
   [junit4]   2> 	at org.apache.solr.request.SimpleFacets.getHeatmapCounts(SimpleFacets.java:1193)
   [junit4]   2> 	at org.apache.solr.handler.component.FacetComponent.getFacetCounts(FacetComponent.java:333)
   [junit4]   2> 	at org.apache.solr.handler.component.FacetComponent.process(FacetComponent.java:273)
   [junit4]   2> 	at org.apache.solr.handler.component.SearchHandler.handleRequestBody(SearchHandler.java:295)
   [junit4]   2> 	at org.apache.solr.handler.RequestHandlerBase.handleRequest(RequestHandlerBase.java:177)
   [junit4]   2> 	at org.apache.solr.core.SolrCore.execute(SolrCore.java:2503)
   [junit4]   2> 	at org.apache.solr.servlet.HttpSolrCall.execute(HttpSolrCall.java:711)
   [junit4]   2> 	at org.apache.solr.servlet.HttpSolrCall.call(HttpSolrCall.java:517)
   [junit4]   2> 	at org.apache.solr.servlet.SolrDispatchFilter.doFilter(SolrDispatchFilter.java:382)
   [junit4]   2> 	at org.apache.solr.servlet.SolrDispatchFilter.doFilter(SolrDispatchFilter.java:326)
   [junit4]   2> 	at org.eclipse.jetty.servlet.ServletHandler$CachedChain.doFilter(ServletHandler.java:1759)
   [junit4]   2> 	at org.apache.solr.client.solrj.embedded.JettySolrRunner$DebugFilter.doFilter(JettySolrRunner.java:139)
   [junit4]   2> 	at org.eclipse.jetty.servlet.ServletHandler$CachedChain.doFilter(ServletHandler.java:1759)
   [junit4]   2> 	at org.eclipse.jetty.servlet.ServletHandler.doHandle(ServletHandler.java:582)
   [junit4]   2> 	at org.eclipse.jetty.server.session.SessionHandler.doHandle(SessionHandler.java:224)
   [junit4]   2> 	at org.eclipse.jetty.server.handler.ContextHandler.doHandle(ContextHandler.java:1180)
   [junit4]   2> 	at org.eclipse.jetty.servlet.ServletHandler.doScope(ServletHandler.java:512)
   [junit4]   2> 	at org.eclipse.jetty.server.session.SessionHandler.doScope(SessionHandler.java:185)
   [junit4]   2> 	at org.eclipse.jetty.server.handler.ContextHandler.doScope(ContextHandler.java:1112)
   [junit4]   2> 	at org.eclipse.jetty.server.handler.ScopedHandler.handle(ScopedHandler.java:141)
   [junit4]   2> 	at org.eclipse.jetty.server.handler.gzip.GzipHandler.handle(GzipHandler.java:493)
   [junit4]   2> 	at org.eclipse.jetty.server.handler.HandlerWrapper.handle(HandlerWrapper.java:134)
   [junit4]   2> 	at org.eclipse.jetty.server.Server.handle(Server.java:534)
   [junit4]   2> 	at org.eclipse.jetty.server.HttpChannel.handle(HttpChannel.java:320)
   [junit4]   2> 	at org.eclipse.jetty.server.HttpConnection.onFillable(HttpConnection.java:251)
   [junit4]   2> 	at org.eclipse.jetty.io.AbstractConnection$ReadCallback.succeeded(AbstractConnection.java:283)
   [junit4]   2> 	at org.eclipse.jetty.io.FillInterest.fillable(FillInterest.java:108)
   [junit4]   2> 	at org.eclipse.jetty.io.SelectChannelEndPoint$2.run(SelectChannelEndPoint.java:93)
   [junit4]   2> 	at org.eclipse.jetty.util.thread.strategy.ExecuteProduceConsume.executeProduceConsume(ExecuteProduceConsume.java:303)
   [junit4]   2> 	at org.eclipse.jetty.util.thread.strategy.ExecuteProduceConsume.produceConsume(ExecuteProduceConsume.java:148)
   [junit4]   2> 	at org.eclipse.jetty.util.thread.strategy.ExecuteProduceConsume.run(ExecuteProduceConsume.java:136)
   [junit4]   2> 	at org.eclipse.jetty.util.thread.QueuedThreadPool.runJob(QueuedThreadPool.java:671)
   [junit4]   2> 	at org.eclipse.jetty.util.thread.QueuedThreadPool$2.run(QueuedThreadPool.java:589)
   [junit4]   2> 	at java.lang.Thread.run(Thread.java:748)
   [junit4]   2> 
   [junit4]   2> 14611 INFO  (qtp490710789-95) [    x:collection1] o.a.s.c.S.Request [collection1]  webapp= path=/select params={q=*:*&distrib=false&facet.heatmap=srpt_quad&facet.heatmap.geom=["50+50"+TO+"180+90"]&facet.heatmap.distErrPct=0&rows=0&facet=true&wt=javabin&version=2} hits=0 status=400 QTime=1
   [junit4]   2> 14642 INFO  (qtp490710789-94) [    x:collection1] o.a.s.c.S.Request [collection1]  webapp= path=/select params={q=*:*&distrib=false&facet.heatmap=srpt_quad&facet.heatmap.geom=["50+50"+TO+"180+90"]&rows=0&facet=true&wt=javabin&version=2} hits=0 status=0 QTime=29
   [junit4]   2> 14752 INFO  (qtp1598606825-115) [    x:collection1] o.a.s.s.AbstractSpatialPrefixTreeFieldType srpt_quad{class=org.apache.solr.schema.SpatialRecursivePrefixTreeFieldType,analyzer=org.apache.solr.schema.FieldType$DefaultAnalyzer,args={distanceUnits=degrees, class=solr.SpatialRecursivePrefixTreeFieldType, prefixTree=quad}} strat: RecursivePrefixTreeStrategy(SPG:(QuadPrefixTree(maxLevels:26,ctx:SpatialContext{geo=true, calculator=Haversine, worldBounds=Rect(minX=-180.0,maxX=180.0,minY=-90.0,maxY=90.0)})),pruneLeafyBranches) maxLevels: 26
   [junit4]   2> 14752 INFO  (qtp1598606825-115) [    x:collection1] o.a.s.c.S.Request [collection1]  webapp= path=/select params={distrib=false&facet.heatmap={!+facet.heatmap.format%3Dpng}srpt_quad&facet.heatmap.geom=["50+50"+TO+"180+90"]&fl=id&fl=score&shards.purpose=20&start=0&fsv=true&shard.url=[ff01::083]:33332/|[ff01::114]:33332/|http://127.0.0.1:59931//collection1|[ff01::213]:33332/&rows=0&version=2&q=*:*&NOW=1514257766547&isShard=true&facet=true&wt=javabin} hits=0 status=0 QTime=42
   [junit4]   2> 14767 INFO  (qtp1598606825-114) [    x:collection1] o.a.s.c.S.Request [collection1]  webapp= path=/select params={q=*:*&shards=[ff01::083]:33332/|[ff01::114]:33332/|http://127.0.0.1:59931//collection1|[ff01::213]:33332/&facet.heatmap=srpt_quad&facet.heatmap.geom=["50+50"+TO+"180+90"]&rows=0&facet=true&wt=javabin&version=2} hits=0 status=0 QTime=123
   [junit4]   2> 14783 INFO  (qtp490710789-95) [    x:collection1] o.a.s.c.S.Request [collection1]  webapp= path=/select params={facet.heatmap.gridLevel=3&q=*:*&distrib=false&facet.heatmap=srpt_quad&facet.heatmap.geom=["50+50"+TO+"180+90"]&rows=0&facet=true&wt=javabin&version=2} hits=0 status=0 QTime=1
   [junit4]   2> 14783 INFO  (qtp1598606825-111) [    x:collection1] o.a.s.c.S.Request [collection1]  webapp= path=/select params={facet.heatmap.gridLevel=3&distrib=false&facet.heatmap={!+facet.heatmap.format%3Dpng}srpt_quad&facet.heatmap.geom=["50+50"+TO+"180+90"]&fl=id&fl=score&shards.purpose=20&start=0&fsv=true&shard.url=http://127.0.0.1:59931//collection1&rows=0&version=2&q=*:*&NOW=1514257766688&isShard=true&facet=true&wt=javabin} hits=0 status=0 QTime=0
   [junit4]   2> 14783 INFO  (qtp1598606825-112) [    x:collection1] o.a.s.c.S.Request [collection1]  webapp= path=/select params={facet.heatmap.gridLevel=3&q=*:*&shards=http://127.0.0.1:59931//collection1&facet.heatmap=srpt_quad&facet.heatmap.geom=["50+50"+TO+"180+90"]&rows=0&facet=true&wt=javabin&version=2} hits=0 status=0 QTime=3
   [junit4]   2> 14783 INFO  (qtp490710789-95) [    x:collection1] o.a.s.c.S.Request [collection1]  webapp= path=/select params={q=*:*&distrib=false&facet.heatmap=srpt_quad&facet.heatmap.geom=["50+50"+TO+"180+90"]&facet.heatmap.distErr=100&rows=0&facet=true&wt=javabin&version=2} hits=0 status=0 QTime=0
   [junit4]   2> 14783 INFO  (qtp1598606825-120) [    x:collection1] o.a.s.c.S.Request [collection1]  webapp= path=/select params={distrib=false&facet.heatmap={!+facet.heatmap.format%3Dpng}srpt_quad&facet.heatmap.geom=["50+50"+TO+"180+90"]&fl=id&fl=score&shards.purpose=20&start=0&fsv=true&facet.heatmap.distErr=100&shard.url=[ff01::114]:33332/|[ff01::083]:33332/|http://127.0.0.1:59931//collection1|[ff01::213]:33332/&rows=0&version=2&q=*:*&NOW=1514257766688&isShard=true&facet=true&wt=javabin} hits=0 status=0 QTime=0
   [junit4]   2> 14798 INFO  (qtp1598606825-111) [    x:collection1] o.a.s.c.S.Request [collection1]  webapp= path=/select params={q=*:*&shards=[ff01::114]:33332/|[ff01::083]:33332/|http://127.0.0.1:59931//collection1|[ff01::213]:33332/&facet.heatmap=srpt_quad&facet.heatmap.geom=["50+50"+TO+"180+90"]&facet.heatmap.distErr=100&rows=0&facet=true&wt=javabin&version=2} hits=0 status=0 QTime=4
   [junit4]   2> 14798 INFO  (qtp490710789-91) [    x:collection1] o.a.s.c.S.Request [collection1]  webapp= path=/select params={q=*:*&distrib=false&facet.heatmap=srpt_quad&facet.heatmap.geom=["50+50"+TO+"180+90"]&facet.heatmap.distErrPct=0.05&rows=0&facet=true&wt=javabin&version=2} hits=0 status=0 QTime=0
   [junit4]   2> 14798 INFO  (qtp1598606825-118) [    x:collection1] o.a.s.c.S.Request [collection1]  webapp= path=/select params={distrib=false&facet.heatmap={!+facet.heatmap.format%3Dpng}srpt_quad&facet.heatmap.geom=["50+50"+TO+"180+90"]&fl=id&fl=score&shards.purpose=20&start=0&fsv=true&shard.url=http://127.0.0.1:59931//collection1|[ff01::213]:33332/&rows=0&version=2&q=*:*&NOW=1514257766703&isShard=true&facet.heatmap.distErrPct=0.05&facet=true&wt=javabin} hits=0 status=0 QTime=1
   [junit4]   2> 14798 INFO  (qtp1598606825-122) [    x:collection1] o.a.s.c.S.Request [collection1]  webapp= path=/select params={q=*:*&shards=http://127.0.0.1:59931//collection1|[ff01::213]:33332/&facet.heatmap=srpt_quad&facet.heatmap.geom=["50+50"+TO+"180+90"]&facet.heatmap.distErrPct=0.05&rows=0&facet=true&wt=javabin&version=2} hits=0 status=0 QTime=3
   [junit4]   2> 14798 INFO  (qtp490710789-102) [    x:collection1] o.a.s.c.S.Request [collection1]  webapp= path=/select params={q=*:*&distrib=false&facet.heatmap=srpt_quad&facet.heatmap.distErrPct=0.10&rows=0&facet=true&wt=javabin&version=2} hits=0 status=0 QTime=0
   [junit4]   2> 14814 INFO  (qtp1598606825-115) [    x:collection1] o.a.s.c.S.Request [collection1]  webapp= path=/select params={distrib=false&facet.heatmap={!+facet.heatmap.format%3Dpng}srpt_quad&fl=id&fl=score&shards.purpose=20&start=0&fsv=true&shard.url=[ff01::213]:33332/|http://127.0.0.1:59931//collection1&rows=0&version=2&q=*:*&NOW=1514257766703&isShard=true&facet.heatmap.distErrPct=0.10&facet=true&wt=javabin} hits=0 status=0 QTime=0
   [junit4]   2> 14814 INFO  (qtp1598606825-113) [    x:collection1] o.a.s.c.S.Request [collection1]  webapp= path=/select params={q=*:*&shards=[ff01::213]:33332/|http://127.0.0.1:59931//collection1&facet.heatmap=srpt_quad&facet.heatmap.distErrPct=0.10&rows=0&facet=true&wt=javabin&version=2} hits=0 status=0 QTime=4
   [junit4]   2> 14814 INFO  (qtp490710789-101) [    x:collection1] o.a.s.c.S.Request [collection1]  webapp= path=/select params={q=*:*&distrib=false&facet.heatmap=srpt_quad&facet.heatmap={!key%3Dcourse+facet.heatmap.gridLevel%3D2+facet.heatmap.format%3Dpng}srpt_quad&facet.heatmap.distErrPct=0.10&rows=0&facet=true&wt=javabin&version=2} hits=0 status=0 QTime=0
   [junit4]   2> 14814 INFO  (qtp1598606825-121) [    x:collection1] o.a.s.c.S.Request [collection1]  webapp= path=/select params={distrib=false&facet.heatmap={!+facet.heatmap.format%3Dpng}srpt_quad&facet.heatmap={!+key%3Dcourse+facet.heatmap.gridLevel%3D2+facet.heatmap.format%3Dpng+v%3Dsrpt_quad}srpt_quad&fl=id&fl=score&shards.purpose=20&start=0&fsv=true&shard.url=http://127.0.0.1:59931//collection1&rows=0&version=2&q=*:*&NOW=1514257766719&isShard=true&facet.heatmap.distErrPct=0.10&facet=true&wt=javabin} hits=0 status=0 QTime=0
   [junit4]   2> 14814 INFO  (qtp1598606825-114) [    x:collection1] o.a.s.c.S.Request [collection1]  webapp= path=/select params={q=*:*&shards=http://127.0.0.1:59931//collection1&facet.heatmap=srpt_quad&facet.heatmap={!key%3Dcourse+facet.heatmap.gridLevel%3D2+facet.heatmap.format%3Dpng}srpt_quad&facet.heatmap.distErrPct=0.10&rows=0&facet=true&wt=javabin&version=2} hits=0 status=0 QTime=3
   [junit4]   2> 14892 INFO  (qtp490710789-100) [    x:collection1] o.a.s.u.p.LogUpdateProcessorFactory [collection1]  webapp= path=/update params={wt=javabin&version=2}{add=[0]} 0 58
   [junit4]   2> 14892 INFO  (qtp1598606825-112) [    x:collection1] o.a.s.u.p.LogUpdateProcessorFactory [collection1]  webapp= path=/update params={wt=javabin&version=2}{add=[0]} 0 6
   [junit4]   2> 14908 INFO  (qtp490710789-98) [    x:collection1] o.a.s.u.p.LogUpdateProcessorFactory [collection1]  webapp= path=/update params={wt=javabin&version=2}{add=[1]} 0 3
   [junit4]   2> 14908 INFO  (qtp1598606825-120) [    x:collection1] o.a.s.u.p.LogUpdateProcessorFactory [collection1]  webapp= path=/update params={wt=javabin&version=2}{add=[1]} 0 2
   [junit4]   2> 14923 INFO  (qtp490710789-98) [    x:collection1] o.a.s.u.p.LogUpdateProcessorFactory [collection1]  webapp= path=/update params={wt=javabin&version=2}{add=[3]} 0 3
   [junit4]   2> 14923 INFO  (qtp1598606825-120) [    x:collection1] o.a.s.u.p.LogUpdateProcessorFactory [collection1]  webapp= path=/update params={wt=javabin&version=2}{add=[3]} 0 0
   [junit4]   2> 14923 INFO  (qtp490710789-93) [    x:collection1] o.a.s.u.p.LogUpdateProcessorFactory [collection1]  webapp= path=/update params={wt=javabin&version=2}{add=[4]} 0 0
   [junit4]   2> 14923 INFO  (qtp1598606825-118) [    x:collection1] o.a.s.u.p.LogUpdateProcessorFactory [collection1]  webapp= path=/update params={wt=javabin&version=2}{add=[4]} 0 0
   [junit4]   2> 14923 INFO  (qtp490710789-94) [    x:collection1] o.a.s.u.DirectUpdateHandler2 start commit{,optimize=false,openSearcher=true,waitSearcher=true,expungeDeletes=false,softCommit=false,prepareCommit=false}
   [junit4]   2> 14923 INFO  (qtp490710789-94) [    x:collection1] o.a.s.u.SolrIndexWriter Calling setCommitData with IW:org.apache.solr.update.SolrIndexWriter@6b3f5187 commitCommandVersion:0
   [junit4]   2> 15001 INFO  (qtp490710789-94) [    x:collection1] o.a.s.s.SolrIndexSearcher Opening [Searcher@24f44cc3[collection1] main]
   [junit4]   2> 15017 INFO  (qtp490710789-94) [    x:collection1] o.a.s.u.DirectUpdateHandler2 end_commit_flush
   [junit4]   2> 15017 INFO  (searcherExecutor-38-thread-1-processing-x:collection1) [    x:collection1] o.a.s.c.SolrCore [collection1] Registered new searcher Searcher@24f44cc3[collection1] main{ExitableDirectoryReader(UninvertingDirectoryReader(Uninverting(_0(7.3.0):c4)))}
   [junit4]   2> 15017 INFO  (qtp490710789-94) [    x:collection1] o.a.s.u.p.LogUpdateProcessorFactory [collection1]  webapp= path=/update params={waitSearcher=true&commit=true&softCommit=false&wt=javabin&version=2}{commit=} 0 87
   [junit4]   2> 15017 INFO  (qtp1598606825-122) [    x:collection1] o.a.s.u.DirectUpdateHandler2 start commit{,optimize=false,openSearcher=true,waitSearcher=true,expungeDeletes=false,softCommit=false,prepareCommit=false}
   [junit4]   2> 15017 INFO  (qtp1598606825-122) [    x:collection1] o.a.s.u.SolrIndexWriter Calling setCommitData with IW:org.apache.solr.update.SolrIndexWriter@ca70bae commitCommandVersion:0
   [junit4]   2> 15095 INFO  (qtp1598606825-122) [    x:collection1] o.a.s.s.SolrIndexSearcher Opening [Searcher@51f60352[collection1] main]
   [junit4]   2> 15095 INFO  (qtp1598606825-122) [    x:collection1] o.a.s.u.DirectUpdateHandler2 end_commit_flush
   [junit4]   2> 15095 INFO  (searcherExecutor-48-thread-1-processing-x:collection1) [    x:collection1] o.a.s.c.SolrCore [collection1] Registered new searcher Searcher@51f60352[collection1] main{ExitableDirectoryReader(UninvertingDirectoryReader(Uninverting(_0(7.3.0):c4)))}
   [junit4]   2> 15095 INFO  (qtp1598606825-122) [    x:collection1] o.a.s.u.p.LogUpdateProcessorFactory [collection1]  webapp= path=/update params={waitSearcher=true&commit=true&softCommit=false&wt=javabin&version=2}{commit=} 0 74
   [junit4]   2> 15127 INFO  (qtp490710789-92) [    x:collection1] o.a.s.c.S.Request [collection1]  webapp= path=/select params={facet.heatmap.gridLevel=4&q=*:*&distrib=false&facet.heatmap=srpt_quad&facet.heatmap.geom=["50+20"+TO+"180+90"]&rows=0&facet=true&wt=javabin&version=2} hits=4 status=0 QTime=38
   [junit4]   2> 15283 INFO  (qtp1598606825-113) [    x:collection1] o.a.s.c.S.Request [collection1]  webapp= path=/select params={facet.heatmap.gridLevel=4&distrib=false&facet.heatmap={!+facet.heatmap.format%3Dpng}srpt_quad&facet.heatmap.geom=["50+20"+TO+"180+90"]&fl=id&fl=score&shards.purpose=20&start=0&fsv=true&shard.url=http://127.0.0.1:59931//collection1&rows=0&version=2&q=*:*&NOW=1514257767047&isShard=true&facet=true&wt=javabin} hits=4 status=0 QTime=146
   [junit4]   2> 15298 INFO  (qtp1598606825-115) [    x:collection1] o.a.s.c.S.Request [collection1]  webapp= path=/select params={facet.heatmap.gridLevel=4&q=*:*&shards=http://127.0.0.1:59931//collection1&facet.heatmap=srpt_quad&facet.heatmap.geom=["50+20"+TO+"180+90"]&rows=0&facet=true&wt=javabin&version=2} hits=4 status=0 QTime=158
   [junit4]   2> 15330 INFO  (qtp490710789-95) [    x:collection1] o.a.s.c.S.Request [collection1]  webapp= path=/select params={facet.heatmap.gridLevel=4&q=*:*&distrib=false&facet.heatmap={!ex%3Dexcludeme}srpt_quad&facet.heatmap.geom=["50+20"+TO+"180+90"]&fq={!tag%3Dexcludeme}id:0&rows=0&facet=true&wt=javabin&version=2} hits=1 status=0 QTime=37
   [junit4]   2> 15361 INFO  (qtp1598606825-114) [    x:collection1] o.a.s.c.S.Request [collection1]  webapp= path=/select params={facet.heatmap.gridLevel=4&distrib=false&facet.heatmap={!+ex%3Dexcludeme+v%3Dsrpt_quad+facet.heatmap.format%3Dpng}srpt_quad&facet.heatmap.geom=["50+20"+TO+"180+90"]&fl=id&fl=score&shards.purpose=20&start=0&fsv=true&fq={!tag%3Dexcludeme}id:0&shard.url=http://127.0.0.1:59931//collection1&rows=0&version=2&q=*:*&NOW=1514257767250&isShard=true&facet=true&wt=javabin} hits=1 status=0 QTime=16
   [junit4]   2> 15361 INFO  (qtp1598606825-121) [    x:collection1] o.a.s.c.S.Request [collection1]  webapp= path=/select params={facet.heatmap.gridLevel=4&q=*:*&shards=http://127.0.0.1:59931//collection1&facet.heatmap={!ex%3Dexcludeme}srpt_quad&facet.heatmap.geom=["50+20"+TO+"180+90"]&fq={!tag%3Dexcludeme}id:0&rows=0&facet=true&wt=javabin&version=2} hits=1 status=0 QTime=20
   [junit4]   2> 15361 INFO  (qtp490710789-91) [    x:collection1] o.a.s.c.S.Request [collection1]  webapp= path=/select params={facet.heatmap.gridLevel=7&q=*:*&distrib=false&facet.heatmap=srpt_quad&facet.heatmap.geom=BUFFER(POINT(110+40),+7)&rows=0&facet=true&wt=javabin&version=2} hits=4 status=0 QTime=7
   [junit4]   2> 15376 INFO  (qtp1598606825-111) [    x:collection1] o.a.s.c.S.Request [collection1]  webapp= path=/select params={facet.heatmap.gridLevel=7&distrib=false&facet.heatmap={!+facet.heatmap.format%3Dpng}srpt_quad&facet.heatmap.geom=BUFFER(POINT(110+40),+7)&fl=id&fl=score&shards.purpose=20&start=0&fsv=true&shard.url=[ff01::083]:33332/|[ff01::114]:33332/|[ff01::213]:33332/|http://127.0.0.1:59931//collection1&rows=0&version=2&q=*:*&NOW=1514257767281&isShard=true&facet=true&wt=javabin} hits=4 status=0 QTime=4
   [junit4]   2> 15376 INFO  (qtp1598606825-112) [    x:collection1] o.a.s.c.S.Request [collection1]  webapp= path=/select params={facet.heatmap.gridLevel=7&q=*:*&shards=[ff01::083]:33332/|[ff01::114]:33332/|[ff01::213]:33332/|http://127.0.0.1:59931//collection1&facet.heatmap=srpt_quad&facet.heatmap.geom=BUFFER(POINT(110+40),+7)&rows=0&facet=true&wt=javabin&version=2} hits=4 status=0 QTime=7
   [junit4]   2> 15376 INFO  (qtp490710789-102) [    x:collection1] o.a.s.c.S.Request [collection1]  webapp= path=/select params={q=*:*&distrib=false&facet.heatmap=srpt_quad&facet.heatmap.geom=ENVELOPE(0,+10,+-80,+-90)&rows=0&facet=true&wt=javabin&version=2} hits=4 status=0 QTime=0
   [junit4]   2> 15392 INFO  (qtp1598606825-111) [    x:collection1] o.a.s.c.S.Request [collection1]  webapp= path=/select params={distrib=false&facet.heatmap={!+facet.heatmap.format%3Dpng}srpt_quad&facet.heatmap.geom=ENVELOPE(0,+10,+-80,+-90)&fl=id&fl=score&shards.purpose=20&start=0&fsv=true&shard.url=http://127.0.0.1:59931//collection1|[ff01::083]:33332/|[ff01::114]:33332/&rows=0&version=2&q=*:*&NOW=1514257767281&isShard=true&facet=true&wt=javabin} hits=4 status=0 QTime=1
   [junit4]   2> 15392 INFO  (qtp1598606825-112) [    x:collection1] o.a.s.c.S.Request [collection1]  webapp= path=/select params={q=*:*&shards=http://127.0.0.1:59931//collection1|[ff01::083]:33332/|[ff01::114]:33332/&facet.heatmap=srpt_quad&facet.heatmap.geom=ENVELOPE(0,+10,+-80,+-90)&rows=0&facet=true&wt=javabin&version=2} hits=4 status=0 QTime=5
   [junit4]   2> 15392 INFO  (qtp490710789-102) [    x:collection1] o.a.s.c.S.Request [collection1]  webapp= path=/select params={facet.heatmap.format=png&q=*:*&distrib=false&facet.heatmap=srpt_quad&rows=0&facet=true&wt=javabin&version=2} hits=4 status=0 QTime=4
   [junit4]   2> 15408 INFO  (qtp1598606825-111) [    x:collection1] o.a.s.c.S.Request [collection1]  webapp= path=/select params={facet.heatmap.format=png&distrib=false&facet.heatmap={!+facet.heatmap.format%3Dpng}srpt_quad&fl=id&fl=score&shards.purpose=20&start=0&fsv=true&shard.url=http://127.0.0.1:59931//collection1|[ff01::213]:33332/&rows=0&version=2&q=*:*&NOW=1514257767297&isShard=true&facet=true&wt=javabin} hits=4 status=0 QTime=4
   [junit4]   2> 15408 INFO  (qtp1598606825-112) [    x:collection1] o.a.s.c.S.Request [collection1]  webapp= path=/select params={facet.heatmap.format=png&q=*:*&shards=http://127.0.0.1:59931//collection1|[ff01::213]:33332/&facet.heatmap=srpt_quad&rows=0&facet=true&wt=javabin&version=2} hits=4 status=0 QTime=11
   [junit4]   2> 15408 INFO  (TEST-SpatialHeatmapFacetsTest.test-seed#[7BE9B4871C0BEFDB]) [    ] o.a.s.SolrTestCaseJ4 ###Ending test
   [junit4]   2> 15408 INFO  (TEST-SpatialHeatmapFacetsTest.test-seed#[7BE9B4871C0BEFDB]) [    ] o.e.j.s.AbstractConnector Stopped ServerConnector@49a0bf21{HTTP/1.1,[http/1.1]}{127.0.0.1:0}
   [junit4]   2> 15408 INFO  (TEST-SpatialHeatmapFacetsTest.test-seed#[7BE9B4871C0BEFDB]) [    ] o.a.s.c.CoreContainer Shutting down CoreContainer instance=1822637135
   [junit4]   2> 15408 INFO  (TEST-SpatialHeatmapFacetsTest.test-seed#[7BE9B4871C0BEFDB]) [    ] o.a.s.m.SolrMetricManager Closing metric reporters for registry=solr.node, tag=null
   [junit4]   2> 15408 INFO  (TEST-SpatialHeatmapFacetsTest.test-seed#[7BE9B4871C0BEFDB]) [    ] o.a.s.m.SolrMetricManager Closing metric reporters for registry=solr.jvm, tag=null
   [junit4]   2> 15408 INFO  (TEST-SpatialHeatmapFacetsTest.test-seed#[7BE9B4871C0BEFDB]) [    ] o.a.s.m.SolrMetricManager Closing metric reporters for registry=solr.jetty, tag=null
   [junit4]   2> 15408 INFO  (coreCloseExecutor-53-thread-1) [    x:collection1] o.a.s.c.SolrCore [collection1]  CLOSING SolrCore org.apache.solr.core.SolrCore@6501ae1d
   [junit4]   2> 15408 INFO  (coreCloseExecutor-53-thread-1) [    x:collection1] o.a.s.m.SolrMetricManager Closing metric reporters for registry=solr.core.collection1, tag=1694608925
   [junit4]   2> 15423 INFO  (TEST-SpatialHeatmapFacetsTest.test-seed#[7BE9B4871C0BEFDB]) [    ] o.e.j.s.h.ContextHandler Stopped o.e.j.s.ServletContextHandler@c54e299{/,null,UNAVAILABLE}
   [junit4]   2> 15423 INFO  (TEST-SpatialHeatmapFacetsTest.test-seed#[7BE9B4871C0BEFDB]) [    ] o.e.j.s.AbstractConnector Stopped ServerConnector@5fb0d48a{HTTP/1.1,[http/1.1]}{127.0.0.1:0}
   [junit4]   2> 15423 INFO  (TEST-SpatialHeatmapFacetsTest.test-seed#[7BE9B4871C0BEFDB]) [    ] o.a.s.c.CoreContainer Shutting down CoreContainer instance=1102502931
   [junit4]   2> 15423 INFO  (TEST-SpatialHeatmapFacetsTest.test-seed#[7BE9B4871C0BEFDB]) [    ] o.a.s.m.SolrMetricManager Closing metric reporters for registry=solr.node, tag=null
   [junit4]   2> 15423 INFO  (TEST-SpatialHeatmapFacetsTest.test-seed#[7BE9B4871C0BEFDB]) [    ] o.a.s.m.SolrMetricManager Closing metric reporters for registry=solr.jvm, tag=null
   [junit4]   2> 15423 INFO  (TEST-SpatialHeatmapFacetsTest.test-seed#[7BE9B4871C0BEFDB]) [    ] o.a.s.m.SolrMetricManager Closing metric reporters for registry=solr.jetty, tag=null
   [junit4]   2> 15423 INFO  (coreCloseExecutor-55-thread-1) [    x:collection1] o.a.s.c.SolrCore [collection1]  CLOSING SolrCore org.apache.solr.core.SolrCore@2dc07347
   [junit4]   2> 15423 INFO  (coreCloseExecutor-55-thread-1) [    x:collection1] o.a.s.m.SolrMetricManager Closing metric reporters for registry=solr.core.collection1, tag=767587143
   [junit4]   2> 15423 INFO  (TEST-SpatialHeatmapFacetsTest.test-seed#[7BE9B4871C0BEFDB]) [    ] o.e.j.s.h.ContextHandler Stopped o.e.j.s.ServletContextHandler@4f3872ba{/,null,UNAVAILABLE}
   [junit4]   2> 15720 INFO  (TEST-SpatialHeatmapFacetsTest.test-seed#[7BE9B4871C0BEFDB]) [    ] o.e.j.s.Server jetty-9.3.20.v20170531
   [junit4]   2> 15720 INFO  (TEST-SpatialHeatmapFacetsTest.test-seed#[7BE9B4871C0BEFDB]) [    ] o.e.j.s.h.ContextHandler Started o.e.j.s.ServletContextHandler@7d6b7c12{/,null,AVAILABLE}
   [junit4]   2> 15720 INFO  (TEST-SpatialHeatmapFacetsTest.test-seed#[7BE9B4871C0BEFDB]) [    ] o.e.j.s.AbstractConnector Started ServerConnector@ac7beb9{HTTP/1.1,[http/1.1]}{127.0.0.1:59940}
   [junit4]   2> 15720 INFO  (TEST-SpatialHeatmapFacetsTest.test-seed#[7BE9B4871C0BEFDB]) [    ] o.e.j.s.Server Started @24110ms
   [junit4]   2> 15720 INFO  (TEST-SpatialHeatmapFacetsTest.test-seed#[7BE9B4871C0BEFDB]) [    ] o.a.s.c.s.e.JettySolrRunner Jetty properties: {schema=schema-spatial.xml, solrconfig=solrconfig-basic.xml, hostContext=/, hostPort=59940, coreRootDirectory=C:\Users\jenkins\workspace\Lucene-Solr-7.x-Windows\solr\build\solr-core\test\J0\temp\solr.handler.component.SpatialHeatmapFacetsTest_7BE9B4871C0BEFDB-001\tempDir-001\control\cores}
   [junit4]   2> 15720 ERROR (TEST-SpatialHeatmapFacetsTest.test-seed#[7BE9B4871C0BEFDB]) [    ] o.a.s.u.StartupLoggingUtils Missing Java Option solr.log.dir. Logging may be missing or incomplete.
   [junit4]   2> 15720 INFO  (TEST-SpatialHeatmapFacetsTest.test-seed#[7BE9B4871C0BEFDB]) [    ] o.a.s.s.SolrDispatchFilter  ___      _       Welcome to Apache Solr? version 7.3.0
   [junit4]   2> 15720 INFO  (TEST-SpatialHeatmapFacetsTest.test-seed#[7BE9B4871C0BEFDB]) [    ] o.a.s.s.SolrDispatchFilter / __| ___| |_ _   Starting in standalone mode on port null
   [junit4]   2> 15720 INFO  (TEST-SpatialHeatmapFacetsTest.test-seed#[7BE9B4871C0BEFDB]) [    ] o.a.s.s.SolrDispatchFilter \__ \/ _ \ | '_|  Install dir: null
   [junit4]   2> 15720 INFO  (TEST-SpatialHeatmapFacetsTest.test-seed#[7BE9B4871C0BEFDB]) [    ] o.a.s.s.SolrDispatchFilter |___/\___/_|_|    Start time: 2017-12-26T03:09:27.625Z
   [junit4]   2> 15720 INFO  (TEST-SpatialHeatmapFacetsTest.test-seed#[7BE9B4871C0BEFDB]) [    ] o.a.s.c.SolrXmlConfig Loading container configuration from C:\Users\jenkins\workspace\Lucene-Solr-7.x-Windows\solr\build\solr-core\test\J0\temp\solr.handler.component.SpatialHeatmapFacetsTest_7BE9B4871C0BEFDB-001\tempDir-001\control\solr.xml
   [junit4]   2> 15736 INFO  (TEST-SpatialHeatmapFacetsTest.test-seed#[7BE9B4871C0BEFDB]) [    ] o.a.s.c.SolrXmlConfig Configuration parameter autoReplicaFailoverWorkLoopDelay is ignored
   [junit4]   2> 15736 INFO  (TEST-SpatialHeatmapFacetsTest.test-seed#[7BE9B4871C0BEFDB]) [    ] o.a.s.c.SolrXmlConfig Configuration parameter autoReplicaFailoverBadNodeExpiration is ignored
   [junit4]   2> 15813 INFO  (TEST-SpatialHeatmapFacetsTest.test-seed#[7BE9B4871C0BEFDB]) [    ] o.a.s.c.CorePropertiesLocator Found 1 core definitions underneath C:\Users\jenkins\workspace\Lucene-Solr-7.x-Windows\solr\build\solr-core\test\J0\temp\solr.handler.component.SpatialHeatmapFacetsTest_7BE9B4871C0BEFDB-001\tempDir-001\control\cores
   [junit4]   2> 15813 INFO  (TEST-SpatialHeatmapFacetsTest.test-seed#[7BE9B4871C0BEFDB]) [    ] o.a.s.c.CorePropertiesLocator Cores are: [collection1]
   [junit4]   2> 15827 INFO  (coreLoadExecutor-62-thread-1) [    ] o.a.s.c.TransientSolrCoreCacheDefault Allocating transient cache for 4 transient cores
   [junit4]   2> 15827 INFO  (coreLoadExecutor-62-thread-1) [    x:collection1] o.a.s.c.SolrResourceLoader [null] Added 2 libs to classloader, from paths: [/C:/Users/jenkins/workspace/Lucene-Solr-7.x-Windows/solr/core/src/test-files/solr/collection1/lib, /C:/Users/jenkins/workspace/Luc

[...truncated too long message...]

.apache.solr.common.cloud.ZkStateReader.refreshLiveNodes(ZkStateReader.java:703)
   [junit4]   2> 	at org.apache.solr.common.cloud.ZkStateReader.access$900(ZkStateReader.java:72)
   [junit4]   2> 	at org.apache.solr.common.cloud.ZkStateReader$LiveNodeWatcher.refreshAndWatch(ZkStateReader.java:1090)
   [junit4]   2> 	at org.apache.solr.common.cloud.ZkStateReader$LiveNodeWatcher.process(ZkStateReader.java:1085)
   [junit4]   2> 	at org.apache.solr.common.cloud.SolrZkClient$1.lambda$process$1(SolrZkClient.java:268)
   [junit4]   2> 	at java.util.concurrent.Executors$RunnableAdapter.call(Executors.java:511)
   [junit4]   2> 	at java.util.concurrent.FutureTask.run(FutureTask.java:266)
   [junit4]   2> 	at org.apache.solr.common.util.ExecutorUtil$MDCAwareThreadPoolExecutor.lambda$execute$0(ExecutorUtil.java:188)
   [junit4]   2> 	at java.util.concurrent.ThreadPoolExecutor.runWorker(ThreadPoolExecutor.java:1149)
   [junit4]   2> 	at java.util.concurrent.ThreadPoolExecutor$Worker.run(ThreadPoolExecutor.java:624)
   [junit4]   2> 	at java.lang.Thread.run(Thread.java:748)
   [junit4]   2> 164768 INFO  (jetty-closer-4-thread-1) [    ] o.e.j.s.h.ContextHandler Stopped o.e.j.s.ServletContextHandler@c712afb{/solr,null,UNAVAILABLE}
   [junit4]   2> 164785 INFO  (jetty-closer-4-thread-2) [    ] o.e.j.s.h.ContextHandler Stopped o.e.j.s.ServletContextHandler@41ddf7c1{/solr,null,UNAVAILABLE}
   [junit4]   2> 164786 ERROR (SUITE-StreamExpressionTest-seed#[471708545E64CA78]-worker) [    ] o.a.z.s.ZooKeeperServer ZKShutdownHandler is not registered, so ZooKeeper server won't take any action on ERROR or SHUTDOWN server state changes
   [junit4]   2> 164788 INFO  (SUITE-StreamExpressionTest-seed#[471708545E64CA78]-worker) [    ] o.a.s.c.ZkTestServer connecting to 127.0.0.1:56605 56605
   [junit4]   2> 164791 INFO  (Thread-2) [    ] o.a.s.c.ZkTestServer connecting to 127.0.0.1:56605 56605
   [junit4]   2> 164793 WARN  (Thread-2) [    ] o.a.s.c.ZkTestServer Watch limit violations: 
   [junit4]   2> Maximum concurrent create/delete watches above limit:
   [junit4]   2> 
   [junit4]   2> 	100	/solr/aliases.json
   [junit4]   2> 	100	/solr/clusterprops.json
   [junit4]   2> 	15	/solr/configs/conf
   [junit4]   2> 	7	/solr/configs/ml
   [junit4]   2> 	4	/solr/security.json
   [junit4]   2> 
   [junit4]   2> Maximum concurrent data watches above limit:
   [junit4]   2> 
   [junit4]   2> 	100	/solr/clusterstate.json
   [junit4]   2> 	40	/solr/collections/destinationCollection/state.json
   [junit4]   2> 	30	/solr/collections/parallelDestinationCollection1/state.json
   [junit4]   2> 	20	/solr/collections/parallelDestinationCollection/state.json
   [junit4]   2> 	10	/solr/collections/mainCorpus1/state.json
   [junit4]   2> 	10	/solr/collections/destination/state.json
   [junit4]   2> 	10	/solr/collections/destination1/state.json
   [junit4]   2> 	10	/solr/collections/collection1/state.json
   [junit4]   2> 	10	/solr/collections/workQueue1/state.json
   [junit4]   2> 	10	/solr/collections/workQueue/state.json
   [junit4]   2> 	10	/solr/collections/uknownCollection/state.json
   [junit4]   2> 	10	/solr/collections/modelCollection/state.json
   [junit4]   2> 	10	/solr/collections/checkpointCollection/state.json
   [junit4]   2> 	10	/solr/collections/mainCorpus/state.json
   [junit4]   2> 
   [junit4]   2> Maximum concurrent children watches above limit:
   [junit4]   2> 
   [junit4]   2> 	100	/solr/live_nodes
   [junit4]   2> 	100	/solr/collections
   [junit4]   2> 
   [junit4]   2> NOTE: leaving temporary files on disk at: C:\Users\jenkins\workspace\Lucene-Solr-7.x-Windows\solr\build\solr-solrj\test\J1\temp\solr.client.solrj.io.stream.StreamExpressionTest_471708545E64CA78-001
   [junit4]   2> Dec 26, 2017 4:20:40 AM com.carrotsearch.randomizedtesting.ThreadLeakControl checkThreadLeaks
   [junit4]   2> WARNING: Will linger awaiting termination of 1 leaked thread(s).
   [junit4]   2> NOTE: test params are: codec=Asserting(Lucene70), sim=RandomSimilarity(queryNorm=true): {}, locale=es-PR, timezone=America/Yakutat
   [junit4]   2> NOTE: Windows 10 10.0 amd64/Oracle Corporation 1.8.0_144 (64-bit)/cpus=3,threads=1,free=169864624,total=330825728
   [junit4]   2> NOTE: All tests run in this JVM: [StreamExpressionToExplanationTest, CommonParamsTest, NaturalLogEvaluatorTest, TestValidatingJsonMap, CubedRootEvaluatorTest, EqualToEvaluatorTest, SolrQueryTest, TestSuggesterResponse, TestFastInputStream, RegressionEvaluatorTest, StreamExpressionTest]
   [junit4] Completed [51/146 (1!)] on J1 in 150.67s, 142 tests, 1 error <<< FAILURES!

[...truncated 1749 lines...]
   [junit4] Suite: org.apache.solr.update.processor.TestOpenNLPExtractNamedEntitiesUpdateProcessorFactory
   [junit4]   2> Creating dataDir: C:\Users\jenkins\workspace\Lucene-Solr-7.x-Windows\solr\build\contrib\solr-analysis-extras\test\J1\temp\solr.update.processor.TestOpenNLPExtractNamedEntitiesUpdateProcessorFactory_EB9D7F05D38C9AE4-001\init-core-data-001
   [junit4]   2> NOTE: test params are: codec=Asserting(Lucene70): {}, docValues:{}, maxPointsInLeafNode=1660, maxMBSortInHeap=5.10123966481724, sim=RandomSimilarity(queryNorm=false): {}, locale=el, timezone=Asia/Srednekolymsk
   [junit4]   2> NOTE: Windows 10 10.0 amd64/Oracle Corporation 1.8.0_144 (64-bit)/cpus=3,threads=1,free=142199216,total=173015040
   [junit4]   2> NOTE: All tests run in this JVM: [TestFoldingMultitermExtrasQuery, TestOpenNLPExtractNamedEntitiesUpdateProcessorFactory]
   [junit4]   2> NOTE: reproduce with: ant test  -Dtestcase=TestOpenNLPExtractNamedEntitiesUpdateProcessorFactory -Dtests.seed=EB9D7F05D38C9AE4 -Dtests.slow=true -Dtests.locale=el -Dtests.timezone=Asia/Srednekolymsk -Dtests.asserts=true -Dtests.file.encoding=UTF-8
   [junit4] ERROR   0.00s J1 | TestOpenNLPExtractNamedEntitiesUpdateProcessorFactory (suite) <<<
   [junit4]    > Throwable #1: java.io.IOException: Could not remove the following files (in the order of attempts):
   [junit4]    >    C:\Users\jenkins\workspace\Lucene-Solr-7.x-Windows\solr\build\contrib\solr-analysis-extras\test\J1\temp\solr.update.processor.TestOpenNLPExtractNamedEntitiesUpdateProcessorFactory_EB9D7F05D38C9AE4-001\tempDir-001\collection1\conf: java.nio.file.DirectoryNotEmptyException: C:\Users\jenkins\workspace\Lucene-Solr-7.x-Windows\solr\build\contrib\solr-analysis-extras\test\J1\temp\solr.update.processor.TestOpenNLPExtractNamedEntitiesUpdateProcessorFactory_EB9D7F05D38C9AE4-001\tempDir-001\collection1\conf
   [junit4]    >    C:\Users\jenkins\workspace\Lucene-Solr-7.x-Windows\solr\build\contrib\solr-analysis-extras\test\J1\temp\solr.update.processor.TestOpenNLPExtractNamedEntitiesUpdateProcessorFactory_EB9D7F05D38C9AE4-001\tempDir-001\collection1: java.nio.file.DirectoryNotEmptyException: C:\Users\jenkins\workspace\Lucene-Solr-7.x-Windows\solr\build\contrib\solr-analysis-extras\test\J1\temp\solr.update.processor.TestOpenNLPExtractNamedEntitiesUpdateProcessorFactory_EB9D7F05D38C9AE4-001\tempDir-001\collection1
   [junit4]    >    C:\Users\jenkins\workspace\Lucene-Solr-7.x-Windows\solr\build\contrib\solr-analysis-extras\test\J1\temp\solr.update.processor.TestOpenNLPExtractNamedEntitiesUpdateProcessorFactory_EB9D7F05D38C9AE4-001\tempDir-001: java.nio.file.DirectoryNotEmptyException: C:\Users\jenkins\workspace\Lucene-Solr-7.x-Windows\solr\build\contrib\solr-analysis-extras\test\J1\temp\solr.update.processor.TestOpenNLPExtractNamedEntitiesUpdateProcessorFactory_EB9D7F05D38C9AE4-001\tempDir-001
   [junit4]    >    C:\Users\jenkins\workspace\Lucene-Solr-7.x-Windows\solr\build\contrib\solr-analysis-extras\test\J1\temp\solr.update.processor.TestOpenNLPExtractNamedEntitiesUpdateProcessorFactory_EB9D7F05D38C9AE4-001\tempDir-001\collection1\conf\en-test-sent.bin: java.nio.file.AccessDeniedException: C:\Users\jenkins\workspace\Lucene-Solr-7.x-Windows\solr\build\contrib\solr-analysis-extras\test\J1\temp\solr.update.processor.TestOpenNLPExtractNamedEntitiesUpdateProcessorFactory_EB9D7F05D38C9AE4-001\tempDir-001\collection1\conf\en-test-sent.bin
   [junit4]    >    C:\Users\jenkins\workspace\Lucene-Solr-7.x-Windows\solr\build\contrib\solr-analysis-extras\test\J1\temp\solr.update.processor.TestOpenNLPExtractNamedEntitiesUpdateProcessorFactory_EB9D7F05D38C9AE4-001\tempDir-001\collection1\conf\en-test-tokenizer.bin: java.nio.file.AccessDeniedException: C:\Users\jenkins\workspace\Lucene-Solr-7.x-Windows\solr\build\contrib\solr-analysis-extras\test\J1\temp\solr.update.processor.TestOpenNLPExtractNamedEntitiesUpdateProcessorFactory_EB9D7F05D38C9AE4-001\tempDir-001\collection1\conf\en-test-tokenizer.bin
   [junit4]    >    C:\Users\jenkins\workspace\Lucene-Solr-7.x-Windows\solr\build\contrib\solr-analysis-extras\test\J1\temp\solr.update.processor.TestOpenNLPExtractNamedEntitiesUpdateProcessorFactory_EB9D7F05D38C9AE4-001\tempDir-001\collection1\conf\en-test-ner-person.bin: java.nio.file.AccessDeniedException: C:\Users\jenkins\workspace\Lucene-Solr-7.x-Windows\solr\build\contrib\solr-analysis-extras\test\J1\temp\solr.update.processor.TestOpenNLPExtractNamedEntitiesUpdateProcessorFactory_EB9D7F05D38C9AE4-001\tempDir-001\collection1\conf\en-test-ner-person.bin
   [junit4]    >    C:\Users\jenkins\workspace\Lucene-Solr-7.x-Windows\solr\build\contrib\solr-analysis-extras\test\J1\temp\solr.update.processor.TestOpenNLPExtractNamedEntitiesUpdateProcessorFactory_EB9D7F05D38C9AE4-001: java.nio.file.DirectoryNotEmptyException: C:\Users\jenkins\workspace\Lucene-Solr-7.x-Windows\solr\build\contrib\solr-analysis-extras\test\J1\temp\solr.update.processor.TestOpenNLPExtractNamedEntitiesUpdateProcessorFactory_EB9D7F05D38C9AE4-001
   [junit4]    > 	at __randomizedtesting.SeedInfo.seed([EB9D7F05D38C9AE4]:0)
   [junit4]    > 	at org.apache.lucene.util.IOUtils.rm(IOUtils.java:329)
   [junit4]    > 	at java.lang.Thread.run(Thread.java:748)
   [junit4] Completed [4/5 (1!)] on J1 in 1.96s, 8 tests, 1 error <<< FAILURES!

[...truncated 45770 lines...]

Mime
View raw message