lucene-dev mailing list archives

Site index · List index
Message view « Date » · « Thread »
Top « Date » · « Thread »
From Policeman Jenkins Server <jenk...@thetaphi.de>
Subject [JENKINS] Lucene-Solr-7.2-Windows (64bit/jdk-9.0.1) - Build # 24 - Still Unstable!
Date Tue, 19 Dec 2017 22:33:34 GMT
Build: https://jenkins.thetaphi.de/job/Lucene-Solr-7.2-Windows/24/
Java: 64bit/jdk-9.0.1 -XX:+UseCompressedOops -XX:+UseSerialGC

1 tests failed.
FAILED:  junit.framework.TestSuite.org.apache.solr.search.TestAddFieldRealTimeGet

Error Message:
Could not remove the following files (in the order of attempts):    C:\Users\jenkins\workspace\Lucene-Solr-7.2-Windows\solr\build\solr-core\test\J1\temp\solr.search.TestAddFieldRealTimeGet_4A0C75951C87AC2B-001\init-core-data-001\index:
java.nio.file.DirectoryNotEmptyException: C:\Users\jenkins\workspace\Lucene-Solr-7.2-Windows\solr\build\solr-core\test\J1\temp\solr.search.TestAddFieldRealTimeGet_4A0C75951C87AC2B-001\init-core-data-001\index
   C:\Users\jenkins\workspace\Lucene-Solr-7.2-Windows\solr\build\solr-core\test\J1\temp\solr.search.TestAddFieldRealTimeGet_4A0C75951C87AC2B-001\init-core-data-001:
java.nio.file.DirectoryNotEmptyException: C:\Users\jenkins\workspace\Lucene-Solr-7.2-Windows\solr\build\solr-core\test\J1\temp\solr.search.TestAddFieldRealTimeGet_4A0C75951C87AC2B-001\init-core-data-001


Stack Trace:
java.io.IOException: Could not remove the following files (in the order of attempts):
   C:\Users\jenkins\workspace\Lucene-Solr-7.2-Windows\solr\build\solr-core\test\J1\temp\solr.search.TestAddFieldRealTimeGet_4A0C75951C87AC2B-001\init-core-data-001\index:
java.nio.file.DirectoryNotEmptyException: C:\Users\jenkins\workspace\Lucene-Solr-7.2-Windows\solr\build\solr-core\test\J1\temp\solr.search.TestAddFieldRealTimeGet_4A0C75951C87AC2B-001\init-core-data-001\index
   C:\Users\jenkins\workspace\Lucene-Solr-7.2-Windows\solr\build\solr-core\test\J1\temp\solr.search.TestAddFieldRealTimeGet_4A0C75951C87AC2B-001\init-core-data-001:
java.nio.file.DirectoryNotEmptyException: C:\Users\jenkins\workspace\Lucene-Solr-7.2-Windows\solr\build\solr-core\test\J1\temp\solr.search.TestAddFieldRealTimeGet_4A0C75951C87AC2B-001\init-core-data-001

	at __randomizedtesting.SeedInfo.seed([4A0C75951C87AC2B]:0)
	at org.apache.lucene.util.IOUtils.rm(IOUtils.java:329)
	at org.apache.lucene.util.TestRuleTemporaryFilesCleanup.afterAlways(TestRuleTemporaryFilesCleanup.java:216)
	at com.carrotsearch.randomizedtesting.rules.TestRuleAdapter$1.afterAlways(TestRuleAdapter.java:31)
	at com.carrotsearch.randomizedtesting.rules.StatementAdapter.evaluate(StatementAdapter.java:43)
	at com.carrotsearch.randomizedtesting.rules.StatementAdapter.evaluate(StatementAdapter.java:36)
	at org.apache.lucene.util.TestRuleAssertionsRequired$1.evaluate(TestRuleAssertionsRequired.java:53)
	at org.apache.lucene.util.TestRuleMarkFailure$1.evaluate(TestRuleMarkFailure.java:47)
	at org.apache.lucene.util.TestRuleIgnoreAfterMaxFailures$1.evaluate(TestRuleIgnoreAfterMaxFailures.java:64)
	at org.apache.lucene.util.TestRuleIgnoreTestSuites$1.evaluate(TestRuleIgnoreTestSuites.java:54)
	at com.carrotsearch.randomizedtesting.rules.StatementAdapter.evaluate(StatementAdapter.java:36)
	at com.carrotsearch.randomizedtesting.ThreadLeakControl$StatementRunner.run(ThreadLeakControl.java:368)
	at java.base/java.lang.Thread.run(Thread.java:844)




Build Log:
[...truncated 13894 lines...]
   [junit4] Suite: org.apache.solr.search.TestAddFieldRealTimeGet
   [junit4]   2> Creating dataDir: C:\Users\jenkins\workspace\Lucene-Solr-7.2-Windows\solr\build\solr-core\test\J1\temp\solr.search.TestAddFieldRealTimeGet_4A0C75951C87AC2B-001\init-core-data-001
   [junit4]   2> 3520733 WARN  (SUITE-TestAddFieldRealTimeGet-seed#[4A0C75951C87AC2B]-worker)
[    ] o.a.s.SolrTestCaseJ4 startTrackingSearchers: numOpens=1 numCloses=1
   [junit4]   2> 3520733 INFO  (SUITE-TestAddFieldRealTimeGet-seed#[4A0C75951C87AC2B]-worker)
[    ] o.a.s.SolrTestCaseJ4 Using PointFields (NUMERIC_POINTS_SYSPROP=true) w/NUMERIC_DOCVALUES_SYSPROP=false
   [junit4]   2> 3520734 INFO  (SUITE-TestAddFieldRealTimeGet-seed#[4A0C75951C87AC2B]-worker)
[    ] o.a.s.SolrTestCaseJ4 Randomized ssl (true) and clientAuth (false) via: @org.apache.solr.util.RandomizeSSL(reason="",
value=0.0/0.0, ssl=0.0/0.0, clientAuth=0.0/0.0)
   [junit4]   2> 3520735 INFO  (SUITE-TestAddFieldRealTimeGet-seed#[4A0C75951C87AC2B]-worker)
[    ] o.a.s.SolrTestCaseJ4 SecureRandom sanity checks: test.solr.allowed.securerandom=null
& java.security.egd=file:/dev/./urandom
   [junit4]   2> 3520736 INFO  (TEST-TestAddFieldRealTimeGet.test-seed#[4A0C75951C87AC2B])
[    ] o.a.s.SolrTestCaseJ4 ###Starting test
   [junit4]   2> 3520742 INFO  (TEST-TestAddFieldRealTimeGet.test-seed#[4A0C75951C87AC2B])
[    ] o.a.s.SolrTestCaseJ4 ####initCore
   [junit4]   2> 3520750 INFO  (TEST-TestAddFieldRealTimeGet.test-seed#[4A0C75951C87AC2B])
[    ] o.a.s.c.SolrConfig Using Lucene MatchVersion: 7.2.0
   [junit4]   2> 3520756 INFO  (TEST-TestAddFieldRealTimeGet.test-seed#[4A0C75951C87AC2B])
[    ] o.a.s.s.ManagedIndexSchemaFactory The schema is configured as managed, but managed
schema resource managed-schema not found - loading non-managed schema schema-id-and-version-fields-only.xml
instead
   [junit4]   2> 3520759 INFO  (TEST-TestAddFieldRealTimeGet.test-seed#[4A0C75951C87AC2B])
[    ] o.a.s.s.IndexSchema [null] Schema name=id-and-version-fields-only
   [junit4]   2> 3520760 INFO  (TEST-TestAddFieldRealTimeGet.test-seed#[4A0C75951C87AC2B])
[    ] o.a.s.s.IndexSchema Loaded schema id-and-version-fields-only/1.6 with uniqueid field
id
   [junit4]   2> 3520761 INFO  (TEST-TestAddFieldRealTimeGet.test-seed#[4A0C75951C87AC2B])
[    ] o.a.s.s.ManagedIndexSchema Upgraded to managed schema at C:\Users\jenkins\workspace\Lucene-Solr-7.2-Windows\solr\build\solr-core\test\J1\temp\solr.search.TestAddFieldRealTimeGet_4A0C75951C87AC2B-001\tempDir-001\collection1\conf\managed-schema
   [junit4]   2> 3520766 INFO  (TEST-TestAddFieldRealTimeGet.test-seed#[4A0C75951C87AC2B])
[    ] o.a.s.s.ManagedIndexSchemaFactory After upgrading to managed schema, renamed the non-managed
schema C:\Users\jenkins\workspace\Lucene-Solr-7.2-Windows\solr\build\solr-core\test\J1\temp\solr.search.TestAddFieldRealTimeGet_4A0C75951C87AC2B-001\tempDir-001\collection1\conf\schema-id-and-version-fields-only.xml
to C:\Users\jenkins\workspace\Lucene-Solr-7.2-Windows\solr\build\solr-core\test\J1\temp\solr.search.TestAddFieldRealTimeGet_4A0C75951C87AC2B-001\tempDir-001\collection1\conf\schema-id-and-version-fields-only.xml.bak
   [junit4]   2> 3520804 INFO  (TEST-TestAddFieldRealTimeGet.test-seed#[4A0C75951C87AC2B])
[    ] o.a.s.m.r.SolrJmxReporter JMX monitoring for 'solr.node' (registry 'solr.node') enabled
at server: com.sun.jmx.mbeanserver.JmxMBeanServer@5e22106
   [junit4]   2> 3520811 INFO  (TEST-TestAddFieldRealTimeGet.test-seed#[4A0C75951C87AC2B])
[    ] o.a.s.m.r.SolrJmxReporter JMX monitoring for 'solr.jvm' (registry 'solr.jvm') enabled
at server: com.sun.jmx.mbeanserver.JmxMBeanServer@5e22106
   [junit4]   2> 3520811 INFO  (TEST-TestAddFieldRealTimeGet.test-seed#[4A0C75951C87AC2B])
[    ] o.a.s.m.r.SolrJmxReporter JMX monitoring for 'solr.jetty' (registry 'solr.jetty') enabled
at server: com.sun.jmx.mbeanserver.JmxMBeanServer@5e22106
   [junit4]   2> 3520813 INFO  (coreLoadExecutor-15741-thread-1) [    ] o.a.s.c.TransientSolrCoreCacheDefault
Allocating transient cache for 2147483647 transient cores
   [junit4]   2> 3520822 INFO  (coreLoadExecutor-15741-thread-1) [    x:collection1] o.a.s.c.SolrConfig
Using Lucene MatchVersion: 7.2.0
   [junit4]   2> 3520828 INFO  (coreLoadExecutor-15741-thread-1) [    x:collection1] o.a.s.s.IndexSchema
[collection1] Schema name=id-and-version-fields-only
   [junit4]   2> 3520842 INFO  (coreLoadExecutor-15741-thread-1) [    x:collection1] o.a.s.s.IndexSchema
Loaded schema id-and-version-fields-only/1.6 with uniqueid field id
   [junit4]   2> 3520842 INFO  (coreLoadExecutor-15741-thread-1) [    x:collection1] o.a.s.c.CoreContainer
Creating SolrCore 'collection1' using configuration from instancedir C:\Users\jenkins\workspace\Lucene-Solr-7.2-Windows\solr\build\solr-core\test\J1\temp\solr.search.TestAddFieldRealTimeGet_4A0C75951C87AC2B-001\tempDir-001\collection1,
trusted=true
   [junit4]   2> 3520843 INFO  (coreLoadExecutor-15741-thread-1) [    x:collection1] o.a.s.m.r.SolrJmxReporter
JMX monitoring for 'solr.core.collection1' (registry 'solr.core.collection1') enabled at server:
com.sun.jmx.mbeanserver.JmxMBeanServer@5e22106
   [junit4]   2> 3520843 INFO  (coreLoadExecutor-15741-thread-1) [    x:collection1] o.a.s.c.SolrCore
solr.RecoveryStrategy.Builder
   [junit4]   2> 3520843 INFO  (coreLoadExecutor-15741-thread-1) [    x:collection1] o.a.s.c.SolrCore
[[collection1] ] Opening new SolrCore at [C:\Users\jenkins\workspace\Lucene-Solr-7.2-Windows\solr\build\solr-core\test\J1\temp\solr.search.TestAddFieldRealTimeGet_4A0C75951C87AC2B-001\tempDir-001\collection1],
dataDir=[C:\Users\jenkins\workspace\Lucene-Solr-7.2-Windows\solr\build\solr-core\test\J1\temp\solr.search.TestAddFieldRealTimeGet_4A0C75951C87AC2B-001\init-core-data-001\]
   [junit4]   2> 3520846 INFO  (coreLoadExecutor-15741-thread-1) [    x:collection1] o.a.s.u.RandomMergePolicy
RandomMergePolicy wrapping class org.apache.lucene.index.AlcoholicMergePolicy: [AlcoholicMergePolicy:
minMergeSize=0, mergeFactor=10, maxMergeSize=715281669, maxMergeSizeForForcedMerge=9223372036854775807,
calibrateSizeByDeletes=true, maxMergeDocs=2147483647, maxCFSSegmentSizeMB=8.796093022207999E12,
noCFSRatio=0.1]
   [junit4]   2> 3520851 WARN  (coreLoadExecutor-15741-thread-1) [    x:collection1] o.a.s.c.RequestHandlers
INVALID paramSet a in requestHandler {type = requestHandler,name = /dump,class = DumpRequestHandler,attributes
= {initParams=a, name=/dump, registerPath=/solr,/v2, class=DumpRequestHandler},args = {defaults={a=A,b=B}}}
   [junit4]   2> 3520898 INFO  (coreLoadExecutor-15741-thread-1) [    x:collection1] o.a.s.u.UpdateHandler
Using UpdateLog implementation: org.apache.solr.update.UpdateLog
   [junit4]   2> 3520899 INFO  (coreLoadExecutor-15741-thread-1) [    x:collection1] o.a.s.u.UpdateLog
Initializing UpdateLog: dataDir= defaultSyncLevel=FLUSH numRecordsToKeep=100 maxNumLogsToKeep=10
numVersionBuckets=65536
   [junit4]   2> 3520900 INFO  (coreLoadExecutor-15741-thread-1) [    x:collection1] o.a.s.u.CommitTracker
Hard AutoCommit: disabled
   [junit4]   2> 3520900 INFO  (coreLoadExecutor-15741-thread-1) [    x:collection1] o.a.s.u.CommitTracker
Soft AutoCommit: disabled
   [junit4]   2> 3520901 INFO  (coreLoadExecutor-15741-thread-1) [    x:collection1] o.a.s.u.RandomMergePolicy
RandomMergePolicy wrapping class org.apache.lucene.index.LogByteSizeMergePolicy: [LogByteSizeMergePolicy:
minMergeSize=1677721, mergeFactor=39, maxMergeSize=2147483648, maxMergeSizeForForcedMerge=9223372036854775807,
calibrateSizeByDeletes=true, maxMergeDocs=2147483647, maxCFSSegmentSizeMB=8.796093022207999E12,
noCFSRatio=0.4497506841653627]
   [junit4]   2> 3520902 INFO  (coreLoadExecutor-15741-thread-1) [    x:collection1] o.a.s.s.SolrIndexSearcher
Opening [Searcher@7f07324[collection1] main]
   [junit4]   2> 3520903 INFO  (coreLoadExecutor-15741-thread-1) [    x:collection1] o.a.s.r.ManagedResourceStorage
File-based storage initialized to use dir: C:\Users\jenkins\workspace\Lucene-Solr-7.2-Windows\solr\build\solr-core\test\J1\temp\solr.search.TestAddFieldRealTimeGet_4A0C75951C87AC2B-001\tempDir-001\collection1\conf
   [junit4]   2> 3520903 INFO  (coreLoadExecutor-15741-thread-1) [    x:collection1] o.a.s.h.ReplicationHandler
Commits will be reserved for 10000ms.
   [junit4]   2> 3520904 INFO  (searcherExecutor-15742-thread-1-processing-x:collection1)
[    x:collection1] o.a.s.c.SolrCore [collection1] Registered new searcher Searcher@7f07324[collection1]
main{ExitableDirectoryReader(UninvertingDirectoryReader())}
   [junit4]   2> 3520904 INFO  (coreLoadExecutor-15741-thread-1) [    x:collection1] o.a.s.u.UpdateLog
Could not find max version in index or recent updates, using new clock 1587252304122216448
   [junit4]   2> 3520907 INFO  (TEST-TestAddFieldRealTimeGet.test-seed#[4A0C75951C87AC2B])
[    ] o.a.s.SolrTestCaseJ4 ####initCore end
   [junit4]   2> 3520907 INFO  (TEST-TestAddFieldRealTimeGet.test-seed#[4A0C75951C87AC2B])
[    ] o.a.s.u.DirectUpdateHandler2 [collection1] REMOVING ALL DOCUMENTS FROM INDEX
   [junit4]   2> 3520907 INFO  (TEST-TestAddFieldRealTimeGet.test-seed#[4A0C75951C87AC2B])
[    ] o.a.s.s.SolrIndexSearcher Opening [Searcher@1eda3fcb[collection1] realtime]
   [junit4]   2> 3520908 INFO  (TEST-TestAddFieldRealTimeGet.test-seed#[4A0C75951C87AC2B])
[    ] o.a.s.u.p.LogUpdateProcessorFactory [collection1]  webapp=null path=null params={_version_=-9223372036854775807&update.distrib=FROMLEADER&versions=true&wt=json&indent=true}{deleteByQuery=*:*
(-9223372036854775807)} 0 0
   [junit4]   2> 3520908 INFO  (TEST-TestAddFieldRealTimeGet.test-seed#[4A0C75951C87AC2B])
[    ] o.a.s.u.DirectUpdateHandler2 start commit{_version_=1587252304126410752,optimize=false,openSearcher=true,waitSearcher=true,expungeDeletes=false,softCommit=false,prepareCommit=false}
   [junit4]   2> 3520908 INFO  (TEST-TestAddFieldRealTimeGet.test-seed#[4A0C75951C87AC2B])
[    ] o.a.s.u.SolrIndexWriter Calling setCommitData with IW:org.apache.solr.update.SolrIndexWriter@7c3da684
commitCommandVersion:1587252304126410752
   [junit4]   2> 3520910 INFO  (TEST-TestAddFieldRealTimeGet.test-seed#[4A0C75951C87AC2B])
[    ] o.a.s.s.SolrIndexSearcher Opening [Searcher@64b4cee1[collection1] main]
   [junit4]   2> 3520910 INFO  (TEST-TestAddFieldRealTimeGet.test-seed#[4A0C75951C87AC2B])
[    ] o.a.s.u.DirectUpdateHandler2 end_commit_flush
   [junit4]   2> 3520912 INFO  (searcherExecutor-15742-thread-1) [    ] o.a.s.c.SolrCore
[collection1] Registered new searcher Searcher@64b4cee1[collection1] main{ExitableDirectoryReader(UninvertingDirectoryReader())}
   [junit4]   2> 3520912 INFO  (TEST-TestAddFieldRealTimeGet.test-seed#[4A0C75951C87AC2B])
[    ] o.a.s.u.p.LogUpdateProcessorFactory [collection1]  webapp=null path=null params={}{commit=}
0 3
   [junit4]   2> 3520913 INFO  (TEST-TestAddFieldRealTimeGet.test-seed#[4A0C75951C87AC2B])
[    ] o.a.s.u.p.LogUpdateProcessorFactory [collection1]  webapp=null path=null params={}{}
0 0
   [junit4]   2> 3520914 ERROR (TEST-TestAddFieldRealTimeGet.test-seed#[4A0C75951C87AC2B])
[    ] o.a.s.h.RequestHandlerBase org.apache.solr.common.SolrException: ERROR: [doc=1] unknown
field 'newfield'
   [junit4]   2> 	at org.apache.solr.update.DocumentBuilder.toDocument(DocumentBuilder.java:214)
   [junit4]   2> 	at org.apache.solr.update.AddUpdateCommand.getLuceneDocument(AddUpdateCommand.java:100)
   [junit4]   2> 	at org.apache.solr.update.DirectUpdateHandler2.updateDocument(DirectUpdateHandler2.java:963)
   [junit4]   2> 	at org.apache.solr.update.DirectUpdateHandler2.updateDocOrDocValues(DirectUpdateHandler2.java:954)
   [junit4]   2> 	at org.apache.solr.update.DirectUpdateHandler2.doNormalUpdate(DirectUpdateHandler2.java:334)
   [junit4]   2> 	at org.apache.solr.update.DirectUpdateHandler2.addDoc0(DirectUpdateHandler2.java:271)
   [junit4]   2> 	at org.apache.solr.update.DirectUpdateHandler2.addDoc(DirectUpdateHandler2.java:221)
   [junit4]   2> 	at org.apache.solr.update.processor.RunUpdateProcessor.processAdd(RunUpdateProcessorFactory.java:67)
   [junit4]   2> 	at org.apache.solr.update.processor.UpdateRequestProcessor.processAdd(UpdateRequestProcessor.java:55)
   [junit4]   2> 	at org.apache.solr.update.processor.DistributedUpdateProcessor.doLocalAdd(DistributedUpdateProcessor.java:910)
   [junit4]   2> 	at org.apache.solr.update.processor.DistributedUpdateProcessor.versionAdd(DistributedUpdateProcessor.java:1121)
   [junit4]   2> 	at org.apache.solr.update.processor.DistributedUpdateProcessor.processAdd(DistributedUpdateProcessor.java:616)
   [junit4]   2> 	at org.apache.solr.update.processor.LogUpdateProcessorFactory$LogUpdateProcessor.processAdd(LogUpdateProcessorFactory.java:103)
   [junit4]   2> 	at org.apache.solr.handler.loader.XMLLoader.processUpdate(XMLLoader.java:261)
   [junit4]   2> 	at org.apache.solr.handler.loader.XMLLoader.load(XMLLoader.java:188)
   [junit4]   2> 	at org.apache.solr.handler.UpdateRequestHandler$1.load(UpdateRequestHandler.java:97)
   [junit4]   2> 	at org.apache.solr.handler.ContentStreamHandlerBase.handleRequestBody(ContentStreamHandlerBase.java:68)
   [junit4]   2> 	at org.apache.solr.handler.RequestHandlerBase.handleRequest(RequestHandlerBase.java:177)
   [junit4]   2> 	at org.apache.solr.core.SolrCore.execute(SolrCore.java:2503)
   [junit4]   2> 	at org.apache.solr.servlet.DirectSolrConnection.request(DirectSolrConnection.java:125)
   [junit4]   2> 	at org.apache.solr.util.TestHarness.update(TestHarness.java:284)
   [junit4]   2> 	at org.apache.solr.util.BaseTestHarness.checkUpdateStatus(BaseTestHarness.java:281)
   [junit4]   2> 	at org.apache.solr.util.BaseTestHarness.validateErrorUpdate(BaseTestHarness.java:264)
   [junit4]   2> 	at org.apache.solr.SolrTestCaseJ4.checkUpdateU(SolrTestCaseJ4.java:851)
   [junit4]   2> 	at org.apache.solr.SolrTestCaseJ4.assertFailedU(SolrTestCaseJ4.java:839)
   [junit4]   2> 	at org.apache.solr.search.TestAddFieldRealTimeGet.test(TestAddFieldRealTimeGet.java:62)
   [junit4]   2> 	at java.base/jdk.internal.reflect.NativeMethodAccessorImpl.invoke0(Native
Method)
   [junit4]   2> 	at java.base/jdk.internal.reflect.NativeMethodAccessorImpl.invoke(NativeMethodAccessorImpl.java:62)
   [junit4]   2> 	at java.base/jdk.internal.reflect.DelegatingMethodAccessorImpl.invoke(DelegatingMethodAccessorImpl.java:43)
   [junit4]   2> 	at java.base/java.lang.reflect.Method.invoke(Method.java:564)
   [junit4]   2> 	at com.carrotsearch.randomizedtesting.RandomizedRunner.invoke(RandomizedRunner.java:1737)
   [junit4]   2> 	at com.carrotsearch.randomizedtesting.RandomizedRunner$8.evaluate(RandomizedRunner.java:934)
   [junit4]   2> 	at com.carrotsearch.randomizedtesting.RandomizedRunner$9.evaluate(RandomizedRunner.java:970)
   [junit4]   2> 	at com.carrotsearch.randomizedtesting.RandomizedRunner$10.evaluate(RandomizedRunner.java:984)
   [junit4]   2> 	at com.carrotsearch.randomizedtesting.rules.SystemPropertiesRestoreRule$1.evaluate(SystemPropertiesRestoreRule.java:57)
   [junit4]   2> 	at org.apache.lucene.util.TestRuleSetupTeardownChained$1.evaluate(TestRuleSetupTeardownChained.java:49)
   [junit4]   2> 	at org.apache.lucene.util.AbstractBeforeAfterRule$1.evaluate(AbstractBeforeAfterRule.java:45)
   [junit4]   2> 	at org.apache.lucene.util.TestRuleThreadAndTestName$1.evaluate(TestRuleThreadAndTestName.java:48)
   [junit4]   2> 	at org.apache.lucene.util.TestRuleIgnoreAfterMaxFailures$1.evaluate(TestRuleIgnoreAfterMaxFailures.java:64)
   [junit4]   2> 	at org.apache.lucene.util.TestRuleMarkFailure$1.evaluate(TestRuleMarkFailure.java:47)
   [junit4]   2> 	at com.carrotsearch.randomizedtesting.rules.StatementAdapter.evaluate(StatementAdapter.java:36)
   [junit4]   2> 	at com.carrotsearch.randomizedtesting.ThreadLeakControl$StatementRunner.run(ThreadLeakControl.java:368)
   [junit4]   2> 	at com.carrotsearch.randomizedtesting.ThreadLeakControl.forkTimeoutingTask(ThreadLeakControl.java:817)
   [junit4]   2> 	at com.carrotsearch.randomizedtesting.ThreadLeakControl$3.evaluate(ThreadLeakControl.java:468)
   [junit4]   2> 	at com.carrotsearch.randomizedtesting.RandomizedRunner.runSingleTest(RandomizedRunner.java:943)
   [junit4]   2> 	at com.carrotsearch.randomizedtesting.RandomizedRunner$5.evaluate(RandomizedRunner.java:829)
   [junit4]   2> 	at com.carrotsearch.randomizedtesting.RandomizedRunner$6.evaluate(RandomizedRunner.java:879)
   [junit4]   2> 	at com.carrotsearch.randomizedtesting.RandomizedRunner$7.evaluate(RandomizedRunner.java:890)
   [junit4]   2> 	at com.carrotsearch.randomizedtesting.rules.StatementAdapter.evaluate(StatementAdapter.java:36)
   [junit4]   2> 	at com.carrotsearch.randomizedtesting.rules.SystemPropertiesRestoreRule$1.evaluate(SystemPropertiesRestoreRule.java:57)
   [junit4]   2> 	at org.apache.lucene.util.AbstractBeforeAfterRule$1.evaluate(AbstractBeforeAfterRule.java:45)
   [junit4]   2> 	at com.carrotsearch.randomizedtesting.rules.StatementAdapter.evaluate(StatementAdapter.java:36)
   [junit4]   2> 	at org.apache.lucene.util.TestRuleStoreClassName$1.evaluate(TestRuleStoreClassName.java:41)
   [junit4]   2> 	at com.carrotsearch.randomizedtesting.rules.NoShadowingOrOverridesOnMethodsRule$1.evaluate(NoShadowingOrOverridesOnMethodsRule.java:40)
   [junit4]   2> 	at com.carrotsearch.randomizedtesting.rules.NoShadowingOrOverridesOnMethodsRule$1.evaluate(NoShadowingOrOverridesOnMethodsRule.java:40)
   [junit4]   2> 	at com.carrotsearch.randomizedtesting.rules.StatementAdapter.evaluate(StatementAdapter.java:36)
   [junit4]   2> 	at com.carrotsearch.randomizedtesting.rules.StatementAdapter.evaluate(StatementAdapter.java:36)
   [junit4]   2> 	at org.apache.lucene.util.TestRuleAssertionsRequired$1.evaluate(TestRuleAssertionsRequired.java:53)
   [junit4]   2> 	at org.apache.lucene.util.TestRuleMarkFailure$1.evaluate(TestRuleMarkFailure.java:47)
   [junit4]   2> 	at org.apache.lucene.util.TestRuleIgnoreAfterMaxFailures$1.evaluate(TestRuleIgnoreAfterMaxFailures.java:64)
   [junit4]   2> 	at org.apache.lucene.util.TestRuleIgnoreTestSuites$1.evaluate(TestRuleIgnoreTestSuites.java:54)
   [junit4]   2> 	at com.carrotsearch.randomizedtesting.rules.StatementAdapter.evaluate(StatementAdapter.java:36)
   [junit4]   2> 	at com.carrotsearch.randomizedtesting.ThreadLeakControl$StatementRunner.run(ThreadLeakControl.java:368)
   [junit4]   2> 	at java.base/java.lang.Thread.run(Thread.java:844)
   [junit4]   2> 
   [junit4]   2> 3520915 INFO  (TEST-TestAddFieldRealTimeGet.test-seed#[4A0C75951C87AC2B])
[    ] o.a.s.s.ManagedIndexSchema Upgraded to managed schema at C:\Users\jenkins\workspace\Lucene-Solr-7.2-Windows\solr\build\solr-core\test\J1\temp\solr.search.TestAddFieldRealTimeGet_4A0C75951C87AC2B-001\tempDir-001\collection1\conf\managed-schema
   [junit4]   2> 3520917 INFO  (TEST-TestAddFieldRealTimeGet.test-seed#[4A0C75951C87AC2B])
[    ] o.a.s.u.p.LogUpdateProcessorFactory [collection1]  webapp=null path=null params={}{add=[1
(1587252304134799360)]} 0 1
   [junit4]   2> 3520918 INFO  (TEST-TestAddFieldRealTimeGet.test-seed#[4A0C75951C87AC2B])
[    ] o.a.s.c.S.Request [collection1]  webapp=null path=null params={q=id:1&wt=xml} hits=0
status=0 QTime=0
   [junit4]   2> 3520918 INFO  (TEST-TestAddFieldRealTimeGet.test-seed#[4A0C75951C87AC2B])
[    ] o.a.s.c.S.Request [collection1]  webapp=null path=null params={qt=/get&fl=id,newfield&id=1&wt=xml}
status=0 QTime=0
   [junit4]   2> 3520918 INFO  (TEST-TestAddFieldRealTimeGet.test-seed#[4A0C75951C87AC2B])
[    ] o.a.s.c.S.Request [collection1]  webapp=null path=null params={qt=/get&fl=id,newfield&ids=1&wt=xml}
status=0 QTime=0
   [junit4]   2> 3520918 INFO  (TEST-TestAddFieldRealTimeGet.test-seed#[4A0C75951C87AC2B])
[    ] o.a.s.u.DirectUpdateHandler2 start commit{_version_=1587252304136896512,optimize=false,openSearcher=true,waitSearcher=true,expungeDeletes=false,softCommit=false,prepareCommit=false}
   [junit4]   2> 3520918 INFO  (TEST-TestAddFieldRealTimeGet.test-seed#[4A0C75951C87AC2B])
[    ] o.a.s.u.SolrIndexWriter Calling setCommitData with IW:org.apache.solr.update.SolrIndexWriter@7c3da684
commitCommandVersion:1587252304136896512
   [junit4]   2> 3520929 INFO  (TEST-TestAddFieldRealTimeGet.test-seed#[4A0C75951C87AC2B])
[    ] o.a.s.s.SolrIndexSearcher Opening [Searcher@231356a7[collection1] main]
   [junit4]   2> 3520930 INFO  (TEST-TestAddFieldRealTimeGet.test-seed#[4A0C75951C87AC2B])
[    ] o.a.s.u.DirectUpdateHandler2 end_commit_flush
   [junit4]   2> 3520931 INFO  (searcherExecutor-15742-thread-1) [    ] o.a.s.c.SolrCore
[collection1] Registered new searcher Searcher@231356a7[collection1] main{ExitableDirectoryReader(UninvertingDirectoryReader(Uninverting(_0(7.2.0):C1)))}
   [junit4]   2> 3520931 INFO  (TEST-TestAddFieldRealTimeGet.test-seed#[4A0C75951C87AC2B])
[    ] o.a.s.u.p.LogUpdateProcessorFactory [collection1]  webapp=null path=null params={}{commit=}
0 12
   [junit4]   2> 3520931 INFO  (TEST-TestAddFieldRealTimeGet.test-seed#[4A0C75951C87AC2B])
[    ] o.a.s.c.S.Request [collection1]  webapp=null path=null params={q=id:1&wt=xml} hits=1
status=0 QTime=0
   [junit4]   2> 3520932 INFO  (TEST-TestAddFieldRealTimeGet.test-seed#[4A0C75951C87AC2B])
[    ] o.a.s.c.S.Request [collection1]  webapp=null path=null params={qt=/get&fl=id,newfield&id=1&wt=xml}
status=0 QTime=0
   [junit4]   2> 3520932 INFO  (TEST-TestAddFieldRealTimeGet.test-seed#[4A0C75951C87AC2B])
[    ] o.a.s.c.S.Request [collection1]  webapp=null path=null params={qt=/get&fl=id,newfield&ids=1&wt=xml}
status=0 QTime=0
   [junit4]   2> 3520932 INFO  (TEST-TestAddFieldRealTimeGet.test-seed#[4A0C75951C87AC2B])
[    ] o.a.s.SolrTestCaseJ4 ###Ending test
   [junit4]   2> 3520933 INFO  (SUITE-TestAddFieldRealTimeGet-seed#[4A0C75951C87AC2B]-worker)
[    ] o.a.s.SolrTestCaseJ4 ###deleteCore
   [junit4]   2> 3520933 INFO  (SUITE-TestAddFieldRealTimeGet-seed#[4A0C75951C87AC2B]-worker)
[    ] o.a.s.c.CoreContainer Shutting down CoreContainer instance=962803600
   [junit4]   2> 3520933 INFO  (SUITE-TestAddFieldRealTimeGet-seed#[4A0C75951C87AC2B]-worker)
[    ] o.a.s.m.SolrMetricManager Closing metric reporters for registry=solr.node, tag=null
   [junit4]   2> 3520933 INFO  (SUITE-TestAddFieldRealTimeGet-seed#[4A0C75951C87AC2B]-worker)
[    ] o.a.s.m.r.SolrJmxReporter Closing reporter [org.apache.solr.metrics.reporters.SolrJmxReporter@6661da3a:
rootName = null, domain = solr.node, service url = null, agent id = null] for registry solr.node
/ com.codahale.metrics.MetricRegistry@209bb82c
   [junit4]   2> 3520936 INFO  (SUITE-TestAddFieldRealTimeGet-seed#[4A0C75951C87AC2B]-worker)
[    ] o.a.s.m.SolrMetricManager Closing metric reporters for registry=solr.jvm, tag=null
   [junit4]   2> 3520936 INFO  (SUITE-TestAddFieldRealTimeGet-seed#[4A0C75951C87AC2B]-worker)
[    ] o.a.s.m.r.SolrJmxReporter Closing reporter [org.apache.solr.metrics.reporters.SolrJmxReporter@532826d:
rootName = null, domain = solr.jvm, service url = null, agent id = null] for registry solr.jvm
/ com.codahale.metrics.MetricRegistry@b8e2a88
   [junit4]   2> 3520938 INFO  (SUITE-TestAddFieldRealTimeGet-seed#[4A0C75951C87AC2B]-worker)
[    ] o.a.s.m.SolrMetricManager Closing metric reporters for registry=solr.jetty, tag=null
   [junit4]   2> 3520938 INFO  (SUITE-TestAddFieldRealTimeGet-seed#[4A0C75951C87AC2B]-worker)
[    ] o.a.s.m.r.SolrJmxReporter Closing reporter [org.apache.solr.metrics.reporters.SolrJmxReporter@3525675e:
rootName = null, domain = solr.jetty, service url = null, agent id = null] for registry solr.jetty
/ com.codahale.metrics.MetricRegistry@2028e3b
   [junit4]   2> 3520939 INFO  (coreCloseExecutor-15747-thread-1) [    x:collection1] o.a.s.c.SolrCore
[collection1]  CLOSING SolrCore org.apache.solr.core.SolrCore@17ff91de
   [junit4]   2> 3520939 INFO  (coreCloseExecutor-15747-thread-1) [    x:collection1] o.a.s.m.SolrMetricManager
Closing metric reporters for registry=solr.core.collection1, tag=402624990
   [junit4]   2> 3520939 INFO  (coreCloseExecutor-15747-thread-1) [    x:collection1] o.a.s.m.r.SolrJmxReporter
Closing reporter [org.apache.solr.metrics.reporters.SolrJmxReporter@743efca9: rootName = null,
domain = solr.core.collection1, service url = null, agent id = null] for registry solr.core.collection1
/ com.codahale.metrics.MetricRegistry@69df566c
   [junit4]   2> 3520947 INFO  (SUITE-TestAddFieldRealTimeGet-seed#[4A0C75951C87AC2B]-worker)
[    ] o.a.s.SolrTestCaseJ4 ------------------------------------------------------- Done waiting
for tracked resources to be released
   [junit4]   2> NOTE: test params are: codec=CheapBastard, sim=RandomSimilarity(queryNorm=true):
{}, locale=fr-LU, timezone=Europe/Mariehamn
   [junit4]   2> NOTE: Windows 10 10.0 amd64/Oracle Corporation 9.0.1 (64-bit)/cpus=3,threads=1,free=227811744,total=518979584
   [junit4]   2> NOTE: All tests run in this JVM: [TestSolr4Spatial2, TestSkipOverseerOperations,
TestSort, TestSSLRandomization, TestStressReorder, ShardSplitTest, TestCopyFieldCollectionResource,
AutoAddReplicasPlanActionTest, TestHashPartitioner, OverseerRolesTest, PluginInfoTest, TestInfoStreamLogging,
TestSolrCloudWithHadoopAuthPlugin, ChaosMonkeyNothingIsSafeWithPullReplicasTest, HdfsSyncSliceTest,
TestLeaderElectionWithEmptyReplica, WrapperMergePolicyFactoryTest, TestStreamBody, SpellPossibilityIteratorTest,
ConcurrentDeleteAndCreateCollectionTest, SystemInfoHandlerTest, TestClusterProperties, TestManagedResource,
TestShortCircuitedRequests, MetricUtilsTest, LeaderElectionIntegrationTest, TestApiFramework,
TestRandomFlRTGCloud, TestQueryUtils, TestSlowCompositeReaderWrapper, PropertiesRequestHandlerTest,
DeleteLastCustomShardedReplicaTest, AnalysisErrorHandlingTest, TestElisionMultitermQuery,
TestLRUCache, OverseerTaskQueueTest, TestExclusionRuleCollectionAccess, TestDistribDocBasedVersion,
TestFastWriter, TestXmlQParser, TestAuthenticationFramework, SortSpecParsingTest, MergeStrategyTest,
LukeRequestHandlerTest, ChangedSchemaMergeTest, TestRestManager, TestBM25SimilarityFactory,
TermsComponentTest, TestRetrieveFieldsOptimizer, TestJsonFacetRefinement, CollectionsAPIDistributedZkTest,
DistributedQueryComponentCustomSortTest, TestJavabinTupleStreamParser, SolrCoreCheckLockOnStartupTest,
DOMUtilTest, ActionThrottleTest, HdfsRecoveryZkTest, CdcrBootstrapTest, DistribDocExpirationUpdateProcessorTest,
TestSolrIndexConfig, RestartWhileUpdatingTest, TestDynamicLoading, BasicDistributedZk2Test,
TestOverriddenPrefixQueryForCustomFieldType, TestLMJelinekMercerSimilarityFactory, AliasIntegrationTest,
DistributedFacetPivotSmallTest, TestNumericTerms32, DeleteStatusTest, CdcrVersionReplicationTest,
DebugComponentTest, PolyFieldTest, FullHLLTest, TestCSVLoader, TestSolrCloudWithKerberosAlt,
DeleteReplicaTest, SimpleMLTQParserTest, TestCrossCoreJoin, HdfsDirectoryTest, PreAnalyzedUpdateProcessorTest,
CachingDirectoryFactoryTest, ChaosMonkeySafeLeaderTest, TestDFISimilarityFactory, HighlighterMaxOffsetTest,
TestRequestForwarding, TestOnReconnectListenerSupport, TestRestoreCore, TestObjectReleaseTracker,
TestSchemaVersionResource, PeerSyncTest, DocumentBuilderTest, BlockJoinFacetDistribTest, TestPullReplica,
TestCollationField, TestNRTOpen, BadComponentTest, TestManagedSchema, TestLegacyField, CoreAdminHandlerTest,
TestSimpleQParserPlugin, PreAnalyzedFieldTest, SolrCoreTest, BigEndianAscendingWordDeserializerTest,
AtomicUpdatesTest, SoftAutoCommitTest, TestSQLHandlerNonCloud, NodeAddedTriggerTest, TestIndexSearcher,
BaseCdcrDistributedZkTest, AssignTest, PreAnalyzedFieldManagedSchemaCloudTest, TestExactSharedStatsCache,
InfixSuggestersTest, QueryElevationComponentTest, DocumentAnalysisRequestHandlerTest, ExitableDirectoryReaderTest,
EnumFieldTest, TestPayloadScoreQParserPlugin, AnalyticsMergeStrategyTest, ClassificationUpdateProcessorIntegrationTest,
AnalysisAfterCoreReloadTest, TestDocSet, JsonLoaderTest, UtilsToolTest, BlockJoinFacetSimpleTest,
DataDrivenBlockJoinTest, UUIDUpdateProcessorFallbackTest, TestCloudManagedSchema, SOLR749Test,
LeaderInitiatedRecoveryOnCommitTest, TestFastOutputStream, TestGroupingSearch, CoreSorterTest,
SpellingQueryConverterTest, TestFieldCacheWithThreads, UpdateLogTest, SegmentsInfoRequestHandlerTest,
TestFieldCacheSortRandom, TestGraphTermsQParserPlugin, TestSolrConfigHandlerConcurrent, HdfsNNFailoverTest,
CustomCollectionTest, TestJsonRequest, TestLeaderInitiatedRecoveryThread, TestDistributedStatsComponentCardinality,
LoggingHandlerTest, TestFoldingMultitermQuery, TestCoreBackup, SSLMigrationTest, TestMultiWordSynonyms,
TestLRUStatsCache, FileUtilsTest, TestCollectionsAPIViaSolrCloudCluster, TestLuceneMatchVersion,
TestRebalanceLeaders, ZkNodePropsTest, TestStressLiveNodes, TestMaxScoreQueryParser, IndexSchemaRuntimeFieldTest,
TestCoreContainer, ConjunctionSolrSpellCheckerTest, TestUniqueKeyFieldResource, AutoscalingHistoryHandlerTest,
ExternalFileFieldSortTest, TestSortByMinMaxFunction, StatelessScriptUpdateProcessorFactoryTest,
TestComplexPhraseQParserPlugin, OpenCloseCoreStressTest, TestDocTermOrds, TestMinMaxOnMultiValuedField,
TestFastLRUCache, CloneFieldUpdateProcessorFactoryTest, MultiThreadedOCPTest, RegexBytesRefFilterTest,
TestSuggestSpellingConverter, TestDistributedGrouping, BitVectorTest, UpdateRequestProcessorFactoryTest,
TestRawResponseWriter, TestEmbeddedSolrServerConstructors, TestAuthorizationFramework, ComputePlanActionTest,
TestCollationFieldDocValues, TestCloudInspectUtil, TestHttpShardHandlerFactory, SchemaVersionSpecificBehaviorTest,
SyncSliceTest, OverseerTest, ShardRoutingTest, BasicZkTest, FullSolrCloudDistribCmdsTest,
ClusterStateUpdateTest, TestRandomFaceting, LeaderElectionTest, ZkSolrClientTest, TestZkChroot,
TestRandomDVFaceting, ShardRoutingCustomTest, TestFaceting, DistributedSpellCheckComponentTest,
TermVectorComponentDistributedTest, TestJoin, TestReload, TestStressVersions, DistributedTermsComponentTest,
SimpleFacetsTest, TestSolr4Spatial, SolrCmdDistributorTest, ConvertedLegacyTest, TestFiltering,
TestFunctionQuery, BasicFunctionalityTest, TestLazyCores, TestBadConfig, ShowFileRequestHandlerTest,
SolrIndexSplitterTest, SimplePostToolTest, TestCoreDiscovery, SignatureUpdateProcessorFactoryTest,
TestExtendedDismaxParser, SpellCheckCollatorTest, DocValuesTest, SuggesterTest, TestStressLucene,
TestTrie, SpatialFilterTest, NoCacheHeaderTest, TestUpdate, FieldMutatingUpdateProcessorTest,
TestWordDelimiterFilterFactory, QueryEqualityTest, DefaultValueUpdateProcessorTest, TestRemoteStreaming,
DocValuesMultiTest, DistanceFunctionTest, TestSolrDeletionPolicy1, CacheHeaderTest, DirectSolrSpellCheckerTest,
TestQueryTypes, TestOmitPositions, FileBasedSpellCheckerTest, XmlUpdateRequestHandlerTest,
TestValueSourceCache, TermVectorComponentTest, TestIndexingPerformance, MoreLikeThisHandlerTest,
RequiredFieldsTest, FieldAnalysisRequestHandlerTest, TestSolrQueryParser, FastVectorHighlighterTest,
SolrPluginUtilsTest, TestCSVResponseWriter, MBeansHandlerTest, QueryParsingTest, TestAnalyzedSuggestions,
TestPartialUpdateDeduplication, TestPHPSerializedResponseWriter, PingRequestHandlerTest, TestComponentsName,
SearchHandlerTest, TestLFUCache, HighlighterConfigTest, UpdateParamsTest, AlternateDirectoryTest,
TestQuerySenderNoQuery, CopyFieldTest, ResponseLogComponentTest, SolrIndexConfigTest, TestMergePolicyConfig,
TestSolrDeletionPolicy2, SampleTest, TestSearchPerf, TestConfig, TestFuzzyAnalyzedSuggestions,
TestSolrCoreProperties, TestPostingsSolrHighlighter, TestPhraseSuggestions, TestCharFilters,
SynonymTokenizerTest, TestXIncludeConfig, EchoParamsTest, TestSweetSpotSimilarityFactory,
TestPerFieldSimilarity, TestIBSimilarityFactory, TimeZoneUtilsTest, ResourceLoaderTest, OpenExchangeRatesOrgProviderTest,
URLClassifyProcessorTest, TestSystemIdResolver, TestSolrJ, TestUtils, TestDocumentBuilder,
UUIDFieldTest, CircularListTest, DistributedMLTComponentTest, TestRTGBase, DistributedIntervalFacetingTest,
TestCursorMarkWithoutUniqueKey, TestDistributedMissingSort, TestSimpleTrackingShardHandler,
TestTolerantSearch, TestLuceneIndexBackCompat, TestEmbeddedSolrServerSchemaAPI, TestJettySolrRunner,
AddReplicaTest, AsyncCallRequestStatusResponseTest, ChaosMonkeySafeLeaderWithPullReplicasTest,
CloudExitableDirectoryReaderTest, CollectionStateFormat2Test, CollectionsAPIAsyncDistributedZkTest,
CollectionsAPISolrJTest, DistributedQueueTest, DocValuesNotIndexedTest, HttpPartitionTest,
LeaderInitiatedRecoveryOnShardRestartTest, LegacyCloudClusterPropTest, MigrateRouteKeyTest,
MoveReplicaHDFSFailoverTest, OutOfBoxZkACLAndCredentialsProvidersTest, OverriddenZkACLAndCredentialsProvidersTest,
OverseerModifyCollectionTest, RemoteQueryErrorTest, ReplaceNodeTest, RollingRestartTest, SharedFSAutoReplicaFailoverTest,
SimpleCollectionCreateDeleteTest, TestCloudDeleteByQuery, TestCloudJSONFacetJoinDomain, TestCloudPivotFacet,
TestCloudSearcherWarming, TestLeaderElectionZkExpiry, TestLockTree, TestMiniSolrCloudClusterSSL,
TestSolrCloudWithDelegationTokens, TestStressInPlaceUpdates, AutoScalingHandlerTest, HdfsAutoAddReplicasIntegrationTest,
NodeLostTriggerTest, SearchRateTriggerTest, TestPolicyCloud, CdcrReplicationDistributedZkTest,
CdcrReplicationHandlerTest, CdcrRequestHandlerTest, HdfsBasicDistributedZkTest, HdfsChaosMonkeyNothingIsSafeTest,
HdfsChaosMonkeySafeLeaderTest, HdfsCollectionsAPIDistributedZkTest, HdfsThreadLeakTest, HdfsTlogReplayBufferedWhileIndexingTest,
HdfsWriteToMultipleCollectionsTest, StressHdfsTest, TestClusterStateMutator, ZkStateWriterTest,
RuleEngineTest, BlobRepositoryCloudTest, ConfigureRecoveryStrategyTest, DirectoryFactoryTest,
HdfsDirectoryFactoryTest, QueryResultKeyTest, TestBackupRepositoryFactory, TestConfigOverlay,
TestConfigSetImmutable, TestConfigSetProperties, TestConfigSets, TestCorePropertiesReload,
TestImplicitCoreProperties, TestInitParams, TestShardHandlerFactory, TestSimpleTextCodec,
TestSolrConfigHandler, RequestLoggingTest, SearchHandlerTest, TestBlobHandler, TestSQLHandler,
V2ApiIntegrationTest, CoreAdminCreateDiscoverTest, CoreAdminRequestStatusTest, InfoHandlerTest,
MetricsHandlerTest, SecurityConfHandlerTest, StatsReloadRaceTest, TestConfigsApi, DistributedDebugComponentTest,
DistributedFacetPivotLargeTest, DistributedFacetPivotSmallAdvancedTest, DistributedFacetPivotWhiteBoxTest,
DistributedSuggestComponentTest, TestExpandComponent, TestPivotHelperCode, TestTrackingShardHandlerFactory,
SolrGraphiteReporterTest, SolrJmxReporterTest, SolrCloudReportersTest, TestIntervalFaceting,
TestChildDocTransformer, TestSubQueryTransformerDistrib, TestDynamicFieldCollectionResource,
TestFieldResource, TestFieldTypeResource, TestSerializedLuceneMatchVersion, BadCopyFieldTest,
DateRangeFieldTest, ManagedSchemaRoundRobinCloudTest, TestCloudSchemaless, TestSchemaManager,
TestUseDocValuesAsStored, TestUseDocValuesAsStored2, CursorMarkTest, TestAddFieldRealTimeGet]
   [junit4]   2> NOTE: reproduce with: ant test  -Dtestcase=TestAddFieldRealTimeGet -Dtests.seed=4A0C75951C87AC2B
-Dtests.slow=true -Dtests.locale=fr-LU -Dtests.timezone=Europe/Mariehamn -Dtests.asserts=true
-Dtests.file.encoding=Cp1252
   [junit4] ERROR   0.00s J1 | TestAddFieldRealTimeGet (suite) <<<
   [junit4]    > Throwable #1: java.io.IOException: Could not remove the following files
(in the order of attempts):
   [junit4]    >    C:\Users\jenkins\workspace\Lucene-Solr-7.2-Windows\solr\build\solr-core\test\J1\temp\solr.search.TestAddFieldRealTimeGet_4A0C75951C87AC2B-001\init-core-data-001\index:
java.nio.file.DirectoryNotEmptyException: C:\Users\jenkins\workspace\Lucene-Solr-7.2-Windows\solr\build\solr-core\test\J1\temp\solr.search.TestAddFieldRealTimeGet_4A0C75951C87AC2B-001\init-core-data-001\index
   [junit4]    >    C:\Users\jenkins\workspace\Lucene-Solr-7.2-Windows\solr\build\solr-core\test\J1\temp\solr.search.TestAddFieldRealTimeGet_4A0C75951C87AC2B-001\init-core-data-001:
java.nio.file.DirectoryNotEmptyException: C:\Users\jenkins\workspace\Lucene-Solr-7.2-Windows\solr\build\solr-core\test\J1\temp\solr.search.TestAddFieldRealTimeGet_4A0C75951C87AC2B-001\init-core-data-001
   [junit4]    > 	at __randomizedtesting.SeedInfo.seed([4A0C75951C87AC2B]:0)
   [junit4]    > 	at org.apache.lucene.util.IOUtils.rm(IOUtils.java:329)
   [junit4]    > 	at java.base/java.lang.Thread.run(Thread.java:844)
   [junit4] Completed [682/751 (1!)] on J1 in 0.24s, 1 test, 1 error <<< FAILURES!

[...truncated 40376 lines...]

Mime
View raw message