lucene-dev mailing list archives

Site index · List index
Message view « Date » · « Thread »
Top « Date » · « Thread »
From Policeman Jenkins Server <jenk...@thetaphi.de>
Subject [JENKINS] Lucene-Solr-master-Solaris (64bit/jdk1.8.0) - Build # 1584 - Still Unstable!
Date Mon, 25 Dec 2017 22:38:27 GMT
Build: https://jenkins.thetaphi.de/job/Lucene-Solr-master-Solaris/1584/
Java: 64bit/jdk1.8.0 -XX:+UseCompressedOops -XX:+UseSerialGC

1 tests failed.
FAILED:  org.apache.solr.cloud.MoveReplicaHDFSTest.testFailedMove

Error Message:
No live SolrServers available to handle this request:[http://127.0.0.1:49804/solr/MoveReplicaHDFSTest_failed_coll_true, http://127.0.0.1:53011/solr/MoveReplicaHDFSTest_failed_coll_true, http://127.0.0.1:52348/solr/MoveReplicaHDFSTest_failed_coll_true]

Stack Trace:
org.apache.solr.client.solrj.SolrServerException: No live SolrServers available to handle this request:[http://127.0.0.1:49804/solr/MoveReplicaHDFSTest_failed_coll_true, http://127.0.0.1:53011/solr/MoveReplicaHDFSTest_failed_coll_true, http://127.0.0.1:52348/solr/MoveReplicaHDFSTest_failed_coll_true]
	at __randomizedtesting.SeedInfo.seed([2AE73FA5E9EB708E:802AEC575E38A55E]:0)
	at org.apache.solr.client.solrj.impl.LBHttpSolrClient.request(LBHttpSolrClient.java:462)
	at org.apache.solr.client.solrj.impl.CloudSolrClient.sendRequest(CloudSolrClient.java:1104)
	at org.apache.solr.client.solrj.impl.CloudSolrClient.requestWithRetryOnStaleState(CloudSolrClient.java:884)
	at org.apache.solr.client.solrj.impl.CloudSolrClient.requestWithRetryOnStaleState(CloudSolrClient.java:991)
	at org.apache.solr.client.solrj.impl.CloudSolrClient.request(CloudSolrClient.java:817)
	at org.apache.solr.client.solrj.SolrRequest.process(SolrRequest.java:194)
	at org.apache.solr.client.solrj.SolrClient.query(SolrClient.java:942)
	at org.apache.solr.cloud.MoveReplicaTest.testFailedMove(MoveReplicaTest.java:309)
	at sun.reflect.NativeMethodAccessorImpl.invoke0(Native Method)
	at sun.reflect.NativeMethodAccessorImpl.invoke(NativeMethodAccessorImpl.java:62)
	at sun.reflect.DelegatingMethodAccessorImpl.invoke(DelegatingMethodAccessorImpl.java:43)
	at java.lang.reflect.Method.invoke(Method.java:498)
	at com.carrotsearch.randomizedtesting.RandomizedRunner.invoke(RandomizedRunner.java:1737)
	at com.carrotsearch.randomizedtesting.RandomizedRunner$8.evaluate(RandomizedRunner.java:934)
	at com.carrotsearch.randomizedtesting.RandomizedRunner$9.evaluate(RandomizedRunner.java:970)
	at com.carrotsearch.randomizedtesting.RandomizedRunner$10.evaluate(RandomizedRunner.java:984)
	at com.carrotsearch.randomizedtesting.rules.SystemPropertiesRestoreRule$1.evaluate(SystemPropertiesRestoreRule.java:57)
	at org.apache.lucene.util.TestRuleSetupTeardownChained$1.evaluate(TestRuleSetupTeardownChained.java:49)
	at org.apache.lucene.util.AbstractBeforeAfterRule$1.evaluate(AbstractBeforeAfterRule.java:45)
	at org.apache.lucene.util.TestRuleThreadAndTestName$1.evaluate(TestRuleThreadAndTestName.java:48)
	at org.apache.lucene.util.TestRuleIgnoreAfterMaxFailures$1.evaluate(TestRuleIgnoreAfterMaxFailures.java:64)
	at org.apache.lucene.util.TestRuleMarkFailure$1.evaluate(TestRuleMarkFailure.java:47)
	at com.carrotsearch.randomizedtesting.rules.StatementAdapter.evaluate(StatementAdapter.java:36)
	at com.carrotsearch.randomizedtesting.ThreadLeakControl$StatementRunner.run(ThreadLeakControl.java:368)
	at com.carrotsearch.randomizedtesting.ThreadLeakControl.forkTimeoutingTask(ThreadLeakControl.java:817)
	at com.carrotsearch.randomizedtesting.ThreadLeakControl$3.evaluate(ThreadLeakControl.java:468)
	at com.carrotsearch.randomizedtesting.RandomizedRunner.runSingleTest(RandomizedRunner.java:943)
	at com.carrotsearch.randomizedtesting.RandomizedRunner$5.evaluate(RandomizedRunner.java:829)
	at com.carrotsearch.randomizedtesting.RandomizedRunner$6.evaluate(RandomizedRunner.java:879)
	at com.carrotsearch.randomizedtesting.RandomizedRunner$7.evaluate(RandomizedRunner.java:890)
	at com.carrotsearch.randomizedtesting.rules.StatementAdapter.evaluate(StatementAdapter.java:36)
	at com.carrotsearch.randomizedtesting.rules.SystemPropertiesRestoreRule$1.evaluate(SystemPropertiesRestoreRule.java:57)
	at org.apache.lucene.util.AbstractBeforeAfterRule$1.evaluate(AbstractBeforeAfterRule.java:45)
	at com.carrotsearch.randomizedtesting.rules.StatementAdapter.evaluate(StatementAdapter.java:36)
	at org.apache.lucene.util.TestRuleStoreClassName$1.evaluate(TestRuleStoreClassName.java:41)
	at com.carrotsearch.randomizedtesting.rules.NoShadowingOrOverridesOnMethodsRule$1.evaluate(NoShadowingOrOverridesOnMethodsRule.java:40)
	at com.carrotsearch.randomizedtesting.rules.NoShadowingOrOverridesOnMethodsRule$1.evaluate(NoShadowingOrOverridesOnMethodsRule.java:40)
	at com.carrotsearch.randomizedtesting.rules.StatementAdapter.evaluate(StatementAdapter.java:36)
	at com.carrotsearch.randomizedtesting.rules.StatementAdapter.evaluate(StatementAdapter.java:36)
	at com.carrotsearch.randomizedtesting.rules.StatementAdapter.evaluate(StatementAdapter.java:36)
	at org.apache.lucene.util.TestRuleAssertionsRequired$1.evaluate(TestRuleAssertionsRequired.java:53)
	at org.apache.lucene.util.TestRuleMarkFailure$1.evaluate(TestRuleMarkFailure.java:47)
	at org.apache.lucene.util.TestRuleIgnoreAfterMaxFailures$1.evaluate(TestRuleIgnoreAfterMaxFailures.java:64)
	at org.apache.lucene.util.TestRuleIgnoreTestSuites$1.evaluate(TestRuleIgnoreTestSuites.java:54)
	at com.carrotsearch.randomizedtesting.rules.StatementAdapter.evaluate(StatementAdapter.java:36)
	at com.carrotsearch.randomizedtesting.ThreadLeakControl$StatementRunner.run(ThreadLeakControl.java:368)
	at java.lang.Thread.run(Thread.java:748)
Caused by: org.apache.solr.client.solrj.impl.HttpSolrClient$RemoteSolrException: Error from server at http://127.0.0.1:53011/solr/MoveReplicaHDFSTest_failed_coll_true: no servers hosting shard: shard1
	at org.apache.solr.client.solrj.impl.HttpSolrClient.executeMethod(HttpSolrClient.java:643)
	at org.apache.solr.client.solrj.impl.HttpSolrClient.request(HttpSolrClient.java:255)
	at org.apache.solr.client.solrj.impl.HttpSolrClient.request(HttpSolrClient.java:244)
	at org.apache.solr.client.solrj.impl.LBHttpSolrClient.doRequest(LBHttpSolrClient.java:483)
	at org.apache.solr.client.solrj.impl.LBHttpSolrClient.request(LBHttpSolrClient.java:413)
	... 46 more




Build Log:
[...truncated 12363 lines...]
   [junit4] Suite: org.apache.solr.cloud.MoveReplicaHDFSTest
   [junit4]   2> 1413066 INFO  (SUITE-MoveReplicaHDFSTest-seed#[2AE73FA5E9EB708E]-worker) [    ] o.a.s.SolrTestCaseJ4 SecureRandom sanity checks: test.solr.allowed.securerandom=null & java.security.egd=file:/dev/./urandom
   [junit4]   2> Creating dataDir: /export/home/jenkins/workspace/Lucene-Solr-master-Solaris/solr/build/solr-core/test/J0/temp/solr.cloud.MoveReplicaHDFSTest_2AE73FA5E9EB708E-001/init-core-data-001
   [junit4]   2> 1413066 WARN  (SUITE-MoveReplicaHDFSTest-seed#[2AE73FA5E9EB708E]-worker) [    ] o.a.s.SolrTestCaseJ4 startTrackingSearchers: numOpens=12 numCloses=12
   [junit4]   2> 1413066 INFO  (SUITE-MoveReplicaHDFSTest-seed#[2AE73FA5E9EB708E]-worker) [    ] o.a.s.SolrTestCaseJ4 Using TrieFields (NUMERIC_POINTS_SYSPROP=false) w/NUMERIC_DOCVALUES_SYSPROP=false
   [junit4]   2> 1413067 INFO  (SUITE-MoveReplicaHDFSTest-seed#[2AE73FA5E9EB708E]-worker) [    ] o.a.s.SolrTestCaseJ4 Randomized ssl (false) and clientAuth (false) via: @org.apache.solr.util.RandomizeSSL(reason=, value=NaN, ssl=NaN, clientAuth=NaN)
   [junit4]   2> 1413068 INFO  (SUITE-MoveReplicaHDFSTest-seed#[2AE73FA5E9EB708E]-worker) [    ] o.a.s.c.MiniSolrCloudCluster Starting cluster of 4 servers in /export/home/jenkins/workspace/Lucene-Solr-master-Solaris/solr/build/solr-core/test/J0/temp/solr.cloud.MoveReplicaHDFSTest_2AE73FA5E9EB708E-001/tempDir-001
   [junit4]   2> 1413068 INFO  (SUITE-MoveReplicaHDFSTest-seed#[2AE73FA5E9EB708E]-worker) [    ] o.a.s.c.ZkTestServer STARTING ZK TEST SERVER
   [junit4]   2> 1413068 INFO  (Thread-1903) [    ] o.a.s.c.ZkTestServer client port:0.0.0.0/0.0.0.0:0
   [junit4]   2> 1413068 INFO  (Thread-1903) [    ] o.a.s.c.ZkTestServer Starting server
   [junit4]   2> 1413070 ERROR (Thread-1903) [    ] o.a.z.s.ZooKeeperServer ZKShutdownHandler is not registered, so ZooKeeper server won't take any action on ERROR or SHUTDOWN server state changes
   [junit4]   2> 1413173 INFO  (SUITE-MoveReplicaHDFSTest-seed#[2AE73FA5E9EB708E]-worker) [    ] o.a.s.c.ZkTestServer start zk server on port:61702
   [junit4]   2> 1413176 INFO  (zkConnectionManagerCallback-2619-thread-1) [    ] o.a.s.c.c.ConnectionManager zkClient has connected
   [junit4]   2> 1413180 INFO  (jetty-launcher-2616-thread-1) [    ] o.e.j.s.Server jetty-9.3.20.v20170531
   [junit4]   2> 1413180 INFO  (jetty-launcher-2616-thread-2) [    ] o.e.j.s.Server jetty-9.3.20.v20170531
   [junit4]   2> 1413180 INFO  (jetty-launcher-2616-thread-3) [    ] o.e.j.s.Server jetty-9.3.20.v20170531
   [junit4]   2> 1413181 INFO  (jetty-launcher-2616-thread-4) [    ] o.e.j.s.Server jetty-9.3.20.v20170531
   [junit4]   2> 1413185 INFO  (jetty-launcher-2616-thread-1) [    ] o.e.j.s.h.ContextHandler Started o.e.j.s.ServletContextHandler@4f1e8d58{/solr,null,AVAILABLE}
   [junit4]   2> 1413185 INFO  (jetty-launcher-2616-thread-4) [    ] o.e.j.s.h.ContextHandler Started o.e.j.s.ServletContextHandler@153e5d40{/solr,null,AVAILABLE}
   [junit4]   2> 1413185 INFO  (jetty-launcher-2616-thread-2) [    ] o.e.j.s.h.ContextHandler Started o.e.j.s.ServletContextHandler@6781cadf{/solr,null,AVAILABLE}
   [junit4]   2> 1413185 INFO  (jetty-launcher-2616-thread-1) [    ] o.e.j.s.AbstractConnector Started ServerConnector@6af0a64c{HTTP/1.1,[http/1.1]}{127.0.0.1:48251}
   [junit4]   2> 1413185 INFO  (jetty-launcher-2616-thread-1) [    ] o.e.j.s.Server Started @1416193ms
   [junit4]   2> 1413185 INFO  (jetty-launcher-2616-thread-4) [    ] o.e.j.s.AbstractConnector Started ServerConnector@1f34aae{HTTP/1.1,[http/1.1]}{127.0.0.1:52348}
   [junit4]   2> 1413185 INFO  (jetty-launcher-2616-thread-1) [    ] o.a.s.c.s.e.JettySolrRunner Jetty properties: {hostContext=/solr, hostPort=48251}
   [junit4]   2> 1413185 INFO  (jetty-launcher-2616-thread-4) [    ] o.e.j.s.Server Started @1416193ms
   [junit4]   2> 1413185 INFO  (jetty-launcher-2616-thread-4) [    ] o.a.s.c.s.e.JettySolrRunner Jetty properties: {hostContext=/solr, hostPort=52348}
   [junit4]   2> 1413185 ERROR (jetty-launcher-2616-thread-1) [    ] o.a.s.u.StartupLoggingUtils Missing Java Option solr.log.dir. Logging may be missing or incomplete.
   [junit4]   2> 1413185 ERROR (jetty-launcher-2616-thread-4) [    ] o.a.s.u.StartupLoggingUtils Missing Java Option solr.log.dir. Logging may be missing or incomplete.
   [junit4]   2> 1413185 INFO  (jetty-launcher-2616-thread-1) [    ] o.a.s.s.SolrDispatchFilter  ___      _       Welcome to Apache Solr™ version 8.0.0
   [junit4]   2> 1413185 INFO  (jetty-launcher-2616-thread-4) [    ] o.a.s.s.SolrDispatchFilter  ___      _       Welcome to Apache Solr™ version 8.0.0
   [junit4]   2> 1413185 INFO  (jetty-launcher-2616-thread-1) [    ] o.a.s.s.SolrDispatchFilter / __| ___| |_ _   Starting in cloud mode on port null
   [junit4]   2> 1413185 INFO  (jetty-launcher-2616-thread-4) [    ] o.a.s.s.SolrDispatchFilter / __| ___| |_ _   Starting in cloud mode on port null
   [junit4]   2> 1413186 INFO  (jetty-launcher-2616-thread-1) [    ] o.a.s.s.SolrDispatchFilter \__ \/ _ \ | '_|  Install dir: null
   [junit4]   2> 1413186 INFO  (jetty-launcher-2616-thread-4) [    ] o.a.s.s.SolrDispatchFilter \__ \/ _ \ | '_|  Install dir: null
   [junit4]   2> 1413186 INFO  (jetty-launcher-2616-thread-1) [    ] o.a.s.s.SolrDispatchFilter |___/\___/_|_|    Start time: 2017-12-25T21:25:31.537Z
   [junit4]   2> 1413186 INFO  (jetty-launcher-2616-thread-4) [    ] o.a.s.s.SolrDispatchFilter |___/\___/_|_|    Start time: 2017-12-25T21:25:31.537Z
   [junit4]   2> 1413185 INFO  (jetty-launcher-2616-thread-2) [    ] o.e.j.s.AbstractConnector Started ServerConnector@512095ee{HTTP/1.1,[http/1.1]}{127.0.0.1:53011}
   [junit4]   2> 1413186 INFO  (jetty-launcher-2616-thread-2) [    ] o.e.j.s.Server Started @1416194ms
   [junit4]   2> 1413186 INFO  (jetty-launcher-2616-thread-2) [    ] o.a.s.c.s.e.JettySolrRunner Jetty properties: {hostContext=/solr, hostPort=53011}
   [junit4]   2> 1413186 ERROR (jetty-launcher-2616-thread-2) [    ] o.a.s.u.StartupLoggingUtils Missing Java Option solr.log.dir. Logging may be missing or incomplete.
   [junit4]   2> 1413186 INFO  (jetty-launcher-2616-thread-2) [    ] o.a.s.s.SolrDispatchFilter  ___      _       Welcome to Apache Solr™ version 8.0.0
   [junit4]   2> 1413186 INFO  (jetty-launcher-2616-thread-2) [    ] o.a.s.s.SolrDispatchFilter / __| ___| |_ _   Starting in cloud mode on port null
   [junit4]   2> 1413186 INFO  (jetty-launcher-2616-thread-2) [    ] o.a.s.s.SolrDispatchFilter \__ \/ _ \ | '_|  Install dir: null
   [junit4]   2> 1413186 INFO  (jetty-launcher-2616-thread-2) [    ] o.a.s.s.SolrDispatchFilter |___/\___/_|_|    Start time: 2017-12-25T21:25:31.537Z
   [junit4]   2> 1413187 INFO  (jetty-launcher-2616-thread-3) [    ] o.e.j.s.h.ContextHandler Started o.e.j.s.ServletContextHandler@13619a0b{/solr,null,AVAILABLE}
   [junit4]   2> 1413188 INFO  (jetty-launcher-2616-thread-3) [    ] o.e.j.s.AbstractConnector Started ServerConnector@65fbc480{HTTP/1.1,[http/1.1]}{127.0.0.1:49804}
   [junit4]   2> 1413188 INFO  (jetty-launcher-2616-thread-3) [    ] o.e.j.s.Server Started @1416196ms
   [junit4]   2> 1413188 INFO  (jetty-launcher-2616-thread-3) [    ] o.a.s.c.s.e.JettySolrRunner Jetty properties: {hostContext=/solr, hostPort=49804}
   [junit4]   2> 1413188 ERROR (jetty-launcher-2616-thread-3) [    ] o.a.s.u.StartupLoggingUtils Missing Java Option solr.log.dir. Logging may be missing or incomplete.
   [junit4]   2> 1413189 INFO  (jetty-launcher-2616-thread-3) [    ] o.a.s.s.SolrDispatchFilter  ___      _       Welcome to Apache Solr™ version 8.0.0
   [junit4]   2> 1413189 INFO  (zkConnectionManagerCallback-2623-thread-1) [    ] o.a.s.c.c.ConnectionManager zkClient has connected
   [junit4]   2> 1413189 INFO  (jetty-launcher-2616-thread-3) [    ] o.a.s.s.SolrDispatchFilter / __| ___| |_ _   Starting in cloud mode on port null
   [junit4]   2> 1413189 INFO  (jetty-launcher-2616-thread-3) [    ] o.a.s.s.SolrDispatchFilter \__ \/ _ \ | '_|  Install dir: null
   [junit4]   2> 1413189 INFO  (jetty-launcher-2616-thread-3) [    ] o.a.s.s.SolrDispatchFilter |___/\___/_|_|    Start time: 2017-12-25T21:25:31.540Z
   [junit4]   2> 1413190 INFO  (zkConnectionManagerCallback-2625-thread-1) [    ] o.a.s.c.c.ConnectionManager zkClient has connected
   [junit4]   2> 1413190 INFO  (jetty-launcher-2616-thread-4) [    ] o.a.s.s.SolrDispatchFilter solr.xml found in ZooKeeper. Loading...
   [junit4]   2> 1413191 INFO  (zkConnectionManagerCallback-2622-thread-1) [    ] o.a.s.c.c.ConnectionManager zkClient has connected
   [junit4]   2> 1413191 INFO  (jetty-launcher-2616-thread-2) [    ] o.a.s.s.SolrDispatchFilter solr.xml found in ZooKeeper. Loading...
   [junit4]   2> 1413192 INFO  (zkConnectionManagerCallback-2627-thread-1) [    ] o.a.s.c.c.ConnectionManager zkClient has connected
   [junit4]   2> 1413193 INFO  (jetty-launcher-2616-thread-3) [    ] o.a.s.s.SolrDispatchFilter solr.xml found in ZooKeeper. Loading...
   [junit4]   2> 1413193 INFO  (jetty-launcher-2616-thread-1) [    ] o.a.s.s.SolrDispatchFilter solr.xml found in ZooKeeper. Loading...
   [junit4]   2> 1413202 INFO  (jetty-launcher-2616-thread-2) [    ] o.a.s.c.ZkContainer Zookeeper client=127.0.0.1:61702/solr
   [junit4]   2> 1413202 INFO  (jetty-launcher-2616-thread-3) [    ] o.a.s.c.ZkContainer Zookeeper client=127.0.0.1:61702/solr
   [junit4]   2> 1413205 INFO  (zkConnectionManagerCallback-2635-thread-1) [    ] o.a.s.c.c.ConnectionManager zkClient has connected
   [junit4]   2> 1413205 INFO  (zkConnectionManagerCallback-2633-thread-1) [    ] o.a.s.c.c.ConnectionManager zkClient has connected
   [junit4]   2> 1413207 DEBUG (jetty-launcher-2616-thread-3) [n:127.0.0.1:49804_solr    ] o.a.s.c.ZkController Added new OnReconnect listener org.apache.solr.cloud.ZkController$$Lambda$114/100060969@9e1c2cb
   [junit4]   2> 1413207 WARN  (NIOServerCxn.Factory:0.0.0.0/0.0.0.0:0) [    ] o.a.z.s.NIOServerCnxn caught end of stream exception
   [junit4]   2> EndOfStreamException: Unable to read additional data from client sessionid 0x1608f90fa9c0005, likely client has closed socket
   [junit4]   2> 	at org.apache.zookeeper.server.NIOServerCnxn.doIO(NIOServerCnxn.java:239)
   [junit4]   2> 	at org.apache.zookeeper.server.NIOServerCnxnFactory.run(NIOServerCnxnFactory.java:203)
   [junit4]   2> 	at java.lang.Thread.run(Thread.java:748)
   [junit4]   2> 1413208 INFO  (jetty-launcher-2616-thread-1) [    ] o.a.s.c.ZkContainer Zookeeper client=127.0.0.1:61702/solr
   [junit4]   2> 1413208 DEBUG (jetty-launcher-2616-thread-2) [n:127.0.0.1:53011_solr    ] o.a.s.c.ZkController Added new OnReconnect listener org.apache.solr.cloud.ZkController$$Lambda$114/100060969@459324e3
   [junit4]   2> 1413210 INFO  (zkConnectionManagerCallback-2641-thread-1) [    ] o.a.s.c.c.ConnectionManager zkClient has connected
   [junit4]   2> 1413210 INFO  (zkConnectionManagerCallback-2643-thread-1-processing-n:127.0.0.1:53011_solr) [n:127.0.0.1:53011_solr    ] o.a.s.c.c.ConnectionManager zkClient has connected
   [junit4]   2> 1413212 DEBUG (jetty-launcher-2616-thread-1) [n:127.0.0.1:48251_solr    ] o.a.s.c.ZkController Added new OnReconnect listener org.apache.solr.cloud.ZkController$$Lambda$114/100060969@40d4294b
   [junit4]   2> 1413213 WARN  (NIOServerCxn.Factory:0.0.0.0/0.0.0.0:0) [    ] o.a.z.s.NIOServerCnxn caught end of stream exception
   [junit4]   2> EndOfStreamException: Unable to read additional data from client sessionid 0x1608f90fa9c0008, likely client has closed socket
   [junit4]   2> 	at org.apache.zookeeper.server.NIOServerCnxn.doIO(NIOServerCnxn.java:239)
   [junit4]   2> 	at org.apache.zookeeper.server.NIOServerCnxnFactory.run(NIOServerCnxnFactory.java:203)
   [junit4]   2> 	at java.lang.Thread.run(Thread.java:748)
   [junit4]   2> 1413213 INFO  (jetty-launcher-2616-thread-4) [    ] o.a.s.c.ZkContainer Zookeeper client=127.0.0.1:61702/solr
   [junit4]   2> 1413214 INFO  (zkConnectionManagerCallback-2637-thread-1-processing-n:127.0.0.1:49804_solr) [n:127.0.0.1:49804_solr    ] o.a.s.c.c.ConnectionManager zkClient has connected
   [junit4]   2> 1413215 INFO  (zkConnectionManagerCallback-2646-thread-1-processing-n:127.0.0.1:48251_solr) [n:127.0.0.1:48251_solr    ] o.a.s.c.c.ConnectionManager zkClient has connected
   [junit4]   2> 1413217 INFO  (zkConnectionManagerCallback-2649-thread-1) [    ] o.a.s.c.c.ConnectionManager zkClient has connected
   [junit4]   2> 1413219 DEBUG (jetty-launcher-2616-thread-4) [n:127.0.0.1:52348_solr    ] o.a.s.c.ZkController Added new OnReconnect listener org.apache.solr.cloud.ZkController$$Lambda$114/100060969@9aefe77
   [junit4]   2> 1413223 INFO  (zkConnectionManagerCallback-2651-thread-1-processing-n:127.0.0.1:52348_solr) [n:127.0.0.1:52348_solr    ] o.a.s.c.c.ConnectionManager zkClient has connected
   [junit4]   2> 1413379 DEBUG (SyncThread:0) [    ] o.a.s.c.ZkTestServer Watch added: create/delete: /solr/clusterprops.json
   [junit4]   2> 1413379 DEBUG (SyncThread:0) [    ] o.a.s.c.ZkTestServer Watch added: children: /solr/live_nodes
   [junit4]   2> 1413379 DEBUG (SyncThread:0) [    ] o.a.s.c.ZkTestServer Watch added: data: /solr/clusterstate.json
   [junit4]   2> 1413380 DEBUG (SyncThread:0) [    ] o.a.s.c.ZkTestServer Watch added: children: /solr/collections
   [junit4]   2> 1413380 DEBUG (SyncThread:0) [    ] o.a.s.c.ZkTestServer Watch added: create/delete: /solr/aliases.json
   [junit4]   2> 1413381 DEBUG (SyncThread:0) [    ] o.a.s.c.ZkTestServer Watch added: create/delete: /solr/security.json
   [junit4]   2> 1413387 INFO  (jetty-launcher-2616-thread-1) [n:127.0.0.1:48251_solr    ] o.a.s.c.Overseer Overseer (id=null) closing
   [junit4]   2> 1413387 DEBUG (jetty-launcher-2616-thread-1) [n:127.0.0.1:48251_solr    ] o.a.s.c.LeaderElector Joined leadership election with path: /overseer_elect/election/99237044644741130-127.0.0.1:48251_solr-n_0000000000
   [junit4]   2> 1413388 INFO  (jetty-launcher-2616-thread-1) [n:127.0.0.1:48251_solr    ] o.a.s.c.OverseerElectionContext I am going to be the leader 127.0.0.1:48251_solr
   [junit4]   2> 1413389 INFO  (jetty-launcher-2616-thread-1) [n:127.0.0.1:48251_solr    ] o.a.s.c.Overseer Overseer (id=99237044644741130-127.0.0.1:48251_solr-n_0000000000) starting
   [junit4]   2> 1413392 DEBUG (SyncThread:0) [    ] o.a.s.c.ZkTestServer Watch added: create/delete: /solr/clusterprops.json
   [junit4]   2> 1413392 DEBUG (SyncThread:0) [    ] o.a.s.c.ZkTestServer Watch added: children: /solr/live_nodes
   [junit4]   2> 1413393 DEBUG (SyncThread:0) [    ] o.a.s.c.ZkTestServer Watch added: data: /solr/clusterstate.json
   [junit4]   2> 1413394 DEBUG (SyncThread:0) [    ] o.a.s.c.ZkTestServer Watch added: children: /solr/collections
   [junit4]   2> 1413394 DEBUG (SyncThread:0) [    ] o.a.s.c.ZkTestServer Watch added: create/delete: /solr/aliases.json
   [junit4]   2> 1413395 DEBUG (SyncThread:0) [    ] o.a.s.c.ZkTestServer Watch added: create/delete: /solr/security.json
   [junit4]   2> 1413399 INFO  (jetty-launcher-2616-thread-3) [n:127.0.0.1:49804_solr    ] o.a.s.c.Overseer Overseer (id=null) closing
   [junit4]   2> 1413399 DEBUG (jetty-launcher-2616-thread-3) [n:127.0.0.1:49804_solr    ] o.a.s.c.LeaderElector Joined leadership election with path: /overseer_elect/election/99237044644741127-127.0.0.1:49804_solr-n_0000000001
   [junit4]   2> 1413401 DEBUG (SyncThread:0) [    ] o.a.s.c.ZkTestServer Watch added: data: /solr/overseer_elect/election/99237044644741130-127.0.0.1:48251_solr-n_0000000000
   [junit4]   2> 1413401 DEBUG (jetty-launcher-2616-thread-3) [n:127.0.0.1:49804_solr    ] o.a.s.c.LeaderElector Watching path /overseer_elect/election/99237044644741130-127.0.0.1:48251_solr-n_0000000000 to know if I could be the leader
   [junit4]   2> 1413401 DEBUG (OverseerCollectionConfigSetProcessor-99237044644741130-127.0.0.1:48251_solr-n_0000000000) [n:127.0.0.1:48251_solr    ] o.a.s.c.OverseerTaskProcessor Process current queue of overseer operations
   [junit4]   2> 1413402 INFO  (jetty-launcher-2616-thread-1) [n:127.0.0.1:48251_solr    ] o.a.s.c.ZkController Register node as live in ZooKeeper:/live_nodes/127.0.0.1:48251_solr
   [junit4]   2> 1413402 INFO  (jetty-launcher-2616-thread-3) [n:127.0.0.1:49804_solr    ] o.a.s.c.ZkController Register node as live in ZooKeeper:/live_nodes/127.0.0.1:49804_solr
   [junit4]   2> 1413402 DEBUG (OverseerStateUpdate-99237044644741130-127.0.0.1:48251_solr-n_0000000000) [n:127.0.0.1:48251_solr    ] o.a.s.c.Overseer Starting to work on the main queue
   [junit4]   2> 1413402 DEBUG (OverseerAutoScalingTriggerThread-99237044644741130-127.0.0.1:48251_solr-n_0000000000) [n:127.0.0.1:48251_solr    ] o.a.s.c.a.OverseerTriggerThread Adding .autoAddReplicas trigger
   [junit4]   2> 1413402 DEBUG (SyncThread:0) [    ] o.a.s.c.ZkTestServer Watch fired: children: /solr/live_nodes
   [junit4]   2> 1413403 DEBUG (SyncThread:0) [    ] o.a.s.c.ZkTestServer Watch fired: children: /solr/live_nodes
   [junit4]   2> 1413404 DEBUG (SyncThread:0) [    ] o.a.s.c.ZkTestServer Watch added: children: /solr/live_nodes
   [junit4]   2> 1413405 INFO  (zkCallback-2636-thread-1-processing-n:127.0.0.1:49804_solr) [n:127.0.0.1:49804_solr    ] o.a.s.c.c.ZkStateReader Updated live nodes from ZooKeeper... (0) -> (1)
   [junit4]   2> 1413406 DEBUG (SyncThread:0) [    ] o.a.s.c.ZkTestServer Watch added: children: /solr/live_nodes
   [junit4]   2> 1413406 DEBUG (SyncThread:0) [    ] o.a.s.c.ZkTestServer Watch fired: children: /solr/live_nodes
   [junit4]   2> 1413406 DEBUG (SyncThread:0) [    ] o.a.s.c.ZkTestServer Watch fired: children: /solr/live_nodes
   [junit4]   2> 1413413 DEBUG (SyncThread:0) [    ] o.a.s.c.ZkTestServer Watch added: data: /solr/autoscaling.json
   [junit4]   2> 1413413 DEBUG (OverseerAutoScalingTriggerThread-99237044644741130-127.0.0.1:48251_solr-n_0000000000) [n:127.0.0.1:48251_solr    ] o.a.s.c.a.OverseerTriggerThread Refreshing /autoscaling.json with znode version 1
   [junit4]   2> 1413413 DEBUG (SyncThread:0) [    ] o.a.s.c.ZkTestServer Watch added: children: /solr/live_nodes
   [junit4]   2> 1413414 DEBUG (OverseerAutoScalingTriggerThread-99237044644741130-127.0.0.1:48251_solr-n_0000000000) [n:127.0.0.1:48251_solr    ] o.a.s.c.a.NodeLostTrigger Initial livenodes: []
   [junit4]   2> 1413414 DEBUG (OverseerAutoScalingTriggerThread-99237044644741130-127.0.0.1:48251_solr-n_0000000000) [n:127.0.0.1:48251_solr    ] o.a.s.c.a.OverseerTriggerThread Current znodeVersion 1, lastZnodeVersion -1
   [junit4]   2> 1413414 DEBUG (OverseerAutoScalingTriggerThread-99237044644741130-127.0.0.1:48251_solr-n_0000000000) [n:127.0.0.1:48251_solr    ] o.a.s.c.a.OverseerTriggerThread Processed trigger updates upto znodeVersion 1
   [junit4]   2> 1413414 DEBUG (SyncThread:0) [    ] o.a.s.c.ZkTestServer Watch added: create/delete: /solr/clusterprops.json
   [junit4]   2> 1413415 INFO  (OverseerStateUpdate-99237044644741130-127.0.0.1:48251_solr-n_0000000000) [n:127.0.0.1:48251_solr    ] o.a.s.c.c.ZkStateReader Updated live nodes from ZooKeeper... (0) -> (2)
   [junit4]   2> 1413415 DEBUG (OverseerCollectionConfigSetProcessor-99237044644741130-127.0.0.1:48251_solr-n_0000000000) [n:127.0.0.1:48251_solr    ] o.a.s.c.OverseerTaskProcessor Cleaning up work-queue. #Running tasks: 0
   [junit4]   2> 1413415 DEBUG (SyncThread:0) [    ] o.a.s.c.ZkTestServer Watch added: children: /solr/live_nodes
   [junit4]   2> 1413415 DEBUG (OverseerCollectionConfigSetProcessor-99237044644741130-127.0.0.1:48251_solr-n_0000000000) [n:127.0.0.1:48251_solr    ] o.a.s.c.OverseerTaskProcessor RunningTasks: []
   [junit4]   2> 1413415 INFO  (jetty-launcher-2616-thread-2) [n:127.0.0.1:53011_solr    ] o.a.s.c.c.ZkStateReader Updated live nodes from ZooKeeper... (0) -> (2)
   [junit4]   2> 1413415 DEBUG (OverseerCollectionConfigSetProcessor-99237044644741130-127.0.0.1:48251_solr-n_0000000000) [n:127.0.0.1:48251_solr    ] o.a.s.c.OverseerTaskProcessor BlockedTasks: []
   [junit4]   2> 1413415 DEBUG (OverseerCollectionConfigSetProcessor-99237044644741130-127.0.0.1:48251_solr-n_0000000000) [n:127.0.0.1:48251_solr    ] o.a.s.c.OverseerTaskProcessor CompletedTasks: []
   [junit4]   2> 1413415 DEBUG (OverseerCollectionConfigSetProcessor-99237044644741130-127.0.0.1:48251_solr-n_0000000000) [n:127.0.0.1:48251_solr    ] o.a.s.c.OverseerTaskProcessor RunningZKTasks: []
   [junit4]   2> 1413415 DEBUG (SyncThread:0) [    ] o.a.s.c.ZkTestServer Watch added: data: /solr/clusterstate.json
   [junit4]   2> 1413415 DEBUG (OverseerCollectionConfigSetProcessor-99237044644741130-127.0.0.1:48251_solr-n_0000000000) [n:127.0.0.1:48251_solr    ] o.a.s.c.OverseerTaskQueue Peeking for top 100 elements. ExcludeSet: []
   [junit4]   2> 1413415 DEBUG (SyncThread:0) [    ] o.a.s.c.ZkTestServer Watch added: children: /solr/collections
   [junit4]   2> 1413416 DEBUG (SyncThread:0) [    ] o.a.s.c.ZkTestServer Watch added: create/delete: /solr/aliases.json
   [junit4]   2> 1413416 DEBUG (SyncThread:0) [    ] o.a.s.c.ZkTestServer Watch added: children: /solr/overseer/collection-queue-work
   [junit4]   2> 1413416 DEBUG (SyncThread:0) [    ] o.a.s.c.ZkTestServer Watch added: children: /solr/overseer/queue-work
   [junit4]   2> 1413417 DEBUG (SyncThread:0) [    ] o.a.s.c.ZkTestServer Watch added: create/delete: /solr/security.json
   [junit4]   2> 1413417 DEBUG (SyncThread:0) [    ] o.a.s.c.ZkTestServer Watch added: children: /solr/overseer/queue
   [junit4]   2> 1413421 DEBUG (OverseerAutoScalingTriggerThread-99237044644741130-127.0.0.1:48251_solr-n_0000000000) [n:127.0.0.1:48251_solr    ] o.a.s.c.a.OverseerTriggerThread -- clean old nodeAdded markers
   [junit4]   2> 1413421 INFO  (jetty-launcher-2616-thread-2) [n:127.0.0.1:53011_solr    ] o.a.s.c.Overseer Overseer (id=null) closing
   [junit4]   2> 1413421 DEBUG (jetty-launcher-2616-thread-2) [n:127.0.0.1:53011_solr    ] o.a.s.c.LeaderElector Joined leadership election with path: /overseer_elect/election/99237044644741129-127.0.0.1:53011_solr-n_0000000002
   [junit4]   2> 1413421 DEBUG (OverseerAutoScalingTriggerThread-99237044644741130-127.0.0.1:48251_solr-n_0000000000) [n:127.0.0.1:48251_solr    ] o.a.s.c.a.OverseerTriggerThread Current znodeVersion 1, lastZnodeVersion 1
   [junit4]   2> 1413422 DEBUG (SyncThread:0) [    ] o.a.s.c.ZkTestServer Watch added: children: /solr/autoscaling/events/.auto_add_replicas
   [junit4]   2> 1413422 DEBUG (SyncThread:0) [    ] o.a.s.c.ZkTestServer Watch added: data: /solr/overseer_elect/election/99237044644741127-127.0.0.1:49804_solr-n_0000000001
   [junit4]   2> 1413422 DEBUG (jetty-launcher-2616-thread-2) [n:127.0.0.1:53011_solr    ] o.a.s.c.LeaderElector Watching path /overseer_elect/election/99237044644741127-127.0.0.1:49804_solr-n_0000000001 to know if I could be the leader
   [junit4]   2> 1413422 DEBUG (ScheduledTrigger-4417-thread-1) [n:127.0.0.1:48251_solr    ] o.a.s.c.a.NodeLostTrigger Running NodeLostTrigger: .auto_add_replicas with currently live nodes: 2
   [junit4]   2> 1413422 DEBUG (jetty-launcher-2616-thread-2) [n:127.0.0.1:53011_solr    ] o.a.s.c.ZkController Publish node=127.0.0.1:53011_solr as DOWN
   [junit4]   2> 1413423 DEBUG (SyncThread:0) [    ] o.a.s.c.ZkTestServer Watch fired: children: /solr/overseer/queue
   [junit4]   2> 1413424 INFO  (jetty-launcher-2616-thread-2) [n:127.0.0.1:53011_solr    ] o.a.s.c.ZkController Register node as live in ZooKeeper:/live_nodes/127.0.0.1:53011_solr
   [junit4]   2> 1413424 DEBUG (SyncThread:0) [    ] o.a.s.c.ZkTestServer Watch added: children: /solr/overseer/queue
   [junit4]   2> 1413425 DEBUG (SyncThread:0) [    ] o.a.s.c.ZkTestServer Watch fired: children: /solr/live_nodes
   [junit4]   2> 1413425 DEBUG (SyncThread:0) [    ] o.a.s.c.ZkTestServer Watch fired: children: /solr/live_nodes
   [junit4]   2> 1413425 DEBUG (SyncThread:0) [    ] o.a.s.c.ZkTestServer Watch added: children: /solr/live_nodes
   [junit4]   2> 1413436 INFO  (zkCallback-2642-thread-1-processing-n:127.0.0.1:53011_solr) [n:127.0.0.1:53011_solr    ] o.a.s.c.c.ZkStateReader Updated live nodes from ZooKeeper... (2) -> (3)
   [junit4]   2> 1413447 DEBUG (OverseerStateUpdate-99237044644741130-127.0.0.1:48251_solr-n_0000000000) [n:127.0.0.1:48251_solr    ] o.a.s.c.Overseer processMessage: queueSize: 1, message = {
   [junit4]   2>   "operation":"downnode",
   [junit4]   2>   "node_name":"127.0.0.1:53011_solr"} current state version: 0
   [junit4]   2> 1413447 DEBUG (OverseerStateUpdate-99237044644741130-127.0.0.1:48251_solr-n_0000000000) [n:127.0.0.1:48251_solr    ] o.a.s.c.o.NodeMutator DownNode state invoked for node: 127.0.0.1:53011_solr
   [junit4]   2> 1413454 DEBUG (SyncThread:0) [    ] o.a.s.c.ZkTestServer Watch added: create/delete: /solr/clusterprops.json
   [junit4]   2> 1413454 DEBUG (SyncThread:0) [    ] o.a.s.c.ZkTestServer Watch added: children: /solr/live_nodes
   [junit4]   2> 1413454 INFO  (zkCallback-2645-thread-1-processing-n:127.0.0.1:48251_solr) [n:127.0.0.1:48251_solr    ] o.a.s.c.c.ZkStateReader Updated live nodes from ZooKeeper... (2) -> (3)
   [junit4]   2> 1413476 DEBUG (SyncThread:0) [    ] o.a.s.c.ZkTestServer Watch added: children: /solr/live_nodes
   [junit4]   2> 1413477 DEBUG (SyncThread:0) [    ] o.a.s.c.ZkTestServer Watch added: children: /solr/live_nodes
   [junit4]   2> 1413477 INFO  (zkCallback-2636-thread-1-processing-n:127.0.0.1:49804_solr) [n:127.0.0.1:49804_solr    ] o.a.s.c.c.ZkStateReader Updated live nodes from ZooKeeper... (1) -> (3)
   [junit4]   2> 1413478 INFO  (jetty-launcher-2616-thread-4) [n:127.0.0.1:52348_solr    ] o.a.s.c.c.ZkStateReader Updated live nodes from ZooKeeper... (0) -> (3)
   [junit4]   2> 1413478 DEBUG (SyncThread:0) [    ] o.a.s.c.ZkTestServer Watch added: data: /solr/clusterstate.json
   [junit4]   2> 1413480 DEBUG (SyncThread:0) [    ] o.a.s.c.ZkTestServer Watch added: children: /solr/collections
   [junit4]   2> 1413480 DEBUG (SyncThread:0) [    ] o.a.s.c.ZkTestServer Watch added: create/delete: /solr/aliases.json
   [junit4]   2> 1413485 DEBUG (SyncThread:0) [    ] o.a.s.c.ZkTestServer Watch added: create/delete: /solr/security.json
   [junit4]   2> 1413487 INFO  (jetty-launcher-2616-thread-4) [n:127.0.0.1:52348_solr    ] o.a.s.c.Overseer Overseer (id=null) closing
   [junit4]   2> 1413487 DEBUG (jetty-launcher-2616-thread-4) [n:127.0.0.1:52348_solr    ] o.a.s.c.LeaderElector Joined leadership election with path: /overseer_elect/election/99237044644741132-127.0.0.1:52348_solr-n_0000000003
   [junit4]   2> 1413488 DEBUG (SyncThread:0) [    ] o.a.s.c.ZkTestServer Watch added: data: /solr/overseer_elect/election/99237044644741129-127.0.0.1:53011_solr-n_0000000002
   [junit4]   2> 1413488 DEBUG (jetty-launcher-2616-thread-4) [n:127.0.0.1:52348_solr    ] o.a.s.c.LeaderElector Watching path /overseer_elect/election/99237044644741129-127.0.0.1:53011_solr-n_0000000002 to know if I could be the leader
   [junit4]   2> 1413488 DEBUG (jetty-launcher-2616-thread-4) [n:127.0.0.1:52348_solr    ] o.a.s.c.ZkController Publish node=127.0.0.1:52348_solr as DOWN
   [junit4]   2> 1413490 DEBUG (SyncThread:0) [    ] o.a.s.c.ZkTestServer Watch fired: children: /solr/overseer/queue
   [junit4]   2> 1413491 INFO  (jetty-launcher-2616-thread-4) [n:127.0.0.1:52348_solr    ] o.a.s.c.ZkController Register node as live in ZooKeeper:/live_nodes/127.0.0.1:52348_solr
   [junit4]   2> 1413492 DEBUG (SyncThread:0) [    ] o.a.s.c.ZkTestServer Watch added: children: /solr/overseer/queue
   [junit4]   2> 1413492 DEBUG (OverseerStateUpdate-99237044644741130-127.0.0.1:48251_solr-n_0000000000) [n:127.0.0.1:48251_solr    ] o.a.s.c.Overseer processMessage: queueSize: 2, message = {
   [junit4]   2>   "operation":"downnode",
   [junit4]   2>   "node_name":"127.0.0.1:52348_solr"} current state version: 0
   [junit4]   2> 1413492 DEBUG (OverseerStateUpdate-99237044644741130-127.0.0.1:48251_solr-n_0000000000) [n:127.0.0.1:48251_solr    ] o.a.s.c.o.NodeMutator DownNode state invoked for node: 127.0.0.1:52348_solr
   [junit4]   2> 1413493 DEBUG (SyncThread:0) [    ] o.a.s.c.ZkTestServer Watch fired: children: /solr/live_nodes
   [junit4]   2> 1413493 DEBUG (SyncThread:0) [    ] o.a.s.c.ZkTestServer Watch fired: children: /solr/live_nodes
   [junit4]   2> 1413493 DEBUG (SyncThread:0) [    ] o.a.s.c.ZkTestServer Watch fired: children: /solr/live_nodes
   [junit4]   2> 1413493 DEBUG (SyncThread:0) [    ] o.a.s.c.ZkTestServer Watch fired: children: /solr/live_nodes
   [junit4]   2> 1413493 DEBUG (SyncThread:0) [    ] o.a.s.c.ZkTestServer Watch added: children: /solr/live_nodes
   [junit4]   2> 1413493 DEBUG (SyncThread:0) [    ] o.a.s.c.ZkTestServer Watch added: children: /solr/live_nodes
   [junit4]   2> 1413494 DEBUG (SyncThread:0) [    ] o.a.s.c.ZkTestServer Watch added: children: /solr/live_nodes
   [junit4]   2> 1413494 INFO  (zkCallback-2645-thread-1-processing-n:127.0.0.1:48251_solr) [n:127.0.0.1:48251_solr    ] o.a.s.c.c.ZkStateReader Updated live nodes from ZooKeeper... (3) -> (4)
   [junit4]   2> 1413494 INFO  (zkCallback-2642-thread-1-processing-n:127.0.0.1:53011_solr) [n:127.0.0.1:53011_solr    ] o.a.s.c.c.ZkStateReader Updated live nodes from ZooKeeper... (3) -> (4)
   [junit4]   2> 1413494 INFO  (zkCallback-2636-thread-1-processing-n:127.0.0.1:49804_solr) [n:127.0.0.1:49804_solr    ] o.a.s.c.c.ZkStateReader Updated live nodes from ZooKeeper... (3) -> (4)
   [junit4]   2> 1413494 DEBUG (SyncThread:0) [    ] o.a.s.c.ZkTestServer Watch added: children: /solr/live_nodes
   [junit4]   2> 1413495 INFO  (zkCallback-2650-thread-1-processing-n:127.0.0.1:52348_solr) [n:127.0.0.1:52348_solr    ] o.a.s.c.c.ZkStateReader Updated live nodes from ZooKeeper... (3) -> (4)
   [junit4]   2> 1413510 INFO  (jetty-launcher-2616-thread-1) [n:127.0.0.1:48251_solr    ] o.a.s.m.r.SolrJmxReporter JMX monitoring for 'solr_48251.solr.node' (registry 'solr.node') enabled at server: com.sun.jmx.mbeanserver.JmxMBeanServer@3fc597dc
   [junit4]   2> 1413545 INFO  (jetty-launcher-2616-thread-2) [n:127.0.0.1:53011_solr    ] o.a.s.m.r.SolrJmxReporter JMX monitoring for 'solr_53011.solr.node' (registry 'solr.node') enabled at server: com.sun.jmx.mbeanserver.JmxMBeanServer@3fc597dc
   [junit4]   2> 1413550 INFO  (jetty-launcher-2616-thread-2) [n:127.0.0.1:53011_solr    ] o.a.s.m.r.SolrJmxReporter JMX monitoring for 'solr_53011.solr.jvm' (registry 'solr.jvm') enabled at server: com.sun.jmx.mbeanserver.JmxMBeanServer@3fc597dc
   [junit4]   2> 1413550 INFO  (jetty-launcher-2616-thread-2) [n:127.0.0.1:53011_solr    ] o.a.s.m.r.SolrJmxReporter JMX monitoring for 'solr_53011.solr.jetty' (registry 'solr.jetty') enabled at server: com.sun.jmx.mbeanserver.JmxMBeanServer@3fc597dc
   [junit4]   2> 1413551 INFO  (jetty-launcher-2616-thread-2) [n:127.0.0.1:53011_solr    ] o.a.s.c.CorePropertiesLocator Found 0 core definitions underneath /export/home/jenkins/workspace/Lucene-Solr-master-Solaris/solr/build/solr-core/test/J0/temp/solr.cloud.MoveReplicaHDFSTest_2AE73FA5E9EB708E-001/tempDir-001/node2/.
   [junit4]   2> 1413561 INFO  (jetty-launcher-2616-thread-1) [n:127.0.0.1:48251_solr    ] o.a.s.m.r.SolrJmxReporter JMX monitoring for 'solr_48251.solr.jvm' (registry 'solr.jvm') enabled at server: com.sun.jmx.mbeanserver.JmxMBeanServer@3fc597dc
   [junit4]   2> 1413562 INFO  (jetty-launcher-2616-thread-1) [n:127.0.0.1:48251_solr    ] o.a.s.m.r.SolrJmxReporter JMX monitoring for 'solr_48251.solr.jetty' (registry 'solr.jetty') enabled at server: com.sun.jmx.mbeanserver.JmxMBeanServer@3fc597dc
   [junit4]   2> 1413562 INFO  (jetty-launcher-2616-thread-1) [n:127.0.0.1:48251_solr    ] o.a.s.c.CorePropertiesLocator Found 0 core definitions underneath /export/home/jenkins/workspace/Lucene-Solr-master-Solaris/solr/build/solr-core/test/J0/temp/solr.cloud.MoveReplicaHDFSTest_2AE73FA5E9EB708E-001/tempDir-001/node1/.
   [junit4]   2> 1413568 INFO  (jetty-launcher-2616-thread-3) [n:127.0.0.1:49804_solr    ] o.a.s.m.r.SolrJmxReporter JMX monitoring for 'solr_49804.solr.node' (registry 'solr.node') enabled at server: com.sun.jmx.mbeanserver.JmxMBeanServer@3fc597dc
   [junit4]   2> 1413574 INFO  (jetty-launcher-2616-thread-3) [n:127.0.0.1:49804_solr    ] o.a.s.m.r.SolrJmxReporter JMX monitoring for 'solr_49804.solr.jvm' (registry 'solr.jvm') enabled at server: com.sun.jmx.mbeanserver.JmxMBeanServer@3fc597dc
   [junit4]   2> 1413574 INFO  (jetty-launcher-2616-thread-3) [n:127.0.0.1:49804_solr    ] o.a.s.m.r.SolrJmxReporter JMX monitoring for 'solr_49804.solr.jetty' (registry 'solr.jetty') enabled at server: com.sun.jmx.mbeanserver.JmxMBeanServer@3fc597dc
   [junit4]   2> 1413575 INFO  (jetty-launcher-2616-thread-3) [n:127.0.0.1:49804_solr    ] o.a.s.c.CorePropertiesLocator Found 0 core definitions underneath /export/home/jenkins/workspace/Lucene-Solr-master-Solaris/solr/build/solr-core/test/J0/temp/solr.cloud.MoveReplicaHDFSTest_2AE73FA5E9EB708E-001/tempDir-001/node3/.
   [junit4]   2> 1413587 INFO  (jetty-launcher-2616-thread-4) [n:127.0.0.1:52348_solr    ] o.a.s.m.r.SolrJmxReporter JMX monitoring for 'solr_52348.solr.node' (registry 'solr.node') enabled at server: com.sun.jmx.mbeanserver.JmxMBeanServer@3fc597dc
   [junit4]   2> 1413593 DEBUG (SyncThread:0) [    ] o.a.s.c.ZkTestServer Watch fired: children: /solr/overseer/queue
   [junit4]   2> 1413593 DEBUG (SyncThread:0) [    ] o.a.s.c.ZkTestServer Watch added: children: /solr/overseer/queue
   [junit4]   2> 1413594 INFO  (jetty-launcher-2616-thread-4) [n:127.0.0.1:52348_solr    ] o.a.s.m.r.SolrJmxReporter JMX monitoring for 'solr_52348.solr.jvm' (registry 'solr.jvm') enabled at server: com.sun.jmx.mbeanserver.JmxMBeanServer@3fc597dc
   [junit4]   2> 1413594 INFO  (jetty-launcher-2616-thread-4) [n:127.0.0.1:52348_solr    ] o.a.s.m.r.SolrJmxReporter JMX monitoring for 'solr_52348.solr.jetty' (registry 'solr.jetty') enabled at server: com.sun.jmx.mbeanserver.JmxMBeanServer@3fc597dc
   [junit4]   2> 1413595 INFO  (jetty-launcher-2616-thread-4) [n:127.0.0.1:52348_solr    ] o.a.s.c.CorePropertiesLocator Found 0 core definitions underneath /export/home/jenkins/workspace/Lucene-Solr-master-Solaris/solr/build/solr-core/test/J0/temp/solr.cloud.MoveReplicaHDFSTest_2AE73FA5E9EB708E-001/tempDir-001/node4/.
   [junit4]   2> 1413657 INFO  (zkConnectionManagerCallback-2661-thread-1) [    ] o.a.s.c.c.ConnectionManager zkClient has connected
   [junit4]   2> 1413660 INFO  (zkConnectionManagerCallback-2665-thread-1) [    ] o.a.s.c.c.ConnectionManager zkClient has connected
   [junit4]   2> 1413661 DEBUG (SyncThread:0) [    ] o.a.s.c.ZkTestServer Watch added: create/delete: /solr/clusterprops.json
   [junit4]   2> 1413662 DEBUG (SyncThread:0) [    ] o.a.s.c.ZkTestServer Watch added: children: /solr/live_nodes
   [junit4]   2> 1413662 INFO  (SUITE-MoveReplicaHDFSTest-seed#[2AE73FA5E9EB708E]-worker) [    ] o.a.s.c.c.ZkStateReader Updated live nodes from ZooKeeper... (0) -> (4)
   [junit4]   2> 1413662 DEBUG (SyncThread:0) [    ] o.a.s.c.ZkTestServer Watch added: data: /solr/clusterstate.json
   [junit4]   2> 1413663 DEBUG (SyncThread:0) [    ] o.a.s.c.ZkTestServer Watch added: children: /solr/collections
   [junit4]   2> 1413663 DEBUG (SyncThread:0) [    ] o.a.s.c.ZkTestServer Watch added: create/delete: /solr/aliases.json
   [junit4]   2> 1413664 INFO  (SUITE-MoveReplicaHDFSTest-seed#[2AE73FA5E9EB708E]-worker) [    ] o.a.s.c.s.i.ZkClientClusterStateProvider Cluster at 127.0.0.1:61702/solr ready
   [junit4]   2> 1413670 INFO  (qtp1828951617-11256) [n:127.0.0.1:48251_solr    ] o.a.s.h.a.CollectionsHandler Invoked Collection Action :overseerstatus with params action=OVERSEERSTATUS&wt=javabin&version=2 and sendToOCPQueue=true
   [junit4]   2> 1413670 DEBUG (SyncThread:0) [    ] o.a.s.c.ZkTestServer Watch fired: children: /solr/overseer/collection-queue-work
   [junit4]   2> 1413671 DEBUG (SyncThread:0) [    ] o.a.s.c.ZkTestServer Watch added: create/delete: /solr/overseer/collection-queue-work/qnr-0000000000
   [junit4]   2> 1413671 DEBUG (SyncThread:0) [    ] o.a.s.c.ZkTestServer Watch added: children: /solr/overseer/collection-queue-work
   [junit4]   2> 1413671 DEBUG (OverseerCollectionConfigSetProcessor-99237044644741130-127.0.0.1:48251_solr-n_0000000000) [n:127.0.0.1:48251_solr    ] o.a.s.c.ZkDistributedQueue Found child node with improper name: qnr-0000000000
   [junit4]   2> 1413671 DEBUG (SyncThread:0) [    ] o.a.s.c.ZkTestServer Watch fired: children: /solr/overseer/collection-queue-work
   [junit4]   2> 1413671 DEBUG (SyncThread:0) [    ] o.a.s.c.ZkTestServer Watch added: children: /solr/overseer/collection-queue-work
   [junit4]   2> 1413672 DEBUG (OverseerCollectionConfigSetProcessor-99237044644741130-127.0.0.1:48251_solr-n_0000000000) [n:127.0.0.1:48251_solr    ] o.a.s.c.ZkDistributedQueue Found child node with improper name: qnr-0000000000
   [junit4]   2> 1413672 DEBUG (OverseerCollectionConfigSetProcessor-99237044644741130-127.0.0.1:48251_solr-n_0000000000) [n:127.0.0.1:48251_solr    ] o.a.s.c.OverseerTaskQueue Returning topN elements: [/overseer/collection-queue-work/qn-0000000000, ]
   [junit4]   2> 1413672 DEBUG (OverseerCollectionConfigSetProcessor-99237044644741130-127.0.0.1:48251_solr-n_0000000000) [n:127.0.0.1:48251_solr    ] o.a.s.c.OverseerTaskProcessor Got 1 tasks from work-queue : [[org.apache.solr.cloud.OverseerTaskQueue$QueueEvent@2e684ecf]]
   [junit4]   2> 1413672 DEBUG (OverseerCollectionConfigSetProcessor-99237044644741130-127.0.0.1:48251_solr-n_0000000000) [n:127.0.0.1:48251_solr    ] o.a.s.c.OverseerTaskProcessor Marked task [/overseer/collection-queue-work/qn-0000000000] as running
   [junit4]   2> 1413672 DEBUG (OverseerCollectionConfigSetProcessor-99237044644741130-127.0.0.1:48251_solr-n_0000000000) [n:127.0.0.1:48251_solr    ] o.a.s.c.OverseerTaskProcessor Overseer Collection Message Handler: Get the message id:/overseer/collection-queue-work/qn-0000000000 message:{"operation":"overseerstatus"}
   [junit4]   2> 1413673 DEBUG (OverseerThreadFactory-4419-thread-1-processing-n:127.0.0.1:48251_solr) [n:127.0.0.1:48251_solr    ] o.a.s.c.OverseerTaskProcessor Runner processing /overseer/collection-queue-work/qn-0000000000
   [junit4]   2> 1413673 DEBUG (OverseerThreadFactory-4419-thread-1-processing-n:127.0.0.1:48251_solr) [n:127.0.0.1:48251_solr    ] o.a.s.c.OverseerCollectionMessageHandler OverseerCollectionMessageHandler.processMessage : overseerstatus , {"operation":"overseerstatus"}
   [junit4]   2> 1413673 DEBUG (OverseerCollectionConfigSetProcessor-99237044644741130-127.0.0.1:48251_solr-n_0000000000) [n:127.0.0.1:48251_solr    ] o.a.s.c.OverseerTaskProcessor Cleaning up work-queue. #Running tasks: 1
   [junit4]   2> 1413673 DEBUG (OverseerCollectionConfigSetProcessor-99237044644741130-127.0.0.1:48251_solr-n_0000000000) [n:127.0.0.1:48251_solr    ] o.a.s.c.OverseerTaskProcessor RunningTasks: [/overseer/collection-queue-work/qn-0000000000]
   [junit4]   2> 1413673 DEBUG (OverseerCollectionConfigSetProcessor-99237044644741130-127.0.0.1:48251_solr-n_0000000000) [n:127.0.0.1:48251_solr    ] o.a.s.c.OverseerTaskProcessor BlockedTasks: []
   [junit4]   2> 1413673 DEBUG (OverseerCollectionConfigSetProcessor-99237044644741130-127.0.0.1:48251_solr-n_0000000000) [n:127.0.0.1:48251_solr    ] o.a.s.c.OverseerTaskProcessor CompletedTasks: []
   [junit4]   2> 1413673 DEBUG (OverseerCollectionConfigSetProcessor-99237044644741130-127.0.0.1:48251_solr-n_0000000000) [n:127.0.0.1:48251_solr    ] o.a.s.c.OverseerTaskProcessor RunningZKTasks: [/overseer/collection-queue-work/qn-0000000000]
   [junit4]   2> 1413673 DEBUG (OverseerCollectionConfigSetProcessor-99237044644741130-127.0.0.1:48251_solr-n_0000000000) [n:127.0.0.1:48251_solr    ] o.a.s.c.OverseerTaskQueue Peeking for top 99 elements. ExcludeSet: [/overseer/collection-queue-work/qn-0000000000],[]
   [junit4]   2> 1413677 DEBUG (OverseerThreadFactory-4419-thread-1-processing-n:127.0.0.1:48251_solr) [n:127.0.0.1:48251_solr    ] o.a.s.c.OverseerTaskProcessor Completed task:[/overseer/collection-queue-work/qn-0000000000]
   [junit4]   2> 1413678 DEBUG (SyncThread:0) [    ] o.a.s.c.ZkTestServer Watch fired: data: /solr/overseer/collection-queue-work/qnr-0000000000
   [junit4]   2> 1413678 DEBUG (zkCallback-2645-thread-1-processing-n:127.0.0.1:48251_solr) [n:127.0.0.1:48251_solr    ] o.a.s.c.OverseerTaskQueue NodeDataChanged fired on path /overseer/collection-queue-work/qnr-0000000000 state SyncConnected latchEventType null
   [junit4]   2> 1413678 DEBUG (SyncThread:0) [    ] o.a.s.c.ZkTestServer Watch fired: children: /solr/overseer/collection-queue-work
   [junit4]   2> 1413678 DEBUG (OverseerThreadFactory-4419-thread-1-processing-n:127.0.0.1:48251_solr) [n:127.0.0.1:48251_solr    ] o.a.s.c.OverseerTaskProcessor Marked task [/overseer/collection-queue-work/qn-0000000000] as completed.
   [junit4]   2> 1413678 DEBUG (OverseerThreadFactory-4419-thread-1-processing-n:127.0.0.1:48251_solr) [n:127.0.0.1:48251_solr    ] o.a.s.c.OverseerTaskProcessor RunningTasks: []
   [junit4]   2> 1413678 DEBUG (OverseerThreadFactory-4419-thread-1-processing-n:127.0.0.1:48251_solr) [n:127.0.0.1:48251_solr    ] o.a.s.c.OverseerTaskProcessor BlockedTasks: []
   [junit4]   2> 1413678 DEBUG (OverseerThreadFactory-4419-thread-1-processing-n:127.0.0.1:48251_solr) [n:127.0.0.1:48251_solr    ] o.a.s.c.OverseerTaskProcessor CompletedTasks: [/overseer/collection-queue-work/qn-0000000000]
   [junit4]   2> 1413679 DEBUG (OverseerThreadFactory-4419-thread-1-processing-n:127.0.0.1:48251_solr) [n:127.0.0.1:48251_solr    ] o.a.s.c.OverseerTaskProcessor RunningZKTasks: [/overseer/collection-queue-work/qn-0000000000]
   [junit4]   2> 1413679 DEBUG (SyncThread:0) [    ] o.a.s.c.ZkTestServer Watch added: children: /solr/overseer/collection-queue-work
   [junit4]   2> 1413679 DEBUG (OverseerThreadFactory-4419-thread-1-processing-n:127.0.0.1:48251_solr) [n:127.0.0.1:48251_solr    ] o.a.s.c.OverseerTaskProcessor Overseer Collection Message Handler: Message id:/overseer/collection-queue-work/qn-0000000000 complete, response:{leader=127.0.0.1:48251_solr,overseer_queue_size=0,overseer_work_queue_size=0,overseer_collection_queue_size=2,overseer_operations={am_i_leader={requests=3,errors=0,avgRequestsPerSecond=10.894274774628505,5minRateRequestsPerSecond=0.0,15minRateRequestsPerSecond=0.0,avgTimePerRequest=1.1995933333333333,medianRequestTime=0.764592,75thPcRequestTime=2.431597,95thPcRequestTime=2.431597,99thPcRequestTime=2.431597,999thPcRequestTime=2.431597},downnode={requests=2,errors=0,avgRequestsPerSecond=8.707163384622604,5minRateRequestsPerSecond=0.0,15minRateRequestsPerSecond=0.0,avgTimePerRequest=0.0354695,medianRequestTime=0.039422,75thPcRequestTime=0.039422,95thPcRequestTime=0.039422,99thPcRequestTime=0.039422,999thPcRequestTime=0.039422}},collection_operations={am_i_leader={requests=3,errors=0,avgRequestsPerSecond=10.910117848729143,5minRateRequestsPerSecond=0.0,15minRateRequestsPerSecond=0.0,avgTimePerRequest=1.2469637249860785,medianRequestTime=0.968834,75thPcRequestTime=2.365218,95thPcRequestTime=2.365218,99thPcRequestTime=2.365218,999thPcRequestTime=2.365218},overseerstatus={requests=0,errors=0,avgRequestsPerSecond=0.0,5minRateRequestsPerSecond=0.0,15minRateRequestsPerSecond=0.0,avgTimePerRequest=0.0,medianRequestTime=0.0,75thPcRequestTime=0.0,95thPcRequestTime=0.0,99thPcRequestTime=0.0,999thPcRequestTime=0.0}},overseer_queue={},overseer_internal_queue={peek={avgRequestsPerSecond=3.8323844132357707,5minRateRequestsPerSecond=0.0,15minRateRequestsPerSecond=0.0,avgTimePerRequest=0.93259,medianRequestTime=0.93259,75thPcRequestTime=0.93259,95thPcRequestTime=0.93259,99thPcRequestTime=0.93259,999thPcRequestTime=0.93259}},collection_queue={peektopn_wait2000={avgRequestsPerSecond=3.8263020492633024,5minRateRequestsPerSecond=0.0,15minRateRequestsPerSecond=0.0,avgTimePerRequest=256.944941,medianRequestTime=256.944941,75thPcRequestTime=256.944941,95thPcRequestTime=256.944941,99thPcRequestTime=256.944941,999thPcRequestTime=256.944941}}}
   [junit4]   2> 1413679 DEBUG (OverseerCollectionConfigSetProcessor-99237044644741130-127.0.0.1:48251_solr-n_0000000000) [n:127.0.0.1:48251_solr    ] o.a.s.c.ZkDistributedQueue Found child node with improper name: qnr-0000000000
   [junit4]   2> 1413679 DEBUG (SyncThread:0) [    ] o.a.s.c.ZkTestServer Watch fired: children: /solr/overseer/collection-queue-work
   [junit4]   2> 1413679 DEBUG (SyncThread:0) [    ] o.a.s.c.ZkTestServer Watch added: children: /solr/overseer/collection-queue-work
   [junit4]   2> 1413679 INFO  (qtp1828951617-11256) [n:127.0.0.1:48251_solr    ] o.a.s.s.HttpSolrCall [admin] webapp=null path=/admin/collections params={action=OVERSEERSTATUS&wt=javabin&version=2} status=0 QTime=9
   [junit4]   2> 1414261 WARN  (SUITE-MoveReplicaHDFSTest-seed#[2AE73FA5E9EB708E]-worker) [    ] o.a.h.u.NativeCodeLoader Unable to load native-hadoop library for your platform... using builtin-java classes where applicable
   [junit4]   1> Formatting using clusterid: testClusterID
   [junit4]   2> 1414424 DEBUG (ScheduledTrigger-4417-thread-1) [n:127.0.0.1:48251_solr    ] o.a.s.c.a.NodeLostTrigger Running NodeLostTrigger: .auto_add_replicas with currently live nodes: 4
   [junit4]   2> 1415466 DEBUG (ScheduledTrigger-4417-thread-2) [n:127.0.0.1:48251_solr    ] o.a.s.c.a.NodeLostTrigger Running NodeLostTrigger: .auto_add_replicas with currently live nodes: 4
   [junit4]   2> 1415675 DEBUG (OverseerCollectionConfigSetProcessor-99237044644741130-127.0.0.1:48251_solr-n_0000000000) [n:127.0.0.1:48251_solr    ] o.a.s.c.OverseerTaskProcessor Got 0 tasks from work-queue : [[]]
   [junit4]   2> 1415675 DEBUG (OverseerCollectionConfigSetProcessor-99237044644741130-127.0.0.1:48251_solr-n_0000000000) [n:127.0.0.1:48251_solr    ] o.a.s.c.OverseerTaskProcessor Cleaning up work-queue. #Running tasks: 0
   [junit4]   2> 1415676 INFO  (OverseerCollectionConfigSetProcessor-99237044644741130-127.0.0.1:48251_solr-n_0000000000) [n:127.0.0.1:48251_solr    ] o.a.s.c.OverseerTaskQueue Response ZK path: /overseer/collection-queue-work/qnr-0000000000 doesn't exist.  Requestor may have disconnected from ZooKeeper
   [junit4]   2> 1415704 DEBUG (OverseerCollectionConfigSetProcessor-99237044644741130-127.0.0.1:48251_solr-n_0000000000) [n:127.0.0.1:48251_solr    ] o.a.s.c.OverseerTaskProcessor RunningTasks: []
   [junit4]   2> 1415704 DEBUG (OverseerCollectionConfigSetProcessor-99237044644741130-127.0.0.1:48251_solr-n_0000000000) [n:127.0.0.1:48251_solr    ] o.a.s.c.OverseerTaskProcessor BlockedTasks: []
   [junit4]   2> 1415704 DEBUG (OverseerCollectionConfigSetProcessor-99237044644741130-127.0.0.1:48251_solr-n_0000000000) [n:127.0.0.1:48251_solr    ] o.a.s.c.OverseerTaskProcessor CompletedTasks: []
   [junit4]   2> 1415704 DEBUG (OverseerCollectionConfigSetProcessor-99237044644741130-127.0.0.1:48251_solr-n_0000000000) [n:127.0.0.1:48251_solr    ] o.a.s.c.OverseerTaskProcessor RunningZKTasks: []
   [junit4]   2> 1415704 DEBUG (OverseerCollectionConfigSetProcessor-99237044644741130-127.0.0.1:48251_solr-n_0000000000) [n:127.0.0.1:48251_solr    ] o.a.s.c.OverseerTaskQueue Peeking for top 100 elements. ExcludeSet: []
   [junit4]   2> 1415735 WARN  (SUITE-MoveReplicaHDFSTest-seed#[2AE73FA5E9EB708E]-worker) [    ] o.a.h.m.i.MetricsConfig Cannot locate configuration: tried hadoop-metrics2-namenode.properties,hadoop-metrics2.properties
   [junit4]   2> 1416350 INFO  (SUITE-MoveReplicaHDFSTest-seed#[2AE73FA5E9EB708E]-worker) [    ] o.m.log Logging to org.slf4j.impl.Log4jLoggerAdapter(org.mortbay.log) via org.mortbay.log.Slf4jLog
   [junit4]   2> 1416473 DEBUG (ScheduledTrigger-4417-thread-1) [n:127.0.0.1:48251_solr    ] o.a.s.c.a.NodeLostTrigger Running NodeLostTrigger: .auto_add_replicas with currently live nodes: 4
   [junit4]   2> 1416481 WARN  (SUITE-MoveReplicaHDFSTest-seed#[2AE73FA5E9EB708E]-worker) [    ] o.a.h.h.HttpRequestLog Jetty request log can only be enabled using Log4j
   [junit4]   2> 1417095 INFO  (SUITE-MoveReplicaHDFSTest-seed#[2AE73FA5E9EB708E]-worker) [    ] o.m.log jetty-6.1.26
   [junit4]   2> 1417212 INFO  (SUITE-MoveReplicaHDFSTest-seed#[2AE73FA5E9EB708E]-worker) [    ] o.m.log Extract jar:file:/export/home/jenkins/.ivy2/cache/org.apache.hadoop/hadoop-hdfs/tests/hadoop-hdfs-2.7.4-tests.jar!/webapps/hdfs to ./temp/Jetty_serv1.vm3_51147_hdfs____.34ykpz/webapp
   [junit4]   2> 1417474 DEBUG (ScheduledTrigger-4417-thread-1) [n:127.0.0.1:48251_solr    ] o.a.s.c.a.NodeLostTrigger Running NodeLostTrigger: .auto_add_replicas with currently live nodes: 4
   [junit4]   2> 1417705 DEBUG (OverseerCollectionConfigSetProcessor-99237044644741130-127.0.0.1:48251_solr-n_0000000000) [n:127.0.0.1:48251_solr    ] o.a.s.c.OverseerTaskProcessor Got 0 tasks from work-queue : [[]]
   [junit4]   2> 1417705 DEBUG (OverseerCollectionConfigSetProcessor-99237044644741130-127.0.0.1:48251_solr-n_0000000000) [n:127.0.0.1:48251_solr    ] o.a.s.c.OverseerTaskProcessor Cleaning up work-queue. #Running tasks: 0
   [junit4]   2> 1417705 DEBUG (OverseerCollectionConfigSetProcessor-99237044644741130-127.0.0.1:48251_solr-n_0000000000) [n:127.0.0.1:48251_solr    ] o.a.s.c.OverseerTaskProcessor RunningTasks: []
   [junit4]   2> 1417705 DEBUG (OverseerCollectionConfigSetProcessor-99237044644741130-127.0.0.1:48251_solr-n_0000000000) [n:127.0.0.1:48251_solr    ] o.a.s.c.OverseerTaskProcessor BlockedTasks: []
   [junit4]   2> 1417705 DEBUG (OverseerCollectionConfigSetProcessor-99237044644741130-127.0.0.1:48251_solr-n_0000000000) [n:127.0.0.1:48251_solr    ] o.a.s.c.OverseerTaskProcessor CompletedTasks: []
   [junit4]   2> 1417705 DEBUG (OverseerCollectionConfigSetProcessor-99237044644741130-127.0.0.1:48251_solr-n_0000000000) [n:127.0.0.1:48251_solr    ] o.a.s.c.OverseerTaskProcessor RunningZKTasks: []
   [junit4]   2> 1417705 DEBUG (OverseerCollectionConfigSetProcessor-99237044644741130-127.0.0.1:48251_solr-n_0000000000) [n:127.0.0.1:48251_solr    ] o.a.s.c.OverseerTaskQueue Peeking for top 100 elements. ExcludeSet: []
   [junit4]   2> 1418140 INFO  (SUITE-MoveReplicaHDFSTest-seed#[2AE73FA5E9EB708E]-worker) [    ] o.m.log Started HttpServer2$SelectChannelConnectorWithSafeStartup@serv1-vm3:51147
   [junit4]   2> 1418475 DEBUG (ScheduledTrigger-4417-thread-1) [n:127.0.0.1:48251_solr    ] o.a.s.c.a.NodeLostTrigger Running NodeLostTrigger: .auto_add_replicas with currently live nodes: 4
   [junit4]   2> 1419476 DEBUG (ScheduledTrigger-4417-thread-1) [n:127.0.0.1:48251_solr    ] o.a.s.c.a.NodeLostTrigger Running NodeLostTrigger: .auto_add_replicas with currently live nodes: 4
   [junit4]   2> 1419705 DEBUG (OverseerCollectionConfigSetProcessor-99237044644741130-127.0.0.1:48251_solr-n_0000000000) [n:127.0.0.1:48251_solr    ] o.a.s.c.OverseerTaskProcessor Got 0 tasks from work-queue : [[]]
   [junit4]   2> 1419706 DEBUG (OverseerCollectionConfigSetProcessor-99237044644741130-127.0.0.1:48251_solr-n_0000000000) [n:127.0.0.1:48251_solr    ] o.a.s.c.OverseerTaskProcessor Cleaning up work-queue. #Running tasks: 0
   [junit4]   2> 1419706 DEBUG (OverseerCollectionConfigSetProcessor-99237044644741130-127.0.0.1:48251_solr-n_0000000000) [n:127.0.0.1:48251_solr    ] o.a.s.c.OverseerTaskProcessor RunningTasks: []
   [junit4]   2> 1419706 DEBUG (OverseerCollectionConfigSetProcessor-99237044644741130-127.0.0.1:48251_solr-n_0000000000) [n:127.0.0.1:48251_solr    ] o.a.s.c.OverseerTaskProcessor BlockedTasks: []
   [junit4]   2> 1419706 DEBUG (OverseerCollectionConfigSetProcessor-99237044644741130-127.0.0.1:48251_solr-n_0000000000) [n:127.0.0.1:48251_solr    ] o.a.s.c.OverseerTaskProcessor CompletedTasks: []
   [junit4]   2> 1419706 DEBUG (OverseerCollectionConfigSetProcessor-99237044644741130-127.0.0.1:48251_solr-n_0000000000) [n:127.0.0.1:48251_solr    ] o.a.s.c.OverseerTaskProcessor RunningZKTasks: []
   [junit4]   2> 1419706 DEBUG (OverseerCollectionConfigSetProcessor-99237044644741130-127.0.0.1:48251_solr-n_0000000000) [n:127.0.0.1:48251_solr    ] o.a.s.c.OverseerTaskQueue Peeking for top 100 elements. ExcludeSet: []
   [junit4]   2> 1420477 DEBUG (ScheduledTrigger-4417-thread-1) [n:127.0.0.1:48251_solr    ] o.a.s.c.a.NodeLostTrigger Running NodeLostTrigger: .auto_add_replicas with currently live nodes: 4
   [junit4]   2> 1420828 WARN  (SUITE-MoveReplicaHDFSTest-seed#[2AE73FA5E9EB708E]-worker) [    ] o.a.h.h.HttpRequestLog Jetty request log can only be enabled using Log4j
   [junit4]   2> 1420835 INFO  (SUITE-MoveReplicaHDFSTest-seed#[2AE73FA5E9EB708E]-worker) [    ] o.m.log jetty-6.1.26
   [junit4]   2> 1420848 INFO  (SUITE-MoveReplicaHDFSTest-seed#[2AE73FA5E9EB708E]-worker) [    ] o.m.log Extract jar:file:/export/home/jenkins/.ivy2/cache/org.apache.hadoop/hadoop-hdfs/tests/hadoop-hdfs-2.7.4-tests.jar!/webapps/datanode to ./temp/Jetty_localhost_65115_datanode____7ztknx/webapp
   [junit4]   2> 1421424 INFO  (SUITE-MoveReplicaHDFSTest-seed#[2AE73FA5E9EB708E]-worker) [    ] o.m.log Started HttpServer2$SelectChannelConnectorWithSafeStartup@localhost:65115
   [junit4]   2> 1421478 DEBUG (ScheduledTrigger-4417-thread-1) [n:127.0.0.1:48251_solr    ] o.a.s.c.a.NodeLostTrigger Running NodeLostTrigger: .auto_add_replicas with currently live nodes: 4
   [junit4]   2> 1421707 DEBUG (OverseerCollectionConfigSetProcessor-99237044644741130-127.0.0.1:48251_solr-n_0000000000) [n:127.0.0.1:48251_solr    ] o.a.s.c.OverseerTaskProcessor Got 0 tasks from work-queue : [[]]
   [junit4]   2> 1421707 DEBUG (OverseerCollectionConfigSetProcessor-99237044644741130-127.0.0.1:48251_solr-n_0000000000) [n:127.0.0.1:48251_solr    ] o.a.s.c.OverseerTaskProcessor Cleaning up work-queue. #Running tasks: 0
   [junit4]   2> 1421707 DEBUG (OverseerCollectionConfigSetProcessor-99237044644741130-127.0.0.1:48251_solr-n_0000000000) [n:127.0.0.1:48251_solr    ] o.a.s.c.OverseerTaskProcessor RunningTasks: []
   [junit4]   2> 1421707 DEBUG (OverseerCollectionConfigSetProcessor-99237044644741130-127.0.0.1:48251_solr-n_0000000000) [n:127.0.0.1:48251_solr    ] o.a.s.c.OverseerTaskProcessor BlockedTasks: []
   [junit4]   2> 1421707 DEBUG (OverseerCollectionConfigSetProcessor-99237044644741130-127.0.0.1:48251_solr-n_0000000000) [n:127.0.0.1:48251_solr    ] o.a.s.c.OverseerTaskProcessor CompletedTasks: []
   [junit4]   2> 1421707 DEBUG (OverseerCollectionConfigSetProcessor-99237044644741130-127.0.0.1:48251_solr-n_0000000000) [n:127.0.0.1:48251_solr    ] o.a.s.c.OverseerTaskProcessor RunningZKTasks: []
   [junit4]   2> 1421707 DEBUG (OverseerCollectionConfigSetProcessor-99237044644741130-127.0.0.1:48251_solr-n_0000000000) [n:127.0.0.1:48251_solr    ] o.a.s.c.OverseerTaskQueue Peeking for top 100 elements. ExcludeSet: []
   [junit4]   2> 1421872 WARN  (SUITE-MoveReplicaHDFSTest-seed#[2AE73FA5E9EB708E]-worker) [    ] o.a.h.h.HttpRequestLog Jetty request log can only be enabled using Log4j
   [junit4]   2> 1421877 INFO  (SUITE-MoveReplicaHDFSTest-seed#[2AE73FA5E9EB708E]-worker) [    ] o.m.log jetty-6.1.26
   [junit4]   2> 1421892 INFO  (SUITE-MoveReplicaHDFSTest-seed#[2AE73FA5E9EB708E]-worker) [    ] o.m.log Extract jar:file:/export/home/jenkins/.ivy2/cache/org.apache.hadoop/hadoop-hdfs/tests/hadoop-hdfs-2.7.4-tests.jar!/webapps/datanode to ./temp/Jetty_localhost_64989_datanode____.43p6sd/webapp
   [junit4]   2> 1422444 INFO  (SUITE-MoveReplicaHDFSTest-seed#[2AE73FA5E9EB708E]-worker) [    ] o.m.log Started HttpServer2$SelectChannelConnectorWithSafeStartup@localhost:64989
   [junit4]   2> 1422478 DEBUG (ScheduledTrigger-4417-thread-1) [n:127.0.0.1:48251_solr    ] o.a.s.c.a.NodeLostTrigger Running NodeLostTrigger: .auto_add_replicas with currently live nodes: 4
   [junit4]   2> 1422706 ERROR (DataNode: [[[DISK]file:/export/home/jenkins/workspace/Lucene-Solr-master-Solaris/solr/build/solr-core/test/J0/temp/solr.cloud.MoveReplicaHDFSTest_2AE73FA5E9EB708E-001/tempDir-002/hdfsBaseDir/data/data1/, [DISK]file:/export/home/jenkins/workspace/Lucene-Solr-master-Solaris/solr/build/solr-core/test/J0/temp/solr.cloud.MoveReplicaHDFSTest_2AE73FA5E9EB708E-001/tempDir-002/hdfsBaseDir/data/data2/]]  heartbeating to serv1-vm3/127.0.0.1:50264) [    ] o.a.h.h.s.d.DirectoryScanner dfs.datanode.directoryscan.throttle.limit.ms.per.sec set to value below 1 ms/sec. Assuming default value of 1000
   [junit4]   2> 1423120 ERROR (DataNode: [[[DISK]file:/export/home/jenkins/workspace/Lucene-Solr-master-Solaris/solr/build/solr-core/test/J0/temp/solr.cloud.MoveReplicaHDFSTest_2AE73FA5E9EB708E-001/tempDir-002/hdfsBaseDir/data/data3/, [DISK]file:/export/home/jenkins/workspace/Lucene-Solr-master-Solaris/solr/build/solr-core/test/J0/temp/solr.cloud.MoveReplicaHDFSTest_2AE73FA5E9EB708E-001/tempDir-002/hdfsBaseDir/data/data4/]]  heartbeating to serv1-vm3/127.0.0.1:50264) [    ] o.a.h.h.s.d.DirectoryScanner dfs.datanode.directoryscan.throttle.limit.ms.per.sec set to value below 1 ms/sec. Assuming default value of 1000
   [junit4]   2> 1423284 INFO  (Block report processor) [    ] BlockStateChange BLOCK* processReport 0x709412c46212c: from storage DS-93e2ce3a-d416-4b35-aa61-774e9cbce3f9 node DatanodeRegistration(127.0.0.1:52871, datanodeUuid=a7c8b630-c40a-41b9-9589-07a2892901d6, infoPort=50435, infoSecurePort=0, ipcPort=37604, storageInfo=lv=-56;cid=testClusterID;nsid=1102941289;c=0), blocks: 0, hasStaleStorage: true, processing time: 3 msecs
   [junit4]   2> 1423285 INFO  (Block report processor) [    ] BlockStateChange BLOCK* processReport 0x709412cced69a: from storage DS-5cd30ff0-0dc8-4d38-894c-eb47dbdf4b65 node DatanodeRegistration(127.0.0.1:42293, datanodeUuid=524a620f-351c-4b4e-a91a-69a4e74579fc, infoPort=52399, infoSecurePort=0, ipcPort=44728, storageInfo=lv=-56;cid=testClusterID;nsid=1102941289;c=0), blocks: 0, hasStaleStorage: true, processing time: 1 msecs
   [junit4]   2> 1423285 INFO  (Block report processor) [    ] BlockStateChange BLOCK* processReport 0x709412c46212c: from storage DS-39716072-ea45-4e92-bec7-bb113ce94c80 node DatanodeRegistration(127.0.0.1:52871, datanodeUuid=a7c8b630-c40a-41b9-9589-07a2892901d6, infoPort=50435, infoSecurePort=0, ipcPort=37604, storageInfo=lv=-56;cid=testClusterID;nsid=1102941289;c=0), blocks: 0, hasStaleStorage: false, processing time: 0 msecs
   [junit4]   2> 1423285 INFO  (Block report processor) [    ] BlockStateChange BLOCK* processReport 0x709412cced69a: from storage DS-8ddbddda-5db6-4c87-a89d-840935963902 node DatanodeRegistration(127.0.0.1:42293, datanodeUuid=524a620f-351c-4b4e-a91a-69a4e74579fc, infoPort=52399, infoSecurePort=0, ipcPort=44728, storageInfo=lv=-56;cid=testClusterID;nsid=1102941289;c=0), blocks: 0, hasStaleStorage: false, processing time: 0 msecs
   [junit4]   2> 1423479 DEBUG (ScheduledTrigger-4417-thread-1) [n:127.0.0.1:48251_solr    ] o.a.s.c.a.NodeLostTrigger Running NodeLostTrigger: .auto_add_replicas with currently live nodes: 4
   [junit4]   2> 1423707 DEBUG (OverseerCollectionConfigSetProcessor-99237044644741130-127.0.0.1:48251_solr-n_0000000000) [n:127.0.0.1:48251_solr    ] o.a.s.c.OverseerTaskProcessor Got 0 tasks from work-queue : [[]]
   [junit4]   2> 1423709 DEBUG (OverseerCollectionConfigSetProcessor-99237044644741130-127.0.0.1:48251_solr-n_0000000000) [n:127.0.0.1:48251_solr    ] o.a.s.c.OverseerTaskProcessor Cleaning up work-queue. #Running tasks: 0
   [junit4]   2> 1423709 DEBUG (OverseerCollectionConfigSetProcessor-99237044644741130-127.0.0.1:48251_solr-n_0000000000) [n:127.0.0.1:48251_solr    ] o.a.s.c.OverseerTaskProcessor RunningTasks: []
   [junit4]   2> 1423709 DEBUG (OverseerCollectionConfigSetProcessor-99237044644741130-127.0.0.1:48251_solr-n_0000000000) [n:127.0.0.1:48251_solr    ] o.a.s.c.OverseerTaskProcessor BlockedTasks: []
   [junit4]   2> 1423709 DEBUG (OverseerCollectionConfigSetProcessor-99237044644741130-127.0.0.1:48251_solr-n_0000000000) [n:127.0.0.1:48251_solr    ] o.a.s.c.OverseerTaskProcessor CompletedTasks: []
   [junit4]   2> 1423709 DEBUG (OverseerCollectionConfigSetProcessor-99237044644741130-127.0.0.1:48251_solr-n_0000000000) [n:127.0.0.1:48251_solr    ] o.a.s.c.OverseerTaskProcessor RunningZKTasks: []
   [junit4]   2> 1423709 DEBUG (OverseerCollectionConfigSetProcessor-99237044644741130-127.0.0.1:48251_solr-n_0000000000) [n:127.0.0.1:48251_solr    ] o.a.s.c.OverseerTaskQueue Peeking for top 100 elements. ExcludeSet: []
   [junit4]   2> 1423985 INFO  (TEST-MoveReplicaHDFSTest.testFailedMove-seed#[2AE73FA5E9EB708E]) [    ] o.a.s.SolrTestCaseJ4 ###Starting testFailedMove
   [junit4]   2> 1423986 DEBUG (SyncThread:0) [    ] o.a.s.c.ZkTestServer Watch added: create/delete: /solr/clusterprops.json
   [junit4]   2> 1423987 DEBUG (SyncThread:0) [    ] o.a.s.c.ZkTestServer Watch added: children: /solr/live_nodes
   [junit4]   2> 1423987 INFO  (TEST-MoveReplicaHDFSTest.testFailedMove-seed#[2AE73FA5E9EB708E]) [    ] o.a.s.c.c.ZkStateReader Updated live nodes from ZooKeeper... (0) -> (4)
   [junit4]   2> 1423987 DEBUG (SyncThread:0) [    ] o.a.s.c.ZkTestServer Watch added: data: /solr/clusterstate.json
   [junit4]   2> 1423988 DEBUG (SyncThread:0) [    ] o.a.s.c.ZkTestServer Watch added: children: /solr/collections
   [junit4]   2> 1423988 DEBUG (SyncThread:0) [    ] o.a.s.c.ZkTestServer Watch added: create/delete: /solr/aliases.json
   [junit4]   2> 1423989 INFO  (TEST-MoveReplicaHDFSTest.testFailedMove-seed#[2AE73FA5E9EB708E]) [    ] o.e.j.s.Server jetty-9.3.20.v20170531
   [junit4]   2> 1423990 INFO  (TEST-MoveReplicaHDFSTest.testFailedMove-seed#[2AE73FA5E9EB708E]) [    ] o.e.j.s.h.ContextHandler Started o.e.j.s.ServletContextHandler@685bcbad{/solr,null,AVAILABLE}
   [junit4]   2> 1423991 INFO  (TEST-MoveReplicaHDFSTest.testFailedMove-seed#[2AE73FA5E9EB708E]) [    ] o.e.j.s.AbstractConnector Started ServerConnector@31101df4{HTTP/1.1,[http/1.1]}{127.0.0.1:54560}
   [junit4]   2> 1423991 INFO  (TEST-MoveReplicaHDFSTest.testFailedMove-seed#[2AE73FA5E9EB708E]) [    ] o.e.j.s.Server Started @1427001ms
   [junit4]   2> 1423991 INFO  (TEST-MoveReplicaHDFSTest.testFailedMove-seed#[2AE73FA5E9EB708E]) [    ] o.a.s.c.s.e.JettySolrRunner Jetty properties: {hostContext=/solr, hostPort=54560}
   [junit4]   2> 1423992 ERROR (TEST-MoveReplicaHDFSTest.testFailedMove-seed#[2AE73FA5E9EB708E]) [    ] o.a.s.u.StartupLoggingUtils Missing Java Option solr.log.dir. Logging may be missing or incomplete.
   [junit4]   2> 1423992 INFO  (TEST-MoveReplicaHDFSTest.testFailedMove-seed#[2AE73FA5E9EB708E]) [    ] o.a.s.s.SolrDispatchFilter  ___      _       Welcome to Apache Solr™ version 8.0.0
   [junit4]   2> 1423992 INFO  (TEST-MoveReplicaHDFSTest.testFailedMove-seed#[2AE73FA5E9EB708E]) [    ] o.a.s.s.SolrDispatchFilter / __| ___| |_ _   Starting in cloud mode on port null
   [junit4]   2> 1423992 INFO  (TEST-MoveReplicaHDFSTest.testFailedMove-seed#[2AE73FA5E9EB708E]) [    ] o.a.s.s.SolrDispatchFilter \__ \/ _ \ | '_|  Install dir: null
   [junit4]   2> 1423992 INFO  (TEST-MoveReplicaHDFSTest.testFailedMove-seed#[2AE73FA5E9EB708E]) [    ] o.a.s.s.SolrDispatchFilter |___/\___/_|_|    Start time: 2017-12-25T21:25:42.343Z
   [junit4]   2> 1423995 INFO  (zkConnectionManagerCallback-2668-thread-1) [    ] o.a.s.c.c.ConnectionManager zkClient has connected
   [junit4]   2> 1423996 INFO  (TEST-MoveReplicaHDFSTest.testFailedMove-seed#[2AE73FA5E9EB708E]) [    ] o.a.s.s.SolrDispatchFilter solr.xml found in ZooKeeper. Loading...
   [junit4]   2> 1424003 INFO  (TEST-MoveReplicaHDFSTest.testFailedMove-seed#[2AE73FA5E9EB708E]) [    ] o.a.s.c.ZkContainer Zookeeper client=127.0.0.1:61702/solr
   [junit4]   2> 1424005 INFO  (zkConnectionManagerCallback-2672-thread-1) [    ] o.a.s.c.c.ConnectionManager zkClient has connected
   [junit4]   2> 1424007 DEBUG (TEST-MoveReplicaHDFSTest.testFailedMove-seed#[2AE73FA5E9EB708E]) [n:127.0.0.1:54560_solr    ] o.a.s.c.ZkController Added new OnReconnect listener org.apache.solr.cloud.ZkController$$Lambda$114/100060969@3cb4b0fc
   [junit4]   2> 1424008 INFO  (zkConnectionManagerCallback-2674-thread-1-processing-n:127.0.0.1:54560_solr) [n:127.0.0.1:54560_solr    ] o.a.s.c.c.ConnectionManager zkClient has connected
   [junit4]   2> 1424015 DEBUG (SyncThread:0) [    ] o.a.s.c.ZkTestServer Watch added: create/delete: /solr/clusterprops.json
   [junit4]   2> 1424015 DEBUG (SyncThread:0) [    ] o.a.s.c.ZkTestServer Watch added: children: /solr/live_nodes
   [junit4]   2> 1424015 INFO  (TEST-MoveReplicaHDFSTest.testFailedMove-seed#[2AE73FA5E9EB708E]) [n:127.0.0.1:54560_solr    ] o.a.s.c.c.ZkStateReader Updated live nodes from ZooKeeper... (0) -> (4)
   [junit4]   2> 1424016 DEBUG (SyncThread:0) [    ] o.a.s.c.ZkTestServer Watch added: data: /solr/clusterstate.json
   [junit4]   2> 1424016 DEBUG (SyncThread:0) [    ] o.a.s.c.ZkTestServer Watch added: children: /solr/collections
   [junit4]   2> 1424016 DEBUG (SyncThread:0) [    ] o.a.s.c.ZkTestServer Watch added: create/delete: /solr/aliases.json
   [junit4]   2> 1424020 DEBUG (SyncThread:0) [    ] o.a.s.c.ZkTestServer Watch added: create/delete: /solr/security.json
   [junit4]   2> 1424022 INFO  (TEST-MoveReplicaHDFSTest.testFailedMove-seed#[2AE73FA5E9EB708E]) [n:127.0.0.1:54560_solr    ] o.a.s.c.Overseer Overseer (id=null) closing
   [junit4]   2> 1424022 DEBUG (TEST-MoveReplicaHDFSTest.testFailedMove-seed#[2AE73FA5E9EB708E]) [n:127.0.0.1:54560_solr    ] o.a.s.c.LeaderElector Joined leadership election with path: /overseer_elect/election/99237044644741137-127.0.0.1:54560_solr-n_0000000004
   [junit4]   2> 1424022 DEBUG (SyncThread:0) [    ] o.a.s.c.ZkTestServer Watch added: data: /solr/overseer_elect/election/99237044644741132-127.0.0.1:52348_solr-n_0000000003
   [junit4]   2> 1424023 DEBUG (TEST-MoveReplicaHDFSTest.testFailedMove-seed#[2AE73FA5E9EB708E]) [n:127.0.0.1:54560_solr    ] o.a.s.c.LeaderElector Watching path /overseer_elect/election/99237044644741132-127.0.0.1:52348_solr-n_0000000003 to know if I could be the leader
   [junit4]   2> 1424023 DEBUG (TEST-MoveReplicaHDFSTest.testFailedMove-seed#[2AE73FA5E9EB708E]) [n:127.0.0.1:54560_solr    ] o.a.s.c.ZkController Publish node=127.0.0.1:54560_solr as DOWN
   [junit4]   2> 1424024 DEBUG (SyncThread:0) [    ] o.a.s.c.ZkTestServer Watch fired: children: /solr/overseer/queue
   [junit4]   2> 1424024 INFO  (TEST-MoveReplicaHDFSTest.testFailedMove-seed#[2AE73FA5E9EB708E]) [n:127.0.0.1:54560_solr    ] o.a.s.c.ZkController Register node as live in ZooKeeper:/live_nodes/127.0.0.1:54560_solr
   [junit4]   2> 1424024 DEBUG (SyncThread:0) [    ] o.a.s.c.ZkTestServer Watch added: children: /solr/overseer/queue
   [junit4]   2> 1424024 DEBUG (OverseerStateUpdate-99237044644741130-127.0.0.1:48251_solr-n_0000000000) [n:127.0.0.1:48251_solr    ] o.a.s.c.Overseer processMessage: queueSize: 1, message = {
   [junit4]   2>   "operation":"downnode",
   [junit4]   2>   "node_name":"127.0.0.1:54560_solr"} current state version: 0
   [junit4]   2> 1424024 DEBUG (OverseerStateUpdate-99237044644741130-127.0.0.1:48251_solr-n_0000000000) [n:127.0.0.1:48251_solr    ] o.a.s.c.o.NodeMutator DownNode state invoked for node: 127.0.0.1:54560_solr
   [junit4]   2> 1424025 DEBUG (SyncThread:0) [    ] o.a.s.c.ZkTestServer Watch fired: children: /solr/live_nodes
   [junit4]   2> 1424025 DEBUG (SyncThread:0) [    ] o.a.s.c.ZkTestServer Watch fired: children: /solr/live_nodes
   [junit4]   2> 1424025 DEBUG (SyncThread:0) [    ] o.a.s.c.ZkTestServer Watch fired: children: /solr/live_nodes
   [junit4]   2> 1424025 DEBUG (SyncThread:0) [    ] o.a.s.c.ZkTestServer Watch fired: children: /solr/live_nodes
   [junit4]   2> 1424025 DEBUG (SyncThread:0) [    ] o.a.s.c.ZkTestServer Watch fired: children: /solr/live_nodes
   [junit4]   2> 1424025 DEBUG (SyncThread:0) [    ] o.a.s.c.ZkTestServer Watch fired: children: /solr/live_nodes
   [junit4]   2> 1424026 DEBUG (SyncThread:0) [    ] o.a.s.c.ZkTestServer Watch added: children: /solr/live_nodes
   [junit4]   2> 1424026 DEBUG (SyncThread:0) [    ] o.a.s.c.ZkTestServer Watch added: children: /solr/live_nodes
   [junit4]   2> 1424026 DEBUG (SyncThread:0) [    ] o.a.s.c.ZkTestServer Watch added: children: /solr/live_nodes
   [junit4]   2> 1424026 DEBUG (SyncThread:0) [    ] o.a.s.c.ZkTestServer Watch added: children: /solr/live_nodes
   [junit4]   2> 1424026 DEBUG (SyncThread:0) [    ] o.a.s.c.ZkTestServer Watch added: children: /solr/live_nodes
   [junit4]   2> 1424026 INFO  (zkCallback-2664-thread-1) [    ] o.a.s.c.c.ZkStateReader Updated live nodes from ZooKeeper... (4) -> (5)
   [junit4]   2> 1424026 INFO  (zkCallback-2642-thread-1-processing-n:127.0.0.1:53011_solr) [n:127.0.0.1:53011_solr    ] o.a.s.c.c.ZkStateReader Updated live nodes from ZooKeeper... (4) -> (5)
   [junit4]   2> 1424026 INFO  (zkCallback-2636-thread-1-processing-n:127.0.0.1:49804_solr) [n:127.0.0.1:49804_solr    ] o.a.s.c.c.ZkStateReader Updated live nodes from ZooKeeper... (4) -> (5)
   [junit4]   2> 1424026 DEBUG (SyncThread:0) [    ] o.a.s.c.ZkTestServer Watch added: children: /solr/live_nodes
   [junit4]   2> 1424027 INFO  (zkCallback-2650-thread-1-processing-n:127.0.0.1:52348_solr) [n:127.0.0.1:52348_solr    ] o.a.s.c.c.ZkStateReader Updated live nodes from ZooKeeper... (4) -> (5)
   [junit4]   2> 1424027 INFO  (zkCallback-2664-thread-2) [    ] o.a.s.c.c.ZkStateReader Updated live nodes from ZooKeeper... (4) -> (5)
   [junit4]   2> 1424028 INFO  (zkCallback-2645-thread-1-processing-n:127.0.0.1:48251_solr) [n:127.0.0.1:48251_solr    ] o.a.s.c.c.ZkStateReader Updated live nodes from ZooKeeper... (4) -> (5)
   [junit4]   2> 1424028 DEBUG (SyncThread:0) [    ] o.a.s.c.ZkTestServer Watch added: children: /solr/live_nodes
   [junit4]   2> 1424032 INFO  (zkCallback-2673-thread-1-processing-n:127.0.0.1:54560_solr) [n:127.0.0.1:54560_solr    ] o.a.s.c.c.ZkStateReader Updated live nodes from ZooKeeper... (4) -> (5)
   [junit4]   2> 1424123 INFO  (TEST-MoveReplicaHDFSTest.testFailedMove-seed#[2AE73FA5E9EB708E]) [n:127.0.0.1:54560_solr    ] o.a.s.m.r.SolrJmxReporter JMX monitoring for 'solr_54560.solr.node' (registry 'solr.node') enabled at server: com.sun.jmx.mbeanserver.JmxMBeanServer@3fc597dc
   [junit4]   2> 1424125 DEBUG (SyncThread:0) [    ] o.a.s.c.ZkTestServer Watch fired: children: /solr/overseer/queue
   [junit4]   2> 1424131 INFO  (TEST-MoveReplicaHDFSTest.testFailedMove-seed#[2AE73FA5E9EB708E]) [n:127.0.0.1:54560_solr    ] o.a.s.m.r.SolrJmxReporter JMX monitoring for 'solr_54560.solr.jvm' (registry 'solr.jvm') enabled at server: com.sun.jmx.mbeanserver.JmxMBeanServer@3fc597dc
   [junit4]   2> 1424131 INFO  (TEST-MoveReplicaHDFSTest.testFailedMove-seed#[2AE73FA5E9EB708E]) [n:127.0.0.1:54560_solr    ] o.a.s.m.r.SolrJmxReporter JMX monitoring for 'solr_54560.solr.jetty' (registry 'solr.jetty') enabled at server: com.sun.jmx.mbeanserver.JmxMBeanServer@3fc597dc
   [junit4]   2> 1424131 INFO  (TEST-MoveReplicaHDFSTest.testFailedMove-seed#[2AE73FA5E9EB708E]) [n:127.0.0.1:54560_solr    ] o.a.s.c.CorePropertiesLocator Found 0 core definitions underneath /export/home/jenkins/workspace/Lucene-Solr-master-Solaris/solr/build/solr-core/test/J0/temp/solr.cloud.MoveReplicaHDFSTest_2AE73FA5E9EB708E-001/tempDir-001/node5/.
   [junit4]   2> 1424136 DEBUG (SyncThread:0) [    ] o.a.s.c.ZkTestServer Watch added: children: /solr/overseer/queue
   [junit4]   2> 1424223 INFO  (zkConnectionManagerCallback-2678-thread-1) [    ] o.a.s.c.c.ConnectionManager zkClient has connected
   [junit4]   2> 1424235 INFO  (qtp1828951617-11257) [n:127.0.0.1:48251_solr    ] o.a.s.h.a.CollectionsHandler Invoked Collection Action :create with params replicationFactor=2&collection.configName=conf1&autoAddReplicas=false&name=MoveReplicaHDFSTest_failed_coll_true&nrtReplicas=2&action=CREATE&numShards=2&wt=javabin&version=2 and sendToOCPQueue=true
   [junit4]   2> 1424236 DEBUG (SyncThread:0) [    ] o.a.s.c.ZkTestServer Watch fired: children: /solr/overseer/collection-queue-work
   [junit4]   2> 1424236 DEBUG (SyncThread:0) [    ] o.a.s.c.ZkTestServer Watch added: create/delete: /solr/overseer/collection-queue-work/qnr-0000000002
   [junit4]   2> 1424236 DEBUG (SyncThread:0) [    ] o.a.s.c.ZkTestServer Watch added: children: /solr/overseer/collection-queue-work
   [junit4]   2> 1424236 DEBUG (OverseerCollectionConfigSetProcessor-99237044644741130-127.0.0.1:48251_solr-n_0000000000) [n:127.0.0.1:48251_solr    ] o.a.s.c.ZkDistributedQueue Found child node with improper name: qnr-0000000002
   [junit4]   2> 1424236 DEBUG (SyncThread:0) [    ] o.a.s.c.ZkTestServer Watch fired: children: /solr/overseer/collection-queue-work
   [junit4]   2> 1424237 DEBUG (SyncThread:0) [    ] o.a.s.c.ZkTestServer Watch added: children: /solr/overseer/collection-queue-work
   [junit4]   2> 1424237 DEBUG (OverseerCollectionConfigSetProcessor-99237044644741130-127.0.0.1:48251_solr-n_0000000000) [n:127.0.0.1:48251_solr    ] o.a.s.c.ZkDistributedQueue Found child node with improper name: qnr-0000000002
   [junit4]   2> 1424237 DEBUG (OverseerCollectionConfigSetProcessor-99237044644741130-127.0.0.1:48251_solr-n_0000000000) [n:127.0.0.1:48251_solr    ] o.a.s.c.OverseerTaskQueue Returning topN elements: [/overseer/collection-queue-work/qn-0000000002, ]
   [junit4]   2> 1424237 DEBUG (OverseerCollectionConfigSetProcessor-99237044644741130-127.0.0.1:48251_solr-n_0000000000) [n:127.0.0.1:48251_solr    ] o.a.s.c.OverseerTaskProcessor Got 1 tasks from work-queue : [[org.apache.solr.cloud.OverseerTaskQueue$QueueEvent@2e684ed1]]
   [junit4]   2> 1424237 DEBUG (OverseerCollectionConfigSetProcessor-99237044644741130-127.0.0.1:48251_solr-n_0000000000) [n:127.0.0.1:48251_solr    ] o.a.s.c.OverseerTaskProcessor Marked task [/overseer/collection-queue-work/qn-0000000002] as running
   [junit4]   2> 1424237 DEBUG (OverseerCollectionConfigSetProcessor-99237044644741130-127.0.0.1:48251_solr-n_0000000000) [n:127.0.0.1:48251_solr    ] o.a.s.c.OverseerTaskProcessor Overseer Collection Message Handler: Get the message id:/overseer/collection-queue-work/qn-0000000002 message:{
   [junit4]   2>   "name":"MoveReplicaHDFSTest_failed_coll_true",
   [junit4]   2>   "fromApi":"true",
   [junit4]   2>   "replicationFactor":"2",
   [junit4]   2>   "collection.configName":"conf1",
   [junit4]   2>   "numShards":"2",
   [junit4]   2>   "autoAddReplicas":"false",
   [junit4]   2>   "nrtReplicas":"2",
   [junit4]   2>   "stateFormat":"2",
   [junit4]   2>   "operation":"create"}
   [junit4]   2> 1424237 DEBUG (OverseerThreadFactory-4419-thread-2-processing-n:127.0.0.1:48251_solr) [n:127.0.0.1:48251_solr    ] o.a.s.c.OverseerTaskProcessor Runner processing /overseer/collection-queue-work/qn-0000000002
   [junit4]   2> 1424238 DEBUG (OverseerThreadFactory-4419-thread-2-processing-n:127.0.0.1:48251_solr) [n:127.0.0.1:48251_solr    ] o.a.s.c.OverseerCollectionMessageHandler OverseerCollectionMessageHandler.processMessage : create , {
   [junit4]   2>   "name":"MoveReplicaHDFSTest_failed_coll_true",
   [junit4]   2>   "fromApi":"true",
   [junit4]   2>   "replicationFactor":"2",
   [junit4]   2>   "collection.configName":"conf1",
   [junit4]   2>   "numShards":"2",
   [junit4]   2>   "autoAddReplicas":"false",
   [junit4]   2>   "nrtReplicas":"2",
   [junit4]   2>   "stateFormat":"2",
   [junit4]   2>   "operation":"create"}
   [junit4]   2> 1424238 INFO  (OverseerThreadFactory-4419-thread-2-processing-n:127.0.0.1:48251_solr) [n:127.0.0.1:48251_solr    ] o.a.s.c.CreateCollectionCmd Create collection MoveReplicaHDFSTest_failed_coll_true
   [junit4]   2> 1424238 DEBUG (OverseerCollectionConfigSetProcessor-99237044644741130-127.0.0.1:48251_solr-n_0000000000) [n:127.0.0.1:48251_solr    ] o.a.s.c.OverseerTaskProcessor Cleaning up work-queue. #Running tasks: 1
   [junit4]   2> 1424238 DEBUG (OverseerCollectionConfigSetProcessor-99237044644741130-127.0.0.1:48251_solr-n_0000000000) [n:127.0.0.1:48251_solr    ] o.a.s.c.OverseerTaskProcessor RunningTasks: [/overseer/collection-queue-work/qn-0000000002]
   [junit4]   2> 1424238 DEBUG (OverseerCollectionConfigSetProcessor-99237044644741130-127.0.0.1:48251_solr-n_0000000000) [n:127.0.0.1:48251_solr    ] o.a.s.c.OverseerTaskProcessor BlockedTasks: []
   [junit4]   2> 1424238 DEBUG (OverseerCollectionConfigSetProcessor-99237044644741130-127.0.0.1:48251_solr-n_0000000000) [n:127.0.0.1:48251_solr    ] o.a.s.c.OverseerTaskProcessor CompletedTasks: []
   [junit4]   2> 1424238 DEBUG (OverseerCollectionConfigSetProcessor-99237044644741130-127.0.0.1:48251_solr-n_0000000000) [n:127.0.0.1:48251_solr    ] o.a.s.c.OverseerTaskProcessor RunningZKTasks: [/overseer/collection-queue-work/qn-0000000002]
   [junit4]   2> 1424238 DEBUG (OverseerCollectionConfigSetProcessor-99237044644741130-127.0.0.1:48251_solr-n_0000000000) [n:127.0.0.1:48251_solr    ] o.a.s.c.OverseerTaskQueue Peeking for top 99 elements. ExcludeSet: [/overseer/collection-queue-work/qn-0000000002],[]
   [junit4]   2> 1424239 DEBUG (OverseerThreadFactory-4419-thread-2-processing-n:127.0.0.1:48251_solr) [n:127.0.0.1:48251_solr    ] o.a.s.c.Assign Identify nodes using default
   [junit4]   2> 1424239 DEBUG (OverseerThreadFactory-4419-thread-2-processing-n:127.0.0.1:48251_solr) [n:127.0.0.1:48251_solr    ] o.a.s.c.OverseerCollectionMessageHandler creating collections conf node /collections/MoveReplicaHDFSTest_failed_coll_true 
   [junit4]   2> 1424240 DEBUG (SyncThread:0) [    ] o.a.s.c.ZkTestServer Watch fired: children: /solr/collections
   [junit4]   2> 1424240 DEBUG (SyncThread:0) [    ] o.a.s.c.ZkTestServer Watch fired: children: /solr/collections
   [junit4]   2> 1424240 DEBUG (SyncThread:0) [    ] o.a.s.c.ZkTestServer Watch fired: children: /solr/collections
   [junit4]   2> 1424240 DEBUG (SyncThread:0) [    ] o.a.s.c.ZkTestServer Watch fired: children: /solr/collections
   [junit4]   2> 1424241 DEBUG (SyncThread:0) [    ] o.a.s.c.ZkTestServer Watch fired: children: /solr/collections
   [junit4]   2> 1424241 DEBUG (SyncThread:0) [    ] o.a.s.c.ZkTestServer Watch fired: children: /solr/collections
   [junit4]   2> 1424241 DEBUG (SyncThread:0) [    ] o.a.s.c.ZkTestServer Watch added: children: /solr/collections
   [junit4]   2> 1424241 DEBUG (SyncThread:0) [    ] o.a.s.c.ZkTestServer Watch added: children: /solr/collections
   [junit4]   2> 1424241 DEBUG (SyncThread:0) [    ] o.a.s.c.ZkTestServer Watch added: children: /solr/collections
   [junit4]   2> 1424241 DEBUG (OverseerThreadFactory-4419-thread-2-processing-n:127.0.0.1:48251_solr) [n:127.0.0.1:48251_solr    ] o.a.s.c.CreateCollectionCmd Check for collection zkNode:MoveReplicaHDFSTest_failed_coll_true
   [junit4]   2> 1424242 DEBUG (OverseerThreadFactory-4419-thread-2-processing-n:127.0.0.1:48251_solr) [n:127.0.0.1:48251_solr    ] o.a.s.c.CreateCollectionCmd Collection zkNode exists
   [junit4]   2> 1424242 DEBUG (SyncThread:0) [    ] o.a.s.c.ZkTestServer Watch added: children: /solr/collections
   [junit4]   2> 1424242 DEBUG (SyncThread:0) [    ] o.a.s.c.ZkTestServer Watch added: children: /solr/collections
   [junit4]   2> 1424242 DEBUG (SyncThread:0) [    ] o.a.s.c.ZkTestServer Watch added: children: /solr/collections
   [junit4]   2> 1424242 DEBUG (SyncThread:0) [    ] o.a.s.c.ZkTestServer Watch added: children: /solr/collections
   [junit4]   2> 1424243 DEBUG (SyncThread:0) [    ] o.a.s.c.ZkTestServer Watch fired: children: /solr/overseer/queue
   [junit4]   2> 1424243 DEBUG (SyncThread:0) [    ] o.a.s.c.ZkTestServer Watch added: children: /solr/overseer/queue
   [junit4]   2> 1424244 DEBUG (OverseerStateUpdate-99237044644741130-127.0.0.1:48251_solr-n_0000000000) [n:127.0.0.1:48251_solr    ] o.a.s.c.Overseer processMessage: queueSize: 1, message = {
   [junit4]   2>   "name":"MoveReplicaHDFSTest_failed_coll_true",
   [junit4]   2>   "fromApi":"true",
   [junit4]   2>   "replicationFactor":"2",
   [junit4]   2>   "collection.configName":"conf1",
   [junit4]   2>   "numShards":"2",
   [junit4]   2>   "autoAddReplicas":"false",
   [junit4]   2>   "nrtReplicas":"2",
   [junit4]   2>   "stateFormat":"2",
   [junit4]   2>   "operation":"create"} current state version: 0
   [junit4]   2> 1424244 DEBUG (OverseerStateUpdate-99237044644741130-127.0.0.1:48251_solr-n_0000000000) [n:127.0.0.1:48251_solr    ] o.a.s.c.o.ClusterStateMutator building a new cName: MoveReplicaHDFSTest_failed_coll_true
   [junit4]   2> 1424244 DEBUG (OverseerStateUpdate-99237044644741130-127.0.0.1:48251_solr-n_0000000000) [n:127.0.0.1:48251_solr    ] o.a.s.c.o.ZkStateWriter going to create_collection /collections/MoveReplicaHDFSTest_failed_coll_true/state.json
   [junit4]   2> 1424245 DEBUG (SyncThread:0) [    ] o.a.s.c.ZkTestServer Watch fired: children: /solr/overseer/queue
   [junit4]   2> 1424245 DEBUG (SyncThread:0) [    ] o.a.s.c.ZkTestServer Watch added: children: /solr/overseer/queue
   [junit4]   2> 1424348 DEBUG (OverseerThreadFactory-4419-thread-2-processing-n:127.0.0.1:48251_solr) [n:127.0.0.1:48251_solr    ] o.a.s.c.CreateCollectionCmd Creating SolrCores for new collection MoveReplicaHDFSTest_failed_coll_true, shardNames [shard1, shard2] , message : {
   [junit4]   2>   "name":"MoveReplicaHDFSTest_failed_coll_true",
   [junit4]   2>   "fromApi":"true",
   [junit4]   2>   "replicationFactor":"2",
   [junit4]   2>   "collection.configName":"conf1",
   [junit4]   2>   "numShards":"2",
   [junit4]   2>   "autoAddReplicas":"false",
   [junit4]   2>   "nrtReplicas":"2",
   [junit4]   2>   "stateFormat":"2",
   [junit4]   2>   "operation":"create"}
   [junit4]   2> 1424350 DEBUG (OverseerThreadFactory-4419-thread-2-processing-n:127.0.0.1:48251_solr) [n:127.0.0.1:48251_solr    ] o.a.s.c.CreateCollectionCmd Creating core MoveReplicaHDFSTest_failed_coll_true_shard1_replica_n1 as part of shard shard1 of collection MoveReplicaHDFSTest_failed_coll_true on 127.0.0.1:48251_solr
   [junit4]   2> 1424351 DEBUG (SyncThread:0) [    ] o.a.s.c.ZkTestServer Watch fired: children: /solr/overseer/queue
   [junit4]   2> 1424352 DEBUG (SyncThread:0) [    ] o.a.s.c.ZkTestServer Watch added: children: /solr/overseer/queue
   [junit4]   2> 1424352 DEBUG (OverseerStateUpdate-99237044644741130-127.0.0.1:48251_solr-n_0000000000) [n:127.0.0.1:48251_solr    ] o.a.s.c.Overseer processMessage: queueSize: 1, message = {
   [junit4]   2>   "operation":"ADDREPLICA",
   [junit4]   2>   "collection":"MoveReplicaHDFSTest_failed_coll_true",
   [junit4]   2>   "shard":"shard1",
   [junit4]   2>   "core":"MoveReplicaHDFSTest_failed_coll_true_shard1_replica_n1",
   [junit4]   2>   "state":"down",
   [junit4]   2>   "base_url":"http://127.0.0.1:48251/solr",
   [junit4]   2>   "type":"NRT",
   [junit4]   2>   "waitForFinalState":"false"} current state version: 0
   [junit4]   2> 1424352 INFO  (OverseerStateUpdate-99237044644741130-127.0.0.1:48251_solr-n_0000000000) [n:127.0.0.1:48251_solr    ] o.a.s.c.o.SliceMutator createReplica() {
   [junit4]   2>   "operation":"ADDREPLICA",
   [junit4]   2>   "collection":"MoveReplicaHDFSTest_failed_coll_true",
   [junit4]   2>   "shard":"shard1",
   [junit4]   2>   "core":"MoveReplicaHDFSTest_failed_coll_true_shard1_replica_n1",
   [junit4]   2>   "state":"down",
   [junit4]   2>   "base_url":"http://127.0.0.1:48251/solr",
   [junit4]   2>   "type":"NRT",
   [junit4]   2>   "waitForFinalState":"false"} 
   [junit4]   2> 1424353 DEBUG (OverseerThreadFactory-4419-thread-2-processing-n:127.0.0.1:48251_solr) [n:127.0.0.1:48251_solr    ] o.a.s.c.CreateCollectionCmd Creating core MoveReplicaHDFSTest_failed_coll_true_shard1_replica_n2 as part of shard shard1 of collection MoveReplicaHDFSTest_failed_coll_true on 127.0.0.1:49804_solr
   [junit4]   2> 1424354 DEBUG (OverseerStateUpdate-99237044644741130-127.0.0.1:48251_solr-n_0000000000) [n:127.0.0.1:48251_solr    ] o.a.s.c.o.SliceMutator Old Slice: shard1:{
   [junit4]   2>   "range":"80000000-ffffffff",
   [junit4]   2>   "state":"active",
   [junit4]   2>   "replicas":{}}
   [junit4]   2> 1424354 DEBUG (OverseerStateUpdate-99237044644741130-127.0.0.1:48251_solr-n_0000000000) [n:127.0.0.1:48251_solr    ] o.a.s.c.o.SliceMutator New Slice: shard1:{
   [junit4]   2>   "range":"80000000-ffffffff",
   [junit4]   2>   "state":"active",
   [junit4]   2>   "replicas":{"core_node3":{
   [junit4]   2>       "core":"MoveReplicaHDFSTest_failed_coll_true_shard1_replica_n1",
   [junit4]   2>       "base_url":"http://127.0.0.1:48251/solr",
   [junit4]   2>       "state":"down",
   [junit4]   2>       "node_n

[...truncated too long message...]

serv1-vm3:50264/data/MoveReplicaHDFSTest_coll_false/core_node12/data/index
   [junit4]   2> 1505123 INFO  (coreCloseExecutor-4558-thread-1) [n:127.0.0.1:47909_solr c:MoveReplicaHDFSTest_coll_false s:shard2 r:core_node12 x:MoveReplicaHDFSTest_coll_false_shard2_replica_n11] o.a.s.s.h.HdfsDirectory Closing hdfs directory hdfs://serv1-vm3:50264/data/MoveReplicaHDFSTest_coll_false/core_node12/data/snapshot_metadata
   [junit4]   2> 1505123 INFO  (coreCloseExecutor-4558-thread-1) [n:127.0.0.1:47909_solr c:MoveReplicaHDFSTest_coll_false s:shard2 r:core_node12 x:MoveReplicaHDFSTest_coll_false_shard2_replica_n11] o.a.s.s.h.HdfsDirectory Closing hdfs directory hdfs://serv1-vm3:50264/data/MoveReplicaHDFSTest_coll_false/core_node12/data
   [junit4]   2> 1505138 INFO  (jetty-closer-2617-thread-5) [    ] o.e.j.s.h.ContextHandler Stopped o.e.j.s.ServletContextHandler@41867847{/solr,null,UNAVAILABLE}
   [junit4]   2> 1505140 INFO  (jetty-closer-2617-thread-3) [    ] o.e.j.s.h.ContextHandler Stopped o.e.j.s.ServletContextHandler@685bcbad{/solr,null,UNAVAILABLE}
   [junit4]   2> 1506544 INFO  (org.apache.hadoop.hdfs.server.blockmanagement.BlockManager$ReplicationMonitor@14635179) [    ] BlockStateChange BLOCK* BlockManager: ask 127.0.0.1:52871 to delete [blk_1073742131_1308]
   [junit4]   2> 1506575 INFO  (jetty-closer-2617-thread-4) [    ] o.e.j.s.h.ContextHandler Stopped o.e.j.s.ServletContextHandler@78f6e1d6{/solr,null,UNAVAILABLE}
   [junit4]   2> 1506577 ERROR (SUITE-MoveReplicaHDFSTest-seed#[2AE73FA5E9EB708E]-worker) [    ] o.a.z.s.ZooKeeperServer ZKShutdownHandler is not registered, so ZooKeeper server won't take any action on ERROR or SHUTDOWN server state changes
   [junit4]   2> 1506579 INFO  (SUITE-MoveReplicaHDFSTest-seed#[2AE73FA5E9EB708E]-worker) [    ] o.a.s.c.ZkTestServer connecting to 127.0.0.1:61702 61702
   [junit4]   2> 1509548 INFO  (org.apache.hadoop.hdfs.server.blockmanagement.BlockManager$ReplicationMonitor@14635179) [    ] BlockStateChange BLOCK* BlockManager: ask 127.0.0.1:42293 to delete [blk_1073742131_1308]
   [junit4]   2> 1516718 INFO  (Thread-1903) [    ] o.a.s.c.ZkTestServer connecting to 127.0.0.1:61702 61702
   [junit4]   2> 1516720 WARN  (Thread-1903) [    ] o.a.s.c.ZkTestServer Watch limit violations: 
   [junit4]   2> Maximum concurrent create/delete watches above limit:
   [junit4]   2> 
   [junit4]   2> 	18	/solr/configs/conf1
   [junit4]   2> 	12	/solr/clusterprops.json
   [junit4]   2> 	12	/solr/aliases.json
   [junit4]   2> 	7	/solr/security.json
   [junit4]   2> 
   [junit4]   2> Maximum concurrent data watches above limit:
   [junit4]   2> 
   [junit4]   2> 	74	/solr/collections/MoveReplicaHDFSTest_coll_true/state.json
   [junit4]   2> 	62	/solr/collections/MoveReplicaHDFSTest_coll_false/state.json
   [junit4]   2> 	33	/solr/collections/MoveReplicaHDFSTest_failed_coll_true/state.json
   [junit4]   2> 	32	/solr/collections/MoveReplicaHDFSTest_failed_coll_false/state.json
   [junit4]   2> 	12	/solr/clusterstate.json
   [junit4]   2> 	3	/solr/collections/MoveReplicaHDFSTest_coll_true/leader_elect/shard2/election/99237044644741137-core_node8-n_0000000000
   [junit4]   2> 	2	/solr/overseer_elect/election/99237044644741127-127.0.0.1:49804_solr-n_0000000001
   [junit4]   2> 	2	/solr/collections/MoveReplicaHDFSTest_coll_false/leader_elect/shard2/election/99237044644741141-core_node7-n_0000000001
   [junit4]   2> 	2	/solr/overseer_elect/election/99237044644741137-127.0.0.1:54560_solr-n_0000000004
   [junit4]   2> 	2	/solr/autoscaling.json
   [junit4]   2> 
   [junit4]   2> Maximum concurrent children watches above limit:
   [junit4]   2> 
   [junit4]   2> 	31	/solr/collections
   [junit4]   2> 	23	/solr/live_nodes
   [junit4]   2> 	2	/solr/overseer/queue
   [junit4]   2> 	2	/solr/autoscaling/events/.auto_add_replicas
   [junit4]   2> 	2	/solr/overseer/collection-queue-work
   [junit4]   2> 	2	/solr/overseer/queue-work
   [junit4]   2> 
   [junit4]   2> 1516723 WARN  (SUITE-MoveReplicaHDFSTest-seed#[2AE73FA5E9EB708E]-worker) [    ] o.a.h.h.s.d.DirectoryScanner DirectoryScanner: shutdown has been called
   [junit4]   2> 1516725 WARN  (DataNode: [[[DISK]file:/export/home/jenkins/workspace/Lucene-Solr-master-Solaris/solr/build/solr-core/test/J0/temp/solr.cloud.MoveReplicaHDFSTest_2AE73FA5E9EB708E-001/tempDir-002/hdfsBaseDir/data/data3/, [DISK]file:/export/home/jenkins/workspace/Lucene-Solr-master-Solaris/solr/build/solr-core/test/J0/temp/solr.cloud.MoveReplicaHDFSTest_2AE73FA5E9EB708E-001/tempDir-002/hdfsBaseDir/data/data4/]]  heartbeating to serv1-vm3/127.0.0.1:50264) [    ] o.a.h.h.s.d.DataNode Ending block pool service for: Block pool BP-724696262-127.0.0.1-1514237133109 (Datanode Uuid a7c8b630-c40a-41b9-9589-07a2892901d6) service to serv1-vm3/127.0.0.1:50264
   [junit4]   2> 1516732 INFO  (SUITE-MoveReplicaHDFSTest-seed#[2AE73FA5E9EB708E]-worker) [    ] o.m.log Stopped HttpServer2$SelectChannelConnectorWithSafeStartup@localhost:0
   [junit4]   2> 1516836 WARN  (SUITE-MoveReplicaHDFSTest-seed#[2AE73FA5E9EB708E]-worker) [    ] o.a.h.h.s.d.DirectoryScanner DirectoryScanner: shutdown has been called
   [junit4]   2> 1516844 INFO  (SUITE-MoveReplicaHDFSTest-seed#[2AE73FA5E9EB708E]-worker) [    ] o.m.log Stopped HttpServer2$SelectChannelConnectorWithSafeStartup@localhost:0
   [junit4]   2> 1516848 WARN  (DataNode: [[[DISK]file:/export/home/jenkins/workspace/Lucene-Solr-master-Solaris/solr/build/solr-core/test/J0/temp/solr.cloud.MoveReplicaHDFSTest_2AE73FA5E9EB708E-001/tempDir-002/hdfsBaseDir/data/data1/, [DISK]file:/export/home/jenkins/workspace/Lucene-Solr-master-Solaris/solr/build/solr-core/test/J0/temp/solr.cloud.MoveReplicaHDFSTest_2AE73FA5E9EB708E-001/tempDir-002/hdfsBaseDir/data/data2/]]  heartbeating to serv1-vm3/127.0.0.1:50264) [    ] o.a.h.h.s.d.IncrementalBlockReportManager IncrementalBlockReportManager interrupted
   [junit4]   2> 1516848 WARN  (DataNode: [[[DISK]file:/export/home/jenkins/workspace/Lucene-Solr-master-Solaris/solr/build/solr-core/test/J0/temp/solr.cloud.MoveReplicaHDFSTest_2AE73FA5E9EB708E-001/tempDir-002/hdfsBaseDir/data/data1/, [DISK]file:/export/home/jenkins/workspace/Lucene-Solr-master-Solaris/solr/build/solr-core/test/J0/temp/solr.cloud.MoveReplicaHDFSTest_2AE73FA5E9EB708E-001/tempDir-002/hdfsBaseDir/data/data2/]]  heartbeating to serv1-vm3/127.0.0.1:50264) [    ] o.a.h.h.s.d.DataNode Ending block pool service for: Block pool BP-724696262-127.0.0.1-1514237133109 (Datanode Uuid 524a620f-351c-4b4e-a91a-69a4e74579fc) service to serv1-vm3/127.0.0.1:50264
   [junit4]   2> 1516871 INFO  (SUITE-MoveReplicaHDFSTest-seed#[2AE73FA5E9EB708E]-worker) [    ] o.m.log Stopped HttpServer2$SelectChannelConnectorWithSafeStartup@serv1-vm3:0
   [junit4]   2> 1517004 INFO  (SUITE-MoveReplicaHDFSTest-seed#[2AE73FA5E9EB708E]-worker) [    ] o.a.s.c.ZkTestServer connecting to 127.0.0.1:61702 61702
   [junit4]   2> NOTE: leaving temporary files on disk at: /export/home/jenkins/workspace/Lucene-Solr-master-Solaris/solr/build/solr-core/test/J0/temp/solr.cloud.MoveReplicaHDFSTest_2AE73FA5E9EB708E-001
   [junit4]   2> Dec 25, 2017 9:27:15 PM com.carrotsearch.randomizedtesting.ThreadLeakControl checkThreadLeaks
   [junit4]   2> WARNING: Will linger awaiting termination of 26 leaked thread(s).
   [junit4]   2> NOTE: test params are: codec=Asserting(Lucene70): {_version_=TestBloomFilteredLucenePostings(BloomFilteringPostingsFormat(Lucene50(blocksize=128))), id=BlockTreeOrds(blocksize=128)}, docValues:{}, maxPointsInLeafNode=862, maxMBSortInHeap=5.881620886910431, sim=Asserting(org.apache.lucene.search.similarities.AssertingSimilarity@479acacc), locale=es-CL, timezone=America/Sao_Paulo
   [junit4]   2> NOTE: SunOS 5.11 amd64/Oracle Corporation 1.8.0_152 (64-bit)/cpus=3,threads=6,free=162572512,total=516861952
   [junit4]   2> NOTE: All tests run in this JVM: [HdfsBasicDistributedZkTest, OverseerTest, TestDynamicLoading, TestLFUCache, TriLevelCompositeIdRoutingTest, TestFieldTypeResource, DistributedSuggestComponentTest, ResponseHeaderTest, HdfsTlogReplayBufferedWhileIndexingTest, QueryResultKeyTest, TestBinaryField, TestStressRecovery, DistanceFunctionTest, TestPullReplica, TestCloudInspectUtil, TestMacros, AsyncCallRequestStatusResponseTest, TestRestoreCore, CollectionTooManyReplicasTest, ShardSplitTest, SolrRequestParserTest, CircularListTest, TestTestInjection, TestCollectionsAPIViaSolrCloudCluster, SimpleCollectionCreateDeleteTest, TestEmbeddedSolrServerSchemaAPI, CdcrVersionReplicationTest, TestPKIAuthenticationPlugin, TestSimDistributedQueue, MultiTermTest, BinaryUpdateRequestHandlerTest, MetricTriggerTest, TestExclusionRuleCollectionAccess, TestRealTimeGet, ChaosMonkeyNothingIsSafeTest, AtomicUpdateProcessorFactoryTest, HdfsChaosMonkeySafeLeaderTest, DistributedSpellCheckComponentTest, DistribCursorPagingTest, DateFieldTest, TestSweetSpotSimilarityFactory, VersionInfoTest, BasicAuthIntegrationTest, TestCollationFieldDocValues, TestQuerySenderNoQuery, MetricsConfigTest, TestJavabinTupleStreamParser, ExplicitHLLTest, TestCloudPivotFacet, TestPhraseSuggestions, BigEndianAscendingWordSerializerTest, TestConfigSetsAPIExclusivity, CoreSorterTest, DistributedVersionInfoTest, UnloadDistributedZkTest, TestLockTree, RecoveryZkTest, TestDistributedSearch, RAMDirectoryFactoryTest, TestMultiWordSynonyms, TestRestManager, TestUpdate, SolrMetricsIntegrationTest, TestOrdValues, LeaderElectionTest, ParsingFieldUpdateProcessorsTest, TestFuzzyAnalyzedSuggestions, TestManagedResource, SolrInfoBeanTest, CdcrBootstrapTest, TestRecovery, TestReplicationHandlerBackup, TestAuthenticationFramework, LeaderInitiatedRecoveryOnCommitTest, TestShardHandlerFactory, OutputWriterTest, DateRangeFieldTest, HighlighterTest, TestScoreJoinQPScore, TestManagedSynonymFilterFactory, DistanceUnitsTest, DeleteShardTest, TestCodecSupport, TestExecutePlanAction, SolrCmdDistributorTest, DeleteNodeTest, MoveReplicaHDFSTest]
   [junit4] Completed [229/765 (1!)] on J0 in 113.75s, 4 tests, 1 error <<< FAILURES!

[...truncated 49850 lines...]

Mime
View raw message