lucene-dev mailing list archives

Site index · List index
Message view « Date » · « Thread »
Top « Date » · « Thread »
From Policeman Jenkins Server <jenk...@thetaphi.de>
Subject [JENKINS] Lucene-Solr-master-Solaris (64bit/jdk1.8.0) - Build # 1553 - Unstable!
Date Mon, 04 Dec 2017 15:37:04 GMT
Build: https://jenkins.thetaphi.de/job/Lucene-Solr-master-Solaris/1553/
Java: 64bit/jdk1.8.0 -XX:+UseCompressedOops -XX:+UseSerialGC

1 tests failed.
FAILED:  org.apache.solr.cloud.autoscaling.TriggerIntegrationTest.testTriggerThrottling

Error Message:
Both triggers should have fired by now

Stack Trace:
java.lang.AssertionError: Both triggers should have fired by now
	at __randomizedtesting.SeedInfo.seed([1B22282045F7894E:E0008005975D6ADC]:0)
	at org.junit.Assert.fail(Assert.java:93)
	at org.apache.solr.cloud.autoscaling.TriggerIntegrationTest.testTriggerThrottling(TriggerIntegrationTest.java:205)
	at sun.reflect.NativeMethodAccessorImpl.invoke0(Native Method)
	at sun.reflect.NativeMethodAccessorImpl.invoke(NativeMethodAccessorImpl.java:62)
	at sun.reflect.DelegatingMethodAccessorImpl.invoke(DelegatingMethodAccessorImpl.java:43)
	at java.lang.reflect.Method.invoke(Method.java:498)
	at com.carrotsearch.randomizedtesting.RandomizedRunner.invoke(RandomizedRunner.java:1737)
	at com.carrotsearch.randomizedtesting.RandomizedRunner$8.evaluate(RandomizedRunner.java:934)
	at com.carrotsearch.randomizedtesting.RandomizedRunner$9.evaluate(RandomizedRunner.java:970)
	at com.carrotsearch.randomizedtesting.RandomizedRunner$10.evaluate(RandomizedRunner.java:984)
	at com.carrotsearch.randomizedtesting.rules.SystemPropertiesRestoreRule$1.evaluate(SystemPropertiesRestoreRule.java:57)
	at org.apache.lucene.util.TestRuleSetupTeardownChained$1.evaluate(TestRuleSetupTeardownChained.java:49)
	at org.apache.lucene.util.AbstractBeforeAfterRule$1.evaluate(AbstractBeforeAfterRule.java:45)
	at org.apache.lucene.util.TestRuleThreadAndTestName$1.evaluate(TestRuleThreadAndTestName.java:48)
	at org.apache.lucene.util.TestRuleIgnoreAfterMaxFailures$1.evaluate(TestRuleIgnoreAfterMaxFailures.java:64)
	at org.apache.lucene.util.TestRuleMarkFailure$1.evaluate(TestRuleMarkFailure.java:47)
	at com.carrotsearch.randomizedtesting.rules.StatementAdapter.evaluate(StatementAdapter.java:36)
	at com.carrotsearch.randomizedtesting.ThreadLeakControl$StatementRunner.run(ThreadLeakControl.java:368)
	at com.carrotsearch.randomizedtesting.ThreadLeakControl.forkTimeoutingTask(ThreadLeakControl.java:817)
	at com.carrotsearch.randomizedtesting.ThreadLeakControl$3.evaluate(ThreadLeakControl.java:468)
	at com.carrotsearch.randomizedtesting.RandomizedRunner.runSingleTest(RandomizedRunner.java:943)
	at com.carrotsearch.randomizedtesting.RandomizedRunner$5.evaluate(RandomizedRunner.java:829)
	at com.carrotsearch.randomizedtesting.RandomizedRunner$6.evaluate(RandomizedRunner.java:879)
	at com.carrotsearch.randomizedtesting.RandomizedRunner$7.evaluate(RandomizedRunner.java:890)
	at com.carrotsearch.randomizedtesting.rules.StatementAdapter.evaluate(StatementAdapter.java:36)
	at com.carrotsearch.randomizedtesting.rules.SystemPropertiesRestoreRule$1.evaluate(SystemPropertiesRestoreRule.java:57)
	at org.apache.lucene.util.AbstractBeforeAfterRule$1.evaluate(AbstractBeforeAfterRule.java:45)
	at com.carrotsearch.randomizedtesting.rules.StatementAdapter.evaluate(StatementAdapter.java:36)
	at org.apache.lucene.util.TestRuleStoreClassName$1.evaluate(TestRuleStoreClassName.java:41)
	at com.carrotsearch.randomizedtesting.rules.NoShadowingOrOverridesOnMethodsRule$1.evaluate(NoShadowingOrOverridesOnMethodsRule.java:40)
	at com.carrotsearch.randomizedtesting.rules.NoShadowingOrOverridesOnMethodsRule$1.evaluate(NoShadowingOrOverridesOnMethodsRule.java:40)
	at com.carrotsearch.randomizedtesting.rules.StatementAdapter.evaluate(StatementAdapter.java:36)
	at com.carrotsearch.randomizedtesting.rules.StatementAdapter.evaluate(StatementAdapter.java:36)
	at com.carrotsearch.randomizedtesting.rules.StatementAdapter.evaluate(StatementAdapter.java:36)
	at org.apache.lucene.util.TestRuleAssertionsRequired$1.evaluate(TestRuleAssertionsRequired.java:53)
	at org.apache.lucene.util.TestRuleMarkFailure$1.evaluate(TestRuleMarkFailure.java:47)
	at org.apache.lucene.util.TestRuleIgnoreAfterMaxFailures$1.evaluate(TestRuleIgnoreAfterMaxFailures.java:64)
	at org.apache.lucene.util.TestRuleIgnoreTestSuites$1.evaluate(TestRuleIgnoreTestSuites.java:54)
	at com.carrotsearch.randomizedtesting.rules.StatementAdapter.evaluate(StatementAdapter.java:36)
	at com.carrotsearch.randomizedtesting.ThreadLeakControl$StatementRunner.run(ThreadLeakControl.java:368)
	at java.lang.Thread.run(Thread.java:748)




Build Log:
[...truncated 13427 lines...]
   [junit4] Suite: org.apache.solr.cloud.autoscaling.TriggerIntegrationTest
   [junit4]   2> Creating dataDir: /export/home/jenkins/workspace/Lucene-Solr-master-Solaris/solr/build/solr-core/test/J1/temp/solr.cloud.autoscaling.TriggerIntegrationTest_1B22282045F7894E-001/init-core-data-001
   [junit4]   2> 3119764 WARN  (SUITE-TriggerIntegrationTest-seed#[1B22282045F7894E]-worker) [    ] o.a.s.SolrTestCaseJ4 startTrackingSearchers: numOpens=8 numCloses=8
   [junit4]   2> 3119764 INFO  (SUITE-TriggerIntegrationTest-seed#[1B22282045F7894E]-worker) [    ] o.a.s.SolrTestCaseJ4 Using TrieFields (NUMERIC_POINTS_SYSPROP=false) w/NUMERIC_DOCVALUES_SYSPROP=true
   [junit4]   2> 3119766 INFO  (SUITE-TriggerIntegrationTest-seed#[1B22282045F7894E]-worker) [    ] o.a.s.SolrTestCaseJ4 Randomized ssl (false) and clientAuth (false) via: @org.apache.solr.util.RandomizeSSL(reason=, value=NaN, ssl=NaN, clientAuth=NaN)
   [junit4]   2> 3119766 INFO  (SUITE-TriggerIntegrationTest-seed#[1B22282045F7894E]-worker) [    ] o.a.s.SolrTestCaseJ4 SecureRandom sanity checks: test.solr.allowed.securerandom=null & java.security.egd=file:/dev/./urandom
   [junit4]   2> 3119766 INFO  (SUITE-TriggerIntegrationTest-seed#[1B22282045F7894E]-worker) [    ] o.a.s.c.MiniSolrCloudCluster Starting cluster of 2 servers in /export/home/jenkins/workspace/Lucene-Solr-master-Solaris/solr/build/solr-core/test/J1/temp/solr.cloud.autoscaling.TriggerIntegrationTest_1B22282045F7894E-001/tempDir-001
   [junit4]   2> 3119766 INFO  (SUITE-TriggerIntegrationTest-seed#[1B22282045F7894E]-worker) [    ] o.a.s.c.ZkTestServer STARTING ZK TEST SERVER
   [junit4]   2> 3119767 INFO  (Thread-8872) [    ] o.a.s.c.ZkTestServer client port:0.0.0.0/0.0.0.0:0
   [junit4]   2> 3119767 INFO  (Thread-8872) [    ] o.a.s.c.ZkTestServer Starting server
   [junit4]   2> 3119770 ERROR (Thread-8872) [    ] o.a.z.s.ZooKeeperServer ZKShutdownHandler is not registered, so ZooKeeper server won't take any action on ERROR or SHUTDOWN server state changes
   [junit4]   2> 3119867 INFO  (SUITE-TriggerIntegrationTest-seed#[1B22282045F7894E]-worker) [    ] o.a.s.c.ZkTestServer start zk server on port:36648
   [junit4]   2> 3119890 INFO  (jetty-launcher-4907-thread-2) [    ] o.e.j.s.Server jetty-9.3.20.v20170531
   [junit4]   2> 3119890 INFO  (jetty-launcher-4907-thread-1) [    ] o.e.j.s.Server jetty-9.3.20.v20170531
   [junit4]   2> 3119894 INFO  (jetty-launcher-4907-thread-2) [    ] o.e.j.s.h.ContextHandler Started o.e.j.s.ServletContextHandler@70d8f404{/solr,null,AVAILABLE}
   [junit4]   2> 3119894 INFO  (jetty-launcher-4907-thread-1) [    ] o.e.j.s.h.ContextHandler Started o.e.j.s.ServletContextHandler@7175b609{/solr,null,AVAILABLE}
   [junit4]   2> 3119895 INFO  (jetty-launcher-4907-thread-1) [    ] o.e.j.s.AbstractConnector Started ServerConnector@2b225de4{HTTP/1.1,[http/1.1]}{127.0.0.1:50260}
   [junit4]   2> 3119895 INFO  (jetty-launcher-4907-thread-1) [    ] o.e.j.s.Server Started @3124240ms
   [junit4]   2> 3119895 INFO  (jetty-launcher-4907-thread-1) [    ] o.a.s.c.s.e.JettySolrRunner Jetty properties: {hostContext=/solr, hostPort=50260}
   [junit4]   2> 3119896 ERROR (jetty-launcher-4907-thread-1) [    ] o.a.s.u.StartupLoggingUtils Missing Java Option solr.log.dir. Logging may be missing or incomplete.
   [junit4]   2> 3119896 INFO  (jetty-launcher-4907-thread-1) [    ] o.a.s.s.SolrDispatchFilter  ___      _       Welcome to Apache Solr™ version 8.0.0
   [junit4]   2> 3119896 INFO  (jetty-launcher-4907-thread-1) [    ] o.a.s.s.SolrDispatchFilter / __| ___| |_ _   Starting in cloud mode on port null
   [junit4]   2> 3119896 INFO  (jetty-launcher-4907-thread-1) [    ] o.a.s.s.SolrDispatchFilter \__ \/ _ \ | '_|  Install dir: null
   [junit4]   2> 3119896 INFO  (jetty-launcher-4907-thread-1) [    ] o.a.s.s.SolrDispatchFilter |___/\___/_|_|    Start time: 2017-12-04T15:06:52.012Z
   [junit4]   2> 3119900 INFO  (jetty-launcher-4907-thread-2) [    ] o.e.j.s.AbstractConnector Started ServerConnector@78a26c1f{HTTP/1.1,[http/1.1]}{127.0.0.1:53791}
   [junit4]   2> 3119900 INFO  (jetty-launcher-4907-thread-2) [    ] o.e.j.s.Server Started @3124245ms
   [junit4]   2> 3119900 INFO  (jetty-launcher-4907-thread-2) [    ] o.a.s.c.s.e.JettySolrRunner Jetty properties: {hostContext=/solr, hostPort=53791}
   [junit4]   2> 3119900 ERROR (jetty-launcher-4907-thread-2) [    ] o.a.s.u.StartupLoggingUtils Missing Java Option solr.log.dir. Logging may be missing or incomplete.
   [junit4]   2> 3119900 INFO  (jetty-launcher-4907-thread-2) [    ] o.a.s.s.SolrDispatchFilter  ___      _       Welcome to Apache Solr™ version 8.0.0
   [junit4]   2> 3119900 INFO  (jetty-launcher-4907-thread-2) [    ] o.a.s.s.SolrDispatchFilter / __| ___| |_ _   Starting in cloud mode on port null
   [junit4]   2> 3119900 INFO  (jetty-launcher-4907-thread-2) [    ] o.a.s.s.SolrDispatchFilter \__ \/ _ \ | '_|  Install dir: null
   [junit4]   2> 3119900 INFO  (jetty-launcher-4907-thread-2) [    ] o.a.s.s.SolrDispatchFilter |___/\___/_|_|    Start time: 2017-12-04T15:06:52.016Z
   [junit4]   2> 3119902 INFO  (jetty-launcher-4907-thread-1) [    ] o.a.s.s.SolrDispatchFilter solr.xml found in ZooKeeper. Loading...
   [junit4]   2> 3119903 INFO  (jetty-launcher-4907-thread-2) [    ] o.a.s.s.SolrDispatchFilter solr.xml found in ZooKeeper. Loading...
   [junit4]   2> 3119909 INFO  (jetty-launcher-4907-thread-2) [    ] o.a.s.c.ZkContainer Zookeeper client=127.0.0.1:36648/solr
   [junit4]   2> 3119909 INFO  (jetty-launcher-4907-thread-1) [    ] o.a.s.c.ZkContainer Zookeeper client=127.0.0.1:36648/solr
   [junit4]   2> 3120045 INFO  (jetty-launcher-4907-thread-2) [n:127.0.0.1:53791_solr    ] o.a.s.c.Overseer Overseer (id=null) closing
   [junit4]   2> 3120046 INFO  (jetty-launcher-4907-thread-2) [n:127.0.0.1:53791_solr    ] o.a.s.c.OverseerElectionContext I am going to be the leader 127.0.0.1:53791_solr
   [junit4]   2> 3120047 INFO  (jetty-launcher-4907-thread-2) [n:127.0.0.1:53791_solr    ] o.a.s.c.Overseer Overseer (id=99116647178764293-127.0.0.1:53791_solr-n_0000000000) starting
   [junit4]   2> 3120050 INFO  (jetty-launcher-4907-thread-1) [n:127.0.0.1:50260_solr    ] o.a.s.c.Overseer Overseer (id=null) closing
   [junit4]   2> 3120051 INFO  (jetty-launcher-4907-thread-1) [n:127.0.0.1:50260_solr    ] o.a.s.c.ZkController Register node as live in ZooKeeper:/live_nodes/127.0.0.1:50260_solr
   [junit4]   2> 3120054 INFO  (zkCallback-4918-thread-1-processing-n:127.0.0.1:53791_solr) [n:127.0.0.1:53791_solr    ] o.a.s.c.c.ZkStateReader Updated live nodes from ZooKeeper... (0) -> (1)
   [junit4]   2> 3120058 DEBUG (OverseerAutoScalingTriggerThread-99116647178764293-127.0.0.1:53791_solr-n_0000000000) [n:127.0.0.1:53791_solr    ] o.a.s.c.a.OverseerTriggerThread Adding .autoAddReplicas trigger
   [junit4]   2> 3120061 INFO  (zkCallback-4919-thread-1-processing-n:127.0.0.1:50260_solr) [n:127.0.0.1:50260_solr    ] o.a.s.c.c.ZkStateReader Updated live nodes from ZooKeeper... (0) -> (1)
   [junit4]   2> 3120061 INFO  (jetty-launcher-4907-thread-2) [n:127.0.0.1:53791_solr    ] o.a.s.c.ZkController Register node as live in ZooKeeper:/live_nodes/127.0.0.1:53791_solr
   [junit4]   2> 3120062 DEBUG (OverseerAutoScalingTriggerThread-99116647178764293-127.0.0.1:53791_solr-n_0000000000) [n:127.0.0.1:53791_solr    ] o.a.s.c.a.OverseerTriggerThread Refreshing /autoscaling.json with znode version 1
   [junit4]   2> 3120063 INFO  (zkCallback-4918-thread-1-processing-n:127.0.0.1:53791_solr) [n:127.0.0.1:53791_solr    ] o.a.s.c.c.ZkStateReader Updated live nodes from ZooKeeper... (1) -> (2)
   [junit4]   2> 3120063 DEBUG (OverseerAutoScalingTriggerThread-99116647178764293-127.0.0.1:53791_solr-n_0000000000) [n:127.0.0.1:53791_solr    ] o.a.s.c.a.NodeLostTrigger Initial livenodes: [127.0.0.1:53791_solr, 127.0.0.1:50260_solr]
   [junit4]   2> 3120063 DEBUG (OverseerAutoScalingTriggerThread-99116647178764293-127.0.0.1:53791_solr-n_0000000000) [n:127.0.0.1:53791_solr    ] o.a.s.c.a.OverseerTriggerThread Current znodeVersion 1, lastZnodeVersion -1
   [junit4]   2> 3120063 DEBUG (OverseerAutoScalingTriggerThread-99116647178764293-127.0.0.1:53791_solr-n_0000000000) [n:127.0.0.1:53791_solr    ] o.a.s.c.a.OverseerTriggerThread Processed trigger updates upto znodeVersion 1
   [junit4]   2> 3120065 DEBUG (OverseerAutoScalingTriggerThread-99116647178764293-127.0.0.1:53791_solr-n_0000000000) [n:127.0.0.1:53791_solr    ] o.a.s.c.a.OverseerTriggerThread -- clean old nodeAdded markers
   [junit4]   2> 3120065 DEBUG (OverseerAutoScalingTriggerThread-99116647178764293-127.0.0.1:53791_solr-n_0000000000) [n:127.0.0.1:53791_solr    ] o.a.s.c.a.OverseerTriggerThread Current znodeVersion 1, lastZnodeVersion 1
   [junit4]   2> 3120066 DEBUG (ScheduledTrigger-10136-thread-1) [n:127.0.0.1:53791_solr    ] o.a.s.c.a.NodeLostTrigger Running NodeLostTrigger: .auto_add_replicas with currently live nodes: [127.0.0.1:53791_solr, 127.0.0.1:50260_solr]
   [junit4]   2> 3120067 INFO  (zkCallback-4919-thread-1-processing-n:127.0.0.1:50260_solr) [n:127.0.0.1:50260_solr    ] o.a.s.c.c.ZkStateReader Updated live nodes from ZooKeeper... (1) -> (2)
   [junit4]   2> 3120154 INFO  (jetty-launcher-4907-thread-2) [n:127.0.0.1:53791_solr    ] o.a.s.m.r.SolrJmxReporter JMX monitoring for 'solr_53791.solr.node' (registry 'solr.node') enabled at server: com.sun.jmx.mbeanserver.JmxMBeanServer@40dac22a
   [junit4]   2> 3120155 INFO  (jetty-launcher-4907-thread-1) [n:127.0.0.1:50260_solr    ] o.a.s.m.r.SolrJmxReporter JMX monitoring for 'solr_50260.solr.node' (registry 'solr.node') enabled at server: com.sun.jmx.mbeanserver.JmxMBeanServer@40dac22a
   [junit4]   2> 3120160 INFO  (jetty-launcher-4907-thread-2) [n:127.0.0.1:53791_solr    ] o.a.s.m.r.SolrJmxReporter JMX monitoring for 'solr_53791.solr.jvm' (registry 'solr.jvm') enabled at server: com.sun.jmx.mbeanserver.JmxMBeanServer@40dac22a
   [junit4]   2> 3120160 INFO  (jetty-launcher-4907-thread-2) [n:127.0.0.1:53791_solr    ] o.a.s.m.r.SolrJmxReporter JMX monitoring for 'solr_53791.solr.jetty' (registry 'solr.jetty') enabled at server: com.sun.jmx.mbeanserver.JmxMBeanServer@40dac22a
   [junit4]   2> 3120161 INFO  (jetty-launcher-4907-thread-1) [n:127.0.0.1:50260_solr    ] o.a.s.m.r.SolrJmxReporter JMX monitoring for 'solr_50260.solr.jvm' (registry 'solr.jvm') enabled at server: com.sun.jmx.mbeanserver.JmxMBeanServer@40dac22a
   [junit4]   2> 3120161 INFO  (jetty-launcher-4907-thread-1) [n:127.0.0.1:50260_solr    ] o.a.s.m.r.SolrJmxReporter JMX monitoring for 'solr_50260.solr.jetty' (registry 'solr.jetty') enabled at server: com.sun.jmx.mbeanserver.JmxMBeanServer@40dac22a
   [junit4]   2> 3120161 INFO  (jetty-launcher-4907-thread-2) [n:127.0.0.1:53791_solr    ] o.a.s.c.CorePropertiesLocator Found 0 core definitions underneath /export/home/jenkins/workspace/Lucene-Solr-master-Solaris/solr/build/solr-core/test/J1/temp/solr.cloud.autoscaling.TriggerIntegrationTest_1B22282045F7894E-001/tempDir-001/node2/.
   [junit4]   2> 3120161 INFO  (jetty-launcher-4907-thread-1) [n:127.0.0.1:50260_solr    ] o.a.s.c.CorePropertiesLocator Found 0 core definitions underneath /export/home/jenkins/workspace/Lucene-Solr-master-Solaris/solr/build/solr-core/test/J1/temp/solr.cloud.autoscaling.TriggerIntegrationTest_1B22282045F7894E-001/tempDir-001/node1/.
   [junit4]   2> 3120208 INFO  (SUITE-TriggerIntegrationTest-seed#[1B22282045F7894E]-worker) [    ] o.a.s.c.c.ZkStateReader Updated live nodes from ZooKeeper... (0) -> (2)
   [junit4]   2> 3120209 INFO  (SUITE-TriggerIntegrationTest-seed#[1B22282045F7894E]-worker) [    ] o.a.s.c.s.i.ZkClientClusterStateProvider Cluster at 127.0.0.1:36648/solr ready
   [junit4]   2> 3120326 INFO  (TEST-TriggerIntegrationTest.testNodeMarkersRegistration-seed#[1B22282045F7894E]) [    ] o.a.s.SolrTestCaseJ4 ###Starting testNodeMarkersRegistration
   [junit4]   2> 3120327 INFO  (TEST-TriggerIntegrationTest.testNodeMarkersRegistration-seed#[1B22282045F7894E]) [    ] o.a.s.c.a.TriggerIntegrationTest /autoscaling.json reset, new znode version 2
   [junit4]   2> 3120327 DEBUG (zkCallback-4918-thread-1-processing-n:127.0.0.1:53791_solr) [n:127.0.0.1:53791_solr    ] o.a.s.c.a.OverseerTriggerThread Refreshing /autoscaling.json with znode version 2
   [junit4]   2> 3120327 DEBUG (OverseerAutoScalingTriggerThread-99116647178764293-127.0.0.1:53791_solr-n_0000000000) [n:127.0.0.1:53791_solr    ] o.a.s.c.a.OverseerTriggerThread Processed trigger updates upto znodeVersion 2
   [junit4]   2> 3120332 DEBUG (OverseerAutoScalingTriggerThread-99116647178764293-127.0.0.1:53791_solr-n_0000000000) [n:127.0.0.1:53791_solr    ] o.a.s.c.a.OverseerTriggerThread -- clean old nodeLost markers
   [junit4]   2> 3120333 DEBUG (OverseerAutoScalingTriggerThread-99116647178764293-127.0.0.1:53791_solr-n_0000000000) [n:127.0.0.1:53791_solr    ] o.a.s.c.a.OverseerTriggerThread -- clean old nodeAdded markers
   [junit4]   2> 3120334 DEBUG (OverseerAutoScalingTriggerThread-99116647178764293-127.0.0.1:53791_solr-n_0000000000) [n:127.0.0.1:53791_solr    ] o.a.s.c.a.OverseerTriggerThread Current znodeVersion 2, lastZnodeVersion 2
   [junit4]   2> 3120335 INFO  (qtp203762243-30254) [n:127.0.0.1:50260_solr    ] o.a.s.h.a.CollectionsHandler Invoked Collection Action :overseerstatus with params action=OVERSEERSTATUS&wt=javabin&version=2 and sendToOCPQueue=true
   [junit4]   2> 3120343 INFO  (qtp203762243-30254) [n:127.0.0.1:50260_solr    ] o.a.s.s.HttpSolrCall [admin] webapp=null path=/admin/collections params={action=OVERSEERSTATUS&wt=javabin&version=2} status=0 QTime=7
   [junit4]   2> 3120343 INFO  (TEST-TriggerIntegrationTest.testNodeMarkersRegistration-seed#[1B22282045F7894E]) [    ] o.e.j.s.Server jetty-9.3.20.v20170531
   [junit4]   2> 3120345 INFO  (TEST-TriggerIntegrationTest.testNodeMarkersRegistration-seed#[1B22282045F7894E]) [    ] o.e.j.s.h.ContextHandler Started o.e.j.s.ServletContextHandler@3955976{/solr,null,AVAILABLE}
   [junit4]   2> 3120345 INFO  (TEST-TriggerIntegrationTest.testNodeMarkersRegistration-seed#[1B22282045F7894E]) [    ] o.e.j.s.AbstractConnector Started ServerConnector@3e70a6a6{HTTP/1.1,[http/1.1]}{127.0.0.1:34440}
   [junit4]   2> 3120345 INFO  (TEST-TriggerIntegrationTest.testNodeMarkersRegistration-seed#[1B22282045F7894E]) [    ] o.e.j.s.Server Started @3124690ms
   [junit4]   2> 3120345 INFO  (TEST-TriggerIntegrationTest.testNodeMarkersRegistration-seed#[1B22282045F7894E]) [    ] o.a.s.c.s.e.JettySolrRunner Jetty properties: {hostContext=/solr, hostPort=34440}
   [junit4]   2> 3120348 ERROR (TEST-TriggerIntegrationTest.testNodeMarkersRegistration-seed#[1B22282045F7894E]) [    ] o.a.s.u.StartupLoggingUtils Missing Java Option solr.log.dir. Logging may be missing or incomplete.
   [junit4]   2> 3120348 INFO  (TEST-TriggerIntegrationTest.testNodeMarkersRegistration-seed#[1B22282045F7894E]) [    ] o.a.s.s.SolrDispatchFilter  ___      _       Welcome to Apache Solr™ version 8.0.0
   [junit4]   2> 3120348 INFO  (TEST-TriggerIntegrationTest.testNodeMarkersRegistration-seed#[1B22282045F7894E]) [    ] o.a.s.s.SolrDispatchFilter / __| ___| |_ _   Starting in cloud mode on port null
   [junit4]   2> 3120348 INFO  (TEST-TriggerIntegrationTest.testNodeMarkersRegistration-seed#[1B22282045F7894E]) [    ] o.a.s.s.SolrDispatchFilter \__ \/ _ \ | '_|  Install dir: null
   [junit4]   2> 3120348 INFO  (TEST-TriggerIntegrationTest.testNodeMarkersRegistration-seed#[1B22282045F7894E]) [    ] o.a.s.s.SolrDispatchFilter |___/\___/_|_|    Start time: 2017-12-04T15:06:52.464Z
   [junit4]   2> 3120351 INFO  (TEST-TriggerIntegrationTest.testNodeMarkersRegistration-seed#[1B22282045F7894E]) [    ] o.a.s.s.SolrDispatchFilter solr.xml found in ZooKeeper. Loading...
   [junit4]   2> 3120358 INFO  (TEST-TriggerIntegrationTest.testNodeMarkersRegistration-seed#[1B22282045F7894E]) [    ] o.a.s.c.ZkContainer Zookeeper client=127.0.0.1:36648/solr
   [junit4]   2> 3120373 INFO  (TEST-TriggerIntegrationTest.testNodeMarkersRegistration-seed#[1B22282045F7894E]) [n:127.0.0.1:34440_solr    ] o.a.s.c.c.ZkStateReader Updated live nodes from ZooKeeper... (0) -> (2)
   [junit4]   2> 3120377 INFO  (TEST-TriggerIntegrationTest.testNodeMarkersRegistration-seed#[1B22282045F7894E]) [n:127.0.0.1:34440_solr    ] o.a.s.c.Overseer Overseer (id=null) closing
   [junit4]   2> 3120380 INFO  (TEST-TriggerIntegrationTest.testNodeMarkersRegistration-seed#[1B22282045F7894E]) [n:127.0.0.1:34440_solr    ] o.a.s.c.ZkController Register node as live in ZooKeeper:/live_nodes/127.0.0.1:34440_solr
   [junit4]   2> 3120382 INFO  (zkCallback-4918-thread-1-processing-n:127.0.0.1:53791_solr) [n:127.0.0.1:53791_solr    ] o.a.s.c.c.ZkStateReader Updated live nodes from ZooKeeper... (2) -> (3)
   [junit4]   2> 3120385 INFO  (zkCallback-4926-thread-1) [    ] o.a.s.c.c.ZkStateReader Updated live nodes from ZooKeeper... (2) -> (3)
   [junit4]   2> 3120385 INFO  (zkCallback-4919-thread-1-processing-n:127.0.0.1:50260_solr) [n:127.0.0.1:50260_solr    ] o.a.s.c.c.ZkStateReader Updated live nodes from ZooKeeper... (2) -> (3)
   [junit4]   2> 3120388 INFO  (zkCallback-4931-thread-1-processing-n:127.0.0.1:34440_solr) [n:127.0.0.1:34440_solr    ] o.a.s.c.c.ZkStateReader Updated live nodes from ZooKeeper... (2) -> (3)
   [junit4]   2> 3120513 INFO  (TEST-TriggerIntegrationTest.testNodeMarkersRegistration-seed#[1B22282045F7894E]) [n:127.0.0.1:34440_solr    ] o.a.s.m.r.SolrJmxReporter JMX monitoring for 'solr_34440.solr.node' (registry 'solr.node') enabled at server: com.sun.jmx.mbeanserver.JmxMBeanServer@40dac22a
   [junit4]   2> 3120520 INFO  (TEST-TriggerIntegrationTest.testNodeMarkersRegistration-seed#[1B22282045F7894E]) [n:127.0.0.1:34440_solr    ] o.a.s.m.r.SolrJmxReporter JMX monitoring for 'solr_34440.solr.jvm' (registry 'solr.jvm') enabled at server: com.sun.jmx.mbeanserver.JmxMBeanServer@40dac22a
   [junit4]   2> 3120520 INFO  (TEST-TriggerIntegrationTest.testNodeMarkersRegistration-seed#[1B22282045F7894E]) [n:127.0.0.1:34440_solr    ] o.a.s.m.r.SolrJmxReporter JMX monitoring for 'solr_34440.solr.jetty' (registry 'solr.jetty') enabled at server: com.sun.jmx.mbeanserver.JmxMBeanServer@40dac22a
   [junit4]   2> 3120521 INFO  (TEST-TriggerIntegrationTest.testNodeMarkersRegistration-seed#[1B22282045F7894E]) [n:127.0.0.1:34440_solr    ] o.a.s.c.CorePropertiesLocator Found 0 core definitions underneath /export/home/jenkins/workspace/Lucene-Solr-master-Solaris/solr/build/solr-core/test/J1/temp/solr.cloud.autoscaling.TriggerIntegrationTest_1B22282045F7894E-001/tempDir-001/node3/.
   [junit4]   2> 3120543 INFO  (TEST-TriggerIntegrationTest.testNodeMarkersRegistration-seed#[1B22282045F7894E]) [    ] o.a.s.c.a.TriggerIntegrationTest ====== KILL OVERSEER 1
   [junit4]   2> 3120544 INFO  (TEST-TriggerIntegrationTest.testNodeMarkersRegistration-seed#[1B22282045F7894E]) [    ] o.e.j.s.AbstractConnector Stopped ServerConnector@78a26c1f{HTTP/1.1,[http/1.1]}{127.0.0.1:0}
   [junit4]   2> 3120546 INFO  (TEST-TriggerIntegrationTest.testNodeMarkersRegistration-seed#[1B22282045F7894E]) [    ] o.a.s.c.CoreContainer Shutting down CoreContainer instance=2087682475
   [junit4]   2> 3120546 INFO  (TEST-TriggerIntegrationTest.testNodeMarkersRegistration-seed#[1B22282045F7894E]) [    ] o.a.s.m.SolrMetricManager Closing metric reporters for registry=solr.node, tag=null
   [junit4]   2> 3120547 INFO  (TEST-TriggerIntegrationTest.testNodeMarkersRegistration-seed#[1B22282045F7894E]) [    ] o.a.s.m.r.SolrJmxReporter Closing reporter [org.apache.solr.metrics.reporters.SolrJmxReporter@133f7ece: rootName = solr_53791, domain = solr.node, service url = null, agent id = null] for registry solr.node / com.codahale.metrics.MetricRegistry@19e9440c
   [junit4]   2> 3120551 INFO  (TEST-TriggerIntegrationTest.testNodeMarkersRegistration-seed#[1B22282045F7894E]) [    ] o.a.s.m.SolrMetricManager Closing metric reporters for registry=solr.jvm, tag=null
   [junit4]   2> 3120551 INFO  (TEST-TriggerIntegrationTest.testNodeMarkersRegistration-seed#[1B22282045F7894E]) [    ] o.a.s.m.r.SolrJmxReporter Closing reporter [org.apache.solr.metrics.reporters.SolrJmxReporter@121097e6: rootName = solr_53791, domain = solr.jvm, service url = null, agent id = null] for registry solr.jvm / com.codahale.metrics.MetricRegistry@8530268
   [junit4]   2> 3120553 INFO  (TEST-TriggerIntegrationTest.testNodeMarkersRegistration-seed#[1B22282045F7894E]) [    ] o.a.s.m.SolrMetricManager Closing metric reporters for registry=solr.jetty, tag=null
   [junit4]   2> 3120554 INFO  (TEST-TriggerIntegrationTest.testNodeMarkersRegistration-seed#[1B22282045F7894E]) [    ] o.a.s.m.r.SolrJmxReporter Closing reporter [org.apache.solr.metrics.reporters.SolrJmxReporter@33fcde28: rootName = solr_53791, domain = solr.jetty, service url = null, agent id = null] for registry solr.jetty / com.codahale.metrics.MetricRegistry@603867f5
   [junit4]   2> 3120555 INFO  (TEST-TriggerIntegrationTest.testNodeMarkersRegistration-seed#[1B22282045F7894E]) [    ] o.a.s.c.ZkController Remove node as live in ZooKeeper:/live_nodes/127.0.0.1:53791_solr
   [junit4]   2> 3120557 INFO  (zkCallback-4931-thread-1-processing-n:127.0.0.1:34440_solr) [n:127.0.0.1:34440_solr    ] o.a.s.c.c.ZkStateReader Updated live nodes from ZooKeeper... (3) -> (2)
   [junit4]   2> 3120557 INFO  (zkCallback-4919-thread-1-processing-n:127.0.0.1:50260_solr) [n:127.0.0.1:50260_solr    ] o.a.s.c.c.ZkStateReader Updated live nodes from ZooKeeper... (3) -> (2)
   [junit4]   2> 3120557 INFO  (zkCallback-4926-thread-1) [    ] o.a.s.c.c.ZkStateReader Updated live nodes from ZooKeeper... (3) -> (2)
   [junit4]   2> 3120557 INFO  (TEST-TriggerIntegrationTest.testNodeMarkersRegistration-seed#[1B22282045F7894E]) [    ] o.a.s.m.SolrMetricManager Closing metric reporters for registry=solr.cluster, tag=null
   [junit4]   2> 3120557 INFO  (zkCallback-4918-thread-1-processing-n:127.0.0.1:53791_solr) [n:127.0.0.1:53791_solr    ] o.a.s.c.c.ZkStateReader Updated live nodes from ZooKeeper... (3) -> (2)
   [junit4]   2> 3120558 INFO  (TEST-TriggerIntegrationTest.testNodeMarkersRegistration-seed#[1B22282045F7894E]) [    ] o.a.s.c.TransientSolrCoreCacheDefault Allocating transient cache for 2147483647 transient cores
   [junit4]   2> 3120558 INFO  (TEST-TriggerIntegrationTest.testNodeMarkersRegistration-seed#[1B22282045F7894E]) [    ] o.a.s.c.Overseer Overseer (id=99116647178764293-127.0.0.1:53791_solr-n_0000000000) closing
   [junit4]   2> 3120558 INFO  (OverseerStateUpdate-99116647178764293-127.0.0.1:53791_solr-n_0000000000) [n:127.0.0.1:53791_solr    ] o.a.s.c.Overseer Overseer Loop exiting : 127.0.0.1:53791_solr
   [junit4]   2> 3120558 WARN  (OverseerAutoScalingTriggerThread-99116647178764293-127.0.0.1:53791_solr-n_0000000000) [n:127.0.0.1:53791_solr    ] o.a.s.c.a.OverseerTriggerThread OverseerTriggerThread woken up but we are closed, exiting.
   [junit4]   2> 3120563 DEBUG (TEST-TriggerIntegrationTest.testNodeMarkersRegistration-seed#[1B22282045F7894E]) [    ] o.a.s.c.a.OverseerTriggerThread OverseerTriggerThread has been closed explicitly
   [junit4]   2> 3120564 INFO  (zkCallback-4919-thread-1-processing-n:127.0.0.1:50260_solr) [n:127.0.0.1:50260_solr    ] o.a.s.c.OverseerElectionContext I am going to be the leader 127.0.0.1:50260_solr
   [junit4]   2> 3120564 INFO  (TEST-TriggerIntegrationTest.testNodeMarkersRegistration-seed#[1B22282045F7894E]) [    ] o.e.j.s.h.ContextHandler Stopped o.e.j.s.ServletContextHandler@70d8f404{/solr,null,UNAVAILABLE}
   [junit4]   2> 3120567 INFO  (zkCallback-4919-thread-1-processing-n:127.0.0.1:50260_solr) [n:127.0.0.1:50260_solr    ] o.a.s.c.Overseer Overseer (id=99116647178764294-127.0.0.1:50260_solr-n_0000000001) starting
   [junit4]   2> 3120575 DEBUG (OverseerAutoScalingTriggerThread-99116647178764294-127.0.0.1:50260_solr-n_0000000001) [n:127.0.0.1:50260_solr    ] o.a.s.c.a.OverseerTriggerThread Adding .autoAddReplicas trigger
   [junit4]   2> 3120576 DEBUG (OverseerAutoScalingTriggerThread-99116647178764294-127.0.0.1:50260_solr-n_0000000001) [n:127.0.0.1:50260_solr    ] o.a.s.c.a.OverseerTriggerThread Refreshing /autoscaling.json with znode version 3
   [junit4]   2> 3120577 DEBUG (OverseerAutoScalingTriggerThread-99116647178764294-127.0.0.1:50260_solr-n_0000000001) [n:127.0.0.1:50260_solr    ] o.a.s.c.a.NodeLostTrigger Initial livenodes: [127.0.0.1:34440_solr, 127.0.0.1:50260_solr]
   [junit4]   2> 3120577 DEBUG (OverseerAutoScalingTriggerThread-99116647178764294-127.0.0.1:50260_solr-n_0000000001) [n:127.0.0.1:50260_solr    ] o.a.s.c.a.OverseerTriggerThread Current znodeVersion 3, lastZnodeVersion -1
   [junit4]   2> 3120577 DEBUG (OverseerAutoScalingTriggerThread-99116647178764294-127.0.0.1:50260_solr-n_0000000001) [n:127.0.0.1:50260_solr    ] o.a.s.c.a.OverseerTriggerThread Processed trigger updates upto znodeVersion 3
   [junit4]   2> 3120579 DEBUG (OverseerAutoScalingTriggerThread-99116647178764294-127.0.0.1:50260_solr-n_0000000001) [n:127.0.0.1:50260_solr    ] o.a.s.c.a.OverseerTriggerThread -- clean old nodeAdded markers
   [junit4]   2> 3120580 DEBUG (OverseerAutoScalingTriggerThread-99116647178764294-127.0.0.1:50260_solr-n_0000000001) [n:127.0.0.1:50260_solr    ] o.a.s.c.a.OverseerTriggerThread Current znodeVersion 3, lastZnodeVersion 3
   [junit4]   2> 3120580 DEBUG (ScheduledTrigger-10151-thread-1) [n:127.0.0.1:50260_solr    ] o.a.s.c.a.NodeLostTrigger Running NodeLostTrigger: .auto_add_replicas with currently live nodes: [127.0.0.1:34440_solr, 127.0.0.1:50260_solr]
   [junit4]   2> 3121582 DEBUG (ScheduledTrigger-10151-thread-1) [n:127.0.0.1:50260_solr    ] o.a.s.c.a.NodeLostTrigger Running NodeLostTrigger: .auto_add_replicas with currently live nodes: [127.0.0.1:34440_solr, 127.0.0.1:50260_solr]
   [junit4]   2> 3122589 DEBUG (ScheduledTrigger-10151-thread-2) [n:127.0.0.1:50260_solr    ] o.a.s.c.a.NodeLostTrigger Running NodeLostTrigger: .auto_add_replicas with currently live nodes: [127.0.0.1:34440_solr, 127.0.0.1:50260_solr]
   [junit4]   2> 3123590 DEBUG (ScheduledTrigger-10151-thread-1) [n:127.0.0.1:50260_solr    ] o.a.s.c.a.NodeLostTrigger Running NodeLostTrigger: .auto_add_replicas with currently live nodes: [127.0.0.1:34440_solr, 127.0.0.1:50260_solr]
   [junit4]   2> 3124591 DEBUG (ScheduledTrigger-10151-thread-1) [n:127.0.0.1:50260_solr    ] o.a.s.c.a.NodeLostTrigger Running NodeLostTrigger: .auto_add_replicas with currently live nodes: [127.0.0.1:34440_solr, 127.0.0.1:50260_solr]
   [junit4]   2> 3125567 INFO  (TEST-TriggerIntegrationTest.testNodeMarkersRegistration-seed#[1B22282045F7894E]) [    ] o.a.s.c.a.TriggerIntegrationTest ====== ADD TRIGGERS
   [junit4]   2> 3125574 INFO  (qtp2098497983-30304) [n:127.0.0.1:34440_solr    ] o.a.s.c.c.ZkStateReader Updated live nodes from ZooKeeper... (0) -> (2)
   [junit4]   2> 3125575 INFO  (qtp2098497983-30304) [n:127.0.0.1:34440_solr    ] o.a.s.c.s.i.ZkClientClusterStateProvider Cluster at 127.0.0.1:36648/solr ready
   [junit4]   2> 3125576 INFO  (qtp203762243-30256) [n:127.0.0.1:50260_solr    ] o.a.s.s.HttpSolrCall [admin] webapp=null path=/admin/metrics params={prefix=CORE.coreName&wt=javabin&version=2&group=solr.core} status=0 QTime=0
   [junit4]   2> 3125578 INFO  (qtp2098497983-30306) [n:127.0.0.1:34440_solr    ] o.a.s.s.HttpSolrCall [admin] webapp=null path=/admin/metrics params={prefix=CORE.coreName&wt=javabin&version=2&group=solr.core} status=0 QTime=0
   [junit4]   2> 3125578 DEBUG (qtp2098497983-30304) [n:127.0.0.1:34440_solr    ] o.a.s.c.a.AutoScalingHandler Verified autoscaling configuration
   [junit4]   2> 3125579 INFO  (qtp2098497983-30304) [n:127.0.0.1:34440_solr    ] o.a.s.s.HttpSolrCall [admin] webapp=null path=/admin/autoscaling params={wt=javabin&version=2} status=0 QTime=10
   [junit4]   2> 3125580 DEBUG (zkCallback-4919-thread-1-processing-n:127.0.0.1:50260_solr) [n:127.0.0.1:50260_solr    ] o.a.s.c.a.OverseerTriggerThread Refreshing /autoscaling.json with znode version 4
   [junit4]   2> 3125583 DEBUG (zkCallback-4919-thread-1-processing-n:127.0.0.1:50260_solr) [n:127.0.0.1:50260_solr    ] o.a.s.c.a.NodeLostTrigger Initial livenodes: [127.0.0.1:34440_solr, 127.0.0.1:50260_solr]
   [junit4]   2> 3125583 DEBUG (zkCallback-4919-thread-1-processing-n:127.0.0.1:50260_solr) [n:127.0.0.1:50260_solr    ] o.a.s.c.a.NodeAddedTrigger Initial livenodes: [127.0.0.1:34440_solr, 127.0.0.1:50260_solr]
   [junit4]   2> 3125583 DEBUG (zkCallback-4919-thread-1-processing-n:127.0.0.1:50260_solr) [n:127.0.0.1:50260_solr    ] o.a.s.c.a.NodeAddedTrigger NodeAddedTrigger node_added_trigger instantiated with properties: {event=nodeAdded, waitFor=1, actions=[{name=test, class=org.apache.solr.cloud.autoscaling.TriggerIntegrationTest$TestEventMarkerAction}], enabled=true}
   [junit4]   2> 3125583 DEBUG (OverseerAutoScalingTriggerThread-99116647178764294-127.0.0.1:50260_solr-n_0000000001) [n:127.0.0.1:50260_solr    ] o.a.s.c.a.OverseerTriggerThread Processed trigger updates upto znodeVersion 4
   [junit4]   2> 3125586 INFO  (qtp2098497983-30307) [n:127.0.0.1:34440_solr    ] o.a.s.c.c.ZkStateReader Updated live nodes from ZooKeeper... (0) -> (2)
   [junit4]   2> 3125586 INFO  (OverseerAutoScalingTriggerThread-99116647178764294-127.0.0.1:50260_solr-n_0000000001) [n:127.0.0.1:50260_solr    ] o.a.s.c.a.TriggerIntegrationTest TestEventMarkerAction init
   [junit4]   2> 3125587 DEBUG (OverseerAutoScalingTriggerThread-99116647178764294-127.0.0.1:50260_solr-n_0000000001) [n:127.0.0.1:50260_solr    ] o.a.s.c.a.OverseerTriggerThread Current znodeVersion 4, lastZnodeVersion 4
   [junit4]   2> 3125587 INFO  (qtp2098497983-30307) [n:127.0.0.1:34440_solr    ] o.a.s.c.s.i.ZkClientClusterStateProvider Cluster at 127.0.0.1:36648/solr ready
   [junit4]   2> 3125588 DEBUG (ScheduledTrigger-10151-thread-4) [n:127.0.0.1:50260_solr    ] o.a.s.c.a.NodeAddedTrigger Running NodeAddedTrigger node_added_trigger
   [junit4]   2> 3125588 DEBUG (ScheduledTrigger-10151-thread-4) [n:127.0.0.1:50260_solr    ] o.a.s.c.a.NodeAddedTrigger Found livenodes: [127.0.0.1:34440_solr, 127.0.0.1:50260_solr]
   [junit4]   2> 3125588 INFO  (qtp203762243-30257) [n:127.0.0.1:50260_solr    ] o.a.s.s.HttpSolrCall [admin] webapp=null path=/admin/metrics params={prefix=CORE.coreName&wt=javabin&version=2&group=solr.core} status=0 QTime=0
   [junit4]   2> 3125589 INFO  (qtp2098497983-30308) [n:127.0.0.1:34440_solr    ] o.a.s.s.HttpSolrCall [admin] webapp=null path=/admin/metrics params={prefix=CORE.coreName&wt=javabin&version=2&group=solr.core} status=0 QTime=0
   [junit4]   2> 3125589 DEBUG (qtp2098497983-30307) [n:127.0.0.1:34440_solr    ] o.a.s.c.a.AutoScalingHandler Verified autoscaling configuration
   [junit4]   2> 3125590 INFO  (qtp2098497983-30307) [n:127.0.0.1:34440_solr    ] o.a.s.s.HttpSolrCall [admin] webapp=null path=/cluster/autoscaling params={wt=javabin&version=2} status=0 QTime=10
   [junit4]   2> 3125591 DEBUG (zkCallback-4919-thread-1-processing-n:127.0.0.1:50260_solr) [n:127.0.0.1:50260_solr    ] o.a.s.c.a.OverseerTriggerThread Refreshing /autoscaling.json with znode version 5
   [junit4]   2> 3125591 INFO  (qtp2098497983-30309) [n:127.0.0.1:34440_solr    ] o.a.s.h.a.CollectionsHandler Invoked Collection Action :overseerstatus with params action=OVERSEERSTATUS&wt=javabin&version=2 and sendToOCPQueue=true
   [junit4]   2> 3125591 DEBUG (ScheduledTrigger-10151-thread-3) [n:127.0.0.1:50260_solr    ] o.a.s.c.a.NodeLostTrigger Running NodeLostTrigger: .auto_add_replicas with currently live nodes: [127.0.0.1:34440_solr, 127.0.0.1:50260_solr]
   [junit4]   2> 3125591 DEBUG (zkCallback-4919-thread-1-processing-n:127.0.0.1:50260_solr) [n:127.0.0.1:50260_solr    ] o.a.s.c.a.NodeLostTrigger Initial livenodes: [127.0.0.1:34440_solr, 127.0.0.1:50260_solr]
   [junit4]   2> 3125592 DEBUG (zkCallback-4919-thread-1-processing-n:127.0.0.1:50260_solr) [n:127.0.0.1:50260_solr    ] o.a.s.c.a.NodeLostTrigger Initial livenodes: [127.0.0.1:34440_solr, 127.0.0.1:50260_solr]
   [junit4]   2> 3125592 DEBUG (zkCallback-4919-thread-1-processing-n:127.0.0.1:50260_solr) [n:127.0.0.1:50260_solr    ] o.a.s.c.a.NodeAddedTrigger Initial livenodes: [127.0.0.1:34440_solr, 127.0.0.1:50260_solr]
   [junit4]   2> 3125592 DEBUG (zkCallback-4919-thread-1-processing-n:127.0.0.1:50260_solr) [n:127.0.0.1:50260_solr    ] o.a.s.c.a.NodeAddedTrigger NodeAddedTrigger node_added_trigger instantiated with properties: {event=nodeAdded, waitFor=1, actions=[{name=test, class=org.apache.solr.cloud.autoscaling.TriggerIntegrationTest$TestEventMarkerAction}], enabled=true}
   [junit4]   2> 3125592 DEBUG (OverseerAutoScalingTriggerThread-99116647178764294-127.0.0.1:50260_solr-n_0000000001) [n:127.0.0.1:50260_solr    ] o.a.s.c.a.OverseerTriggerThread Processed trigger updates upto znodeVersion 5
   [junit4]   2> 3125594 INFO  (OverseerAutoScalingTriggerThread-99116647178764294-127.0.0.1:50260_solr-n_0000000001) [n:127.0.0.1:50260_solr    ] o.a.s.c.a.TriggerIntegrationTest TestEventMarkerAction init
   [junit4]   2> 3125596 DEBUG (OverseerAutoScalingTriggerThread-99116647178764294-127.0.0.1:50260_solr-n_0000000001) [n:127.0.0.1:50260_solr    ] o.a.s.c.a.OverseerTriggerThread Current znodeVersion 5, lastZnodeVersion 5
   [junit4]   2> 3125596 DEBUG (ScheduledTrigger-10151-thread-2) [n:127.0.0.1:50260_solr    ] o.a.s.c.a.NodeLostTrigger Running NodeLostTrigger: node_lost_trigger with currently live nodes: [127.0.0.1:34440_solr, 127.0.0.1:50260_solr]
   [junit4]   2> 3125597 INFO  (qtp2098497983-30309) [n:127.0.0.1:34440_solr    ] o.a.s.s.HttpSolrCall [admin] webapp=null path=/admin/collections params={action=OVERSEERSTATUS&wt=javabin&version=2} status=0 QTime=5
   [junit4]   2> 3125597 INFO  (TEST-TriggerIntegrationTest.testNodeMarkersRegistration-seed#[1B22282045F7894E]) [    ] o.a.s.c.a.TriggerIntegrationTest ====== ADD NODE 1
   [junit4]   2> 3125597 INFO  (TEST-TriggerIntegrationTest.testNodeMarkersRegistration-seed#[1B22282045F7894E]) [    ] o.e.j.s.Server jetty-9.3.20.v20170531
   [junit4]   2> 3125599 INFO  (TEST-TriggerIntegrationTest.testNodeMarkersRegistration-seed#[1B22282045F7894E]) [    ] o.e.j.s.h.ContextHandler Started o.e.j.s.ServletContextHandler@22277bd1{/solr,null,AVAILABLE}
   [junit4]   2> 3125599 INFO  (TEST-TriggerIntegrationTest.testNodeMarkersRegistration-seed#[1B22282045F7894E]) [    ] o.e.j.s.AbstractConnector Started ServerConnector@f5f6638{HTTP/1.1,[http/1.1]}{127.0.0.1:48735}
   [junit4]   2> 3125599 INFO  (TEST-TriggerIntegrationTest.testNodeMarkersRegistration-seed#[1B22282045F7894E]) [    ] o.e.j.s.Server Started @3129945ms
   [junit4]   2> 3125599 INFO  (TEST-TriggerIntegrationTest.testNodeMarkersRegistration-seed#[1B22282045F7894E]) [    ] o.a.s.c.s.e.JettySolrRunner Jetty properties: {hostContext=/solr, hostPort=48735}
   [junit4]   2> 3125599 ERROR (TEST-TriggerIntegrationTest.testNodeMarkersRegistration-seed#[1B22282045F7894E]) [    ] o.a.s.u.StartupLoggingUtils Missing Java Option solr.log.dir. Logging may be missing or incomplete.
   [junit4]   2> 3125602 INFO  (TEST-TriggerIntegrationTest.testNodeMarkersRegistration-seed#[1B22282045F7894E]) [    ] o.a.s.s.SolrDispatchFilter  ___      _       Welcome to Apache Solr™ version 8.0.0
   [junit4]   2> 3125602 INFO  (TEST-TriggerIntegrationTest.testNodeMarkersRegistration-seed#[1B22282045F7894E]) [    ] o.a.s.s.SolrDispatchFilter / __| ___| |_ _   Starting in cloud mode on port null
   [junit4]   2> 3125602 INFO  (TEST-TriggerIntegrationTest.testNodeMarkersRegistration-seed#[1B22282045F7894E]) [    ] o.a.s.s.SolrDispatchFilter \__ \/ _ \ | '_|  Install dir: null
   [junit4]   2> 3125602 INFO  (TEST-TriggerIntegrationTest.testNodeMarkersRegistration-seed#[1B22282045F7894E]) [    ] o.a.s.s.SolrDispatchFilter |___/\___/_|_|    Start time: 2017-12-04T15:06:57.718Z
   [junit4]   2> 3125605 INFO  (TEST-TriggerIntegrationTest.testNodeMarkersRegistration-seed#[1B22282045F7894E]) [    ] o.a.s.s.SolrDispatchFilter solr.xml found in ZooKeeper. Loading...
   [junit4]   2> 3125611 INFO  (TEST-TriggerIntegrationTest.testNodeMarkersRegistration-seed#[1B22282045F7894E]) [    ] o.a.s.c.ZkContainer Zookeeper client=127.0.0.1:36648/solr
   [junit4]   2> 3125626 INFO  (TEST-TriggerIntegrationTest.testNodeMarkersRegistration-seed#[1B22282045F7894E]) [n:127.0.0.1:48735_solr    ] o.a.s.c.c.ZkStateReader Updated live nodes from ZooKeeper... (0) -> (2)
   [junit4]   2> 3125630 INFO  (TEST-TriggerIntegrationTest.testNodeMarkersRegistration-seed#[1B22282045F7894E]) [n:127.0.0.1:48735_solr    ] o.a.s.c.Overseer Overseer (id=null) closing
   [junit4]   2> 3125632 INFO  (TEST-TriggerIntegrationTest.testNodeMarkersRegistration-seed#[1B22282045F7894E]) [n:127.0.0.1:48735_solr    ] o.a.s.c.ZkController Register node as live in ZooKeeper:/live_nodes/127.0.0.1:48735_solr
   [junit4]   2> 3125634 INFO  (zkCallback-4926-thread-1) [    ] o.a.s.c.c.ZkStateReader Updated live nodes from ZooKeeper... (2) -> (3)
   [junit4]   2> 3125634 INFO  (zkCallback-4931-thread-1-processing-n:127.0.0.1:34440_solr) [n:127.0.0.1:34440_solr    ] o.a.s.c.c.ZkStateReader Updated live nodes from ZooKeeper... (2) -> (3)
   [junit4]   2> 3125634 INFO  (zkCallback-4919-thread-1-processing-n:127.0.0.1:50260_solr) [n:127.0.0.1:50260_solr    ] o.a.s.c.c.ZkStateReader Updated live nodes from ZooKeeper... (2) -> (3)
   [junit4]   2> 3125637 INFO  (zkCallback-4944-thread-1-processing-n:127.0.0.1:48735_solr) [n:127.0.0.1:48735_solr    ] o.a.s.c.c.ZkStateReader Updated live nodes from ZooKeeper... (2) -> (3)
   [junit4]   2> 3125718 INFO  (TEST-TriggerIntegrationTest.testNodeMarkersRegistration-seed#[1B22282045F7894E]) [n:127.0.0.1:48735_solr    ] o.a.s.m.r.SolrJmxReporter JMX monitoring for 'solr_48735.solr.node' (registry 'solr.node') enabled at server: com.sun.jmx.mbeanserver.JmxMBeanServer@40dac22a
   [junit4]   2> 3125724 INFO  (TEST-TriggerIntegrationTest.testNodeMarkersRegistration-seed#[1B22282045F7894E]) [n:127.0.0.1:48735_solr    ] o.a.s.m.r.SolrJmxReporter JMX monitoring for 'solr_48735.solr.jvm' (registry 'solr.jvm') enabled at server: com.sun.jmx.mbeanserver.JmxMBeanServer@40dac22a
   [junit4]   2> 3125724 INFO  (TEST-TriggerIntegrationTest.testNodeMarkersRegistration-seed#[1B22282045F7894E]) [n:127.0.0.1:48735_solr    ] o.a.s.m.r.SolrJmxReporter JMX monitoring for 'solr_48735.solr.jetty' (registry 'solr.jetty') enabled at server: com.sun.jmx.mbeanserver.JmxMBeanServer@40dac22a
   [junit4]   2> 3125725 INFO  (TEST-TriggerIntegrationTest.testNodeMarkersRegistration-seed#[1B22282045F7894E]) [n:127.0.0.1:48735_solr    ] o.a.s.c.CorePropertiesLocator Found 0 core definitions underneath /export/home/jenkins/workspace/Lucene-Solr-master-Solaris/solr/build/solr-core/test/J1/temp/solr.cloud.autoscaling.TriggerIntegrationTest_1B22282045F7894E-001/tempDir-001/node4/.
   [junit4]   2> 3126589 DEBUG (ScheduledTrigger-10151-thread-4) [n:127.0.0.1:50260_solr    ] o.a.s.c.a.NodeAddedTrigger Running NodeAddedTrigger node_added_trigger
   [junit4]   2> 3126589 DEBUG (ScheduledTrigger-10151-thread-4) [n:127.0.0.1:50260_solr    ] o.a.s.c.a.NodeAddedTrigger Found livenodes: [127.0.0.1:48735_solr, 127.0.0.1:34440_solr, 127.0.0.1:50260_solr]
   [junit4]   2> 3126589 DEBUG (ScheduledTrigger-10151-thread-4) [n:127.0.0.1:50260_solr    ] o.a.s.c.a.NodeAddedTrigger Tracking new node: 127.0.0.1:48735_solr at time 1512400018705000000
   [junit4]   2> 3126591 DEBUG (ScheduledTrigger-10151-thread-1) [n:127.0.0.1:50260_solr    ] o.a.s.c.a.NodeLostTrigger Running NodeLostTrigger: .auto_add_replicas with currently live nodes: [127.0.0.1:48735_solr, 127.0.0.1:34440_solr, 127.0.0.1:50260_solr]
   [junit4]   2> 3126604 DEBUG (ScheduledTrigger-10151-thread-3) [n:127.0.0.1:50260_solr    ] o.a.s.c.a.NodeLostTrigger Running NodeLostTrigger: node_lost_trigger with currently live nodes: [127.0.0.1:48735_solr, 127.0.0.1:34440_solr, 127.0.0.1:50260_solr]
   [junit4]   2> 3127606 DEBUG (ScheduledTrigger-10151-thread-2) [n:127.0.0.1:50260_solr    ] o.a.s.c.a.NodeAddedTrigger Running NodeAddedTrigger node_added_trigger
   [junit4]   2> 3127606 DEBUG (ScheduledTrigger-10151-thread-4) [n:127.0.0.1:50260_solr    ] o.a.s.c.a.NodeLostTrigger Running NodeLostTrigger: .auto_add_replicas with currently live nodes: [127.0.0.1:48735_solr, 127.0.0.1:34440_solr, 127.0.0.1:50260_solr]
   [junit4]   2> 3127606 DEBUG (ScheduledTrigger-10151-thread-2) [n:127.0.0.1:50260_solr    ] o.a.s.c.a.NodeAddedTrigger Found livenodes: [127.0.0.1:48735_solr, 127.0.0.1:34440_solr, 127.0.0.1:50260_solr]
   [junit4]   2> 3127607 DEBUG (ScheduledTrigger-10151-thread-2) [n:127.0.0.1:50260_solr    ] o.a.s.c.a.NodeAddedTrigger NodeAddedTrigger node_added_trigger firing registered processor for nodes: [127.0.0.1:48735_solr] added at times [1512400018705000000], now=1512400019723000000
   [junit4]   2> 3127606 DEBUG (ScheduledTrigger-10151-thread-1) [n:127.0.0.1:50260_solr    ] o.a.s.c.a.NodeLostTrigger Running NodeLostTrigger: node_lost_trigger with currently live nodes: [127.0.0.1:48735_solr, 127.0.0.1:34440_solr, 127.0.0.1:50260_solr]
   [junit4]   2> 3127607 DEBUG (ScheduledTrigger-10151-thread-2) [n:127.0.0.1:50260_solr    ] o.a.s.c.a.ScheduledTriggers ++++++++ Cooldown inactive - processing event: {
   [junit4]   2>   "id":"14fd1fcdd134a640Tcrn4z9jfcodcy9f6f6b7s13x2",
   [junit4]   2>   "source":"node_added_trigger",
   [junit4]   2>   "eventTime":1512400018705000000,
   [junit4]   2>   "eventType":"NODEADDED",
   [junit4]   2>   "properties":{
   [junit4]   2>     "eventTimes":[1512400018705000000],
   [junit4]   2>     "nodeNames":["127.0.0.1:48735_solr"]}}
   [junit4]   2> 3127609 INFO  (OverseerCollectionConfigSetProcessor-99116647178764294-127.0.0.1:50260_solr-n_0000000001) [n:127.0.0.1:50260_solr    ] o.a.s.c.OverseerTaskQueue Response ZK path: /overseer/collection-queue-work/qnr-0000000002 doesn't exist.  Requestor may have disconnected from ZooKeeper
   [junit4]   2> 3127609 INFO  (ScheduledTrigger-10151-thread-2) [n:127.0.0.1:50260_solr    ] o.a.s.c.a.SystemLogListener Collection .system does not exist, disabling logging.
   [junit4]   2> 3127610 DEBUG (AutoscalingActionExecutor-10152-thread-1-processing-n:127.0.0.1:50260_solr) [n:127.0.0.1:50260_solr    ] o.a.s.c.a.ScheduledTriggers -- processing actions for {
   [junit4]   2>   "id":"14fd1fcdd134a640Tcrn4z9jfcodcy9f6f6b7s13x2",
   [junit4]   2>   "source":"node_added_trigger",
   [junit4]   2>   "eventTime":1512400018705000000,
   [junit4]   2>   "eventType":"NODEADDED",
   [junit4]   2>   "properties":{
   [junit4]   2>     "eventTimes":[1512400018705000000],
   [junit4]   2>     "_enqueue_time_":1512400019723000000,
   [junit4]   2>     "nodeNames":["127.0.0.1:48735_solr"]}}
   [junit4]   2> 3128607 DEBUG (ScheduledTrigger-10151-thread-4) [n:127.0.0.1:50260_solr    ] o.a.s.c.a.NodeLostTrigger Running NodeLostTrigger: .auto_add_replicas with currently live nodes: [127.0.0.1:48735_solr, 127.0.0.1:34440_solr, 127.0.0.1:50260_solr]
   [junit4]   2> 3128607 DEBUG (ScheduledTrigger-10151-thread-3) [n:127.0.0.1:50260_solr    ] o.a.s.c.a.NodeLostTrigger Running NodeLostTrigger: node_lost_trigger with currently live nodes: [127.0.0.1:48735_solr, 127.0.0.1:34440_solr, 127.0.0.1:50260_solr]
   [junit4]   2> 3128613 DEBUG (ScheduledTrigger-10151-thread-1) [n:127.0.0.1:50260_solr    ] o.a.s.c.a.NodeAddedTrigger Running NodeAddedTrigger node_added_trigger
   [junit4]   2> 3128613 DEBUG (ScheduledTrigger-10151-thread-1) [n:127.0.0.1:50260_solr    ] o.a.s.c.a.NodeAddedTrigger Found livenodes: [127.0.0.1:48735_solr, 127.0.0.1:34440_solr, 127.0.0.1:50260_solr]
   [junit4]   2> 3129609 DEBUG (ScheduledTrigger-10151-thread-2) [n:127.0.0.1:50260_solr    ] o.a.s.c.a.NodeLostTrigger Running NodeLostTrigger: .auto_add_replicas with currently live nodes: [127.0.0.1:48735_solr, 127.0.0.1:34440_solr, 127.0.0.1:50260_solr]
   [junit4]   2> 3129611 DEBUG (ScheduledTrigger-10151-thread-3) [n:127.0.0.1:50260_solr    ] o.a.s.c.a.NodeLostTrigger Running NodeLostTrigger: node_lost_trigger with currently live nodes: [127.0.0.1:48735_solr, 127.0.0.1:34440_solr, 127.0.0.1:50260_solr]
   [junit4]   2> 3129615 DEBUG (ScheduledTrigger-10151-thread-4) [n:127.0.0.1:50260_solr    ] o.a.s.c.a.NodeAddedTrigger Running NodeAddedTrigger node_added_trigger
   [junit4]   2> 3129615 DEBUG (ScheduledTrigger-10151-thread-4) [n:127.0.0.1:50260_solr    ] o.a.s.c.a.NodeAddedTrigger Found livenodes: [127.0.0.1:48735_solr, 127.0.0.1:34440_solr, 127.0.0.1:50260_solr]
   [junit4]   2> 3130610 DEBUG (ScheduledTrigger-10151-thread-1) [n:127.0.0.1:50260_solr    ] o.a.s.c.a.NodeLostTrigger Running NodeLostTrigger: .auto_add_replicas with currently live nodes: [127.0.0.1:48735_solr, 127.0.0.1:34440_solr, 127.0.0.1:50260_solr]
   [junit4]   2> 3130612 DEBUG (ScheduledTrigger-10151-thread-2) [n:127.0.0.1:50260_solr    ] o.a.s.c.a.NodeLostTrigger Running NodeLostTrigger: node_lost_trigger with currently live nodes: [127.0.0.1:48735_solr, 127.0.0.1:34440_solr, 127.0.0.1:50260_solr]
   [junit4]   2> 3130615 DEBUG (ScheduledTrigger-10151-thread-3) [n:127.0.0.1:50260_solr    ] o.a.s.c.a.NodeAddedTrigger Running NodeAddedTrigger node_added_trigger
   [junit4]   2> 3130615 DEBUG (ScheduledTrigger-10151-thread-3) [n:127.0.0.1:50260_solr    ] o.a.s.c.a.NodeAddedTrigger Found livenodes: [127.0.0.1:48735_solr, 127.0.0.1:34440_solr, 127.0.0.1:50260_solr]
   [junit4]   2> 3130751 INFO  (TEST-TriggerIntegrationTest.testNodeMarkersRegistration-seed#[1B22282045F7894E]) [    ] o.a.s.c.a.TriggerIntegrationTest ====== KILL OVERSEER 2
   [junit4]   2> 3130752 INFO  (TEST-TriggerIntegrationTest.testNodeMarkersRegistration-seed#[1B22282045F7894E]) [    ] o.e.j.s.AbstractConnector Stopped ServerConnector@2b225de4{HTTP/1.1,[http/1.1]}{127.0.0.1:0}
   [junit4]   2> 3130755 INFO  (TEST-TriggerIntegrationTest.testNodeMarkersRegistration-seed#[1B22282045F7894E]) [    ] o.a.s.c.CoreContainer Shutting down CoreContainer instance=404290710
   [junit4]   2> 3130755 INFO  (TEST-TriggerIntegrationTest.testNodeMarkersRegistration-seed#[1B22282045F7894E]) [    ] o.a.s.m.SolrMetricManager Closing metric reporters for registry=solr.node, tag=null
   [junit4]   2> 3130755 INFO  (TEST-TriggerIntegrationTest.testNodeMarkersRegistration-seed#[1B22282045F7894E]) [    ] o.a.s.m.r.SolrJmxReporter Closing reporter [org.apache.solr.metrics.reporters.SolrJmxReporter@215d80bf: rootName = solr_50260, domain = solr.node, service url = null, agent id = null] for registry solr.node / com.codahale.metrics.MetricRegistry@295f8448
   [junit4]   2> 3130761 INFO  (TEST-TriggerIntegrationTest.testNodeMarkersRegistration-seed#[1B22282045F7894E]) [    ] o.a.s.m.SolrMetricManager Closing metric reporters for registry=solr.jvm, tag=null
   [junit4]   2> 3130761 INFO  (TEST-TriggerIntegrationTest.testNodeMarkersRegistration-seed#[1B22282045F7894E]) [    ] o.a.s.m.r.SolrJmxReporter Closing reporter [org.apache.solr.metrics.reporters.SolrJmxReporter@2a3efb7a: rootName = solr_50260, domain = solr.jvm, service url = null, agent id = null] for registry solr.jvm / com.codahale.metrics.MetricRegistry@8530268
   [junit4]   2> 3130764 INFO  (TEST-TriggerIntegrationTest.testNodeMarkersRegistration-seed#[1B22282045F7894E]) [    ] o.a.s.m.SolrMetricManager Closing metric reporters for registry=solr.jetty, tag=null
   [junit4]   2> 3130765 INFO  (TEST-TriggerIntegrationTest.testNodeMarkersRegistration-seed#[1B22282045F7894E]) [    ] o.a.s.m.r.SolrJmxReporter Closing reporter [org.apache.solr.metrics.reporters.SolrJmxReporter@78e70a5d: rootName = solr_50260, domain = solr.jetty, service url = null, agent id = null] for registry solr.jetty / com.codahale.metrics.MetricRegistry@603867f5
   [junit4]   2> 3130767 INFO  (TEST-TriggerIntegrationTest.testNodeMarkersRegistration-seed#[1B22282045F7894E]) [    ] o.a.s.c.ZkController Remove node as live in ZooKeeper:/live_nodes/127.0.0.1:50260_solr
   [junit4]   2> 3130767 INFO  (TEST-TriggerIntegrationTest.testNodeMarkersRegistration-seed#[1B22282045F7894E]) [    ] o.a.s.m.SolrMetricManager Closing metric reporters for registry=solr.cluster, tag=null
   [junit4]   2> 3130768 INFO  (zkCallback-4919-thread-1-processing-n:127.0.0.1:50260_solr) [n:127.0.0.1:50260_solr    ] o.a.s.c.c.ZkStateReader Updated live nodes from ZooKeeper... (3) -> (2)
   [junit4]   2> 3130768 INFO  (zkCallback-4931-thread-1-processing-n:127.0.0.1:34440_solr) [n:127.0.0.1:34440_solr    ] o.a.s.c.c.ZkStateReader Updated live nodes from ZooKeeper... (3) -> (2)
   [junit4]   2> 3130768 INFO  (TEST-TriggerIntegrationTest.testNodeMarkersRegistration-seed#[1B22282045F7894E]) [    ] o.a.s.c.TransientSolrCoreCacheDefault Allocating transient cache for 2147483647 transient cores
   [junit4]   2> 3130768 INFO  (zkCallback-4944-thread-1-processing-n:127.0.0.1:48735_solr) [n:127.0.0.1:48735_solr    ] o.a.s.c.c.ZkStateReader Updated live nodes from ZooKeeper... (3) -> (2)
   [junit4]   2> 3130768 INFO  (zkCallback-4926-thread-1) [    ] o.a.s.c.c.ZkStateReader Updated live nodes from ZooKeeper... (3) -> (2)
   [junit4]   2> 3130768 INFO  (TEST-TriggerIntegrationTest.testNodeMarkersRegistration-seed#[1B22282045F7894E]) [    ] o.a.s.c.Overseer Overseer (id=99116647178764294-127.0.0.1:50260_solr-n_0000000001) closing
   [junit4]   2> 3130769 INFO  (OverseerStateUpdate-99116647178764294-127.0.0.1:50260_solr-n_0000000001) [n:127.0.0.1:50260_solr    ] o.a.s.c.Overseer Overseer Loop exiting : 127.0.0.1:50260_solr
   [junit4]   2> 3130769 WARN  (OverseerAutoScalingTriggerThread-99116647178764294-127.0.0.1:50260_solr-n_0000000001) [n:127.0.0.1:50260_solr    ] o.a.s.c.a.OverseerTriggerThread OverseerTriggerThread woken up but we are closed, exiting.
   [junit4]   2> 3130772 DEBUG (TEST-TriggerIntegrationTest.testNodeMarkersRegistration-seed#[1B22282045F7894E]) [    ] o.a.s.c.a.OverseerTriggerThread OverseerTriggerThread has been closed explicitly
   [junit4]   2> 3130774 INFO  (TEST-TriggerIntegrationTest.testNodeMarkersRegistration-seed#[1B22282045F7894E]) [    ] o.e.j.s.h.ContextHandler Stopped o.e.j.s.ServletContextHandler@7175b609{/solr,null,UNAVAILABLE}
   [junit4]   2> 3130776 INFO  (zkCallback-4931-thread-1-processing-n:127.0.0.1:34440_solr) [n:127.0.0.1:34440_solr    ] o.a.s.c.OverseerElectionContext I am going to be the leader 127.0.0.1:34440_solr
   [junit4]   2> 3130777 INFO  (zkCallback-4931-thread-1-processing-n:127.0.0.1:34440_solr) [n:127.0.0.1:34440_solr    ] o.a.s.c.Overseer Overseer (id=99116647178764299-127.0.0.1:34440_solr-n_0000000002) starting
   [junit4]   2> 3130787 DEBUG (OverseerAutoScalingTriggerThread-99116647178764299-127.0.0.1:34440_solr-n_0000000002) [n:127.0.0.1:34440_solr    ] o.a.s.c.a.OverseerTriggerThread Refreshing /autoscaling.json with znode version 5
   [junit4]   2> 3130787 DEBUG (OverseerAutoScalingTriggerThread-99116647178764299-127.0.0.1:34440_solr-n_0000000002) [n:127.0.0.1:34440_solr    ] o.a.s.c.a.NodeLostTrigger Initial livenodes: [127.0.0.1:48735_solr, 127.0.0.1:34440_solr]
   [junit4]   2> 3130788 DEBUG (OverseerAutoScalingTriggerThread-99116647178764299-127.0.0.1:34440_solr-n_0000000002) [n:127.0.0.1:34440_solr    ] o.a.s.c.a.NodeLostTrigger Initial livenodes: [127.0.0.1:48735_solr, 127.0.0.1:34440_solr]
   [junit4]   2> 3130788 DEBUG (OverseerAutoScalingTriggerThread-99116647178764299-127.0.0.1:34440_solr-n_0000000002) [n:127.0.0.1:34440_solr    ] o.a.s.c.a.NodeAddedTrigger Initial livenodes: [127.0.0.1:48735_solr, 127.0.0.1:34440_solr]
   [junit4]   2> 3130788 DEBUG (OverseerAutoScalingTriggerThread-99116647178764299-127.0.0.1:34440_solr-n_0000000002) [n:127.0.0.1:34440_solr    ] o.a.s.c.a.NodeAddedTrigger NodeAddedTrigger node_added_trigger instantiated with properties: {event=nodeAdded, waitFor=1, actions=[{name=test, class=org.apache.solr.cloud.autoscaling.TriggerIntegrationTest$TestEventMarkerAction}], enabled=true}
   [junit4]   2> 3130788 DEBUG (OverseerAutoScalingTriggerThread-99116647178764299-127.0.0.1:34440_solr-n_0000000002) [n:127.0.0.1:34440_solr    ] o.a.s.c.a.OverseerTriggerThread Current znodeVersion 5, lastZnodeVersion -1
   [junit4]   2> 3130788 DEBUG (OverseerAutoScalingTriggerThread-99116647178764299-127.0.0.1:34440_solr-n_0000000002) [n:127.0.0.1:34440_solr    ] o.a.s.c.a.OverseerTriggerThread Processed trigger updates upto znodeVersion 5
   [junit4]   2> 3130789 INFO  (OverseerAutoScalingTriggerThread-99116647178764299-127.0.0.1:34440_solr-n_0000000002) [n:127.0.0.1:34440_solr    ] o.a.s.c.a.TriggerIntegrationTest TestEventMarkerAction init
   [junit4]   2> 3130789 DEBUG (OverseerAutoScalingTriggerThread-99116647178764299-127.0.0.1:34440_solr-n_0000000002) [n:127.0.0.1:34440_solr    ] o.a.s.c.a.NodeLostTrigger Adding lost node from marker path: 127.0.0.1:50260_solr
   [junit4]   2> 3130790 INFO  (OverseerAutoScalingTriggerThread-99116647178764299-127.0.0.1:34440_solr-n_0000000002) [n:127.0.0.1:34440_solr    ] o.a.s.c.a.TriggerIntegrationTest TestEventMarkerAction init
   [junit4]   2> 3130791 DEBUG (ScheduledTrigger-10162-thread-1) [n:127.0.0.1:34440_solr    ] o.a.s.c.a.NodeLostTrigger Running NodeLostTrigger: node_lost_trigger with currently live nodes: [127.0.0.1:48735_solr, 127.0.0.1:34440_solr]
   [junit4]   2> 3130791 DEBUG (ScheduledTrigger-10162-thread-1) [n:127.0.0.1:34440_solr    ] o.a.s.c.a.NodeLostTrigger Tracking lost node: 127.0.0.1:50260_solr
   [junit4]   2> 3130792 DEBUG (OverseerAutoScalingTriggerThread-99116647178764299-127.0.0.1:34440_solr-n_0000000002) [n:127.0.0.1:34440_solr    ] o.a.s.c.a.OverseerTriggerThread Current znodeVersion 5, lastZnodeVersion 5
   [junit4]   2> 3130793 DEBUG (ScheduledTrigger-10162-thread-2) [n:127.0.0.1:34440_solr    ] o.a.s.c.a.NodeAddedTrigger Running NodeAddedTrigger node_added_trigger
   [junit4]   2> 3130793 DEBUG (ScheduledTrigger-10162-thread-2) [n:127.0.0.1:34440_solr    ] o.a.s.c.a.NodeAddedTrigger Found livenodes: [127.0.0.1:48735_solr, 127.0.0.1:34440_solr]
   [junit4]   2> 3130793 DEBUG (ScheduledTrigger-10162-thread-3) [n:127.0.0.1:34440_solr    ] o.a.s.c.a.NodeLostTrigger Running NodeLostTrigger: .auto_add_replicas with currently live nodes: [127.0.0.1:48735_solr, 127.0.0.1:34440_solr]
   [junit4]   2> 3130793 DEBUG (ScheduledTrigger-10162-thread-3) [n:127.0.0.1:34440_solr    ] o.a.s.c.a.NodeLostTrigger Tracking lost node: 127.0.0.1:50260_solr
   [junit4]   2> 3131793 DEBUG (ScheduledTrigger-10162-thread-1) [n:127.0.0.1:34440_solr    ] o.a.s.c.a.NodeLostTrigger Running NodeLostTrigger: node_lost_trigger with currently live nodes: [127.0.0.1:48735_solr, 127.0.0.1:34440_solr]
   [junit4]   2> 3131793 DEBUG (ScheduledTrigger-10162-thread-1) [n:127.0.0.1:34440_solr    ] o.a.s.c.a.NodeLostTrigger NodeLostTrigger firing registered processor for lost nodes: [127.0.0.1:50260_solr]
   [junit4]   2> 3131793 DEBUG (ScheduledTrigger-10162-thread-1) [n:127.0.0.1:34440_solr    ] o.a.s.c.a.ScheduledTriggers ++++++++ Cooldown inactive - processing event: {
   [junit4]   2>   "id":"14fd1fcecbaa14c0Tcrn4z9jfcodcy9f6f6b7s13x4",
   [junit4]   2>   "source":"node_lost_trigger",
   [junit4]   2>   "eventTime":1512400022907000000,
   [junit4]   2>   "eventType":"NODELOST",
   [junit4]   2>   "properties":{
   [junit4]   2>     "eventTimes":[1512400022907000000],
   [junit4]   2>     "nodeNames":["127.0.0.1:50260_solr"]}}
   [junit4]   2> 3131795 INFO  (ScheduledTrigger-10162-thread-1) [n:127.0.0.1:34440_solr    ] o.a.s.c.a.SystemLogListener Collection .system does not exist, disabling logging.
   [junit4]   2> 3131796 DEBUG (AutoscalingActionExecutor-10163-thread-1-processing-n:127.0.0.1:34440_solr) [n:127.0.0.1:34440_solr    ] o.a.s.c.a.ScheduledTriggers -- processing actions for {
   [junit4]   2>   "id":"14fd1fcecbaa14c0Tcrn4z9jfcodcy9f6f6b7s13x4",
   [junit4]   2>   "source":"node_lost_trigger",
   [junit4]   2>   "eventTime":1512400022907000000,
   [junit4]   2>   "eventType":"NODELOST",
   [junit4]   2>   "properties":{
   [junit4]   2>     "eventTimes":[1512400022907000000],
   [junit4]   2>     "_enqueue_time_":1512400023909000000,
   [junit4]   2>     "nodeNames":["127.0.0.1:50260_solr"]}}
   [junit4]   2> 3131796 INFO  (TEST-TriggerIntegrationTest.testNodeMarkersRegistration-seed#[1B22282045F7894E]) [    ] o.a.s.SolrTestCaseJ4 ###Ending testNodeMarkersRegistration
   [junit4]   2> 3131941 INFO  (TEST-TriggerIntegrationTest.testNodeAddedTriggerRestoreState-seed#[1B22282045F7894E]) [    ] o.a.s.SolrTestCaseJ4 ###Starting testNodeAddedTriggerRestoreState
   [junit4]   2> 3131941 INFO  (TEST-TriggerIntegrationTest.testNodeAddedTriggerRestoreState-seed#[1B22282045F7894E]) [    ] o.a.s.c.a.TriggerIntegrationTest /autoscaling.json reset, new znode version 6
   [junit4]   2> 3131942 DEBUG (zkCallback-4931-thread-1-processing-n:127.0.0.1:34440_solr) [n:127.0.0.1:34440_solr    ] o.a.s.c.a.OverseerTriggerThread Refreshing /autoscaling.json with znode version 6
   [junit4]   2> 3131942 DEBUG (OverseerAutoScalingTriggerThread-99116647178764299-127.0.0.1:34440_solr-n_0000000002) [n:127.0.0.1:34440_solr    ] o.a.s.c.a.OverseerTriggerThread Processed trigger updates upto znodeVersion 6
   [junit4]   2> 3131955 DEBUG (OverseerAutoScalingTriggerThread-99116647178764299-127.0.0.1:34440_solr-n_0000000002) [n:127.0.0.1:34440_solr    ] o.a.s.c.a.OverseerTriggerThread -- clean old nodeLost markers
   [junit4]   2> 3131955 DEBUG (OverseerAutoScalingTriggerThread-99116647178764299-127.0.0.1:34440_solr-n_0000000002) [n:127.0.0.1:34440_solr    ] o.a.s.c.a.OverseerTriggerThread -- clean old nodeAdded markers
   [junit4]   2> 3131956 DEBUG (OverseerAutoScalingTriggerThread-99116647178764299-127.0.0.1:34440_solr-n_0000000002) [n:127.0.0.1:34440_solr    ] o.a.s.c.a.OverseerTriggerThread Current znodeVersion 6, lastZnodeVersion 6
   [junit4]   2> 3131962 INFO  (qtp2098497983-30302) [n:127.0.0.1:34440_solr    ] o.a.s.c.c.ZkStateReader Updated live nodes from ZooKeeper... (0) -> (2)
   [junit4]   2> 3131963 INFO  (qtp2098497983-30302) [n:127.0.0.1:34440_solr    ] o.a.s.c.s.i.ZkClientClusterStateProvider Cluster at 127.0.0.1:36648/solr ready
   [junit4]   2> 3131966 INFO  (qtp2098497983-30305) [n:127.0.0.1:34440_solr    ] o.a.s.s.HttpSolrCall [admin] webapp=null path=/admin/metrics params={prefix=CORE.coreName&wt=javabin&version=2&group=solr.core} status=0 QTime=0
   [junit4]   2> 3131967 INFO  (qtp1591131323-30345) [n:127.0.0.1:48735_solr    ] o.a.s.s.HttpSolrCall [admin] webapp=null path=/admin/metrics params={prefix=CORE.coreName&wt=javabin&version=2&group=solr.core} status=0 QTime=0
   [junit4]   2> 3131968 DEBUG (qtp2098497983-30302) [n:127.0.0.1:34440_solr    ] o.a.s.c.a.AutoScalingHandler Verified autoscaling configuration
   [junit4]   2> 3131969 INFO  (qtp2098497983-30302) [n:127.0.0.1:34440_solr    ] o.a.s.s.HttpSolrCall [admin] webapp=null path=/admin/autoscaling params={wt=javabin&version=2} status=0 QTime=11
   [junit4]   2> 3131970 DEBUG (zkCallback-4931-thread-1-processing-n:127.0.0.1:34440_solr) [n:127.0.0.1:34440_solr    ] o.a.s.c.a.OverseerTriggerThread Refreshing /autoscaling.json with znode version 7
   [junit4]   2> 3131970 INFO  (TEST-TriggerIntegrationTest.testNodeAddedTriggerRestoreState-seed#[1B22282045F7894E]) [    ] o.e.j.s.Server jetty-9.3.20.v20170531
   [junit4]   2> 3131973 DEBUG (zkCallback-4931-thread-1-processing-n:127.0.0.1:34440_solr) [n:127.0.0.1:34440_solr    ] o.a.s.c.a.NodeAddedTrigger Initial livenodes: [127.0.0.1:48735_solr, 127.0.0.1:34440_solr]
   [junit4]   2> 3131973 DEBUG (zkCallback-4931-thread-1-processing-n:127.0.0.1:34440_solr) [n:127.0.0.1:34440_solr    ] o.a.s.c.a.NodeAddedTrigger NodeAddedTrigger node_added_restore_trigger instantiated with properties: {event=nodeAdded, waitFor=5, actions=[{name=test, class=org.apache.solr.cloud.autoscaling.TriggerIntegrationTest$TestTriggerAction}], enabled=true}
   [junit4]   2> 3131973 DEBUG (OverseerAutoScalingTriggerThread-99116647178764299-127.0.0.1:34440_solr-n_0000000002) [n:127.0.0.1:34440_solr    ] o.a.s.c.a.OverseerTriggerThread Processed trigger updates upto znodeVersion 7
   [junit4]   2> 3131973 INFO  (TEST-TriggerIntegrationTest.testNodeAddedTriggerRestoreState-seed#[1B22282045F7894E]) [    ] o.e.j.s.h.ContextHandler Started o.e.j.s.ServletContextHandler@62c0cba3{/solr,null,AVAILABLE}
   [junit4]   2> 3131974 INFO  (TEST-TriggerIntegrationTest.testNodeAddedTriggerRestoreState-seed#[1B22282045F7894E]) [    ] o.e.j.s.AbstractConnector Started ServerConnector@5896411d{HTTP/1.1,[http/1.1]}{127.0.0.1:35934}
   [junit4]   2> 3131974 INFO  (TEST-TriggerIntegrationTest.testNodeAddedTriggerRestoreState-seed#[1B22282045F7894E]) [    ] o.e.j.s.Server Started @3136321ms
   [junit4]   2> 3131974 INFO  (TEST-TriggerIntegrationTest.testNodeAddedTriggerRestoreState-seed#[1B22282045F7894E]) [    ] o.a.s.c.s.e.JettySolrRunner Jetty properties: {hostContext=/solr, hostPort=35934}
   [junit4]   2> 3131974 ERROR (TEST-TriggerIntegrationTest.testNodeAddedTriggerRestoreState-seed#[1B22282045F7894E]) [    ] o.a.s.u.StartupLoggingUtils Missing Java Option solr.log.dir. Logging may be missing or incomplete.
   [junit4]   2> 3131977 INFO  (TEST-TriggerIntegrationTest.testNodeAddedTriggerRestoreState-seed#[1B22282045F7894E]) [    ] o.a.s.s.SolrDispatchFilter  ___      _       Welcome to Apache Solr™ version 8.0.0
   [junit4]   2> 3131977 INFO  (TEST-TriggerIntegrationTest.testNodeAddedTriggerRestoreState-seed#[1B22282045F7894E]) [    ] o.a.s.s.SolrDispatchFilter / __| ___| |_ _   Starting in cloud mode on port null
   [junit4]   2> 3131977 INFO  (TEST-TriggerIntegrationTest.testNodeAddedTriggerRestoreState-seed#[1B22282045F7894E]) [    ] o.a.s.s.SolrDispatchFilter \__ \/ _ \ | '_|  Install dir: null
   [junit4]   2> 3131977 INFO  (TEST-TriggerIntegrationTest.testNodeAddedTriggerRestoreState-seed#[1B22282045F7894E]) [    ] o.a.s.s.SolrDispatchFilter |___/\___/_|_|    Start time: 2017-12-04T15:07:04.093Z
   [junit4]   2> 3131978 INFO  (OverseerAutoScalingTriggerThread-99116647178764299-127.0.0.1:34440_solr-n_0000000002) [n:127.0.0.1:34440_solr    ] o.a.s.c.a.TriggerIntegrationTest TestTriggerAction init
   [junit4]   2> 3131979 DEBUG (OverseerAutoScalingTriggerThread-99116647178764299-127.0.0.1:34440_solr-n_0000000002) [n:127.0.0.1:34440_solr    ] o.a.s.c.a.OverseerTriggerThread -- clean old nodeLost markers
   [junit4]   2> 3131980 DEBUG (OverseerAutoScalingTriggerThread-99116647178764299-127.0.0.1:34440_solr-n_0000000002) [n:127.0.0.1:34440_solr    ] o.a.s.c.a.OverseerTriggerThread Current znodeVersion 7, lastZnodeVersion 7
   [junit4]   2> 3131980 INFO  (TEST-TriggerIntegrationTest.testNodeAddedTriggerRestoreState-seed#[1B22282045F7894E]) [    ] o.a.s.s.SolrDispatchFilter solr.xml found in ZooKeeper. Loading...
   [junit4]   2> 3131980 DEBUG (ScheduledTrigger-10162-thread-4) [n:127.0.0.1:34440_solr    ] o.a.s.c.a.NodeAddedTrigger Running NodeAddedTrigger node_added_restore_trigger
   [junit4]   2> 3131980 DEBUG (ScheduledTrigger-10162-thread-4) [n:127.0.0.1:34440_solr    ] o.a.s.c.a.NodeAddedTrigger Found livenodes: [127.0.0.1:48735_solr, 127.0.0.1:34440_solr]
   [junit4]   2> 3131986 INFO  (TEST-TriggerIntegrationTest.testNodeAddedTriggerRestoreState-seed#[1B22282045F7894E]) [    ] o.a.s.c.ZkContainer Zookeeper client=127.0.0.1:36648/solr
   [junit4]   2> 3131998 INFO  (TEST-TriggerIntegrationTest.testNodeAddedTriggerRestoreState-seed#[1B22282045F7894E]) [n:127.0.0.1:35934_solr    ] o.a.s.c.c.ZkStateReader Updated live nodes from ZooKeeper... (0) -> (2)
   [junit4]   2> 3132001 INFO  (TEST-TriggerIntegrationTest.testNodeAddedTriggerRestoreState-seed#[1B22282045F7894E]) [n:127.0.0.1:35934_solr    ] o.a.s.c.Overseer Overseer (id=null) closing
   [junit4]   2> 3132004 INFO  (TEST-TriggerIntegrationTest.testNodeAddedTriggerRestoreState-seed#[1B22282045F7894E]) [n:127.0.0.1:35934_solr    ] o.a.s.c.ZkController Register node as live in ZooKeeper:/live_nodes/127.0.0.1:35934_solr
   [junit4]   2> 3132006 INFO  (zkCallback-4926-thread-1) [    ] o.a.s.c.c.ZkStateReader Updated live nodes from ZooKeeper... (2) -> (3)
   [junit4]   2> 3132006 INFO  (zkCallback-4931-thread-1-processing-n:127.0.0.1:34440_solr) [n:127.0.0.1:34440_solr    ] o.a.s.c.c.ZkStateReader Updated live nodes from ZooKeeper... (2) -> (3)
   [junit4]   2> 3132006 INFO  (zkCallback-4944-thread-1-processing-n:127.0.0.1:48735_solr) [n:127.0.0.1:48735_solr    ] o.a.s.c.c.ZkStateReader Updated live nodes from ZooKeeper... (2) -> (3)
   [junit4]   2> 3132008 INFO  (zkCallback-4954-thread-1-processing-n:127.0.0.1:35934_solr) [n:127.0.0.1:35934_solr    ] o.a.s.c.c.ZkStateReader Updated live nodes from ZooKeeper... (2) -> (3)
   [junit4]   2> 3132130 INFO  (TEST-TriggerIntegrationTest.testNodeAddedTriggerRestoreState-seed#[1B22282045F7894E]) [n:127.0.0.1:35934_solr    ] o.a.s.m.r.SolrJmxReporter JMX monitoring for 'solr_35934.solr.node' (registry 'solr.node') enabled at server: com.sun.jmx.mbeanserver.JmxMBeanServer@40dac22a
   [junit4]   2> 3132138 INFO  (TEST-TriggerIntegrationTest.testNodeAddedTriggerRestoreState-seed#[1B22282045F7894E]) [n:127.0.0.1:35934_solr    ] o.a.s.m.r.SolrJmxReporter JMX monitoring for 'solr_35934.solr.jvm' (registry 'solr.jvm') enabled at server: com.sun.jmx.mbeanserver.JmxMBeanServer@40dac22a
   [junit4]   2> 3132138 INFO  (TEST-TriggerIntegrationTest.testNodeAddedTriggerRestoreState-seed#[1B22282045F7894E]) [n:127.0.0.1:35934_solr    ] o.a.s.m.r.SolrJmxReporter JMX monitoring for 'solr_35934.solr.jetty' (registry 'solr.jetty') enabled at server: com.sun.jmx.mbeanserver.JmxMBeanServer@40dac22a
   [junit4]   2> 3132139 INFO  (TEST-TriggerIntegrationTest.testNodeAddedTriggerRestoreState-seed#[1B22282045F7894E]) [n:127.0.0.1:35934_solr    ] o.a.s.c.CorePropertiesLocator Found 0 core definitions underneath /export/home/jenkins/workspace/Lucene-Solr-master-Solaris/solr/build/solr-core/test/J1/temp/solr.cloud.autoscaling.TriggerIntegrationTest_1B22282045F7894E-001/tempDir-001/node5/.
   [junit4]   2> 3133001 DEBUG (ScheduledTrigger-10162-thread-4) [n:127.0.0.1:34440_solr    ] o.a.s.c.a.NodeAddedTrigger Running NodeAddedTrigger node_added_restore_trigger
   [junit4]   2> 3133001 DEBUG (ScheduledTrigger-10162-thread-4) [n:127.0.0.1:34440_solr    ] o.a.s.c.a.NodeAddedTrigger Found livenodes: [127.0.0.1:48735_solr, 127.0.0.1:34440_solr, 127.0.0.1:35934_solr]
   [junit4]   2> 3133001 DEBUG (ScheduledTrigger-10162-thread-4) [n:127.0.0.1:34440_solr    ] o.a.s.c.a.NodeAddedTrigger Tracking new node: 127.0.0.1:35934_solr at time 1512400025117000000
   [junit4]   2> 3133679 INFO  (qtp1719926614-30383) [n:127.0.0.1:35934_solr    ] o.a.s.c.c.ZkStateReader Updated live nodes from ZooKeeper... (0) -> (3)
   [junit4]   2> 3133682 INFO  (qtp1719926614-30383) [n:127.0.0.1:35934_solr    ] o.a.s.c.s.i.ZkClientClusterStateProvider Cluster at 127.0.0.1:36648/solr ready
   [junit4]   2> 3133684 INFO  (qtp2098497983-30304) [n:127.0.0.1:34440_solr    ] o.a.s.s.HttpSolrCall [admin] webapp=null path=/admin/metrics params={prefix=CORE.coreName&wt=javabin&version=2&group=solr.core} status=0 QTime=0
   [junit4]   2> 3133686 INFO  (qtp1719926614-30384) [n:127.0.0.1:35934_solr    ] o.a.s.s.HttpSolrCall [admin] webapp=null path=/admin/metrics params={prefix=CORE.coreName&wt=javabin&version=2&group=solr.core} status=0 QTime=0
   [junit4]   2> 3133687 INFO  (qtp1591131323-30347) [n:127.0.0.1:48735_solr    ] o.a.s.s.HttpSolrCall [admin] webapp=null path=/admin/metrics params={prefix=CORE.coreName&wt=javabin&version=2&group=solr.core} status=0 QTime=0
   [junit4]   2> 3133688 DEBUG (qtp1719926614-30383) [n:127.0.0.1:35934_solr    ] o.a.s.c.a.AutoScalingHandler Verified autoscaling configuration
   [junit4]   2> 3133690 INFO  (qtp1719926614-30383) [n:127.0.0.1:35934_solr    ] o.a.s.s.HttpSolrCall [admin] webapp=null path=/cluster/autoscaling params={wt=javabin&version=2} status=0 QTime=20
   [junit4]   2> 3133692 DEBUG (zkCallback-4931-thread-1-processing-n:127.0.0.1:34440_solr) [n:127.0.0.1:34440_solr    ] o.a.s.c.a.OverseerTriggerThread Refreshing /autoscaling.json with znode version 8
   [junit4]   2> 3133692 DEBUG (zkCallback-4931-thread-1-processing-n:127.0.0.1:34440_solr) [n:127.0.0.1:34440_solr    ] o.a.s.c.a.NodeAddedTrigger Initial livenodes: [127.0.0.1:48735_solr, 127.0.0.1:34440_solr, 127.0.0.1:35934_solr]
   [junit4]   2> 3133692 DEBUG (zkCallback-4931-thread-1-processing-n:127.0.0.1:34440_solr) [n:127.0.0.1:34440_solr    ] o.a.s.c.a.NodeAddedTrigger NodeAddedTrigger node_added_restore_trigger instantiated with properties: {event=nodeAdded, waitFor=0, actions=[{name=test, class=org.apache.solr.cloud.autoscaling.TriggerIntegrationTest$TestTriggerAction}], enabled=true}
   [junit4]   2> 3133693 DEBUG (OverseerAutoScalingTriggerThread-99116647178764299-127.0.0.1:34440_solr-n_0000000002) [n:127.0.0.1:34440_solr    ] o.a.s.c.a.OverseerTriggerThread Processed trigger updates upto znodeVersion 8
   [junit4]   2> 3133697 INFO  (OverseerAutoScalingTriggerThread-99116647178764299-127.0.0.1:34440_solr-n_0000000002) [n:127.0.0.1:34440_solr    ] o.a.s.c.a.TriggerIntegrationTest TestTriggerAction init
   [junit4]   2> 3133698 DEBUG (OverseerAutoScalingTriggerThread-99116647178764299-127.0.0.1:34440_solr-n_0000000002) [n:127.0.0.1:34440_solr    ] o.a.s.c.a.NodeAddedTrigger Adding node from marker path: 127.0.0.1:35934_solr
   [junit4]   2> 3133700 DEBUG (OverseerAutoScalingTriggerThread-99116647178764299-127.0.0.1:34440_solr-n_0000000002) [n:127.0.0.1:34440_solr    ] o.a.s.c.a.OverseerTriggerThread -- clean old nodeLost markers
   [junit4]   2> 3133700 DEBUG (ScheduledTrigger-10162-thread-1) [n:127.0.0.1:34440_solr    ] o.a.s.c.a.NodeAddedTrigger Running NodeAddedTrigger node_added_restore_trigger
   [junit4]   2> 3133701 DEBUG (ScheduledTrigger-10162-thread-1) [n:127.0.0.1:34440_solr    ] o.a.s.c.a.NodeAddedTrigger Found livenodes: [127.0.0.1:48735_solr, 127.0.0.1:34440_solr, 127.0.0.1:35934_solr]
   [junit4]   2> 3133701 DEBUG (ScheduledTrigger-10162-thread-1) [n:127.0.0.1:34440_solr    ] o.a.s.c.a.NodeAddedTrigger NodeAddedTrigger node_added_restore_trigger firing registered processor for nodes: [127.0.0.1:35934_solr] added at times [1512400025815000000], now=1512400025817000000
   [junit4]   2> 3133701 DEBUG (ScheduledTrigger-10162-thread-1) [n:127.0.0.1:34440_solr    ] o.a.s.c.a.ScheduledTriggers -------- Cooldown period - rejecting event: {
   [junit4]   2>   "id":"14fd1fcf78fea3c0Tcrn4z9jfcodcy9f6f6b7s13x6",
   [junit4]   2>   "source":"node_added_restore_trigger",
   [junit4]   2>   "eventTime":1512400025815000000,
   [junit4]   2>   "eventType":"NODEADDED",
   [junit4]   2>   "properties":{
   [junit4]   2>     "eventTimes":[1512400025815000000],
   [junit4]   2>     "nodeNames":["127.0.0.1:35934_solr"]}}
   [junit4]   2> 3133701 INFO  (ScheduledTrigger-10162-thread-1) [n:127.0.0.1:34440_solr    ] o.a.s.c.a.SystemLogListener Collection .system does not exist, disabling logging.
   [junit4]   2> 3133702 DEBUG (OverseerAutoScalingTriggerThread-99116647178764299-127.0.0.1:34440_solr-n_0000000002) [n:127.0.0.1:34440_solr    ] o.a.s.c.a.OverseerTriggerThread Current znodeVersion 8, lastZnodeVersion 8
   [junit4]   2> 3134711 DEBUG (ScheduledTrigger-10162-thread-1) [n:127.0.0.1:34440_solr    ] o.a.s.c.a.NodeAddedTrigger Running NodeAddedTrigger node_added_restore_trigger
   [junit4]   2> 3134711 DEBUG (ScheduledTrigger-10162-thread-1) [n:127.0.0.1:34440_solr    ] o.a.s.c.a.NodeAddedTrigger Found livenodes: [127.0.0.1:48735_solr, 127.0.0.1:34440_solr, 127.0.0.1:35934_solr]
   [junit4]   2> 3134711 DEBUG (ScheduledTrigger-10162-thread-1) [n:127.0.0.1:34440_solr    ] o.a.s.c.a.NodeAddedTrigger NodeAddedTrigger node_added_restore_trigger firing registered processor for nodes: [127.0.0.1:35934_solr] added at times [1512400025815000000], now=1512400026827000000
   [junit4]   2> 3134711 DEBUG (ScheduledTrigger-10162-thread-1) [n:127.0.0.1:34440_solr    ] o.a.s.c.a.ScheduledTriggers -------- Cooldown period - rejecting event: {
   [junit4]   2>   "id":"14fd1fcf78fea3c0Tcrn4z9jfcodcy9f6f6b7s13x8",
   [junit4]   2>   "source":"node_added_restore_trigger",
   [junit4]   2>   "eventTime":1512400025815000000,
   [junit4]   2>   "eventType":"NODEADDED",
   [junit4]   2>   "properties":{
   [junit4]   2>     "eventTimes":[1512400025815000000],
   [junit4]   2>     "nodeNames":["127.0.0.1:35934_solr"]}}
   [junit4]   2> 3135716 DEBUG (ScheduledTrigger-10162-thread-1) [n:127.0.0.1:34440_solr    ] o.a.s.c.a.NodeAddedTrigger Running NodeAddedTrigger node_added_restore_trigger
   [junit4]   2> 3135716 DEBUG (ScheduledTrigger-10162-thread-1) [n:127.0.0.1:34440_solr    ] o.a.s.c.a.NodeAddedTrigger Found livenodes: [127.0.0.1:48735_solr, 127.0.0.1:34440_solr, 127.0.0.1:35934_solr]
   [junit4]   2> 3135716 DEBUG (ScheduledTrigger-10162-thread-1) [n:127.0.0.1:34440_solr    ] o.a.s.c.a.NodeAddedTrigger NodeAddedTrigger node_added_restore_trigger firing registered processor for nodes: [127.0.0.1:35934_solr] added at times [1512400025815000000], now=1512400027832000000
   [junit4]   2> 3135716 DEBUG (ScheduledTrigger-10162-thread-1) [n:127.0.0.1:34440_solr    ] o.a.s.c.a.ScheduledTriggers -------- Cooldown period - rejecting event: {
   [junit4]   2>   "id":"14fd1fcf78fea3c0Tcrn4z9jfcodcy9f6f6b7s13x9",
   [junit4]   2>   "source":"node_added_restore_trigger",
   [junit4]   2>   "eventTime":1512400025815000000,
   [junit4]   2>   "eventType":"NODEADDED",
   [junit4]   2>   "properties":{
   [junit4]   2>     "eventTimes":[1512400025815000000],
   [junit4]   2>     "nodeNames":["127.0.0.1:35934_solr"]}}
   [junit4]   2> 3136719 DEBUG (ScheduledTrigger-10162-thread-1) [n:127.0.0.1:34440_solr    ] o.a.s.c.a.NodeAddedTrigger Running NodeAddedTrigger node_added_restore_trigger
   [junit4]   2> 3136719 DEBUG (ScheduledTrigger-10162-thread-1) [n:127.0.0.1:34440_solr    ] o.a.s.c.a.NodeAddedTrigger Found livenodes: [127.0.0.1:48735_solr, 127.0.0.1:34440_solr, 127.0.0.1:35934_solr]
   [junit4]   2> 3136720 DEBUG (ScheduledTrigger-10162-thread-1) [n:127.0.0.1:34440_solr    ] o.a.s.c.a.NodeAddedTrigger NodeAddedTrigger node_added_restore_trigger firing registered processor for nodes: [127.0.0.1:35934_solr] added at times [1512400025815000000], now=1512400028836000000
   [junit4]   2> 3136720 DEBUG (ScheduledTrigger-10162-thread-1) [n:127.0.0.1:34440_solr    ] o.a.s.c.a.ScheduledTriggers -------- Cooldown period - rejecting event: {
   [junit4]   2>   "id":"14fd1fcf78fea3c0Tcrn4z9jfcodcy9f6f6b7s13xa",
   [junit4]   2>   "source":"node_added_restore_trigger",
   [junit4]   2>   "eventTime":1512400025815000000,
   [junit4]   2>   "eventType":"NODEADDED",
   [junit4]   2>   "properties":{
   [junit4]   2>     "eventTimes":[1512400025815000000],
   [junit4]   2>     "nodeNames":["127.0.0.1:35934_solr"]}}
   [junit4]   2> 3137722 DEBUG (ScheduledTrigger-10162-thread-1) [n:127.0.0.1:34440_solr    ] o.a.s.c.a.NodeAddedTrigger Running NodeAddedTrigger node_added_restore_trigger
   [junit4]   2> 3137722 DEBUG (ScheduledTrigger-10162-thread-1) [n:127.0.0.1:34440_solr    ] o.a.s.c.a.NodeAddedTrigger Found livenodes: [127.0.0.1:48735_solr, 127.0.0.1:34440_solr, 127.0.0.1:35934_solr]
   [junit4]   2> 3137722 DEBUG (ScheduledTrigger-10162-thread-1) [n:127.0.0.1:34440_solr    ] o.a.s.c.a.NodeAddedTrigger NodeAddedTrigger node_added_restore_trigger firing registered processor for nodes: [127.0.0.1:35934_solr] added at times [1512400025815000000], now=1512400029838000000
   [junit4]   2> 3137722 DEBUG (ScheduledTrigger-10162-thread-1) [n:127.0.0.1:34440_solr    ] o.a.s.c.a.ScheduledTriggers ++++++++ Cooldown inactive - processing event: {
   [junit4]   2>   "id":"14fd1fcf78fea3c0Tcrn4z9jfcodcy9f6f6b7s13xb",
   [junit4]   2>   "source":"node_added_restore_trigger",
   [junit4]   2>   "eventTime":1512400025815000000,
   [junit4]   2>   "eventType":"NODEADDED",
   [junit4]   2>   "properties":{
   [junit4]   2>     "eventTimes":[1512400025815000000],
   [junit4]   2>     "nodeNames":["127.0.0.1:35934_solr"]}}
   [junit4]   2> 3137724 DEBUG (AutoscalingActionExecutor-10163-thread-1-processing-n:127.0.0.1:34440_solr) [n:127.0.0.1:34440_solr    ] o.a.s.c.a.ScheduledTriggers -- processing actions for {
   [junit4]   2>   "id":"14fd1fcf78fea3c0Tcrn4z9jfcodcy9f6f6b7s13xb",
   [junit4]   2>   "source":"node_added_restore_trigger",
   [junit4]   2>   "eventTime":1512400025815000000,
   [junit4]   2>   "eventType":"NODEADDED",
   [junit4]   2>   "properties":{
   [junit4]   2>     "eventTimes":[1512400025815000000],
   [junit4]   2>     "_enqueue_time_":1512400029839000000,
   [junit4]   2>     "nodeNames":["127.0.0.1:35934_solr"]}}
   [junit4]   2> 3137724 INFO  (AutoscalingActionExecutor-10163-thread-1-processing-n:127.0.0.1:34440_solr) [n:127.0.0.1:34440_solr    ] o.a.s.c.ActionThrottle The last action attempt started 5930ms ago.
   [junit4]   2> 3137725 INFO  (TEST-TriggerIntegrationTest.testNodeAddedTriggerRestoreState-seed#[1B22282045F7894E]) [    ] o.a.s.SolrTestCaseJ4 ###Ending testNodeAddedTriggerRestoreState
   [junit4]   2> 3137897 INFO  (TEST-TriggerIntegrationTest.testCooldown-seed#[1B22282045F7894E]) [    ] o.a.s.SolrTestCaseJ4 ###Starting testCooldown
   [junit4]   2> 3137897 INFO  (TEST-TriggerIntegrationTest.testCooldown-seed#[1B22282045F7894E]) [    ] o.a.s.c.a.TriggerIntegrationTest /autoscaling.json reset, new znode version 9
   [junit4]   2> 3137898 DEBUG (zkCallback-4931-thread-1-processing-n:127.0.0.1:34440_solr) [n:127.0.0.1:34440_solr    ] o.a.s.c.a.OverseerTriggerThread Refreshing /autoscaling.json with znode version 9
   [junit4]   2> 3137898 DEBUG (OverseerAutoScalingTriggerThread-99116647178764299-127.0.0.1:34440_solr-n_0000000002) [n:127.0.0.1:34440_solr    ] o.a.s.c.a.OverseerTriggerThread Processed trigger updates upto znodeVersion 9
   [junit4]   2> 3137902 DEBUG (OverseerAutoScalingTriggerThread-99116647178764299-127.0.0.1:34440_solr-n_0000000002) [n:127.0.0.1:34440_solr    ] o.a.s.c.a.OverseerTriggerThread -- clean old nodeLost markers
   [junit4]   2> 3137903 DEBUG (OverseerAutoScalingTriggerThread-99116647178764299-127.0.0.1:34440_solr-n_0000000002) [n:127.0.0.1:34440_solr    ] o.a.s.c.a.OverseerTriggerThread -- clean old nodeAdded markers
   [junit4]   2> 3137903 DEBUG (OverseerAutoScalingTriggerThread-99116647178764299-127.0.0.1:34440_solr-n_0000000002) [n:127.0.0.1:34440_solr    ] o.a.s.c.a.OverseerTriggerThread Current znodeVersion 9, lastZnodeVersion 9
   [junit4]   2> 3137909 INFO  (qtp2098497983-30308) [n:127.0.0.1:34440_solr    ] o.a.s.c.c.ZkStateReader Updated live nodes from ZooKeeper... (0) -> (3)
   [junit4]   2> 3137911 INFO  (qtp2098497983-30308) [n:127.0.0.1:34440_solr    ] o.a.s.c.s.i.ZkClientClusterStateProvider Cluster at 127.0.0.1:36648/solr ready
   [junit4]   2> 3137915 INFO  (qtp2098497983-30307) [n:127.0.0.1:34440_solr    ] o.a.s.s.HttpSolrCall [admin] webapp=null path=/admin/metrics params={prefix=CORE.coreName&wt=javabin&version=2&group=solr.core} status=0 QTime=0
   [junit4]   2> 3137916 INFO  (qtp1719926614-30387) [n:127.0.0.1:35934_solr    ] o.a.s.s.HttpSolrCall [admin] webapp=null path=/admin/metrics params={prefix=CORE.coreName&wt=javabin&version=2&group=solr.core} status=0 QTime=0
   [junit4]   2> 3137920 INFO  (qtp1591131323-30348) [n:127.0.0.1:48735_solr    ] o.a.s.s.HttpSolrCall [admin] webapp=null path=/admin/metrics params={prefix=CORE.coreName&wt=javabin&version=2&group=solr.core} status=0 QTime=0
   [junit4]   2> 3137920 DEBUG (qtp2098497983-30308) [n:127.0.0.1:34440_solr    ] o.a.s.c.a.AutoScalingHandler Verified autoscaling configuration
   [junit4]   2> 3137922 INFO  (qtp2098497983-30308) [n:127.0.0.1:34440_solr    ] o.a.s.s.HttpSolrCall [admin] webapp=null path=/admin/autoscaling params={wt=javabin&version=2} status=0 QTime=17
   [junit4]   2> 3137923 DEBUG (zkCallback-4931-thread-1-processing-n:127.0.0.1:34440_solr) [n:127.0.0.1:34440_solr    ] o.a.s.c.a.OverseerTriggerThread Refreshing /autoscaling.json with znode version 10
   [junit4]   2> 3137923 DEBUG (zkCallback-4931-thread-1-processing-n:127.0.0.1:34440_solr) [n:127.0.0.1:34440_solr    ] o.a.s.c.a.NodeAddedTrigger Initial livenodes: [127.0.0.1:48735_solr, 127.0.0.1:34440_solr, 127.0.0.1:35934_solr]
   [junit4]   2> 3137923 DEBUG (zkCallback-4931-thread-1-processing-n:127.0.0.1:34440_solr) [n:127.0.0.1:34440_solr    ] o.a.s.c.a.NodeAddedTrigger NodeAddedTrigger node_added_cooldown_trigger instantiated with properties: {event=nodeAdded, waitFor=1, actions=[{name=test, class=org.apache.solr.cloud.autoscaling.TriggerIntegrationTest$TestTriggerAction}], enabled=true}
   [junit4]   2> 3137923 DEBUG (OverseerAutoScalingTriggerThread-99116647178764299-127.0.0.1:34440_solr-n_0000000002) [n:127.0.0.1:34440_solr    ] o.a.s.c.a.OverseerTriggerThread Processed trigger updates upto znodeVersion 10
   [junit4]   2> 3137927 INFO  (OverseerAutoScalingTriggerThread-99116647178764299-127.0.0.1:34440_solr-n_0000000002) [n:127.0.0.1:34440_solr    ] o.a.s.c.a.TriggerIntegrationTest TestTriggerAction init
   [junit4]   2> 3137927 DEBUG (OverseerAutoScalingTriggerThread-99116647178764299-127.0.0.1:34440_solr-n_0000000002) [n:127.0.0.1:34440_solr    ] o.a.s.c.a.OverseerTriggerThread -- clean old nodeLost markers
   [junit4]   2> 3137928 DEBUG (OverseerAutoScalingTriggerThread-99116647178764299-127.0.0.1:34440_solr-n_0000000002) [n:127.0.0.1:34440_solr    ] o.a.s.c.a.OverseerTriggerThread Current znodeVersion 10, lastZnodeVersion 10
   [junit4]   2> 3137928 DEBUG (ScheduledTrigger-10162-thread-2) [n:127.0.0.1:34440_solr    ] o.a.s.c.a.NodeAddedTrigger Running NodeAddedTrigger node_added_cooldown_trigger
   [junit4]   2> 3137928 DEBUG (ScheduledTrigger-10162-thread-2) [n:127.0.0.1:34440_solr    ] o.a.s.c.a.NodeAddedTrigger Found livenodes: [127.0.0.1:48735_solr, 127.0.0.1:34440_solr, 127.0.0.1:35934_solr]
   [junit4]   2> 3137928 INFO  (qtp1591131323-30350) [n:127.0.0.1:48735_solr    ] o.a.s.c.c.ZkStateReader Updated live nodes from ZooKeeper... (0) -> (3)
   [junit4]   2> 3137930 INFO  (qtp1591131323-30350) [n:127.0.0.1:48735_solr    ] o.a.s.c.s.i.ZkClientClusterStateProvider Cluster at 127.0.0.1:36648/solr ready
   [junit4]   2> 3137931 INFO  (qtp2098497983-30305) [n:127.0.0.1:34440_solr    ] o.a.s.s.HttpSolrCall [admin] webapp=null path=/admin/metrics params={prefix=CORE.coreName&wt=javabin&version=2&group=solr.core} status=0 QTime=0
   [junit4]   2> 3137931 INFO  (qtp1719926614-30381) [n:127.0.0.1:35934_solr    ] o.a.s.s.HttpSolrCall [admin] webapp=null path=/admin/metrics params={prefix=CORE.coreName&wt=javabin&version=2&group=solr.core} status=0 QTime=0
   [junit4]   2> 3137932 INFO  (qtp1591131323-30343) [n:127.0.0.1:48735_solr    ] o.a.s.s.HttpSolrCall [admin] webapp=null path=/admin/metrics params={prefix=CORE.coreName&wt=javabin&version=2&group=solr.core} status=0 QTime=0
   [junit4]   2> 3137932 DEBUG (qtp1591131323-30350) [n:127.0.0.1:48735_solr    ] o.a.s.c.a.AutoScalingHandler Verified autoscaling configuration
   [junit4]   2> 3137933 INFO  (qtp1591131323-30350) [n:127.0.0.1:48735_solr    ] o.a.s.s.HttpSolrCall [admin] webapp=null path=/cluster/autoscaling params={wt=javabin&version=2} status=0 QTime=9
   [junit4]   2> 3137934 INFO  (TEST-TriggerIntegrationTest.testCooldown-seed#[1B22282045F7894E]) [    ] o.e.j.s.Server jetty-9.3.20.v20170531
   [junit4]   2> 3137934 DEBUG (zkCallback-4931-thread-1-processing-n:127.0.0.1:34440_solr) [n:127.0.0.1:34440_solr    ] o.a.s.c.a.OverseerTriggerThread Refreshing /autoscaling.json with znode version 11
   [junit4]   2> 3137934 DEBUG (zkCallback-4931-thread-1-processing-n:127.0.0.1:34440_solr) [n:127.0.0.1:34440_solr    ] o.a.s.c.a.NodeAddedTrigger Initial livenodes: [127.0.0.1:48735_solr, 127.0.0.1:34440_solr, 127.0.0.1:35934_solr]
   [junit4]   2> 3137934 DEBUG (zkCallback-4931-thread-1-processing-n:127.0.0.1:34440_solr) [n:127.0.0.1:34440_solr    ] o.a.s.c.a.NodeAddedTrigger NodeAddedTrigger node_added_cooldown_trigger instantiated with properties: {event=nodeAdded, waitFor=1, actions=[{name=test, class=org.apache.solr.cloud.autoscaling.TriggerIntegrationTest$TestTriggerAction}], enabled=true}
   [junit4]   2> 3137934 DEBUG (OverseerAutoScalingTriggerThread-99116647178764299-127.0.0.1:34440_solr-n_0000000002) [n:127.0.0.1:34440_solr    ] o.a.s.c.a.OverseerTriggerThread Processed trigger updates upto znodeVersion 11
   [junit4]   2> 3137935 INFO  (TEST-TriggerIntegrationTest.testCooldown-seed#[1B22282045F7894E]) [    ] o.e.j.s.h.ContextHandler Started o.e.j.s.ServletContextHandler@294e1b8b{/solr,null,AVAILABLE}
   [junit4]   2> 3137935 INFO  (TEST-TriggerIntegrationTest.testCooldown-seed#[1B22282045F7894E]) [    ] o.e.j.s.AbstractConnector Started ServerConnector@69818ca6{HTTP/1.1,[http/1.1]}{127.0.0.1:52672}
   [junit4]   2> 3137935 INFO  (TEST-TriggerIntegrationTest.testCooldown-seed#[1B22282045F7894E]) [    ] o.e.j.s.Server Started @3142284ms
   [junit4]   2> 3137935 INFO  (TEST-TriggerIntegrationTest.testCooldown-seed#[1B22282045F7894E]) [    ] o.a.s.c.s.e.JettySolrRunner Jetty properties: {hostContext=/solr, hostPort=52672}
   [junit4]   2> 3137935 DEBUG (OverseerAutoScalingTriggerThread-99116647178764299-127.0.0.1:34440_solr-n_0000000002) [n:127.0.0.1:34440_solr    ] o.a.s.c.a.OverseerTriggerThread -- clean old nodeLost markers
   [junit4]   2> 3137935 ERROR (TEST-TriggerIntegrationTest.testCooldown-seed#[1B22282045F7894E]) [    ] o.a.s.u.StartupLoggingUtils Missing Java Option solr.log.dir. Logging may be missing or incomplete.
   [junit4]   2> 3137936 INFO  (TEST-TriggerIntegrationTest.testCooldown-seed#[1B22282045F7894E]) [    ] o.a.s.s.SolrDispatchFilter  ___      _       Welcome to Apache Solr™ version 8.0.0
   [junit4]   2> 3137937 INFO  (TEST-TriggerIntegrationTest.testCooldown-seed#[1B22282045F7894E]) [    ] o.a.s.s.SolrDispatchFilter / __| ___| |_ _   Starting in cloud mode on port null
   [junit4]   2> 3137937 DEBUG (OverseerAutoScali

[...truncated too long message...]

 ZK: [KeeperErrorCode = Session expired for /live_nodes]
   [junit4]   2> 3300357 INFO  (jetty-closer-4908-thread-8) [    ] o.e.j.s.h.ContextHandler Stopped o.e.j.s.ServletContextHandler@1126f3ac{/solr,null,UNAVAILABLE}
   [junit4]   2> 3300359 WARN  (zkCallback-5088-thread-2-processing-n:127.0.0.1:45594_solr) [n:127.0.0.1:45594_solr    ] o.a.s.c.c.ZkStateReader ZooKeeper watch triggered, but Solr cannot talk to ZK: [KeeperErrorCode = Session expired for /live_nodes]
   [junit4]   2> 3300360 INFO  (jetty-closer-4908-thread-9) [    ] o.e.j.s.h.ContextHandler Stopped o.e.j.s.ServletContextHandler@6a1345d{/solr,null,UNAVAILABLE}
   [junit4]   2> 3300363 ERROR (SUITE-TriggerIntegrationTest-seed#[1B22282045F7894E]-worker) [    ] o.a.z.s.ZooKeeperServer ZKShutdownHandler is not registered, so ZooKeeper server won't take any action on ERROR or SHUTDOWN server state changes
   [junit4]   2> 3300364 INFO  (SUITE-TriggerIntegrationTest-seed#[1B22282045F7894E]-worker) [    ] o.a.s.c.ZkTestServer connecting to 127.0.0.1:36648 36648
   [junit4]   2> 3311246 INFO  (Thread-8872) [    ] o.a.s.c.ZkTestServer connecting to 127.0.0.1:36648 36648
   [junit4]   2> 3311254 WARN  (Thread-8872) [    ] o.a.s.c.ZkTestServer Watch limit violations: 
   [junit4]   2> Maximum concurrent create/delete watches above limit:
   [junit4]   2> 
   [junit4]   2> 	42	/solr/aliases.json
   [junit4]   2> 	42	/solr/clusterprops.json
   [junit4]   2> 	18	/solr/security.json
   [junit4]   2> 	2	/solr/configs/conf
   [junit4]   2> 
   [junit4]   2> Maximum concurrent data watches above limit:
   [junit4]   2> 
   [junit4]   2> 	42	/solr/clusterstate.json
   [junit4]   2> 	16	/solr/collections/collection1/state.json
   [junit4]   2> 	6	/solr/autoscaling.json
   [junit4]   2> 	4	/solr/overseer_elect/election/99116647178764314-127.0.0.1:52672_solr-n_0000000005
   [junit4]   2> 	3	/solr/overseer_elect/election/99116647178764345-127.0.0.1:57907_solr-n_0000000012
   [junit4]   2> 	3	/solr/overseer_elect/election/99116647178764317-127.0.0.1:52771_solr-n_0000000006
   [junit4]   2> 	2	/solr/overseer_elect/election/99116647178764321-127.0.0.1:60177_solr-n_0000000007
   [junit4]   2> 
   [junit4]   2> Maximum concurrent children watches above limit:
   [junit4]   2> 
   [junit4]   2> 	42	/solr/collections
   [junit4]   2> 	41	/solr/live_nodes
   [junit4]   2> 	6	/solr/overseer/queue-work
   [junit4]   2> 	6	/solr/autoscaling/events/.auto_add_replicas
   [junit4]   2> 	6	/solr/overseer/queue
   [junit4]   2> 	6	/solr/overseer/collection-queue-work
   [junit4]   2> 	3	/solr/autoscaling/events/node_added_trigger
   [junit4]   2> 	2	/solr/autoscaling/events/node_lost_trigger
   [junit4]   2> 
   [junit4]   2> NOTE: leaving temporary files on disk at: /export/home/jenkins/workspace/Lucene-Solr-master-Solaris/solr/build/solr-core/test/J1/temp/solr.cloud.autoscaling.TriggerIntegrationTest_1B22282045F7894E-001
   [junit4]   2> NOTE: test params are: codec=Asserting(Lucene70): {}, docValues:{}, maxPointsInLeafNode=511, maxMBSortInHeap=5.977293180116886, sim=Asserting(org.apache.lucene.search.similarities.AssertingSimilarity@4854c011), locale=es-PR, timezone=America/Cordoba
   [junit4]   2> NOTE: SunOS 5.11 amd64/Oracle Corporation 1.8.0_152 (64-bit)/cpus=3,threads=1,free=163719168,total=518979584
   [junit4]   2> NOTE: All tests run in this JVM: [TestFilteredDocIdSet, SolrIndexSplitterTest, TestSizeLimitedDistributedMap, TestPointFields, TestWordDelimiterFilterFactory, HdfsUnloadDistributedZkTest, TestDeleteCollectionOnDownNodes, TestCollectionAPIs, TestQueryTypes, MoreLikeThisHandlerTest, ClassificationUpdateProcessorFactoryTest, TestCharFilters, TestStressReorder, TestComponentsName, TestCollationField, TestExactStatsCache, ConcurrentDeleteAndCreateCollectionTest, CollectionStateFormat2Test, TestRemoteStreaming, DebugComponentTest, TestSegmentSorting, TestRandomFaceting, PeerSyncWithIndexFingerprintCachingTest, TestLMJelinekMercerSimilarityFactory, TestMaxTokenLenTokenizer, DistributedExpandComponentTest, TestSchemaSimilarityResource, TestInitParams, TestFunctionQuery, PeerSyncReplicationTest, PingRequestHandlerTest, AnalysisAfterCoreReloadTest, TestRequestStatusCollectionAPI, HdfsDirectoryFactoryTest, DocExpirationUpdateProcessorFactoryTest, TestBulkSchemaAPI, TestBackupRepositoryFactory, TestStandardQParsers, DeleteReplicaTest, TestCloudPseudoReturnFields, TestDistributedMissingSort, UpdateParamsTest, DistanceUnitsTest, UpdateRequestProcessorFactoryTest, UninvertDocValuesMergePolicyTest, MigrateRouteKeyTest, FieldMutatingUpdateProcessorTest, TestNumericRangeQuery32, SolrCoreMetricManagerTest, TestRandomRequestDistribution, SharedFSAutoReplicaFailoverTest, SecurityConfHandlerTest, TestAnalyzedSuggestions, QueryEqualityTest, TestComplexPhraseLeadingWildcard, TestBulkSchemaConcurrent, TestDistributedGrouping, TestImpersonationWithHadoopAuth, TestSchemalessBufferedUpdates, TestReloadAndDeleteDocs, CoreMergeIndexesAdminHandlerTest, TestHdfsUpdateLog, HdfsThreadLeakTest, TestFieldCache, AddBlockUpdateTest, TestBlendedInfixSuggestions, SearchHandlerTest, LeaderInitiatedRecoveryOnShardRestartTest, TestSchemaNameResource, CloudMLTQParserTest, CoreAdminCreateDiscoverTest, OverriddenZkACLAndCredentialsProvidersTest, TestBinaryResponseWriter, BigEndianAscendingWordSerializerTest, TestFreeTextSuggestions, TestQueryWrapperFilter, TestPartialUpdateDeduplication, TestNoOpRegenerator, DirectSolrSpellCheckerTest, TestNonDefinedSimilarityFactory, DocValuesNotIndexedTest, StressHdfsTest, DistributedIntervalFacetingTest, RemoteQueryErrorTest, TestPayloadCheckQParserPlugin, BlockJoinFacetRandomTest, TestSolrJ, SystemLogListenerTest, SolrGangliaReporterTest, TestFastOutputStream, LeaderFailureAfterFreshStartTest, HdfsRestartWhileUpdatingTest, TestZkAclsWithHadoopAuth, TestCollectionAPI, CheckHdfsIndexTest, SimpleFacetsTest, TestSha256AuthenticationProvider, ZkStateReaderTest, TestSolrCoreSnapshots, TestConfigSetsAPIZkFailure, CustomCollectionTest, HdfsCollectionsAPIDistributedZkTest, TestPKIAuthenticationPlugin, TestAddFieldRealTimeGet, SolrXmlInZkTest, CdcrReplicationDistributedZkTest, CollectionsAPIDistributedZkTest, TestSolrCloudWithSecureImpersonation, TestOrdValues, TestStressLucene, TestTrieFacet, TestManagedSynonymGraphFilterFactory, DocValuesTest, NodeLostTriggerTest, ExternalFileFieldSortTest, SpellPossibilityIteratorTest, CacheHeaderTest, NodeMutatorTest, RulesTest, VersionInfoTest, TestDynamicFieldCollectionResource, StatsReloadRaceTest, TestSearchPerf, TestDownShardTolerantSearch, BufferStoreTest, LeaderElectionIntegrationTest, SystemInfoHandlerTest, OpenExchangeRatesOrgProviderTest, VMParamsZkACLAndCredentialsProvidersTest, TestElisionMultitermQuery, LukeRequestHandlerTest, EchoParamsTest, TestSerializedLuceneMatchVersion, BasicAuthIntegrationTest, CdcrBidirectionalTest, TestGraphMLResponseWriter, TestExtendedDismaxParser, TestStressInPlaceUpdates, TestNumericTokenStream, HdfsLockFactoryTest, TestSubQueryTransformerDistrib, SolrSlf4jReporterTest, TestMergePolicyConfig, DOMUtilTest, OpenCloseCoreStressTest, JvmMetricsTest, TestSolrQueryResponse, DistributedMLTComponentTest, SearchHandlerTest, TestStressVersions, TestMiniSolrCloudClusterSSL, BasicDistributedZk2Test, ActionThrottleTest, AutoScalingHandlerTest, TestReqParamsAPI, SparseHLLTest, TestTestInjection, TestBadConfig, SolrPluginUtilsTest, MetricsHandlerTest, ManagedSchemaRoundRobinCloudTest, TestCoreContainer, TestCustomSort, TestNumericTerms64, BJQParserTest, TestUnifiedSolrHighlighter, TestPostingsSolrHighlighter, SOLR749Test, HdfsChaosMonkeyNothingIsSafeTest, ClassificationUpdateProcessorTest, TestCoreAdminApis, TestNestedDocsSort, TestCSVLoader, TestCloudSearcherWarming, TestTrie, DocValuesMissingTest, CollectionsAPIAsyncDistributedZkTest, TestLuceneMatchVersion, V2StandaloneTest, TestRTimerTree, SolrCoreCheckLockOnStartupTest, ChaosMonkeySafeLeaderTest, UnloadDistributedZkTest, SyncSliceTest, OverseerTest, ShardRoutingTest, BasicZkTest, FullSolrCloudDistribCmdsTest, ClusterStateUpdateTest, LeaderElectionTest, ZkSolrClientTest, TestZkChroot, TestRandomDVFaceting, ZkCLITest, ShardRoutingCustomTest, TestDistributedSearch, TestFaceting, TestRecovery, DistributedSpellCheckComponentTest, ZkControllerTest, DistributedTermsComponentTest, StatsComponentTest, BadIndexSchemaTest, TestSort, TestFiltering, BasicFunctionalityTest, DirectUpdateHandlerTest, TestIndexSearcher, SoftAutoCommitTest, PreAnalyzedFieldTest, TestSystemIdResolver, TestSuggestSpellingConverter, DateFieldTest, SpellingQueryConverterTest, TestLRUCache, TestDocumentBuilder, ZkNodePropsTest, UUIDFieldTest, FileUtilsTest, CircularListTest, TestRTGBase, CursorPagingTest, TestCrossCoreJoin, TestHighlightDedupGrouping, TestSimpleTrackingShardHandler, TestLuceneIndexBackCompat, TestEmbeddedSolrServerAdminHandler, TestEmbeddedSolrServerConstructors, TestEmbeddedSolrServerSchemaAPI, TestJettySolrRunner, ConnectionReuseTest, AliasIntegrationTest, AssignTest, ChaosMonkeySafeLeaderWithPullReplicasTest, CleanupOldIndexTest, CreateCollectionCleanupTest, DistribCursorPagingTest, DistribJoinFromCollectionTest, DistributedQueueTest, DistributedVersionInfoTest, LeaderElectionContextKeyTest, LeaderFailoverAfterPartitionTest, MoveReplicaHDFSFailoverTest, OutOfBoxZkACLAndCredentialsProvidersTest, OverseerStatusTest, ReplaceNodeTest, ReplicationFactorTest, RestartWhileUpdatingTest, RollingRestartTest, TestCloudDeleteByQuery, TestCloudJSONFacetJoinDomain, TestConfigSetsAPI, TestHdfsCloudBackupRestore, TestLockTree, TestOnReconnectListenerSupport, TestPullReplicaErrorHandling, TestShortCircuitedRequests, TestStressCloudBlindAtomicUpdates, TestTolerantUpdateProcessorCloud, TestTolerantUpdateProcessorRandomCloud, TestUtilizeNode, TlogReplayBufferedWhileIndexingTest, AutoAddReplicasIntegrationTest, HttpTriggerListenerTest, SearchRateTriggerTest, TriggerIntegrationTest]
   [junit4] Completed [592/752 (1!)] on J1 in 191.54s, 13 tests, 1 failure <<< FAILURES!

[...truncated 47883 lines...]

Mime
View raw message