lucene-dev mailing list archives

Site index · List index
Message view « Date » · « Thread »
Top « Date » · « Thread »
From Policeman Jenkins Server <jenk...@thetaphi.de>
Subject [JENKINS] Lucene-Solr-7.2-Windows (64bit/jdk-9.0.1) - Build # 27 - Still Unstable!
Date Sat, 23 Dec 2017 04:29:19 GMT
Build: https://jenkins.thetaphi.de/job/Lucene-Solr-7.2-Windows/27/
Java: 64bit/jdk-9.0.1 -XX:-UseCompressedOops -XX:+UseSerialGC

2 tests failed.
FAILED:  junit.framework.TestSuite.org.apache.lucene.index.TestBackwardsCompatibility

Error Message:
Could not remove the following files (in the order of attempts):    C:\Users\jenkins\workspace\Lucene-Solr-7.2-Windows\lucene\build\backward-codecs\test\J0\temp\lucene.index.TestBackwardsCompatibility_EBB34E5DDA2ED12-001\4.4.0-cfs-001:
java.nio.file.DirectoryNotEmptyException: C:\Users\jenkins\workspace\Lucene-Solr-7.2-Windows\lucene\build\backward-codecs\test\J0\temp\lucene.index.TestBackwardsCompatibility_EBB34E5DDA2ED12-001\4.4.0-cfs-001


Stack Trace:
java.io.IOException: Could not remove the following files (in the order of attempts):
   C:\Users\jenkins\workspace\Lucene-Solr-7.2-Windows\lucene\build\backward-codecs\test\J0\temp\lucene.index.TestBackwardsCompatibility_EBB34E5DDA2ED12-001\4.4.0-cfs-001:
java.nio.file.DirectoryNotEmptyException: C:\Users\jenkins\workspace\Lucene-Solr-7.2-Windows\lucene\build\backward-codecs\test\J0\temp\lucene.index.TestBackwardsCompatibility_EBB34E5DDA2ED12-001\4.4.0-cfs-001

	at __randomizedtesting.SeedInfo.seed([EBB34E5DDA2ED12]:0)
	at org.apache.lucene.util.IOUtils.rm(IOUtils.java:329)
	at org.apache.lucene.util.TestRuleTemporaryFilesCleanup.afterAlways(TestRuleTemporaryFilesCleanup.java:216)
	at com.carrotsearch.randomizedtesting.rules.TestRuleAdapter$1.afterAlways(TestRuleAdapter.java:31)
	at com.carrotsearch.randomizedtesting.rules.StatementAdapter.evaluate(StatementAdapter.java:43)
	at com.carrotsearch.randomizedtesting.rules.StatementAdapter.evaluate(StatementAdapter.java:36)
	at org.apache.lucene.util.TestRuleAssertionsRequired$1.evaluate(TestRuleAssertionsRequired.java:53)
	at org.apache.lucene.util.TestRuleMarkFailure$1.evaluate(TestRuleMarkFailure.java:47)
	at org.apache.lucene.util.TestRuleIgnoreAfterMaxFailures$1.evaluate(TestRuleIgnoreAfterMaxFailures.java:64)
	at org.apache.lucene.util.TestRuleIgnoreTestSuites$1.evaluate(TestRuleIgnoreTestSuites.java:54)
	at com.carrotsearch.randomizedtesting.rules.StatementAdapter.evaluate(StatementAdapter.java:36)
	at com.carrotsearch.randomizedtesting.ThreadLeakControl$StatementRunner.run(ThreadLeakControl.java:368)
	at java.base/java.lang.Thread.run(Thread.java:844)


FAILED:  junit.framework.TestSuite.org.apache.solr.handler.dataimport.TestXPathEntityProcessor

Error Message:
Could not remove the following files (in the order of attempts):    C:\Users\jenkins\workspace\Lucene-Solr-7.2-Windows\solr\build\contrib\solr-dataimporthandler\test\J1\temp\solr.handler.dataimport.TestXPathEntityProcessor_6929C45C21CEA239-001\dih-properties-005:
java.nio.file.AccessDeniedException: C:\Users\jenkins\workspace\Lucene-Solr-7.2-Windows\solr\build\contrib\solr-dataimporthandler\test\J1\temp\solr.handler.dataimport.TestXPathEntityProcessor_6929C45C21CEA239-001\dih-properties-005
   C:\Users\jenkins\workspace\Lucene-Solr-7.2-Windows\solr\build\contrib\solr-dataimporthandler\test\J1\temp\solr.handler.dataimport.TestXPathEntityProcessor_6929C45C21CEA239-001:
java.nio.file.DirectoryNotEmptyException: C:\Users\jenkins\workspace\Lucene-Solr-7.2-Windows\solr\build\contrib\solr-dataimporthandler\test\J1\temp\solr.handler.dataimport.TestXPathEntityProcessor_6929C45C21CEA239-001


Stack Trace:
java.io.IOException: Could not remove the following files (in the order of attempts):
   C:\Users\jenkins\workspace\Lucene-Solr-7.2-Windows\solr\build\contrib\solr-dataimporthandler\test\J1\temp\solr.handler.dataimport.TestXPathEntityProcessor_6929C45C21CEA239-001\dih-properties-005:
java.nio.file.AccessDeniedException: C:\Users\jenkins\workspace\Lucene-Solr-7.2-Windows\solr\build\contrib\solr-dataimporthandler\test\J1\temp\solr.handler.dataimport.TestXPathEntityProcessor_6929C45C21CEA239-001\dih-properties-005
   C:\Users\jenkins\workspace\Lucene-Solr-7.2-Windows\solr\build\contrib\solr-dataimporthandler\test\J1\temp\solr.handler.dataimport.TestXPathEntityProcessor_6929C45C21CEA239-001:
java.nio.file.DirectoryNotEmptyException: C:\Users\jenkins\workspace\Lucene-Solr-7.2-Windows\solr\build\contrib\solr-dataimporthandler\test\J1\temp\solr.handler.dataimport.TestXPathEntityProcessor_6929C45C21CEA239-001

	at __randomizedtesting.SeedInfo.seed([6929C45C21CEA239]:0)
	at org.apache.lucene.util.IOUtils.rm(IOUtils.java:329)
	at org.apache.lucene.util.TestRuleTemporaryFilesCleanup.afterAlways(TestRuleTemporaryFilesCleanup.java:216)
	at com.carrotsearch.randomizedtesting.rules.TestRuleAdapter$1.afterAlways(TestRuleAdapter.java:31)
	at com.carrotsearch.randomizedtesting.rules.StatementAdapter.evaluate(StatementAdapter.java:43)
	at com.carrotsearch.randomizedtesting.rules.StatementAdapter.evaluate(StatementAdapter.java:36)
	at org.apache.lucene.util.TestRuleAssertionsRequired$1.evaluate(TestRuleAssertionsRequired.java:53)
	at org.apache.lucene.util.TestRuleMarkFailure$1.evaluate(TestRuleMarkFailure.java:47)
	at org.apache.lucene.util.TestRuleIgnoreAfterMaxFailures$1.evaluate(TestRuleIgnoreAfterMaxFailures.java:64)
	at org.apache.lucene.util.TestRuleIgnoreTestSuites$1.evaluate(TestRuleIgnoreTestSuites.java:54)
	at com.carrotsearch.randomizedtesting.rules.StatementAdapter.evaluate(StatementAdapter.java:36)
	at com.carrotsearch.randomizedtesting.ThreadLeakControl$StatementRunner.run(ThreadLeakControl.java:368)
	at java.base/java.lang.Thread.run(Thread.java:844)




Build Log:
[...truncated 4608 lines...]
   [junit4] Suite: org.apache.lucene.index.TestBackwardsCompatibility
   [junit4] IGNOR/A 0.00s J0 | TestBackwardsCompatibility.testCreateSingleSegmentNoCFS
   [junit4]    > Assumption #1: backcompat creation tests must be run with -Dtests.bwcdir=/path/to/write/indexes
   [junit4] IGNOR/A 0.00s J0 | TestBackwardsCompatibility.testCreateIndexWithDocValuesUpdates
   [junit4]    > Assumption #1: backcompat creation tests must be run with -Dtests.bwcdir=/path/to/write/indexes
   [junit4] IGNOR/A 0.00s J0 | TestBackwardsCompatibility.testCreateNoCFS
   [junit4]    > Assumption #1: backcompat creation tests must be run with -Dtests.bwcdir=/path/to/write/indexes
   [junit4] IGNOR/A 0.00s J0 | TestBackwardsCompatibility.testCreateSortedIndex
   [junit4]    > Assumption #1: backcompat creation tests must be run with -Dtests.bwcdir=/path/to/write/indexes
   [junit4] IGNOR/A 0.00s J0 | TestBackwardsCompatibility.testCreateEmptyIndex
   [junit4]    > Assumption #1: backcompat creation tests must be run with -Dtests.bwcdir=/path/to/write/indexes
   [junit4] IGNOR/A 0.00s J0 | TestBackwardsCompatibility.testCreateCFS
   [junit4]    > Assumption #1: backcompat creation tests must be run with -Dtests.bwcdir=/path/to/write/indexes
   [junit4] IGNOR/A 0.00s J0 | TestBackwardsCompatibility.testCreateSingleSegmentCFS
   [junit4]    > Assumption #1: backcompat creation tests must be run with -Dtests.bwcdir=/path/to/write/indexes
   [junit4] IGNOR/A 0.00s J0 | TestBackwardsCompatibility.testCreateMoreTermsIndex
   [junit4]    > Assumption #1: backcompat creation tests must be run with -Dtests.bwcdir=/path/to/write/indexes
   [junit4]   2> NOTE: test params are: codec=Asserting(Lucene70): {content6=Lucene50(blocksize=128),
content5=PostingsFormat(name=LuceneFixedGap), content4=FST50, trieInt=Lucene50(blocksize=128),
content3=PostingsFormat(name=Direct), content2=Lucene50(blocksize=128), fie?ld=Lucene50(blocksize=128),
utf8=FST50, trieLong=PostingsFormat(name=Direct), id=Lucene50(blocksize=128), content=FST50,
autf8=PostingsFormat(name=Direct)}, docValues:{utf8=DocValuesFormat(name=Lucene70), fie?ld=DocValuesFormat(name=Memory),
dvShort=DocValuesFormat(name=Lucene70), dvInt=DocValuesFormat(name=Lucene70), longPoint2d=DocValuesFormat(name=Lucene70),
dvBytesSortedVar=DocValuesFormat(name=Memory), dvSortedSet=DocValuesFormat(name=Memory), content=DocValuesFormat(name=Lucene70),
floatPoint1d=DocValuesFormat(name=Memory), intPoint1d=DocValuesFormat(name=Asserting), doublePoint2d=DocValuesFormat(name=Memory),
trieLong=DocValuesFormat(name=Lucene70), dvBytesDerefVar=DocValuesFormat(name=Lucene70), id=DocValuesFormat(name=Memory),
binaryPoint2d=DocValuesFormat(name=Lucene70), dvSortedNumeric=DocValuesFormat(name=Lucene70),
dvBytesDerefFixed=DocValuesFormat(name=Lucene70), autf8=DocValuesFormat(name=Lucene70), dvBytesSortedFixed=DocValuesFormat(name=Lucene70),
trieInt=DocValuesFormat(name=Memory), dvBytesStraightVar=DocValuesFormat(name=Asserting),
dvBytesStraightFixed=DocValuesFormat(name=Memory), dvLong=DocValuesFormat(name=Lucene70),
longPoint1d=DocValuesFormat(name=Lucene70), floatPoint2d=DocValuesFormat(name=Lucene70), dvDouble=DocValuesFormat(name=Memory),
dvFloat=DocValuesFormat(name=Lucene70), content6=DocValuesFormat(name=Memory), content5=DocValuesFormat(name=Asserting),
dvPacked=DocValuesFormat(name=Lucene70), intPoint2d=DocValuesFormat(name=Memory), content4=DocValuesFormat(name=Lucene70),
content3=DocValuesFormat(name=Lucene70), content2=DocValuesFormat(name=Memory), doublePoint1d=DocValuesFormat(name=Lucene70),
dvByte=DocValuesFormat(name=Lucene70), binaryPoint1d=DocValuesFormat(name=Lucene70)}, maxPointsInLeafNode=784,
maxMBSortInHeap=7.361522666275449, sim=RandomSimilarity(queryNorm=true): {content6=DFR GL3(800.0),
content5=DFR I(ne)L3(800.0), content2=DFR I(F)2, utf8=DFR I(F)Z(0.3), fie?ld=DFR GB2, content=DFR
I(F)L2, autf8=DFR I(n)3(800.0)}, locale=so-ET, timezone=Europe/Helsinki
   [junit4]   2> NOTE: Windows 10 10.0 amd64/Oracle Corporation 9.0.1 (64-bit)/cpus=3,threads=1,free=59968328,total=97386496
   [junit4]   2> NOTE: All tests run in this JVM: [TestLucene54DocValuesFormat, TestBackwardsCompatibility]
   [junit4]   2> NOTE: reproduce with: ant test  -Dtestcase=TestBackwardsCompatibility
-Dtests.seed=EBB34E5DDA2ED12 -Dtests.slow=true -Dtests.locale=so-ET -Dtests.timezone=Europe/Helsinki
-Dtests.asserts=true -Dtests.file.encoding=Cp1252
   [junit4] ERROR   0.00s J0 | TestBackwardsCompatibility (suite) <<<
   [junit4]    > Throwable #1: java.io.IOException: Could not remove the following files
(in the order of attempts):
   [junit4]    >    C:\Users\jenkins\workspace\Lucene-Solr-7.2-Windows\lucene\build\backward-codecs\test\J0\temp\lucene.index.TestBackwardsCompatibility_EBB34E5DDA2ED12-001\4.4.0-cfs-001:
java.nio.file.DirectoryNotEmptyException: C:\Users\jenkins\workspace\Lucene-Solr-7.2-Windows\lucene\build\backward-codecs\test\J0\temp\lucene.index.TestBackwardsCompatibility_EBB34E5DDA2ED12-001\4.4.0-cfs-001
   [junit4]    > 	at __randomizedtesting.SeedInfo.seed([EBB34E5DDA2ED12]:0)
   [junit4]    > 	at org.apache.lucene.util.IOUtils.rm(IOUtils.java:329)
   [junit4]    > 	at java.base/java.lang.Thread.run(Thread.java:844)
   [junit4] Completed [7/8 (1!)] on J0 in 19.59s, 30 tests, 1 error, 8 skipped <<<
FAILURES!

[...truncated 14942 lines...]
   [junit4] Suite: org.apache.solr.handler.dataimport.TestXPathEntityProcessor
   [junit4]   2> log4j:WARN No such property [conversionPattern] in org.apache.solr.util.SolrLogLayout.
   [junit4]   2> Creating dataDir: C:\Users\jenkins\workspace\Lucene-Solr-7.2-Windows\solr\build\contrib\solr-dataimporthandler\test\J1\temp\solr.handler.dataimport.TestXPathEntityProcessor_6929C45C21CEA239-001\init-core-data-001
   [junit4]   2> 8592 T14 oas.SolrTestCaseJ4.randomizeNumericTypesProperties Using PointFields
(NUMERIC_POINTS_SYSPROP=true) w/NUMERIC_DOCVALUES_SYSPROP=false
   [junit4]   2> 8706 T14 oejul.Log.initialized Logging initialized @9990ms
   [junit4]   2> 8712 T14 oas.SolrTestCaseJ4.buildSSLConfig Randomized ssl (false) and
clientAuth (false) via: @org.apache.solr.util.RandomizeSSL(reason="", value=0.0/0.0, ssl=0.0/0.0,
clientAuth=0.0/0.0)
   [junit4]   2> 8718 T14 oas.SolrTestCaseJ4.assertNonBlockingRandomGeneratorAvailable
SecureRandom sanity checks: test.solr.allowed.securerandom=null & java.security.egd=file:/dev/./urandom
   [junit4]   2> 8731 T14 oas.SolrTestCaseJ4.setUp ###Starting testMultiValuedWithMultipleDocuments
   [junit4]   2> 8905 T14 oas.SolrTestCaseJ4.tearDown ###Ending testMultiValuedWithMultipleDocuments
   [junit4]   2> 8918 T14 oas.SolrTestCaseJ4.setUp ###Starting testMultiValued
   [junit4]   2> 8933 T14 oas.SolrTestCaseJ4.tearDown ###Ending testMultiValued
   [junit4]   2> 8977 T14 oas.SolrTestCaseJ4.setUp ###Starting streamStopsAfterInterrupt
   [junit4]   2> 8999 T14 oas.SolrTestCaseJ4.tearDown ###Ending streamStopsAfterInterrupt
   [junit4]   2> 9023 T14 oas.SolrTestCaseJ4.setUp ###Starting testMultiValuedFlatten
   [junit4]   2> 9025 T14 oas.SolrTestCaseJ4.tearDown ###Ending testMultiValuedFlatten
   [junit4]   2> 9032 T14 oas.SolrTestCaseJ4.setUp ###Starting streamWritesMessageAfterBlockedAttempt
   [junit4]   2> 10078 T14 oas.SolrTestCaseJ4.tearDown ###Ending streamWritesMessageAfterBlockedAttempt
   [junit4]   2> 10091 T14 oas.SolrTestCaseJ4.setUp ###Starting withFieldsAndXpath
   [junit4]   2> 10096 T14 oas.SolrTestCaseJ4.tearDown ###Ending withFieldsAndXpath
   [junit4]   2> 10116 T14 oas.SolrTestCaseJ4.setUp ###Starting withFieldsAndXpathStream
   [junit4]   2> 10127 T14 oas.SolrTestCaseJ4.tearDown ###Ending withFieldsAndXpathStream
   [junit4]   2> 10129 T14 oas.SolrTestCaseJ4.setUp ###Starting withFieldsAndXpathStreamContinuesOnTimeout
   [junit4]   2> 10499 T14 oas.SolrTestCaseJ4.tearDown ###Ending withFieldsAndXpathStreamContinuesOnTimeout
   [junit4]   2> 10517 T14 oas.SolrTestCaseJ4.setUp ###Starting withDefaultSolrAndXsl
   [junit4]   2> 10822 T14 oashd.XPathEntityProcessor.initXpathReader Using xslTransformer:
com.sun.org.apache.xalan.internal.xsltc.trax.TransformerImpl
   [junit4]   2> 10846 T14 oas.SolrTestCaseJ4.tearDown ###Ending withDefaultSolrAndXsl
   [junit4]   2> 10848 T14 oas.SolrTestCaseJ4.clearObjectTrackerAndCheckEmpty -------------------------------------------------------
Done waiting for tracked resources to be released
   [junit4]   2> NOTE: test params are: codec=CheapBastard, sim=RandomSimilarity(queryNorm=false):
{}, locale=fr-DZ, timezone=America/Danmarkshavn
   [junit4]   2> NOTE: Windows 10 10.0 amd64/Oracle Corporation 9.0.1 (64-bit)/cpus=3,threads=1,free=73593976,total=97386496
   [junit4]   2> NOTE: All tests run in this JVM: [TestXPathEntityProcessor]
   [junit4]   2> NOTE: reproduce with: ant test  -Dtestcase=TestXPathEntityProcessor -Dtests.seed=6929C45C21CEA239
-Dtests.slow=true -Dtests.locale=fr-DZ -Dtests.timezone=America/Danmarkshavn -Dtests.asserts=true
-Dtests.file.encoding=Cp1252
   [junit4] ERROR   0.00s J1 | TestXPathEntityProcessor (suite) <<<
   [junit4]    > Throwable #1: java.io.IOException: Could not remove the following files
(in the order of attempts):
   [junit4]    >    C:\Users\jenkins\workspace\Lucene-Solr-7.2-Windows\solr\build\contrib\solr-dataimporthandler\test\J1\temp\solr.handler.dataimport.TestXPathEntityProcessor_6929C45C21CEA239-001\dih-properties-005:
java.nio.file.AccessDeniedException: C:\Users\jenkins\workspace\Lucene-Solr-7.2-Windows\solr\build\contrib\solr-dataimporthandler\test\J1\temp\solr.handler.dataimport.TestXPathEntityProcessor_6929C45C21CEA239-001\dih-properties-005
   [junit4]    >    C:\Users\jenkins\workspace\Lucene-Solr-7.2-Windows\solr\build\contrib\solr-dataimporthandler\test\J1\temp\solr.handler.dataimport.TestXPathEntityProcessor_6929C45C21CEA239-001:
java.nio.file.DirectoryNotEmptyException: C:\Users\jenkins\workspace\Lucene-Solr-7.2-Windows\solr\build\contrib\solr-dataimporthandler\test\J1\temp\solr.handler.dataimport.TestXPathEntityProcessor_6929C45C21CEA239-001
   [junit4]    > 	at __randomizedtesting.SeedInfo.seed([6929C45C21CEA239]:0)
   [junit4]    > 	at org.apache.lucene.util.IOUtils.rm(IOUtils.java:329)
   [junit4]    > 	at java.base/java.lang.Thread.run(Thread.java:844)
   [junit4] Completed [1/38 (1!)] on J1 in 11.13s, 9 tests, 1 error <<< FAILURES!

[...truncated 34735 lines...]

Mime
View raw message