lucene-dev mailing list archives

Site index · List index
Message view « Date » · « Thread »
Top « Date » · « Thread »
From Policeman Jenkins Server <jenk...@thetaphi.de>
Subject [JENKINS] Lucene-Solr-7.x-Solaris (64bit/jdk1.8.0) - Build # 348 - Unstable!
Date Sun, 24 Dec 2017 00:16:20 GMT
Build: https://jenkins.thetaphi.de/job/Lucene-Solr-7.x-Solaris/348/
Java: 64bit/jdk1.8.0 -XX:+UseCompressedOops -XX:+UseSerialGC

1 tests failed.
FAILED:  org.apache.solr.cloud.autoscaling.TriggerIntegrationTest.testEventQueue

Error Message:
action wasn't interrupted

Stack Trace:
java.lang.AssertionError: action wasn't interrupted
	at __randomizedtesting.SeedInfo.seed([BA6033656271A3FE:73D571CB6B16650B]:0)
	at org.junit.Assert.fail(Assert.java:93)
	at org.junit.Assert.assertTrue(Assert.java:43)
	at org.apache.solr.cloud.autoscaling.TriggerIntegrationTest.testEventQueue(TriggerIntegrationTest.java:711)
	at sun.reflect.NativeMethodAccessorImpl.invoke0(Native Method)
	at sun.reflect.NativeMethodAccessorImpl.invoke(NativeMethodAccessorImpl.java:62)
	at sun.reflect.DelegatingMethodAccessorImpl.invoke(DelegatingMethodAccessorImpl.java:43)
	at java.lang.reflect.Method.invoke(Method.java:498)
	at com.carrotsearch.randomizedtesting.RandomizedRunner.invoke(RandomizedRunner.java:1737)
	at com.carrotsearch.randomizedtesting.RandomizedRunner$8.evaluate(RandomizedRunner.java:934)
	at com.carrotsearch.randomizedtesting.RandomizedRunner$9.evaluate(RandomizedRunner.java:970)
	at com.carrotsearch.randomizedtesting.RandomizedRunner$10.evaluate(RandomizedRunner.java:984)
	at com.carrotsearch.randomizedtesting.rules.SystemPropertiesRestoreRule$1.evaluate(SystemPropertiesRestoreRule.java:57)
	at org.apache.lucene.util.TestRuleSetupTeardownChained$1.evaluate(TestRuleSetupTeardownChained.java:49)
	at org.apache.lucene.util.AbstractBeforeAfterRule$1.evaluate(AbstractBeforeAfterRule.java:45)
	at org.apache.lucene.util.TestRuleThreadAndTestName$1.evaluate(TestRuleThreadAndTestName.java:48)
	at org.apache.lucene.util.TestRuleIgnoreAfterMaxFailures$1.evaluate(TestRuleIgnoreAfterMaxFailures.java:64)
	at org.apache.lucene.util.TestRuleMarkFailure$1.evaluate(TestRuleMarkFailure.java:47)
	at com.carrotsearch.randomizedtesting.rules.StatementAdapter.evaluate(StatementAdapter.java:36)
	at com.carrotsearch.randomizedtesting.ThreadLeakControl$StatementRunner.run(ThreadLeakControl.java:368)
	at com.carrotsearch.randomizedtesting.ThreadLeakControl.forkTimeoutingTask(ThreadLeakControl.java:817)
	at com.carrotsearch.randomizedtesting.ThreadLeakControl$3.evaluate(ThreadLeakControl.java:468)
	at com.carrotsearch.randomizedtesting.RandomizedRunner.runSingleTest(RandomizedRunner.java:943)
	at com.carrotsearch.randomizedtesting.RandomizedRunner$5.evaluate(RandomizedRunner.java:829)
	at com.carrotsearch.randomizedtesting.RandomizedRunner$6.evaluate(RandomizedRunner.java:879)
	at com.carrotsearch.randomizedtesting.RandomizedRunner$7.evaluate(RandomizedRunner.java:890)
	at com.carrotsearch.randomizedtesting.rules.StatementAdapter.evaluate(StatementAdapter.java:36)
	at com.carrotsearch.randomizedtesting.rules.SystemPropertiesRestoreRule$1.evaluate(SystemPropertiesRestoreRule.java:57)
	at org.apache.lucene.util.AbstractBeforeAfterRule$1.evaluate(AbstractBeforeAfterRule.java:45)
	at com.carrotsearch.randomizedtesting.rules.StatementAdapter.evaluate(StatementAdapter.java:36)
	at org.apache.lucene.util.TestRuleStoreClassName$1.evaluate(TestRuleStoreClassName.java:41)
	at com.carrotsearch.randomizedtesting.rules.NoShadowingOrOverridesOnMethodsRule$1.evaluate(NoShadowingOrOverridesOnMethodsRule.java:40)
	at com.carrotsearch.randomizedtesting.rules.NoShadowingOrOverridesOnMethodsRule$1.evaluate(NoShadowingOrOverridesOnMethodsRule.java:40)
	at com.carrotsearch.randomizedtesting.rules.StatementAdapter.evaluate(StatementAdapter.java:36)
	at com.carrotsearch.randomizedtesting.rules.StatementAdapter.evaluate(StatementAdapter.java:36)
	at com.carrotsearch.randomizedtesting.rules.StatementAdapter.evaluate(StatementAdapter.java:36)
	at org.apache.lucene.util.TestRuleAssertionsRequired$1.evaluate(TestRuleAssertionsRequired.java:53)
	at org.apache.lucene.util.TestRuleMarkFailure$1.evaluate(TestRuleMarkFailure.java:47)
	at org.apache.lucene.util.TestRuleIgnoreAfterMaxFailures$1.evaluate(TestRuleIgnoreAfterMaxFailures.java:64)
	at org.apache.lucene.util.TestRuleIgnoreTestSuites$1.evaluate(TestRuleIgnoreTestSuites.java:54)
	at com.carrotsearch.randomizedtesting.rules.StatementAdapter.evaluate(StatementAdapter.java:36)
	at com.carrotsearch.randomizedtesting.ThreadLeakControl$StatementRunner.run(ThreadLeakControl.java:368)
	at java.lang.Thread.run(Thread.java:748)




Build Log:
[...truncated 13651 lines...]
   [junit4] Suite: org.apache.solr.cloud.autoscaling.TriggerIntegrationTest
   [junit4]   2> 4013676 INFO  (SUITE-TriggerIntegrationTest-seed#[BA6033656271A3FE]-worker) [    ] o.a.s.SolrTestCaseJ4 SecureRandom sanity checks: test.solr.allowed.securerandom=null & java.security.egd=file:/dev/./urandom
   [junit4]   2> Creating dataDir: /export/home/jenkins/workspace/Lucene-Solr-7.x-Solaris/solr/build/solr-core/test/J1/temp/solr.cloud.autoscaling.TriggerIntegrationTest_BA6033656271A3FE-001/init-core-data-001
   [junit4]   2> 4013676 WARN  (SUITE-TriggerIntegrationTest-seed#[BA6033656271A3FE]-worker) [    ] o.a.s.SolrTestCaseJ4 startTrackingSearchers: numOpens=26 numCloses=26
   [junit4]   2> 4013676 INFO  (SUITE-TriggerIntegrationTest-seed#[BA6033656271A3FE]-worker) [    ] o.a.s.SolrTestCaseJ4 Using PointFields (NUMERIC_POINTS_SYSPROP=true) w/NUMERIC_DOCVALUES_SYSPROP=true
   [junit4]   2> 4013681 INFO  (SUITE-TriggerIntegrationTest-seed#[BA6033656271A3FE]-worker) [    ] o.a.s.SolrTestCaseJ4 Randomized ssl (false) and clientAuth (false) via: @org.apache.solr.util.RandomizeSSL(reason=, value=NaN, ssl=NaN, clientAuth=NaN)
   [junit4]   2> 4013681 INFO  (SUITE-TriggerIntegrationTest-seed#[BA6033656271A3FE]-worker) [    ] o.a.s.c.MiniSolrCloudCluster Starting cluster of 2 servers in /export/home/jenkins/workspace/Lucene-Solr-7.x-Solaris/solr/build/solr-core/test/J1/temp/solr.cloud.autoscaling.TriggerIntegrationTest_BA6033656271A3FE-001/tempDir-001
   [junit4]   2> 4013681 INFO  (SUITE-TriggerIntegrationTest-seed#[BA6033656271A3FE]-worker) [    ] o.a.s.c.ZkTestServer STARTING ZK TEST SERVER
   [junit4]   2> 4013682 INFO  (Thread-7456) [    ] o.a.s.c.ZkTestServer client port:0.0.0.0/0.0.0.0:0
   [junit4]   2> 4013682 INFO  (Thread-7456) [    ] o.a.s.c.ZkTestServer Starting server
   [junit4]   2> 4013685 ERROR (Thread-7456) [    ] o.a.z.s.ZooKeeperServer ZKShutdownHandler is not registered, so ZooKeeper server won't take any action on ERROR or SHUTDOWN server state changes
   [junit4]   2> 4013782 INFO  (SUITE-TriggerIntegrationTest-seed#[BA6033656271A3FE]-worker) [    ] o.a.s.c.ZkTestServer start zk server on port:61580
   [junit4]   2> 4013787 INFO  (zkConnectionManagerCallback-7480-thread-1) [    ] o.a.s.c.c.ConnectionManager zkClient has connected
   [junit4]   2> 4013797 INFO  (jetty-launcher-7477-thread-1) [    ] o.e.j.s.Server jetty-9.3.20.v20170531
   [junit4]   2> 4013797 INFO  (jetty-launcher-7477-thread-2) [    ] o.e.j.s.Server jetty-9.3.20.v20170531
   [junit4]   2> 4013799 INFO  (jetty-launcher-7477-thread-1) [    ] o.e.j.s.h.ContextHandler Started o.e.j.s.ServletContextHandler@65559fea{/solr,null,AVAILABLE}
   [junit4]   2> 4013799 INFO  (jetty-launcher-7477-thread-1) [    ] o.e.j.s.AbstractConnector Started ServerConnector@3e4937a6{HTTP/1.1,[http/1.1]}{127.0.0.1:60482}
   [junit4]   2> 4013799 INFO  (jetty-launcher-7477-thread-1) [    ] o.e.j.s.Server Started @4019696ms
   [junit4]   2> 4013799 INFO  (jetty-launcher-7477-thread-1) [    ] o.a.s.c.s.e.JettySolrRunner Jetty properties: {hostContext=/solr, hostPort=60482}
   [junit4]   2> 4013799 ERROR (jetty-launcher-7477-thread-1) [    ] o.a.s.u.StartupLoggingUtils Missing Java Option solr.log.dir. Logging may be missing or incomplete.
   [junit4]   2> 4013800 INFO  (jetty-launcher-7477-thread-1) [    ] o.a.s.s.SolrDispatchFilter  ___      _       Welcome to Apache Solr™ version 7.3.0
   [junit4]   2> 4013800 INFO  (jetty-launcher-7477-thread-1) [    ] o.a.s.s.SolrDispatchFilter / __| ___| |_ _   Starting in cloud mode on port null
   [junit4]   2> 4013800 INFO  (jetty-launcher-7477-thread-1) [    ] o.a.s.s.SolrDispatchFilter \__ \/ _ \ | '_|  Install dir: null
   [junit4]   2> 4013800 INFO  (jetty-launcher-7477-thread-1) [    ] o.a.s.s.SolrDispatchFilter |___/\___/_|_|    Start time: 2017-12-23T23:48:56.836Z
   [junit4]   2> 4013800 INFO  (jetty-launcher-7477-thread-2) [    ] o.e.j.s.h.ContextHandler Started o.e.j.s.ServletContextHandler@4591fed4{/solr,null,AVAILABLE}
   [junit4]   2> 4013803 INFO  (jetty-launcher-7477-thread-2) [    ] o.e.j.s.AbstractConnector Started ServerConnector@653d5b52{HTTP/1.1,[http/1.1]}{127.0.0.1:38021}
   [junit4]   2> 4013803 INFO  (jetty-launcher-7477-thread-2) [    ] o.e.j.s.Server Started @4019699ms
   [junit4]   2> 4013803 INFO  (jetty-launcher-7477-thread-2) [    ] o.a.s.c.s.e.JettySolrRunner Jetty properties: {hostContext=/solr, hostPort=38021}
   [junit4]   2> 4013803 ERROR (jetty-launcher-7477-thread-2) [    ] o.a.s.u.StartupLoggingUtils Missing Java Option solr.log.dir. Logging may be missing or incomplete.
   [junit4]   2> 4013803 INFO  (jetty-launcher-7477-thread-2) [    ] o.a.s.s.SolrDispatchFilter  ___      _       Welcome to Apache Solr™ version 7.3.0
   [junit4]   2> 4013805 INFO  (jetty-launcher-7477-thread-2) [    ] o.a.s.s.SolrDispatchFilter / __| ___| |_ _   Starting in cloud mode on port null
   [junit4]   2> 4013805 INFO  (jetty-launcher-7477-thread-2) [    ] o.a.s.s.SolrDispatchFilter \__ \/ _ \ | '_|  Install dir: null
   [junit4]   2> 4013805 INFO  (jetty-launcher-7477-thread-2) [    ] o.a.s.s.SolrDispatchFilter |___/\___/_|_|    Start time: 2017-12-23T23:48:56.841Z
   [junit4]   2> 4013806 INFO  (zkConnectionManagerCallback-7482-thread-1) [    ] o.a.s.c.c.ConnectionManager zkClient has connected
   [junit4]   2> 4013807 INFO  (jetty-launcher-7477-thread-1) [    ] o.a.s.s.SolrDispatchFilter solr.xml found in ZooKeeper. Loading...
   [junit4]   2> 4013807 INFO  (zkConnectionManagerCallback-7484-thread-1) [    ] o.a.s.c.c.ConnectionManager zkClient has connected
   [junit4]   2> 4013808 INFO  (jetty-launcher-7477-thread-2) [    ] o.a.s.s.SolrDispatchFilter solr.xml found in ZooKeeper. Loading...
   [junit4]   2> 4013813 INFO  (jetty-launcher-7477-thread-1) [    ] o.a.s.c.ZkContainer Zookeeper client=127.0.0.1:61580/solr
   [junit4]   2> 4013813 INFO  (jetty-launcher-7477-thread-2) [    ] o.a.s.c.ZkContainer Zookeeper client=127.0.0.1:61580/solr
   [junit4]   2> 4013815 INFO  (zkConnectionManagerCallback-7490-thread-1) [    ] o.a.s.c.c.ConnectionManager zkClient has connected
   [junit4]   2> 4013815 INFO  (zkConnectionManagerCallback-7492-thread-1) [    ] o.a.s.c.c.ConnectionManager zkClient has connected
   [junit4]   2> 4013818 INFO  (zkConnectionManagerCallback-7496-thread-1-processing-n:127.0.0.1:38021_solr) [n:127.0.0.1:38021_solr    ] o.a.s.c.c.ConnectionManager zkClient has connected
   [junit4]   2> 4013818 INFO  (zkConnectionManagerCallback-7494-thread-1-processing-n:127.0.0.1:60482_solr) [n:127.0.0.1:60482_solr    ] o.a.s.c.c.ConnectionManager zkClient has connected
   [junit4]   2> 4013954 INFO  (jetty-launcher-7477-thread-2) [n:127.0.0.1:38021_solr    ] o.a.s.c.Overseer Overseer (id=null) closing
   [junit4]   2> 4013955 INFO  (jetty-launcher-7477-thread-2) [n:127.0.0.1:38021_solr    ] o.a.s.c.OverseerElectionContext I am going to be the leader 127.0.0.1:38021_solr
   [junit4]   2> 4013957 INFO  (jetty-launcher-7477-thread-2) [n:127.0.0.1:38021_solr    ] o.a.s.c.Overseer Overseer (id=99226283980750853-127.0.0.1:38021_solr-n_0000000000) starting
   [junit4]   2> 4013965 INFO  (jetty-launcher-7477-thread-1) [n:127.0.0.1:60482_solr    ] o.a.s.c.Overseer Overseer (id=null) closing
   [junit4]   2> 4013967 INFO  (jetty-launcher-7477-thread-2) [n:127.0.0.1:38021_solr    ] o.a.s.c.ZkController Register node as live in ZooKeeper:/live_nodes/127.0.0.1:38021_solr
   [junit4]   2> 4013967 DEBUG (OverseerAutoScalingTriggerThread-99226283980750853-127.0.0.1:38021_solr-n_0000000000) [n:127.0.0.1:38021_solr    ] o.a.s.c.a.OverseerTriggerThread Adding .autoAddReplicas trigger
   [junit4]   2> 4013968 INFO  (jetty-launcher-7477-thread-1) [n:127.0.0.1:60482_solr    ] o.a.s.c.ZkController Register node as live in ZooKeeper:/live_nodes/127.0.0.1:60482_solr
   [junit4]   2> 4013971 DEBUG (OverseerAutoScalingTriggerThread-99226283980750853-127.0.0.1:38021_solr-n_0000000000) [n:127.0.0.1:38021_solr    ] o.a.s.c.a.OverseerTriggerThread Refreshing /autoscaling.json with znode version 1
   [junit4]   2> 4013971 DEBUG (OverseerAutoScalingTriggerThread-99226283980750853-127.0.0.1:38021_solr-n_0000000000) [n:127.0.0.1:38021_solr    ] o.a.s.c.a.NodeLostTrigger Initial livenodes: []
   [junit4]   2> 4013971 DEBUG (OverseerAutoScalingTriggerThread-99226283980750853-127.0.0.1:38021_solr-n_0000000000) [n:127.0.0.1:38021_solr    ] o.a.s.c.a.OverseerTriggerThread Current znodeVersion 1, lastZnodeVersion -1
   [junit4]   2> 4013971 DEBUG (OverseerAutoScalingTriggerThread-99226283980750853-127.0.0.1:38021_solr-n_0000000000) [n:127.0.0.1:38021_solr    ] o.a.s.c.a.OverseerTriggerThread Processed trigger updates upto znodeVersion 1
   [junit4]   2> 4013972 INFO  (OverseerStateUpdate-99226283980750853-127.0.0.1:38021_solr-n_0000000000) [n:127.0.0.1:38021_solr    ] o.a.s.c.c.ZkStateReader Updated live nodes from ZooKeeper... (0) -> (2)
   [junit4]   2> 4013974 DEBUG (OverseerAutoScalingTriggerThread-99226283980750853-127.0.0.1:38021_solr-n_0000000000) [n:127.0.0.1:38021_solr    ] o.a.s.c.a.OverseerTriggerThread -- clean old nodeAdded markers
   [junit4]   2> 4013974 DEBUG (OverseerAutoScalingTriggerThread-99226283980750853-127.0.0.1:38021_solr-n_0000000000) [n:127.0.0.1:38021_solr    ] o.a.s.c.a.OverseerTriggerThread Current znodeVersion 1, lastZnodeVersion 1
   [junit4]   2> 4013975 DEBUG (ScheduledTrigger-10861-thread-1) [n:127.0.0.1:38021_solr    ] o.a.s.c.a.NodeLostTrigger Running NodeLostTrigger: .auto_add_replicas with currently live nodes: 2
   [junit4]   2> 4013978 INFO  (zkCallback-7493-thread-1-processing-n:127.0.0.1:60482_solr) [n:127.0.0.1:60482_solr    ] o.a.s.c.c.ZkStateReader Updated live nodes from ZooKeeper... (0) -> (2)
   [junit4]   2> 4014039 INFO  (jetty-launcher-7477-thread-1) [n:127.0.0.1:60482_solr    ] o.a.s.m.r.SolrJmxReporter JMX monitoring for 'solr_60482.solr.node' (registry 'solr.node') enabled at server: com.sun.jmx.mbeanserver.JmxMBeanServer@827c084
   [junit4]   2> 4014044 INFO  (jetty-launcher-7477-thread-1) [n:127.0.0.1:60482_solr    ] o.a.s.m.r.SolrJmxReporter JMX monitoring for 'solr_60482.solr.jvm' (registry 'solr.jvm') enabled at server: com.sun.jmx.mbeanserver.JmxMBeanServer@827c084
   [junit4]   2> 4014044 INFO  (jetty-launcher-7477-thread-1) [n:127.0.0.1:60482_solr    ] o.a.s.m.r.SolrJmxReporter JMX monitoring for 'solr_60482.solr.jetty' (registry 'solr.jetty') enabled at server: com.sun.jmx.mbeanserver.JmxMBeanServer@827c084
   [junit4]   2> 4014045 INFO  (jetty-launcher-7477-thread-1) [n:127.0.0.1:60482_solr    ] o.a.s.c.CorePropertiesLocator Found 0 core definitions underneath /export/home/jenkins/workspace/Lucene-Solr-7.x-Solaris/solr/build/solr-core/test/J1/temp/solr.cloud.autoscaling.TriggerIntegrationTest_BA6033656271A3FE-001/tempDir-001/node1/.
   [junit4]   2> 4014100 INFO  (jetty-launcher-7477-thread-2) [n:127.0.0.1:38021_solr    ] o.a.s.m.r.SolrJmxReporter JMX monitoring for 'solr_38021.solr.node' (registry 'solr.node') enabled at server: com.sun.jmx.mbeanserver.JmxMBeanServer@827c084
   [junit4]   2> 4014106 INFO  (jetty-launcher-7477-thread-2) [n:127.0.0.1:38021_solr    ] o.a.s.m.r.SolrJmxReporter JMX monitoring for 'solr_38021.solr.jvm' (registry 'solr.jvm') enabled at server: com.sun.jmx.mbeanserver.JmxMBeanServer@827c084
   [junit4]   2> 4014106 INFO  (jetty-launcher-7477-thread-2) [n:127.0.0.1:38021_solr    ] o.a.s.m.r.SolrJmxReporter JMX monitoring for 'solr_38021.solr.jetty' (registry 'solr.jetty') enabled at server: com.sun.jmx.mbeanserver.JmxMBeanServer@827c084
   [junit4]   2> 4014106 INFO  (jetty-launcher-7477-thread-2) [n:127.0.0.1:38021_solr    ] o.a.s.c.CorePropertiesLocator Found 0 core definitions underneath /export/home/jenkins/workspace/Lucene-Solr-7.x-Solaris/solr/build/solr-core/test/J1/temp/solr.cloud.autoscaling.TriggerIntegrationTest_BA6033656271A3FE-001/tempDir-001/node2/.
   [junit4]   2> 4014123 INFO  (zkConnectionManagerCallback-7502-thread-1) [    ] o.a.s.c.c.ConnectionManager zkClient has connected
   [junit4]   2> 4014127 INFO  (zkConnectionManagerCallback-7506-thread-1) [    ] o.a.s.c.c.ConnectionManager zkClient has connected
   [junit4]   2> 4014129 INFO  (SUITE-TriggerIntegrationTest-seed#[BA6033656271A3FE]-worker) [    ] o.a.s.c.c.ZkStateReader Updated live nodes from ZooKeeper... (0) -> (2)
   [junit4]   2> 4014130 INFO  (SUITE-TriggerIntegrationTest-seed#[BA6033656271A3FE]-worker) [    ] o.a.s.c.s.i.ZkClientClusterStateProvider Cluster at 127.0.0.1:61580/solr ready
   [junit4]   2> 4014271 INFO  (TEST-TriggerIntegrationTest.testEventFromRestoredState-seed#[BA6033656271A3FE]) [    ] o.a.s.SolrTestCaseJ4 ###Starting testEventFromRestoredState
   [junit4]   2> 4014272 INFO  (TEST-TriggerIntegrationTest.testEventFromRestoredState-seed#[BA6033656271A3FE]) [    ] o.a.s.c.a.TriggerIntegrationTest /autoscaling.json reset, new znode version 2
   [junit4]   2> 4014272 DEBUG (zkCallback-7495-thread-1-processing-n:127.0.0.1:38021_solr) [n:127.0.0.1:38021_solr    ] o.a.s.c.a.OverseerTriggerThread Refreshing /autoscaling.json with znode version 2
   [junit4]   2> 4014272 DEBUG (OverseerAutoScalingTriggerThread-99226283980750853-127.0.0.1:38021_solr-n_0000000000) [n:127.0.0.1:38021_solr    ] o.a.s.c.a.OverseerTriggerThread Processed trigger updates upto znodeVersion 2
   [junit4]   2> 4014277 DEBUG (OverseerAutoScalingTriggerThread-99226283980750853-127.0.0.1:38021_solr-n_0000000000) [n:127.0.0.1:38021_solr    ] o.a.s.c.a.OverseerTriggerThread -- clean old nodeLost markers
   [junit4]   2> 4014277 DEBUG (OverseerAutoScalingTriggerThread-99226283980750853-127.0.0.1:38021_solr-n_0000000000) [n:127.0.0.1:38021_solr    ] o.a.s.c.a.OverseerTriggerThread -- clean old nodeAdded markers
   [junit4]   2> 4014278 DEBUG (OverseerAutoScalingTriggerThread-99226283980750853-127.0.0.1:38021_solr-n_0000000000) [n:127.0.0.1:38021_solr    ] o.a.s.c.a.OverseerTriggerThread Current znodeVersion 2, lastZnodeVersion 2
   [junit4]   2> 4014296 INFO  (qtp1597458920-33164) [n:127.0.0.1:38021_solr    ] o.a.s.s.HttpSolrCall [admin] webapp=null path=/admin/metrics params={prefix=CORE.coreName&wt=javabin&version=2&group=solr.core} status=0 QTime=0
   [junit4]   2> 4014297 INFO  (qtp458461685-33158) [n:127.0.0.1:60482_solr    ] o.a.s.s.HttpSolrCall [admin] webapp=null path=/admin/metrics params={prefix=CORE.coreName&wt=javabin&version=2&group=solr.core} status=0 QTime=0
   [junit4]   2> 4014297 DEBUG (qtp458461685-33156) [n:127.0.0.1:60482_solr    ] o.a.s.c.a.AutoScalingHandler Verified autoscaling configuration
   [junit4]   2> 4014298 INFO  (qtp458461685-33156) [n:127.0.0.1:60482_solr    ] o.a.s.s.HttpSolrCall [admin] webapp=null path=/admin/autoscaling params={wt=javabin&version=2} status=0 QTime=10
   [junit4]   2> 4014298 DEBUG (zkCallback-7495-thread-1-processing-n:127.0.0.1:38021_solr) [n:127.0.0.1:38021_solr    ] o.a.s.c.a.OverseerTriggerThread Refreshing /autoscaling.json with znode version 3
   [junit4]   2> 4014301 DEBUG (zkCallback-7495-thread-1-processing-n:127.0.0.1:38021_solr) [n:127.0.0.1:38021_solr    ] o.a.s.c.a.NodeAddedTrigger Initial livenodes: [127.0.0.1:38021_solr, 127.0.0.1:60482_solr]
   [junit4]   2> 4014301 DEBUG (zkCallback-7495-thread-1-processing-n:127.0.0.1:38021_solr) [n:127.0.0.1:38021_solr    ] o.a.s.c.a.NodeAddedTrigger NodeAddedTrigger node_added_trigger instantiated with properties: {event=nodeAdded, waitFor=10, actions=[{name=test, class=org.apache.solr.cloud.autoscaling.TriggerIntegrationTest$TestTriggerAction}], enabled=true}
   [junit4]   2> 4014301 DEBUG (OverseerAutoScalingTriggerThread-99226283980750853-127.0.0.1:38021_solr-n_0000000000) [n:127.0.0.1:38021_solr    ] o.a.s.c.a.OverseerTriggerThread Processed trigger updates upto znodeVersion 3
   [junit4]   2> 4014304 INFO  (OverseerAutoScalingTriggerThread-99226283980750853-127.0.0.1:38021_solr-n_0000000000) [n:127.0.0.1:38021_solr    ] o.a.s.c.a.TriggerIntegrationTest TestTriggerAction init
   [junit4]   2> 4014306 INFO  (qtp458461685-33159) [n:127.0.0.1:60482_solr    ] o.a.s.h.a.CollectionsHandler Invoked Collection Action :overseerstatus with params action=OVERSEERSTATUS&wt=javabin&version=2 and sendToOCPQueue=true
   [junit4]   2> 4014307 DEBUG (OverseerAutoScalingTriggerThread-99226283980750853-127.0.0.1:38021_solr-n_0000000000) [n:127.0.0.1:38021_solr    ] o.a.s.c.a.OverseerTriggerThread -- clean old nodeLost markers
   [junit4]   2> 4014307 DEBUG (OverseerAutoScalingTriggerThread-99226283980750853-127.0.0.1:38021_solr-n_0000000000) [n:127.0.0.1:38021_solr    ] o.a.s.c.a.OverseerTriggerThread Current znodeVersion 3, lastZnodeVersion 3
   [junit4]   2> 4014307 DEBUG (ScheduledTrigger-10861-thread-1) [n:127.0.0.1:38021_solr    ] o.a.s.c.a.NodeAddedTrigger Running NodeAddedTrigger node_added_trigger
   [junit4]   2> 4014308 DEBUG (ScheduledTrigger-10861-thread-1) [n:127.0.0.1:38021_solr    ] o.a.s.c.a.NodeAddedTrigger Found livenodes: 2
   [junit4]   2> 4014313 INFO  (qtp458461685-33159) [n:127.0.0.1:60482_solr    ] o.a.s.s.HttpSolrCall [admin] webapp=null path=/admin/collections params={action=OVERSEERSTATUS&wt=javabin&version=2} status=0 QTime=7
   [junit4]   2> 4014314 INFO  (TEST-TriggerIntegrationTest.testEventFromRestoredState-seed#[BA6033656271A3FE]) [    ] o.e.j.s.Server jetty-9.3.20.v20170531
   [junit4]   2> 4014315 INFO  (TEST-TriggerIntegrationTest.testEventFromRestoredState-seed#[BA6033656271A3FE]) [    ] o.e.j.s.h.ContextHandler Started o.e.j.s.ServletContextHandler@481b8072{/solr,null,AVAILABLE}
   [junit4]   2> 4014316 INFO  (TEST-TriggerIntegrationTest.testEventFromRestoredState-seed#[BA6033656271A3FE]) [    ] o.e.j.s.AbstractConnector Started ServerConnector@3772c869{HTTP/1.1,[http/1.1]}{127.0.0.1:46598}
   [junit4]   2> 4014316 INFO  (TEST-TriggerIntegrationTest.testEventFromRestoredState-seed#[BA6033656271A3FE]) [    ] o.e.j.s.Server Started @4020212ms
   [junit4]   2> 4014316 INFO  (TEST-TriggerIntegrationTest.testEventFromRestoredState-seed#[BA6033656271A3FE]) [    ] o.a.s.c.s.e.JettySolrRunner Jetty properties: {hostContext=/solr, hostPort=46598}
   [junit4]   2> 4014318 ERROR (TEST-TriggerIntegrationTest.testEventFromRestoredState-seed#[BA6033656271A3FE]) [    ] o.a.s.u.StartupLoggingUtils Missing Java Option solr.log.dir. Logging may be missing or incomplete.
   [junit4]   2> 4014318 INFO  (TEST-TriggerIntegrationTest.testEventFromRestoredState-seed#[BA6033656271A3FE]) [    ] o.a.s.s.SolrDispatchFilter  ___      _       Welcome to Apache Solr™ version 7.3.0
   [junit4]   2> 4014318 INFO  (TEST-TriggerIntegrationTest.testEventFromRestoredState-seed#[BA6033656271A3FE]) [    ] o.a.s.s.SolrDispatchFilter / __| ___| |_ _   Starting in cloud mode on port null
   [junit4]   2> 4014318 INFO  (TEST-TriggerIntegrationTest.testEventFromRestoredState-seed#[BA6033656271A3FE]) [    ] o.a.s.s.SolrDispatchFilter \__ \/ _ \ | '_|  Install dir: null
   [junit4]   2> 4014318 INFO  (TEST-TriggerIntegrationTest.testEventFromRestoredState-seed#[BA6033656271A3FE]) [    ] o.a.s.s.SolrDispatchFilter |___/\___/_|_|    Start time: 2017-12-23T23:48:57.354Z
   [junit4]   2> 4014320 INFO  (zkConnectionManagerCallback-7508-thread-1) [    ] o.a.s.c.c.ConnectionManager zkClient has connected
   [junit4]   2> 4014321 INFO  (TEST-TriggerIntegrationTest.testEventFromRestoredState-seed#[BA6033656271A3FE]) [    ] o.a.s.s.SolrDispatchFilter solr.xml found in ZooKeeper. Loading...
   [junit4]   2> 4014327 INFO  (TEST-TriggerIntegrationTest.testEventFromRestoredState-seed#[BA6033656271A3FE]) [    ] o.a.s.c.ZkContainer Zookeeper client=127.0.0.1:61580/solr
   [junit4]   2> 4014328 INFO  (zkConnectionManagerCallback-7512-thread-1) [    ] o.a.s.c.c.ConnectionManager zkClient has connected
   [junit4]   2> 4014331 INFO  (zkConnectionManagerCallback-7514-thread-1-processing-n:127.0.0.1:46598_solr) [n:127.0.0.1:46598_solr    ] o.a.s.c.c.ConnectionManager zkClient has connected
   [junit4]   2> 4014341 INFO  (TEST-TriggerIntegrationTest.testEventFromRestoredState-seed#[BA6033656271A3FE]) [n:127.0.0.1:46598_solr    ] o.a.s.c.c.ZkStateReader Updated live nodes from ZooKeeper... (0) -> (2)
   [junit4]   2> 4014344 INFO  (TEST-TriggerIntegrationTest.testEventFromRestoredState-seed#[BA6033656271A3FE]) [n:127.0.0.1:46598_solr    ] o.a.s.c.Overseer Overseer (id=null) closing
   [junit4]   2> 4014347 INFO  (TEST-TriggerIntegrationTest.testEventFromRestoredState-seed#[BA6033656271A3FE]) [n:127.0.0.1:46598_solr    ] o.a.s.c.ZkController Register node as live in ZooKeeper:/live_nodes/127.0.0.1:46598_solr
   [junit4]   2> 4014349 INFO  (zkCallback-7495-thread-1-processing-n:127.0.0.1:38021_solr) [n:127.0.0.1:38021_solr    ] o.a.s.c.c.ZkStateReader Updated live nodes from ZooKeeper... (2) -> (3)
   [junit4]   2> 4014349 INFO  (zkCallback-7493-thread-1-processing-n:127.0.0.1:60482_solr) [n:127.0.0.1:60482_solr    ] o.a.s.c.c.ZkStateReader Updated live nodes from ZooKeeper... (2) -> (3)
   [junit4]   2> 4014352 INFO  (zkCallback-7505-thread-1) [    ] o.a.s.c.c.ZkStateReader Updated live nodes from ZooKeeper... (2) -> (3)
   [junit4]   2> 4014352 INFO  (zkCallback-7513-thread-1-processing-n:127.0.0.1:46598_solr) [n:127.0.0.1:46598_solr    ] o.a.s.c.c.ZkStateReader Updated live nodes from ZooKeeper... (2) -> (3)
   [junit4]   2> 4014420 INFO  (TEST-TriggerIntegrationTest.testEventFromRestoredState-seed#[BA6033656271A3FE]) [n:127.0.0.1:46598_solr    ] o.a.s.m.r.SolrJmxReporter JMX monitoring for 'solr_46598.solr.node' (registry 'solr.node') enabled at server: com.sun.jmx.mbeanserver.JmxMBeanServer@827c084
   [junit4]   2> 4014427 INFO  (TEST-TriggerIntegrationTest.testEventFromRestoredState-seed#[BA6033656271A3FE]) [n:127.0.0.1:46598_solr    ] o.a.s.m.r.SolrJmxReporter JMX monitoring for 'solr_46598.solr.jvm' (registry 'solr.jvm') enabled at server: com.sun.jmx.mbeanserver.JmxMBeanServer@827c084
   [junit4]   2> 4014427 INFO  (TEST-TriggerIntegrationTest.testEventFromRestoredState-seed#[BA6033656271A3FE]) [n:127.0.0.1:46598_solr    ] o.a.s.m.r.SolrJmxReporter JMX monitoring for 'solr_46598.solr.jetty' (registry 'solr.jetty') enabled at server: com.sun.jmx.mbeanserver.JmxMBeanServer@827c084
   [junit4]   2> 4014428 INFO  (TEST-TriggerIntegrationTest.testEventFromRestoredState-seed#[BA6033656271A3FE]) [n:127.0.0.1:46598_solr    ] o.a.s.c.CorePropertiesLocator Found 0 core definitions underneath /export/home/jenkins/workspace/Lucene-Solr-7.x-Solaris/solr/build/solr-core/test/J1/temp/solr.cloud.autoscaling.TriggerIntegrationTest_BA6033656271A3FE-001/tempDir-001/node3/.
   [junit4]   2> 4015322 DEBUG (ScheduledTrigger-10861-thread-2) [n:127.0.0.1:38021_solr    ] o.a.s.c.a.NodeAddedTrigger Running NodeAddedTrigger node_added_trigger
   [junit4]   2> 4015322 DEBUG (ScheduledTrigger-10861-thread-2) [n:127.0.0.1:38021_solr    ] o.a.s.c.a.NodeAddedTrigger Found livenodes: 3
   [junit4]   2> 4015323 DEBUG (ScheduledTrigger-10861-thread-2) [n:127.0.0.1:38021_solr    ] o.a.s.c.a.NodeAddedTrigger Tracking new node: 127.0.0.1:46598_solr at time 1816197738148226
   [junit4]   2> 4016312 INFO  (OverseerCollectionConfigSetProcessor-99226283980750853-127.0.0.1:38021_solr-n_0000000000) [n:127.0.0.1:38021_solr    ] o.a.s.c.OverseerTaskQueue Response ZK path: /overseer/collection-queue-work/qnr-0000000000 doesn't exist.  Requestor may have disconnected from ZooKeeper
   [junit4]   2> 4016327 DEBUG (ScheduledTrigger-10861-thread-2) [n:127.0.0.1:38021_solr    ] o.a.s.c.a.NodeAddedTrigger Running NodeAddedTrigger node_added_trigger
   [junit4]   2> 4016327 DEBUG (ScheduledTrigger-10861-thread-2) [n:127.0.0.1:38021_solr    ] o.a.s.c.a.NodeAddedTrigger Found livenodes: 3
   [junit4]   2> 4017330 DEBUG (ScheduledTrigger-10861-thread-2) [n:127.0.0.1:38021_solr    ] o.a.s.c.a.NodeAddedTrigger Running NodeAddedTrigger node_added_trigger
   [junit4]   2> 4017330 DEBUG (ScheduledTrigger-10861-thread-2) [n:127.0.0.1:38021_solr    ] o.a.s.c.a.NodeAddedTrigger Found livenodes: 3
   [junit4]   2> 4018340 DEBUG (ScheduledTrigger-10861-thread-2) [n:127.0.0.1:38021_solr    ] o.a.s.c.a.NodeAddedTrigger Running NodeAddedTrigger node_added_trigger
   [junit4]   2> 4018340 DEBUG (ScheduledTrigger-10861-thread-2) [n:127.0.0.1:38021_solr    ] o.a.s.c.a.NodeAddedTrigger Found livenodes: 3
   [junit4]   2> 4019350 DEBUG (ScheduledTrigger-10861-thread-2) [n:127.0.0.1:38021_solr    ] o.a.s.c.a.NodeAddedTrigger Running NodeAddedTrigger node_added_trigger
   [junit4]   2> 4019351 DEBUG (ScheduledTrigger-10861-thread-2) [n:127.0.0.1:38021_solr    ] o.a.s.c.a.NodeAddedTrigger Found livenodes: 3
   [junit4]   2> 4020354 DEBUG (ScheduledTrigger-10861-thread-2) [n:127.0.0.1:38021_solr    ] o.a.s.c.a.NodeAddedTrigger Running NodeAddedTrigger node_added_trigger
   [junit4]   2> 4020354 DEBUG (ScheduledTrigger-10861-thread-2) [n:127.0.0.1:38021_solr    ] o.a.s.c.a.NodeAddedTrigger Found livenodes: 3
   [junit4]   2> 4021360 DEBUG (ScheduledTrigger-10861-thread-2) [n:127.0.0.1:38021_solr    ] o.a.s.c.a.NodeAddedTrigger Running NodeAddedTrigger node_added_trigger
   [junit4]   2> 4021360 DEBUG (ScheduledTrigger-10861-thread-2) [n:127.0.0.1:38021_solr    ] o.a.s.c.a.NodeAddedTrigger Found livenodes: 3
   [junit4]   2> 4022361 DEBUG (ScheduledTrigger-10861-thread-2) [n:127.0.0.1:38021_solr    ] o.a.s.c.a.NodeAddedTrigger Running NodeAddedTrigger node_added_trigger
   [junit4]   2> 4022361 DEBUG (ScheduledTrigger-10861-thread-2) [n:127.0.0.1:38021_solr    ] o.a.s.c.a.NodeAddedTrigger Found livenodes: 3
   [junit4]   2> 4023364 DEBUG (ScheduledTrigger-10861-thread-2) [n:127.0.0.1:38021_solr    ] o.a.s.c.a.NodeAddedTrigger Running NodeAddedTrigger node_added_trigger
   [junit4]   2> 4023364 DEBUG (ScheduledTrigger-10861-thread-2) [n:127.0.0.1:38021_solr    ] o.a.s.c.a.NodeAddedTrigger Found livenodes: 3
   [junit4]   2> 4024365 DEBUG (ScheduledTrigger-10861-thread-2) [n:127.0.0.1:38021_solr    ] o.a.s.c.a.NodeAddedTrigger Running NodeAddedTrigger node_added_trigger
   [junit4]   2> 4024365 DEBUG (ScheduledTrigger-10861-thread-2) [n:127.0.0.1:38021_solr    ] o.a.s.c.a.NodeAddedTrigger Found livenodes: 3
   [junit4]   2> 4025366 DEBUG (ScheduledTrigger-10861-thread-2) [n:127.0.0.1:38021_solr    ] o.a.s.c.a.NodeAddedTrigger Running NodeAddedTrigger node_added_trigger
   [junit4]   2> 4025366 DEBUG (ScheduledTrigger-10861-thread-2) [n:127.0.0.1:38021_solr    ] o.a.s.c.a.NodeAddedTrigger Found livenodes: 3
   [junit4]   2> 4025367 DEBUG (ScheduledTrigger-10861-thread-2) [n:127.0.0.1:38021_solr    ] o.a.s.c.a.NodeAddedTrigger NodeAddedTrigger node_added_trigger firing registered processor for nodes: [127.0.0.1:46598_solr] added at times [1816197738148226], now=1816207784220156
   [junit4]   2> 4025367 DEBUG (ScheduledTrigger-10861-thread-2) [n:127.0.0.1:38021_solr    ] o.a.s.c.a.ScheduledTriggers ++++++++ Cooldown inactive - processing event: {
   [junit4]   2>   "id":"673d27d063182T3kqgpsm7ha78iv3lqnl03dq0v",
   [junit4]   2>   "source":"node_added_trigger",
   [junit4]   2>   "eventTime":1816197738148226,
   [junit4]   2>   "eventType":"NODEADDED",
   [junit4]   2>   "properties":{
   [junit4]   2>     "eventTimes":[1816197738148226],
   [junit4]   2>     "nodeNames":["127.0.0.1:46598_solr"]}}
   [junit4]   2> 4025368 INFO  (ScheduledTrigger-10861-thread-2) [n:127.0.0.1:38021_solr    ] o.a.s.c.a.SystemLogListener Collection .system does not exist, disabling logging.
   [junit4]   2> 4025370 DEBUG (AutoscalingActionExecutor-10862-thread-1-processing-n:127.0.0.1:38021_solr) [n:127.0.0.1:38021_solr    ] o.a.s.c.a.ScheduledTriggers -- processing actions for {
   [junit4]   2>   "id":"673d27d063182T3kqgpsm7ha78iv3lqnl03dq0v",
   [junit4]   2>   "source":"node_added_trigger",
   [junit4]   2>   "eventTime":1816197738148226,
   [junit4]   2>   "eventType":"NODEADDED",
   [junit4]   2>   "properties":{
   [junit4]   2>     "eventTimes":[1816197738148226],
   [junit4]   2>     "_enqueue_time_":1816207784670249,
   [junit4]   2>     "nodeNames":["127.0.0.1:46598_solr"]}}
   [junit4]   2> 4025371 INFO  (TEST-TriggerIntegrationTest.testEventFromRestoredState-seed#[BA6033656271A3FE]) [    ] o.e.j.s.Server jetty-9.3.20.v20170531
   [junit4]   2> 4025373 DEBUG (AutoscalingActionExecutor-10862-thread-1-processing-n:127.0.0.1:38021_solr) [n:127.0.0.1:38021_solr    ] o.a.s.c.a.ScheduledTriggers -- processing took 3 ms for event id=673d27d063182T3kqgpsm7ha78iv3lqnl03dq0v
   [junit4]   2> 4025374 INFO  (TEST-TriggerIntegrationTest.testEventFromRestoredState-seed#[BA6033656271A3FE]) [    ] o.e.j.s.h.ContextHandler Started o.e.j.s.ServletContextHandler@76514da7{/solr,null,AVAILABLE}
   [junit4]   2> 4025375 INFO  (TEST-TriggerIntegrationTest.testEventFromRestoredState-seed#[BA6033656271A3FE]) [    ] o.e.j.s.AbstractConnector Started ServerConnector@3c6d404a{HTTP/1.1,[http/1.1]}{127.0.0.1:54485}
   [junit4]   2> 4025375 INFO  (TEST-TriggerIntegrationTest.testEventFromRestoredState-seed#[BA6033656271A3FE]) [    ] o.e.j.s.Server Started @4031274ms
   [junit4]   2> 4025375 INFO  (TEST-TriggerIntegrationTest.testEventFromRestoredState-seed#[BA6033656271A3FE]) [    ] o.a.s.c.s.e.JettySolrRunner Jetty properties: {hostContext=/solr, hostPort=54485}
   [junit4]   2> 4025380 ERROR (TEST-TriggerIntegrationTest.testEventFromRestoredState-seed#[BA6033656271A3FE]) [    ] o.a.s.u.StartupLoggingUtils Missing Java Option solr.log.dir. Logging may be missing or incomplete.
   [junit4]   2> 4025380 INFO  (TEST-TriggerIntegrationTest.testEventFromRestoredState-seed#[BA6033656271A3FE]) [    ] o.a.s.s.SolrDispatchFilter  ___      _       Welcome to Apache Solr™ version 7.3.0
   [junit4]   2> 4025380 INFO  (TEST-TriggerIntegrationTest.testEventFromRestoredState-seed#[BA6033656271A3FE]) [    ] o.a.s.s.SolrDispatchFilter / __| ___| |_ _   Starting in cloud mode on port null
   [junit4]   2> 4025380 INFO  (TEST-TriggerIntegrationTest.testEventFromRestoredState-seed#[BA6033656271A3FE]) [    ] o.a.s.s.SolrDispatchFilter \__ \/ _ \ | '_|  Install dir: null
   [junit4]   2> 4025380 INFO  (TEST-TriggerIntegrationTest.testEventFromRestoredState-seed#[BA6033656271A3FE]) [    ] o.a.s.s.SolrDispatchFilter |___/\___/_|_|    Start time: 2017-12-23T23:49:08.416Z
   [junit4]   2> 4025383 INFO  (zkConnectionManagerCallback-7518-thread-1) [    ] o.a.s.c.c.ConnectionManager zkClient has connected
   [junit4]   2> 4025384 INFO  (TEST-TriggerIntegrationTest.testEventFromRestoredState-seed#[BA6033656271A3FE]) [    ] o.a.s.s.SolrDispatchFilter solr.xml found in ZooKeeper. Loading...
   [junit4]   2> 4025393 INFO  (TEST-TriggerIntegrationTest.testEventFromRestoredState-seed#[BA6033656271A3FE]) [    ] o.a.s.c.ZkContainer Zookeeper client=127.0.0.1:61580/solr
   [junit4]   2> 4025395 INFO  (zkConnectionManagerCallback-7522-thread-1) [    ] o.a.s.c.c.ConnectionManager zkClient has connected
   [junit4]   2> 4025399 INFO  (zkConnectionManagerCallback-7524-thread-1-processing-n:127.0.0.1:54485_solr) [n:127.0.0.1:54485_solr    ] o.a.s.c.c.ConnectionManager zkClient has connected
   [junit4]   2> 4025410 INFO  (TEST-TriggerIntegrationTest.testEventFromRestoredState-seed#[BA6033656271A3FE]) [n:127.0.0.1:54485_solr    ] o.a.s.c.c.ZkStateReader Updated live nodes from ZooKeeper... (0) -> (3)
   [junit4]   2> 4025413 INFO  (TEST-TriggerIntegrationTest.testEventFromRestoredState-seed#[BA6033656271A3FE]) [n:127.0.0.1:54485_solr    ] o.a.s.c.Overseer Overseer (id=null) closing
   [junit4]   2> 4025416 INFO  (TEST-TriggerIntegrationTest.testEventFromRestoredState-seed#[BA6033656271A3FE]) [n:127.0.0.1:54485_solr    ] o.a.s.c.ZkController Register node as live in ZooKeeper:/live_nodes/127.0.0.1:54485_solr
   [junit4]   2> 4025418 INFO  (zkCallback-7495-thread-1-processing-n:127.0.0.1:38021_solr) [n:127.0.0.1:38021_solr    ] o.a.s.c.c.ZkStateReader Updated live nodes from ZooKeeper... (3) -> (4)
   [junit4]   2> 4025418 INFO  (zkCallback-7493-thread-1-processing-n:127.0.0.1:60482_solr) [n:127.0.0.1:60482_solr    ] o.a.s.c.c.ZkStateReader Updated live nodes from ZooKeeper... (3) -> (4)
   [junit4]   2> 4025418 INFO  (zkCallback-7513-thread-1-processing-n:127.0.0.1:46598_solr) [n:127.0.0.1:46598_solr    ] o.a.s.c.c.ZkStateReader Updated live nodes from ZooKeeper... (3) -> (4)
   [junit4]   2> 4025418 INFO  (zkCallback-7505-thread-1) [    ] o.a.s.c.c.ZkStateReader Updated live nodes from ZooKeeper... (3) -> (4)
   [junit4]   2> 4025421 INFO  (zkCallback-7523-thread-1-processing-n:127.0.0.1:54485_solr) [n:127.0.0.1:54485_solr    ] o.a.s.c.c.ZkStateReader Updated live nodes from ZooKeeper... (3) -> (4)
   [junit4]   2> 4025544 INFO  (TEST-TriggerIntegrationTest.testEventFromRestoredState-seed#[BA6033656271A3FE]) [n:127.0.0.1:54485_solr    ] o.a.s.m.r.SolrJmxReporter JMX monitoring for 'solr_54485.solr.node' (registry 'solr.node') enabled at server: com.sun.jmx.mbeanserver.JmxMBeanServer@827c084
   [junit4]   2> 4025550 INFO  (TEST-TriggerIntegrationTest.testEventFromRestoredState-seed#[BA6033656271A3FE]) [n:127.0.0.1:54485_solr    ] o.a.s.m.r.SolrJmxReporter JMX monitoring for 'solr_54485.solr.jvm' (registry 'solr.jvm') enabled at server: com.sun.jmx.mbeanserver.JmxMBeanServer@827c084
   [junit4]   2> 4025551 INFO  (TEST-TriggerIntegrationTest.testEventFromRestoredState-seed#[BA6033656271A3FE]) [n:127.0.0.1:54485_solr    ] o.a.s.m.r.SolrJmxReporter JMX monitoring for 'solr_54485.solr.jetty' (registry 'solr.jetty') enabled at server: com.sun.jmx.mbeanserver.JmxMBeanServer@827c084
   [junit4]   2> 4025551 INFO  (TEST-TriggerIntegrationTest.testEventFromRestoredState-seed#[BA6033656271A3FE]) [n:127.0.0.1:54485_solr    ] o.a.s.c.CorePropertiesLocator Found 0 core definitions underneath /export/home/jenkins/workspace/Lucene-Solr-7.x-Solaris/solr/build/solr-core/test/J1/temp/solr.cloud.autoscaling.TriggerIntegrationTest_BA6033656271A3FE-001/tempDir-001/node4/.
   [junit4]   2> 4026373 DEBUG (ScheduledTrigger-10861-thread-2) [n:127.0.0.1:38021_solr    ] o.a.s.c.a.NodeAddedTrigger Running NodeAddedTrigger node_added_trigger
   [junit4]   2> 4026373 DEBUG (ScheduledTrigger-10861-thread-2) [n:127.0.0.1:38021_solr    ] o.a.s.c.a.NodeAddedTrigger Found livenodes: 4
   [junit4]   2> 4026373 DEBUG (ScheduledTrigger-10861-thread-2) [n:127.0.0.1:38021_solr    ] o.a.s.c.a.NodeAddedTrigger Tracking new node: 127.0.0.1:54485_solr at time 1816208790995812
   [junit4]   2> 4027375 DEBUG (ScheduledTrigger-10861-thread-2) [n:127.0.0.1:38021_solr    ] o.a.s.c.a.NodeAddedTrigger Running NodeAddedTrigger node_added_trigger
   [junit4]   2> 4027376 DEBUG (ScheduledTrigger-10861-thread-2) [n:127.0.0.1:38021_solr    ] o.a.s.c.a.NodeAddedTrigger Found livenodes: 4
   [junit4]   2> 4028382 DEBUG (ScheduledTrigger-10861-thread-2) [n:127.0.0.1:38021_solr    ] o.a.s.c.a.NodeAddedTrigger Running NodeAddedTrigger node_added_trigger
   [junit4]   2> 4028382 DEBUG (ScheduledTrigger-10861-thread-2) [n:127.0.0.1:38021_solr    ] o.a.s.c.a.NodeAddedTrigger Found livenodes: 4
   [junit4]   2> 4029384 DEBUG (ScheduledTrigger-10861-thread-2) [n:127.0.0.1:38021_solr    ] o.a.s.c.a.NodeAddedTrigger Running NodeAddedTrigger node_added_trigger
   [junit4]   2> 4029384 DEBUG (ScheduledTrigger-10861-thread-2) [n:127.0.0.1:38021_solr    ] o.a.s.c.a.NodeAddedTrigger Found livenodes: 4
   [junit4]   2> 4030385 DEBUG (ScheduledTrigger-10861-thread-2) [n:127.0.0.1:38021_solr    ] o.a.s.c.a.NodeAddedTrigger Running NodeAddedTrigger node_added_trigger
   [junit4]   2> 4030385 DEBUG (ScheduledTrigger-10861-thread-2) [n:127.0.0.1:38021_solr    ] o.a.s.c.a.NodeAddedTrigger Found livenodes: 4
   [junit4]   2> 4031388 DEBUG (ScheduledTrigger-10861-thread-2) [n:127.0.0.1:38021_solr    ] o.a.s.c.a.NodeAddedTrigger Running NodeAddedTrigger node_added_trigger
   [junit4]   2> 4031388 DEBUG (ScheduledTrigger-10861-thread-2) [n:127.0.0.1:38021_solr    ] o.a.s.c.a.NodeAddedTrigger Found livenodes: 4
   [junit4]   2> 4032390 DEBUG (ScheduledTrigger-10861-thread-2) [n:127.0.0.1:38021_solr    ] o.a.s.c.a.NodeAddedTrigger Running NodeAddedTrigger node_added_trigger
   [junit4]   2> 4032390 DEBUG (ScheduledTrigger-10861-thread-2) [n:127.0.0.1:38021_solr    ] o.a.s.c.a.NodeAddedTrigger Found livenodes: 4
   [junit4]   2> 4033391 DEBUG (ScheduledTrigger-10861-thread-2) [n:127.0.0.1:38021_solr    ] o.a.s.c.a.NodeAddedTrigger Running NodeAddedTrigger node_added_trigger
   [junit4]   2> 4033391 DEBUG (ScheduledTrigger-10861-thread-2) [n:127.0.0.1:38021_solr    ] o.a.s.c.a.NodeAddedTrigger Found livenodes: 4
   [junit4]   2> 4034392 DEBUG (ScheduledTrigger-10861-thread-2) [n:127.0.0.1:38021_solr    ] o.a.s.c.a.NodeAddedTrigger Running NodeAddedTrigger node_added_trigger
   [junit4]   2> 4034392 DEBUG (ScheduledTrigger-10861-thread-2) [n:127.0.0.1:38021_solr    ] o.a.s.c.a.NodeAddedTrigger Found livenodes: 4
   [junit4]   2> 4035393 DEBUG (ScheduledTrigger-10861-thread-2) [n:127.0.0.1:38021_solr    ] o.a.s.c.a.NodeAddedTrigger Running NodeAddedTrigger node_added_trigger
   [junit4]   2> 4035393 DEBUG (ScheduledTrigger-10861-thread-2) [n:127.0.0.1:38021_solr    ] o.a.s.c.a.NodeAddedTrigger Found livenodes: 4
   [junit4]   2> 4035593 INFO  (TEST-TriggerIntegrationTest.testEventFromRestoredState-seed#[BA6033656271A3FE]) [    ] o.e.j.s.AbstractConnector Stopped ServerConnector@653d5b52{HTTP/1.1,[http/1.1]}{127.0.0.1:0}
   [junit4]   2> 4035597 INFO  (TEST-TriggerIntegrationTest.testEventFromRestoredState-seed#[BA6033656271A3FE]) [    ] o.a.s.c.CoreContainer Shutting down CoreContainer instance=341209953
   [junit4]   2> 4035597 INFO  (TEST-TriggerIntegrationTest.testEventFromRestoredState-seed#[BA6033656271A3FE]) [    ] o.a.s.m.SolrMetricManager Closing metric reporters for registry=solr.node, tag=null
   [junit4]   2> 4035597 INFO  (TEST-TriggerIntegrationTest.testEventFromRestoredState-seed#[BA6033656271A3FE]) [    ] o.a.s.m.r.SolrJmxReporter Closing reporter [org.apache.solr.metrics.reporters.SolrJmxReporter@236373aa: rootName = solr_38021, domain = solr.node, service url = null, agent id = null] for registry solr.node / com.codahale.metrics.MetricRegistry@258e3ea8
   [junit4]   2> 4035608 INFO  (TEST-TriggerIntegrationTest.testEventFromRestoredState-seed#[BA6033656271A3FE]) [    ] o.a.s.m.SolrMetricManager Closing metric reporters for registry=solr.jvm, tag=null
   [junit4]   2> 4035608 INFO  (TEST-TriggerIntegrationTest.testEventFromRestoredState-seed#[BA6033656271A3FE]) [    ] o.a.s.m.r.SolrJmxReporter Closing reporter [org.apache.solr.metrics.reporters.SolrJmxReporter@bd7ba14: rootName = solr_38021, domain = solr.jvm, service url = null, agent id = null] for registry solr.jvm / com.codahale.metrics.MetricRegistry@2fa0800f
   [junit4]   2> 4035615 INFO  (TEST-TriggerIntegrationTest.testEventFromRestoredState-seed#[BA6033656271A3FE]) [    ] o.a.s.m.SolrMetricManager Closing metric reporters for registry=solr.jetty, tag=null
   [junit4]   2> 4035615 INFO  (TEST-TriggerIntegrationTest.testEventFromRestoredState-seed#[BA6033656271A3FE]) [    ] o.a.s.m.r.SolrJmxReporter Closing reporter [org.apache.solr.metrics.reporters.SolrJmxReporter@1cf66bb6: rootName = solr_38021, domain = solr.jetty, service url = null, agent id = null] for registry solr.jetty / com.codahale.metrics.MetricRegistry@40c8715f
   [junit4]   2> 4035619 INFO  (TEST-TriggerIntegrationTest.testEventFromRestoredState-seed#[BA6033656271A3FE]) [    ] o.a.s.c.ZkController Remove node as live in ZooKeeper:/live_nodes/127.0.0.1:38021_solr
   [junit4]   2> 4035622 INFO  (TEST-TriggerIntegrationTest.testEventFromRestoredState-seed#[BA6033656271A3FE]) [    ] o.a.s.m.SolrMetricManager Closing metric reporters for registry=solr.cluster, tag=null
   [junit4]   2> 4035622 INFO  (zkCallback-7493-thread-1-processing-n:127.0.0.1:60482_solr) [n:127.0.0.1:60482_solr    ] o.a.s.c.c.ZkStateReader Updated live nodes from ZooKeeper... (4) -> (3)
   [junit4]   2> 4035622 INFO  (zkCallback-7505-thread-1) [    ] o.a.s.c.c.ZkStateReader Updated live nodes from ZooKeeper... (4) -> (3)
   [junit4]   2> 4035622 INFO  (zkCallback-7523-thread-1-processing-n:127.0.0.1:54485_solr) [n:127.0.0.1:54485_solr    ] o.a.s.c.c.ZkStateReader Updated live nodes from ZooKeeper... (4) -> (3)
   [junit4]   2> 4035623 INFO  (zkCallback-7495-thread-1-processing-n:127.0.0.1:38021_solr) [n:127.0.0.1:38021_solr    ] o.a.s.c.c.ZkStateReader Updated live nodes from ZooKeeper... (4) -> (3)
   [junit4]   2> 4035622 INFO  (zkCallback-7513-thread-1-processing-n:127.0.0.1:46598_solr) [n:127.0.0.1:46598_solr    ] o.a.s.c.c.ZkStateReader Updated live nodes from ZooKeeper... (4) -> (3)
   [junit4]   2> 4035623 INFO  (TEST-TriggerIntegrationTest.testEventFromRestoredState-seed#[BA6033656271A3FE]) [    ] o.a.s.c.TransientSolrCoreCacheDefault Allocating transient cache for 2147483647 transient cores
   [junit4]   2> 4035624 INFO  (TEST-TriggerIntegrationTest.testEventFromRestoredState-seed#[BA6033656271A3FE]) [    ] o.a.s.c.Overseer Overseer (id=99226283980750853-127.0.0.1:38021_solr-n_0000000000) closing
   [junit4]   2> 4035624 INFO  (OverseerStateUpdate-99226283980750853-127.0.0.1:38021_solr-n_0000000000) [n:127.0.0.1:38021_solr    ] o.a.s.c.Overseer Overseer Loop exiting : 127.0.0.1:38021_solr
   [junit4]   2> 4035625 WARN  (OverseerAutoScalingTriggerThread-99226283980750853-127.0.0.1:38021_solr-n_0000000000) [n:127.0.0.1:38021_solr    ] o.a.s.c.a.OverseerTriggerThread OverseerTriggerThread woken up but we are closed, exiting.
   [junit4]   2> 4035630 DEBUG (TEST-TriggerIntegrationTest.testEventFromRestoredState-seed#[BA6033656271A3FE]) [    ] o.a.s.c.a.OverseerTriggerThread OverseerTriggerThread has been closed explicitly
   [junit4]   2> 4035634 INFO  (TEST-TriggerIntegrationTest.testEventFromRestoredState-seed#[BA6033656271A3FE]) [    ] o.e.j.s.h.ContextHandler Stopped o.e.j.s.ServletContextHandler@4591fed4{/solr,null,UNAVAILABLE}
   [junit4]   2> 4035638 INFO  (zkCallback-7493-thread-1-processing-n:127.0.0.1:60482_solr) [n:127.0.0.1:60482_solr    ] o.a.s.c.OverseerElectionContext I am going to be the leader 127.0.0.1:60482_solr
   [junit4]   2> 4035641 INFO  (zkCallback-7493-thread-1-processing-n:127.0.0.1:60482_solr) [n:127.0.0.1:60482_solr    ] o.a.s.c.Overseer Overseer (id=99226283980750854-127.0.0.1:60482_solr-n_0000000001) starting
   [junit4]   2> 4035653 DEBUG (OverseerAutoScalingTriggerThread-99226283980750854-127.0.0.1:60482_solr-n_0000000001) [n:127.0.0.1:60482_solr    ] o.a.s.c.a.OverseerTriggerThread Adding .autoAddReplicas trigger
   [junit4]   2> 4035654 DEBUG (OverseerAutoScalingTriggerThread-99226283980750854-127.0.0.1:60482_solr-n_0000000001) [n:127.0.0.1:60482_solr    ] o.a.s.c.a.OverseerTriggerThread Refreshing /autoscaling.json with znode version 4
   [junit4]   2> 4035654 DEBUG (OverseerAutoScalingTriggerThread-99226283980750854-127.0.0.1:60482_solr-n_0000000001) [n:127.0.0.1:60482_solr    ] o.a.s.c.a.NodeAddedTrigger Initial livenodes: [127.0.0.1:54485_solr, 127.0.0.1:60482_solr, 127.0.0.1:46598_solr]
   [junit4]   2> 4035654 DEBUG (OverseerAutoScalingTriggerThread-99226283980750854-127.0.0.1:60482_solr-n_0000000001) [n:127.0.0.1:60482_solr    ] o.a.s.c.a.NodeAddedTrigger NodeAddedTrigger node_added_trigger instantiated with properties: {event=nodeAdded, waitFor=10, actions=[{name=test, class=org.apache.solr.cloud.autoscaling.TriggerIntegrationTest$TestTriggerAction}], enabled=true}
   [junit4]   2> 4035655 DEBUG (OverseerAutoScalingTriggerThread-99226283980750854-127.0.0.1:60482_solr-n_0000000001) [n:127.0.0.1:60482_solr    ] o.a.s.c.a.NodeLostTrigger Initial livenodes: [127.0.0.1:54485_solr, 127.0.0.1:60482_solr, 127.0.0.1:46598_solr]
   [junit4]   2> 4035655 DEBUG (OverseerAutoScalingTriggerThread-99226283980750854-127.0.0.1:60482_solr-n_0000000001) [n:127.0.0.1:60482_solr    ] o.a.s.c.a.OverseerTriggerThread Current znodeVersion 4, lastZnodeVersion -1
   [junit4]   2> 4035655 DEBUG (OverseerAutoScalingTriggerThread-99226283980750854-127.0.0.1:60482_solr-n_0000000001) [n:127.0.0.1:60482_solr    ] o.a.s.c.a.OverseerTriggerThread Processed trigger updates upto znodeVersion 4
   [junit4]   2> 4035656 INFO  (OverseerAutoScalingTriggerThread-99226283980750854-127.0.0.1:60482_solr-n_0000000001) [n:127.0.0.1:60482_solr    ] o.a.s.c.a.TriggerIntegrationTest TestTriggerAction init
   [junit4]   2> 4035656 DEBUG (OverseerAutoScalingTriggerThread-99226283980750854-127.0.0.1:60482_solr-n_0000000001) [n:127.0.0.1:60482_solr    ] o.a.s.c.a.NodeAddedTrigger Adding node from marker path: 127.0.0.1:54485_solr
   [junit4]   2> 4035656 DEBUG (ScheduledTrigger-10882-thread-1) [n:127.0.0.1:60482_solr    ] o.a.s.c.a.NodeLostTrigger Running NodeLostTrigger: .auto_add_replicas with currently live nodes: 3
   [junit4]   2> 4035660 DEBUG (OverseerAutoScalingTriggerThread-99226283980750854-127.0.0.1:60482_solr-n_0000000001) [n:127.0.0.1:60482_solr    ] o.a.s.c.a.OverseerTriggerThread Current znodeVersion 4, lastZnodeVersion 4
   [junit4]   2> 4035661 DEBUG (ScheduledTrigger-10882-thread-2) [n:127.0.0.1:60482_solr    ] o.a.s.c.a.NodeAddedTrigger Running NodeAddedTrigger node_added_trigger
   [junit4]   2> 4035661 DEBUG (ScheduledTrigger-10882-thread-2) [n:127.0.0.1:60482_solr    ] o.a.s.c.a.NodeAddedTrigger Found livenodes: 3
   [junit4]   2> 4036661 DEBUG (ScheduledTrigger-10882-thread-1) [n:127.0.0.1:60482_solr    ] o.a.s.c.a.NodeLostTrigger Running NodeLostTrigger: .auto_add_replicas with currently live nodes: 3
   [junit4]   2> 4036667 DEBUG (ScheduledTrigger-10882-thread-3) [n:127.0.0.1:60482_solr    ] o.a.s.c.a.NodeAddedTrigger Running NodeAddedTrigger node_added_trigger
   [junit4]   2> 4036667 DEBUG (ScheduledTrigger-10882-thread-3) [n:127.0.0.1:60482_solr    ] o.a.s.c.a.NodeAddedTrigger Found livenodes: 3
   [junit4]   2> 4036667 DEBUG (ScheduledTrigger-10882-thread-3) [n:127.0.0.1:60482_solr    ] o.a.s.c.a.NodeAddedTrigger NodeAddedTrigger node_added_trigger firing registered processor for nodes: [127.0.0.1:54485_solr] added at times [1816208790995812], now=1816219087407383
   [junit4]   2> 4036667 DEBUG (ScheduledTrigger-10882-thread-3) [n:127.0.0.1:60482_solr    ] o.a.s.c.a.ScheduledTriggers ++++++++ Cooldown inactive - processing event: {
   [junit4]   2>   "id":"673d50fd34364T3kqgpsm7ha78iv3lqnl03dq0x",
   [junit4]   2>   "source":"node_added_trigger",
   [junit4]   2>   "eventTime":1816208790995812,
   [junit4]   2>   "eventType":"NODEADDED",
   [junit4]   2>   "properties":{
   [junit4]   2>     "eventTimes":[1816208790995812],
   [junit4]   2>     "nodeNames":["127.0.0.1:54485_solr"]}}
   [junit4]   2> 4036668 INFO  (ScheduledTrigger-10882-thread-3) [n:127.0.0.1:60482_solr    ] o.a.s.c.a.SystemLogListener Collection .system does not exist, disabling logging.
   [junit4]   2> 4036669 DEBUG (AutoscalingActionExecutor-10883-thread-1-processing-n:127.0.0.1:60482_solr) [n:127.0.0.1:60482_solr    ] o.a.s.c.a.ScheduledTriggers -- processing actions for {
   [junit4]   2>   "id":"673d50fd34364T3kqgpsm7ha78iv3lqnl03dq0x",
   [junit4]   2>   "source":"node_added_trigger",
   [junit4]   2>   "eventTime":1816208790995812,
   [junit4]   2>   "eventType":"NODEADDED",
   [junit4]   2>   "properties":{
   [junit4]   2>     "eventTimes":[1816208790995812],
   [junit4]   2>     "_enqueue_time_":1816219087795532,
   [junit4]   2>     "nodeNames":["127.0.0.1:54485_solr"]}}
   [junit4]   2> 4036669 INFO  (TEST-TriggerIntegrationTest.testEventFromRestoredState-seed#[BA6033656271A3FE]) [    ] o.a.s.SolrTestCaseJ4 ###Ending testEventFromRestoredState
   [junit4]   2> 4036684 DEBUG (AutoscalingActionExecutor-10883-thread-1-processing-n:127.0.0.1:60482_solr) [n:127.0.0.1:60482_solr    ] o.a.s.c.a.ScheduledTriggers -- processing took 15 ms for event id=673d50fd34364T3kqgpsm7ha78iv3lqnl03dq0x
   [junit4]   2> 4036836 INFO  (TEST-TriggerIntegrationTest.testNodeAddedTrigger-seed#[BA6033656271A3FE]) [    ] o.a.s.SolrTestCaseJ4 ###Starting testNodeAddedTrigger
   [junit4]   2> 4036836 INFO  (TEST-TriggerIntegrationTest.testNodeAddedTrigger-seed#[BA6033656271A3FE]) [    ] o.a.s.c.a.TriggerIntegrationTest /autoscaling.json reset, new znode version 5
   [junit4]   2> 4036837 DEBUG (zkCallback-7493-thread-1-processing-n:127.0.0.1:60482_solr) [n:127.0.0.1:60482_solr    ] o.a.s.c.a.OverseerTriggerThread Refreshing /autoscaling.json with znode version 5
   [junit4]   2> 4036837 DEBUG (OverseerAutoScalingTriggerThread-99226283980750854-127.0.0.1:60482_solr-n_0000000001) [n:127.0.0.1:60482_solr    ] o.a.s.c.a.OverseerTriggerThread Processed trigger updates upto znodeVersion 5
   [junit4]   2> 4036842 DEBUG (OverseerAutoScalingTriggerThread-99226283980750854-127.0.0.1:60482_solr-n_0000000001) [n:127.0.0.1:60482_solr    ] o.a.s.c.a.OverseerTriggerThread -- clean old nodeLost markers
   [junit4]   2> 4036843 DEBUG (OverseerAutoScalingTriggerThread-99226283980750854-127.0.0.1:60482_solr-n_0000000001) [n:127.0.0.1:60482_solr    ] o.a.s.c.a.OverseerTriggerThread -- clean old nodeAdded markers
   [junit4]   2> 4036843 DEBUG (OverseerAutoScalingTriggerThread-99226283980750854-127.0.0.1:60482_solr-n_0000000001) [n:127.0.0.1:60482_solr    ] o.a.s.c.a.OverseerTriggerThread Current znodeVersion 5, lastZnodeVersion 5
   [junit4]   2> 4036853 INFO  (qtp1263915564-33247) [n:127.0.0.1:54485_solr    ] o.a.s.s.HttpSolrCall [admin] webapp=null path=/admin/metrics params={prefix=CORE.coreName&wt=javabin&version=2&group=solr.core} status=0 QTime=0
   [junit4]   2> 4036855 INFO  (qtp458461685-33161) [n:127.0.0.1:60482_solr    ] o.a.s.s.HttpSolrCall [admin] webapp=null path=/admin/metrics params={prefix=CORE.coreName&wt=javabin&version=2&group=solr.core} status=0 QTime=0
   [junit4]   2> 4036863 INFO  (qtp1649040025-33221) [n:127.0.0.1:46598_solr    ] o.a.s.s.HttpSolrCall [admin] webapp=null path=/admin/metrics params={prefix=CORE.coreName&wt=javabin&version=2&group=solr.core} status=0 QTime=0
   [junit4]   2> 4036863 DEBUG (qtp458461685-33160) [n:127.0.0.1:60482_solr    ] o.a.s.c.a.AutoScalingHandler Verified autoscaling configuration
   [junit4]   2> 4036863 INFO  (qtp458461685-33160) [n:127.0.0.1:60482_solr    ] o.a.s.s.HttpSolrCall [admin] webapp=null path=/cluster/autoscaling params={wt=javabin&version=2} status=0 QTime=19
   [junit4]   2> 4036864 DEBUG (zkCallback-7493-thread-1-processing-n:127.0.0.1:60482_solr) [n:127.0.0.1:60482_solr    ] o.a.s.c.a.OverseerTriggerThread Refreshing /autoscaling.json with znode version 6
   [junit4]   2> 4036867 DEBUG (zkCallback-7493-thread-1-processing-n:127.0.0.1:60482_solr) [n:127.0.0.1:60482_solr    ] o.a.s.c.a.NodeAddedTrigger Initial livenodes: [127.0.0.1:54485_solr, 127.0.0.1:60482_solr, 127.0.0.1:46598_solr]
   [junit4]   2> 4036867 DEBUG (zkCallback-7493-thread-1-processing-n:127.0.0.1:60482_solr) [n:127.0.0.1:60482_solr    ] o.a.s.c.a.NodeAddedTrigger NodeAddedTrigger node_added_trigger instantiated with properties: {event=nodeAdded, waitFor=1, actions=[{name=test, class=org.apache.solr.cloud.autoscaling.TriggerIntegrationTest$TestTriggerAction}], enabled=true}
   [junit4]   2> 4036867 DEBUG (OverseerAutoScalingTriggerThread-99226283980750854-127.0.0.1:60482_solr-n_0000000001) [n:127.0.0.1:60482_solr    ] o.a.s.c.a.OverseerTriggerThread Processed trigger updates upto znodeVersion 6
   [junit4]   2> 4036870 INFO  (OverseerAutoScalingTriggerThread-99226283980750854-127.0.0.1:60482_solr-n_0000000001) [n:127.0.0.1:60482_solr    ] o.a.s.c.a.TriggerIntegrationTest TestTriggerAction init
   [junit4]   2> 4036871 INFO  (TEST-TriggerIntegrationTest.testNodeAddedTrigger-seed#[BA6033656271A3FE]) [    ] o.e.j.s.Server jetty-9.3.20.v20170531
   [junit4]   2> 4036871 DEBUG (OverseerAutoScalingTriggerThread-99226283980750854-127.0.0.1:60482_solr-n_0000000001) [n:127.0.0.1:60482_solr    ] o.a.s.c.a.OverseerTriggerThread -- clean old nodeLost markers
   [junit4]   2> 4036871 DEBUG (OverseerAutoScalingTriggerThread-99226283980750854-127.0.0.1:60482_solr-n_0000000001) [n:127.0.0.1:60482_solr    ] o.a.s.c.a.OverseerTriggerThread Current znodeVersion 6, lastZnodeVersion 6
   [junit4]   2> 4036872 DEBUG (ScheduledTrigger-10882-thread-4) [n:127.0.0.1:60482_solr    ] o.a.s.c.a.NodeAddedTrigger Running NodeAddedTrigger node_added_trigger
   [junit4]   2> 4036872 DEBUG (ScheduledTrigger-10882-thread-4) [n:127.0.0.1:60482_solr    ] o.a.s.c.a.NodeAddedTrigger Found livenodes: 3
   [junit4]   2> 4036872 INFO  (TEST-TriggerIntegrationTest.testNodeAddedTrigger-seed#[BA6033656271A3FE]) [    ] o.e.j.s.h.ContextHandler Started o.e.j.s.ServletContextHandler@45ff616{/solr,null,AVAILABLE}
   [junit4]   2> 4036872 INFO  (TEST-TriggerIntegrationTest.testNodeAddedTrigger-seed#[BA6033656271A3FE]) [    ] o.e.j.s.AbstractConnector Started ServerConnector@2d854a22{HTTP/1.1,[http/1.1]}{127.0.0.1:42777}
   [junit4]   2> 4036872 INFO  (TEST-TriggerIntegrationTest.testNodeAddedTrigger-seed#[BA6033656271A3FE]) [    ] o.e.j.s.Server Started @4042774ms
   [junit4]   2> 4036872 INFO  (TEST-TriggerIntegrationTest.testNodeAddedTrigger-seed#[BA6033656271A3FE]) [    ] o.a.s.c.s.e.JettySolrRunner Jetty properties: {hostContext=/solr, hostPort=42777}
   [junit4]   2> 4036872 ERROR (TEST-TriggerIntegrationTest.testNodeAddedTrigger-seed#[BA6033656271A3FE]) [    ] o.a.s.u.StartupLoggingUtils Missing Java Option solr.log.dir. Logging may be missing or incomplete.
   [junit4]   2> 4036874 INFO  (TEST-TriggerIntegrationTest.testNodeAddedTrigger-seed#[BA6033656271A3FE]) [    ] o.a.s.s.SolrDispatchFilter  ___      _       Welcome to Apache Solr™ version 7.3.0
   [junit4]   2> 4036874 INFO  (TEST-TriggerIntegrationTest.testNodeAddedTrigger-seed#[BA6033656271A3FE]) [    ] o.a.s.s.SolrDispatchFilter / __| ___| |_ _   Starting in cloud mode on port null
   [junit4]   2> 4036874 INFO  (TEST-TriggerIntegrationTest.testNodeAddedTrigger-seed#[BA6033656271A3FE]) [    ] o.a.s.s.SolrDispatchFilter \__ \/ _ \ | '_|  Install dir: null
   [junit4]   2> 4036874 INFO  (TEST-TriggerIntegrationTest.testNodeAddedTrigger-seed#[BA6033656271A3FE]) [    ] o.a.s.s.SolrDispatchFilter |___/\___/_|_|    Start time: 2017-12-23T23:49:19.910Z
   [junit4]   2> 4036876 INFO  (zkConnectionManagerCallback-7528-thread-1) [    ] o.a.s.c.c.ConnectionManager zkClient has connected
   [junit4]   2> 4036877 INFO  (TEST-TriggerIntegrationTest.testNodeAddedTrigger-seed#[BA6033656271A3FE]) [    ] o.a.s.s.SolrDispatchFilter solr.xml found in ZooKeeper. Loading...
   [junit4]   2> 4036882 INFO  (TEST-TriggerIntegrationTest.testNodeAddedTrigger-seed#[BA6033656271A3FE]) [    ] o.a.s.c.ZkContainer Zookeeper client=127.0.0.1:61580/solr
   [junit4]   2> 4036884 INFO  (zkConnectionManagerCallback-7532-thread-1) [    ] o.a.s.c.c.ConnectionManager zkClient has connected
   [junit4]   2> 4036885 WARN  (NIOServerCxn.Factory:0.0.0.0/0.0.0.0:0) [    ] o.a.z.s.NIOServerCnxn caught end of stream exception
   [junit4]   2> EndOfStreamException: Unable to read additional data from client sessionid 0x16085c7910e0010, likely client has closed socket
   [junit4]   2> 	at org.apache.zookeeper.server.NIOServerCnxn.doIO(NIOServerCnxn.java:239)
   [junit4]   2> 	at org.apache.zookeeper.server.NIOServerCnxnFactory.run(NIOServerCnxnFactory.java:203)
   [junit4]   2> 	at java.lang.Thread.run(Thread.java:748)
   [junit4]   2> 4036886 INFO  (zkConnectionManagerCallback-7534-thread-1-processing-n:127.0.0.1:42777_solr) [n:127.0.0.1:42777_solr    ] o.a.s.c.c.ConnectionManager zkClient has connected
   [junit4]   2> 4036896 INFO  (TEST-TriggerIntegrationTest.testNodeAddedTrigger-seed#[BA6033656271A3FE]) [n:127.0.0.1:42777_solr    ] o.a.s.c.c.ZkStateReader Updated live nodes from ZooKeeper... (0) -> (3)
   [junit4]   2> 4036899 INFO  (TEST-TriggerIntegrationTest.testNodeAddedTrigger-seed#[BA6033656271A3FE]) [n:127.0.0.1:42777_solr    ] o.a.s.c.Overseer Overseer (id=null) closing
   [junit4]   2> 4036901 INFO  (TEST-TriggerIntegrationTest.testNodeAddedTrigger-seed#[BA6033656271A3FE]) [n:127.0.0.1:42777_solr    ] o.a.s.c.ZkController Register node as live in ZooKeeper:/live_nodes/127.0.0.1:42777_solr
   [junit4]   2> 4036903 INFO  (zkCallback-7505-thread-1) [    ] o.a.s.c.c.ZkStateReader Updated live nodes from ZooKeeper... (3) -> (4)
   [junit4]   2> 4036903 INFO  (zkCallback-7523-thread-1-processing-n:127.0.0.1:54485_solr) [n:127.0.0.1:54485_solr    ] o.a.s.c.c.ZkStateReader Updated live nodes from ZooKeeper... (3) -> (4)
   [junit4]   2> 4036903 INFO  (zkCallback-7493-thread-1-processing-n:127.0.0.1:60482_solr) [n:127.0.0.1:60482_solr    ] o.a.s.c.c.ZkStateReader Updated live nodes from ZooKeeper... (3) -> (4)
   [junit4]   2> 4036903 INFO  (zkCallback-7513-thread-1-processing-n:127.0.0.1:46598_solr) [n:127.0.0.1:46598_solr    ] o.a.s.c.c.ZkStateReader Updated live nodes from ZooKeeper... (3) -> (4)
   [junit4]   2> 4036906 INFO  (zkCallback-7533-thread-1-processing-n:127.0.0.1:42777_solr) [n:127.0.0.1:42777_solr    ] o.a.s.c.c.ZkStateReader Updated live nodes from ZooKeeper... (3) -> (4)
   [junit4]   2> 4037014 INFO  (TEST-TriggerIntegrationTest.testNodeAddedTrigger-seed#[BA6033656271A3FE]) [n:127.0.0.1:42777_solr    ] o.a.s.m.r.SolrJmxReporter JMX monitoring for 'solr_42777.solr.node' (registry 'solr.node') enabled at server: com.sun.jmx.mbeanserver.JmxMBeanServer@827c084
   [junit4]   2> 4037021 INFO  (TEST-TriggerIntegrationTest.testNodeAddedTrigger-seed#[BA6033656271A3FE]) [n:127.0.0.1:42777_solr    ] o.a.s.m.r.SolrJmxReporter JMX monitoring for 'solr_42777.solr.jvm' (registry 'solr.jvm') enabled at server: com.sun.jmx.mbeanserver.JmxMBeanServer@827c084
   [junit4]   2> 4037021 INFO  (TEST-TriggerIntegrationTest.testNodeAddedTrigger-seed#[BA6033656271A3FE]) [n:127.0.0.1:42777_solr    ] o.a.s.m.r.SolrJmxReporter JMX monitoring for 'solr_42777.solr.jetty' (registry 'solr.jetty') enabled at server: com.sun.jmx.mbeanserver.JmxMBeanServer@827c084
   [junit4]   2> 4037022 INFO  (TEST-TriggerIntegrationTest.testNodeAddedTrigger-seed#[BA6033656271A3FE]) [n:127.0.0.1:42777_solr    ] o.a.s.c.CorePropertiesLocator Found 0 core definitions underneath /export/home/jenkins/workspace/Lucene-Solr-7.x-Solaris/solr/build/solr-core/test/J1/temp/solr.cloud.autoscaling.TriggerIntegrationTest_BA6033656271A3FE-001/tempDir-001/node5/.
   [junit4]   2> 4037875 DEBUG (ScheduledTrigger-10882-thread-4) [n:127.0.0.1:60482_solr    ] o.a.s.c.a.NodeAddedTrigger Running NodeAddedTrigger node_added_trigger
   [junit4]   2> 4037875 DEBUG (ScheduledTrigger-10882-thread-4) [n:127.0.0.1:60482_solr    ] o.a.s.c.a.NodeAddedTrigger Found livenodes: 4
   [junit4]   2> 4037876 DEBUG (ScheduledTrigger-10882-thread-4) [n:127.0.0.1:60482_solr    ] o.a.s.c.a.NodeAddedTrigger Tracking new node: 127.0.0.1:42777_solr at time 1816220296304840
   [junit4]   2> 4038878 DEBUG (ScheduledTrigger-10882-thread-4) [n:127.0.0.1:60482_solr    ] o.a.s.c.a.NodeAddedTrigger Running NodeAddedTrigger node_added_trigger
   [junit4]   2> 4038878 DEBUG (ScheduledTrigger-10882-thread-4) [n:127.0.0.1:60482_solr    ] o.a.s.c.a.NodeAddedTrigger Found livenodes: 4
   [junit4]   2> 4038878 DEBUG (ScheduledTrigger-10882-thread-4) [n:127.0.0.1:60482_solr    ] o.a.s.c.a.NodeAddedTrigger NodeAddedTrigger node_added_trigger firing registered processor for nodes: [127.0.0.1:42777_solr] added at times [1816220296304840], now=1816221299157031
   [junit4]   2> 4038878 DEBUG (ScheduledTrigger-10882-thread-4) [n:127.0.0.1:60482_solr    ] o.a.s.c.a.ScheduledTriggers ++++++++ Cooldown inactive - processing event: {
   [junit4]   2>   "id":"673d7bd9858c8T3kqgpsm7ha78iv3lqnl03dq0z",
   [junit4]   2>   "source":"node_added_trigger",
   [junit4]   2>   "eventTime":1816220296304840,
   [junit4]   2>   "eventType":"NODEADDED",
   [junit4]   2>   "properties":{
   [junit4]   2>     "eventTimes":[1816220296304840],
   [junit4]   2>     "nodeNames":["127.0.0.1:42777_solr"]}}
   [junit4]   2> 4038880 INFO  (ScheduledTrigger-10882-thread-4) [n:127.0.0.1:60482_solr    ] o.a.s.c.a.SystemLogListener Collection .system does not exist, disabling logging.
   [junit4]   2> 4038881 DEBUG (AutoscalingActionExecutor-10883-thread-1-processing-n:127.0.0.1:60482_solr) [n:127.0.0.1:60482_solr    ] o.a.s.c.a.ScheduledTriggers -- processing actions for {
   [junit4]   2>   "id":"673d7bd9858c8T3kqgpsm7ha78iv3lqnl03dq0z",
   [junit4]   2>   "source":"node_added_trigger",
   [junit4]   2>   "eventTime":1816220296304840,
   [junit4]   2>   "eventType":"NODEADDED",
   [junit4]   2>   "properties":{
   [junit4]   2>     "eventTimes":[1816220296304840],
   [junit4]   2>     "_enqueue_time_":1816221299445938,
   [junit4]   2>     "nodeNames":["127.0.0.1:42777_solr"]}}
   [junit4]   2> 4038896 DEBUG (AutoscalingActionExecutor-10883-thread-1-processing-n:127.0.0.1:60482_solr) [n:127.0.0.1:60482_solr    ] o.a.s.c.a.ScheduledTriggers -- processing took 15 ms for event id=673d7bd9858c8T3kqgpsm7ha78iv3lqnl03dq0z
   [junit4]   2> 4038899 INFO  (qtp1412689619-33284) [n:127.0.0.1:42777_solr    ] o.a.s.s.HttpSolrCall [admin] webapp=null path=/admin/metrics params={prefix=CORE.coreName&wt=javabin&version=2&group=solr.core} status=0 QTime=0
   [junit4]   2> 4038901 INFO  (qtp1649040025-33222) [n:127.0.0.1:46598_solr    ] o.a.s.s.HttpSolrCall [admin] webapp=null path=/admin/metrics params={prefix=CORE.coreName&wt=javabin&version=2&group=solr.core} status=0 QTime=0
   [junit4]   2> 4038903 INFO  (qtp1263915564-33249) [n:127.0.0.1:54485_solr    ] o.a.s.s.HttpSolrCall [admin] webapp=null path=/admin/metrics params={prefix=CORE.coreName&wt=javabin&version=2&group=solr.core} status=0 QTime=0
   [junit4]   2> 4038905 INFO  (qtp458461685-33153) [n:127.0.0.1:60482_solr    ] o.a.s.s.HttpSolrCall [admin] webapp=null path=/admin/metrics params={prefix=CORE.coreName&wt=javabin&version=2&group=solr.core} status=0 QTime=0
   [junit4]   2> 4038905 DEBUG (qtp1412689619-33282) [n:127.0.0.1:42777_solr    ] o.a.s.c.a.AutoScalingHandler Verified autoscaling configuration
   [junit4]   2> 4038906 INFO  (qtp1412689619-33282) [n:127.0.0.1:42777_solr    ] o.a.s.s.HttpSolrCall [admin] webapp=null path=/admin/autoscaling params={wt=javabin&version=2} status=0 QTime=10
   [junit4]   2> 4038907 DEBUG (zkCallback-7493-thread-1-processing-n:127.0.0.1:60482_solr) [n:127.0.0.1:60482_solr    ] o.a.s.c.a.OverseerTriggerThread Refreshing /autoscaling.json with znode version 7
   [junit4]   2> 4038908 DEBUG (zkCallback-7493-thread-1-processing-n:127.0.0.1:60482_solr) [n:127.0.0.1:60482_solr    ] o.a.s.c.a.NodeAddedTrigger Initial livenodes: [127.0.0.1:54485_solr, 127.0.0.1:42777_solr, 127.0.0.1:60482_solr, 127.0.0.1:46598_solr]
   [junit4]   2> 4038908 DEBUG (zkCallback-7493-thread-1-processing-n:127.0.0.1:60482_solr) [n:127.0.0.1:60482_solr    ] o.a.s.c.a.NodeAddedTrigger NodeAddedTrigger node_added_trigger instantiated with properties: {event=nodeAdded, waitFor=1, actions=[{name=test, class=org.apache.solr.cloud.autoscaling.TriggerIntegrationTest$TestTriggerAction}], enabled=true}
   [junit4]   2> 4038909 DEBUG (OverseerAutoScalingTriggerThread-99226283980750854-127.0.0.1:60482_solr-n_0000000001) [n:127.0.0.1:60482_solr    ] o.a.s.c.a.OverseerTriggerThread Processed trigger updates upto znodeVersion 7
   [junit4]   2> 4038910 DEBUG (OverseerAutoScalingTriggerThread-99226283980750854-127.0.0.1:60482_solr-n_0000000001) [n:127.0.0.1:60482_solr    ] o.a.s.c.a.OverseerTriggerThread -- clean old nodeLost markers
   [junit4]   2> 4038911 DEBUG (OverseerAutoScalingTriggerThread-99226283980750854-127.0.0.1:60482_solr-n_0000000001) [n:127.0.0.1:60482_solr    ] o.a.s.c.a.OverseerTriggerThread Current znodeVersion 7, lastZnodeVersion 7
   [junit4]   2> 4039898 DEBUG (ScheduledTrigger-10882-thread-4) [n:127.0.0.1:60482_solr    ] o.a.s.c.a.NodeAddedTrigger Running NodeAddedTrigger node_added_trigger
   [junit4]   2> 4039898 DEBUG (ScheduledTrigger-10882-thread-4) [n:127.0.0.1:60482_solr    ] o.a.s.c.a.NodeAddedTrigger Found livenodes: 4
   [junit4]   2> 4040899 DEBUG (ScheduledTrigger-10882-thread-4) [n:127.0.0.1:60482_solr    ] o.a.s.c.a.NodeAddedTrigger Running NodeAddedTrigger node_added_trigger
   [junit4]   2> 4040899 DEBUG (ScheduledTrigger-10882-thread-4) [n:127.0.0.1:60482_solr    ] o.a.s.c.a.NodeAddedTrigger Found livenodes: 4
   [junit4]   2> 4040909 INFO  (TEST-TriggerIntegrationTest.testNodeAddedTrigger-seed#[BA6033656271A3FE]) [    ] o.a.s.SolrTestCaseJ4 ###Ending testNodeAddedTrigger
   [junit4]   2> 4041140 INFO  (TEST-TriggerIntegrationTest.testTriggerThrottling-seed#[BA6033656271A3FE]) [    ] o.a.s.SolrTestCaseJ4 ###Starting testTriggerThrottling
   [junit4]   2> 4041141 INFO  (TEST-TriggerIntegrationTest.testTriggerThrottling-seed#[BA6033656271A3FE]) [    ] o.a.s.c.a.TriggerIntegrationTest /autoscaling.json reset, new znode version 8
   [junit4]   2> 4041141 DEBUG (zkCallback-7493-thread-1-processing-n:127.0.0.1:60482_solr) [n:127.0.0.1:60482_solr    ] o.a.s.c.a.OverseerTriggerThread Refreshing /autoscaling.json with znode version 8
   [junit4]   2> 4041141 DEBUG (OverseerAutoScalingTriggerThread-99226283980750854-127.0.0.1:60482_solr-n_0000000001) [n:127.0.0.1:60482_solr    ] o.a.s.c.a.OverseerTriggerThread Processed trigger updates upto znodeVersion 8
   [junit4]   2> 4041146 DEBUG (OverseerAutoScalingTriggerThread-99226283980750854-127.0.0.1:60482_solr-n_0000000001) [n:127.0.0.1:60482_solr    ] o.a.s.c.a.OverseerTriggerThread -- clean old nodeLost markers
   [junit4]   2> 4041146 DEBUG (OverseerAutoScalingTriggerThread-99226283980750854-127.0.0.1:60482_solr-n_0000000001) [n:127.0.0.1:60482_solr    ] o.a.s.c.a.OverseerTriggerThread -- clean old nodeAdded markers
   [junit4]   2> 4041147 DEBUG (OverseerAutoScalingTriggerThread-99226283980750854-127.0.0.1:60482_solr-n_0000000001) [n:127.0.0.1:60482_solr    ] o.a.s.c.a.OverseerTriggerThread Current znodeVersion 8, lastZnodeVersion 8
   [junit4]   2> 4041151 INFO  (qtp1412689619-33283) [n:127.0.0.1:42777_solr    ] o.a.s.s.HttpSolrCall [admin] webapp=null path=/admin/metrics params={prefix=CORE.coreName&wt=javabin&version=2&group=solr.core} status=0 QTime=0
   [junit4]   2> 4041152 INFO  (qtp1649040025-33226) [n:127.0.0.1:46598_solr    ] o.a.s.s.HttpSolrCall [admin] webapp=null path=/admin/metrics params={prefix=CORE.coreName&wt=javabin&version=2&group=solr.core} status=0 QTime=0
   [junit4]   2> 4041153 INFO  (qtp1263915564-33252) [n:127.0.0.1:54485_solr    ] o.a.s.s.HttpSolrCall [admin] webapp=null path=/admin/metrics params={prefix=CORE.coreName&wt=javabin&version=2&group=solr.core} status=0 QTime=0
   [junit4]   2> 4041154 INFO  (qtp458461685-33157) [n:127.0.0.1:60482_solr    ] o.a.s.s.HttpSolrCall [admin] webapp=null path=/admin/metrics params={prefix=CORE.coreName&wt=javabin&version=2&group=solr.core} status=0 QTime=0
   [junit4]   2> 4041154 DEBUG (qtp1649040025-33225) [n:127.0.0.1:46598_solr    ] o.a.s.c.a.AutoScalingHandler Verified autoscaling configuration
   [junit4]   2> 4041155 INFO  (qtp1649040025-33225) [n:127.0.0.1:46598_solr    ] o.a.s.s.HttpSolrCall [admin] webapp=null path=/cluster/autoscaling params={wt=javabin&version=2} status=0 QTime=6
   [junit4]   2> 4041156 DEBUG (zkCallback-7493-thread-1-processing-n:127.0.0.1:60482_solr) [n:127.0.0.1:60482_solr    ] o.a.s.c.a.OverseerTriggerThread Refreshing /autoscaling.json with znode version 9
   [junit4]   2> 4041156 DEBUG (zkCallback-7493-thread-1-processing-n:127.0.0.1:60482_solr) [n:127.0.0.1:60482_solr    ] o.a.s.c.a.NodeAddedTrigger Initial livenodes: [127.0.0.1:54485_solr, 127.0.0.1:42777_solr, 127.0.0.1:60482_solr, 127.0.0.1:46598_solr]
   [junit4]   2> 4041157 DEBUG (zkCallback-7493-thread-1-processing-n:127.0.0.1:60482_solr) [n:127.0.0.1:60482_solr    ] o.a.s.c.a.NodeAddedTrigger NodeAddedTrigger node_added_trigger1 instantiated with properties: {event=nodeAdded, waitFor=0, actions=[{name=test, class=org.apache.solr.cloud.autoscaling.TriggerIntegrationTest$ThrottlingTesterAction}], enabled=true}
   [junit4]   2> 4041157 DEBUG (OverseerAutoScalingTriggerThread-99226283980750854-127.0.0.1:60482_solr-n_0000000001) [n:127.0.0.1:60482_solr    ] o.a.s.c.a.OverseerTriggerThread Processed trigger updates upto znodeVersion 9
   [junit4]   2> 4041158 INFO  (qtp1412689619-33287) [n:127.0.0.1:42777_solr    ] o.a.s.s.HttpSolrCall [admin] webapp=null path=/admin/metrics params={prefix=CORE.coreName&wt=javabin&version=2&group=solr.core} status=0 QTime=0
   [junit4]   2> 4041159 INFO  (qtp1649040025-33221) [n:127.0.0.1:46598_solr    ] o.a.s.s.HttpSolrCall [admin] webapp=null path=/admin/metrics params={prefix=CORE.coreName&wt=javabin&version=2&group=solr.core} status=0 QTime=0
   [junit4]   2> 4041160 INFO  (OverseerAutoScalingTriggerThread-99226283980750854-127.0.0.1:60482_solr-n_0000000001) [n:127.0.0.1:60482_solr    ] o.a.s.c.a.TriggerIntegrationTest TestTriggerAction init
   [junit4]   2> 4041160 INFO  (qtp1263915564-33251) [n:127.0.0.1:54485_solr    ] o.a.s.s.HttpSolrCall [admin] webapp=null path=/admin/metrics params={prefix=CORE.coreName&wt=javabin&version=2&group=solr.core} status=0 QTime=0
   [junit4]   2> 4041160 DEBUG (OverseerAutoScalingTriggerThread-99226283980750854-127.0.0.1:60482_solr-n_0000000001) [n:127.0.0.1:60482_solr    ] o.a.s.c.a.OverseerTriggerThread -- clean old nodeLost markers
   [junit4]   2> 4041161 DEBUG (OverseerAutoScalingTriggerThread-99226283980750854-127.0.0.1:60482_solr-n_0000000001) [n:127.0.0.1:60482_solr    ] o.a.s.c.a.OverseerTriggerThread Current znodeVersion 9, lastZnodeVersion 9
   [junit4]   2> 4041161 INFO  (qtp458461685-33158) [n:127.0.0.1:60482_solr    ] o.a.s.s.HttpSolrCall [admin] webapp=null path=/admin/metrics params={prefix=CORE.coreName&wt=javabin&version=2&group=solr.core} status=0 QTime=0
   [junit4]   2> 4041161 DEBUG (ScheduledTrigger-10882-thread-1) [n:127.0.0.1:60482_solr    ] o.a.s.c.a.NodeAddedTrigger Running NodeAddedTrigger node_added_trigger1
   [junit4]   2> 4041161 DEBUG (qtp1263915564-33250) [n:127.0.0.1:54485_solr    ] o.a.s.c.a.AutoScalingHandler Verified autoscaling configuration
   [junit4]   2> 4041161 DEBUG (ScheduledTrigger-10882-thread-1) [n:127.0.0.1:60482_solr    ] o.a.s.c.a.NodeAddedTrigger Found livenodes: 4
   [junit4]   2> 4041162 INFO  (qtp1263915564-33250) [n:127.0.0.1:54485_solr    ] o.a.s.s.HttpSolrCall [admin] webapp=null path=/cluster/autoscaling params={wt=javabin&version=2} status=0 QTime=6
   [junit4]   2> 4041163 DEBUG (zkCallback-7493-thread-1-processing-n:127.0.0.1:60482_solr) [n:127.0.0.1:60482_solr    ] o.a.s.c.a.OverseerTriggerThread Refreshing /autoscaling.json with znode version 10
   [junit4]   2> 4041163 DEBUG (zkCallback-7493-thread-1-processing-n:127.0.0.1:60482_solr) [n:127.0.0.1:60482_solr    ] o.a.s.c.a.NodeAddedTrigger Initial livenodes: [127.0.0.1:54485_solr, 127.0.0.1:42777_solr, 127.0.0.1:60482_solr, 127.0.0.1:46598_solr]
   [junit4]   2> 4041163 DEBUG (zkCallback-7493-thread-1-processing-n:127.0.0.1:60482_solr) [n:127.0.0.1:60482_solr    ] o.a.s.c.a.NodeAddedTrigger NodeAddedTrigger node_added_trigger2 instantiated with properties: {event=nodeAdded, waitFor=0, actions=[{name=test, class=org.apache.solr.cloud.autoscaling.TriggerIntegrationTest$ThrottlingTesterAction}], enabled=true}
   [junit4]   2> 4041164 DEBUG (zkCallback-7493-thread-1-processing-n:127.0.0.1:60482_solr) [n:127.0.0.1:60482_solr    ] o.a.s.c.a.NodeAddedTrigger Initial livenodes: [127.0.0.1:54485_solr, 127.0.0.1:42777_solr, 127.0.0.1:60482_solr, 127.0.0.1:46598_solr]
   [junit4]   2> 4041164 DEBUG (zkCallback-7493-thread-1-processing-n:127.0.0.1:60482_solr) [n:127.0.0.1:60482_solr    ] o.a.s.c.a.NodeAddedTrigger NodeAddedTrigger node_added_trigger1 instantiated with properties: {event=nodeAdded, waitFor=0, actions=[{name=test, class=org.apache.solr.cloud.autoscaling.TriggerIntegrationTest$ThrottlingTesterAction}], enabled=true}
   [junit4]   2> 4041164 DEBUG (OverseerAutoScalingTriggerThread-99226283980750854-127.0.0.1:60482_solr-n_0000000001) [n:127.0.0.1:60482_solr    ] o.a.s.c.a.OverseerTriggerThread Processed trigger updates upto znodeVersion 10
   [junit4]   2> 4041166 INFO  (OverseerAutoScalingTriggerThread-99226283980750854-127.0.0.1:60482_solr-n_0000000001) [n:127.0.0.1:60482_solr    ] o.a.s.c.a.TriggerIntegrationTest TestTriggerAction init
   [junit4]   2> 4041167 INFO  (TEST-TriggerIntegrationTest.testTriggerThrottling-seed#[BA6033656271A3FE]) [    ] o.e.j.s.Server jetty-9.3.20.v20170531
   [junit4]   2> 4041167 DEBUG (OverseerAutoScalingTriggerThread-99226283980750854-127.0.0.1:60482_solr-n_0000000001) [n:127.0.0.1:60482_solr    ] o.a.s.c.a.OverseerTriggerThread -- clean old nodeLost markers
   [junit4]   2> 4041167 DEBUG (OverseerAutoScalingTriggerThread-99226283980750854-127.0.0.1:60482_solr-n_0000000001) [n:127.0.0.1:60482_solr    ] o.a.s.c.a.OverseerTriggerThread Current znodeVersion 10, lastZnodeVersion 10
   [junit4]   2> 4041168 DEBUG (ScheduledTrigger-10882-thread-4) [n:127.0.0.1:60482_solr    ] o.a.s.c.a.NodeAddedTrigger Running NodeAddedTrigger node_added_trigger2
   [junit4]   2> 4041168 DEBUG (ScheduledTrigger-10882-thread-4) [n:127.0.0.1:60482_solr    ] o.a.s.c.a.NodeAddedTrigger Found livenodes: 4
   [junit4]   2> 4041168 INFO  (TEST-TriggerIntegrationTest.testTriggerThrottling-seed#[BA6033656271A3FE]) [    ] o.e.j.s.h.ContextHandler Started o.e.j.s.ServletContextHandler@5c5575a7{/solr,null,AVAILABLE}
   [junit4]   2> 4041169 INFO  (TEST-TriggerIntegrationTest.testTriggerThrottling-seed#[BA6033656271A3FE]) [    ] o.e.j.s.AbstractConnector Started ServerConnector@2792972d{HTTP/1.1,[http/1.1]}{127.0.0.1:59353}
   [junit4]   2> 4041169 INFO  (TEST-TriggerIntegrationTest.testTriggerThrottling-seed#[BA6033656271A3FE]) [    ] o.e.j.s.Server Started @4047072ms
   [junit4]   2> 4041169 INFO  (TEST-TriggerIntegrationTest.testTriggerThrottling-seed#[BA6033656271A3FE]) [    ] o.a.s.c.s.e.JettySolrRunner Jetty properties: {hostContext=/solr, hostPort=59353}
   [junit4]   2> 4041172 ERROR (TEST-TriggerIntegrationTest.testTriggerThrottling-seed#[BA6033656271A3FE]) [    ] o.a.s.u.StartupLoggingUtils Missing Java Option solr.log.dir. Logging may be missing or incomplete.
   [junit4]   2> 4041172 INFO  (TEST-TriggerIntegrationTest.testTriggerThrottling-seed#[BA6033656271A3FE]) [    ] o.a.s.s.SolrDispatchFilter  ___      _       Welcome to Apache Solr™ version 7.3.0
   [junit4]   2> 4041172 INFO  (TEST-TriggerIntegrationTest.testTriggerThrottling-seed#[BA6033656271A3FE]) [    ] o.a.s.s.SolrDispatchFilter / __| ___| |_ _   Starting in cloud mode on port null
   [junit4]   2> 4041172 INFO  (TEST-TriggerIntegrationTest.testTriggerThrottling-seed#[BA6033656271A3FE]) [    ] o.a.s.s.SolrDispatchFilter \__ \/ _ \ | '_|  Install dir: null
   [junit4]   2> 4041172 INFO  (TEST-TriggerIntegrationTest.testTriggerThrottling-seed#[BA6033656271A3FE]) [    ] o.a.s.s.SolrDispatchFilter |___/\___/_|_|    Start time: 2017-12-23T23:49:24.208Z
   [junit4]   2> 4041173 INFO  (zkConnectionManagerCallback-7538-thread-1) [    ] o.a.s.c.c.ConnectionManager zkClient has connected
   [junit4]   2> 4041174 INFO  (TEST-TriggerIntegrationTest.testTriggerThrottling-seed#[BA6033656271A3FE]) [    ] o.a.s.s.SolrDispatchFilter solr.xml found in ZooKeeper. Loading...
   [junit4]   2> 4041181 INFO  (TEST-TriggerIntegrationTest.testTriggerThrottling-seed#[BA6033656271A3FE]) [    ] o.a.s.c.ZkContainer Zookeeper client=127.0.0.1:61580/solr
   [junit4]   2> 4041182 INFO  (zkConnectionManagerCallback-7542-thread-1) [    ] o.a.s.c.c.ConnectionManager zkClient has connected
   [junit4]   2> 4041185 INFO  (zkConnectionManagerCallback-7544-thread-1-processing-n:127.0.0.1:59353_solr) [n:127.0.0.1:59353_solr    ] o.a.s.c.c.ConnectionManager zkClient has connected
   [junit4]   2> 4041194 INFO  (TEST-TriggerIntegrationTest.testTriggerThrottling-seed#[BA6033656271A3FE]) [n:127.0.0.1:59353_solr    ] o.a.s.c.c.ZkStateReader Updated live nodes from ZooKeeper... (0) -> (4)
   [junit4]   2> 4041197 INFO  (TEST-TriggerIntegrationTest.testTriggerThrottling-seed#[BA6033656271A3FE]) [n:127.0.0.1:59353_solr    ] o.a.s.c.Overseer Overseer (id=null) closing
   [junit4]   2> 4041199 INFO  (TEST-TriggerIntegrationTest.testTriggerThrottling-seed#[BA6033656271A3FE]) [n:127.0.0.1:59353_solr    ] o.a.s.c.ZkController Register node as live in ZooKeeper:/live_nodes/127.0.0.1:59353_solr
   [junit4]   2> 4041201 INFO  (zkCallback-7493-thread-1-processing-n:127.0.0.1:60482_solr) [n:127.0.0.1:60482_solr    ] o.a.s.c.c.ZkStateReader Updated live nodes from ZooKeeper... (4) -> (5)
   [junit4]   2> 4041201 INFO  (zkCallback-7533-thread-1-processing-n:127.0.0.1:42777_solr) [n:127.0.0.1:42777_solr    ] o.a.s.c.c.ZkStateReader Updated live nodes from ZooKeeper... (4) -> (5)
   [junit4]   2> 4041201 INFO  (zkCallback-7523-thread-1-processing-n:127.0.0.1:54485_solr) [n:127.0.0.1:54485_solr    ] o.a.s.c.c.ZkStateReader Updated live nodes from ZooKeeper... (4) -> (5)
   [junit4]   2> 4041201 INFO  (zkCallback-7505-thread-1) [    ] o.a.s.c.c.ZkStateReader Updated live nodes from ZooKeeper... (4) -> (5)
   [junit4]   2> 4041202 INFO  (zkCallback-7513-thread-1-processing-n:127.0.0.1:46598_solr) [n:127.0.0.1:46598_solr    ] o.a.s.c.c.ZkStateReader Updated live nodes from ZooKeeper... (4) -> (5)
   [junit4]   2> 4041204 INFO  (zkCallback-7543-thread-1-processing-n:127.0.0.1:59353_solr) [n:127.0.0.1:59353_solr    ] o.a.s.c.c.ZkStateReader Updated live nodes from ZooKeeper... (4) -> (5)
   [junit4]   2> 4041313 INFO  (TEST-TriggerIntegrationTest.testTriggerThrottling-seed#[BA6033656271A3FE]) [n:127.0.0.1:59353_solr    ] o.a.s.m.r.SolrJmxReporter JMX monitoring for 'solr_59353.solr.node' (registry 'solr.node') enabled at server: com.sun.jmx.mbeanserver.JmxMBeanServer@827c084
   [junit4]   2> 4041320 INFO  (TEST-TriggerIntegrationTest.testTriggerThrottling-seed#[BA6033656271A3FE]) [n:127.0.0.1:59353_solr    ] o.a.s.m.r.SolrJmxReporter JMX monitoring for 'solr_59353.solr.jvm' (registry 'solr.jvm') enabled at server: com.sun.jmx.mbeanserver.JmxMBeanServer@827c084
   [junit4]   2> 4041321 INFO  (TEST-TriggerIntegrationTest.testTriggerThrottling-seed#[BA6033656271A3FE]) [n:127.0.0.1:59353_solr    ] o.a.s.m.r.SolrJmxReporter JMX monitoring for 'solr_59353.solr.jetty' (registry 'solr.jetty') enabled at server: com.sun.jmx.mbeanserver.JmxMBeanServer@827c084
   [junit4]   2> 4041321 INFO  (TEST-TriggerIntegrationTest.testTriggerThrottling-seed#[BA6033656271A3FE]) [n:127.0.0.1:59353_solr    ] o.a.s.c.CorePropertiesLocator Found 0 core definitions underneath /export/home/jenkins/workspace/Lucene-Solr-7.x-Solaris/solr/build/solr-core/test/J1/temp/solr.cloud.autoscaling.TriggerIntegrationTest_BA6033656271A3FE-001/tempDir-001/node6/.
   [junit4]   2> 4042176 DEBUG (ScheduledTrigger-10882-thread-3) [n:127.0.0.1:60482_solr    ] o.a.s.c.a.NodeAddedTrigger Running NodeAddedTrigger node_added_trigger1
   [junit4]   2> 4042176 DEBUG (ScheduledTrigger-10882-thread-3) [n:127.0.0.1:60482_solr    ] o.a.s.c.a.NodeAddedTrigger Found livenodes: 5
   [junit4]   2> 4042181 DEBUG (ScheduledTrigger-10882-thread-1) [n:127.0.0.1:60482_solr    ] o.a.s.c.a.NodeAddedTrigger Running NodeAddedTrigger node_added_trigger2
   [junit4]   2> 4042181 DEBUG (ScheduledTrigger-10882-thread-1) [n:127.0.0.1:60482_solr    ] o.a.s.c.a.NodeAddedTrigger Found livenodes: 5
   [junit4]   2> 4042181 DEBUG (ScheduledTrigger-10882-thread-3) [n:127.0.0.1:60482_solr    ] o.a.s.c.a.NodeAddedTrigger Tracking new node: 127.0.0.1:59353_solr at time 1816224602920017
   [junit4]   2> 4042182 DEBUG (ScheduledTrigger-10882-thread-3) [n:127.0.0.1:60482_solr    ] o.a.s.c.a.NodeAddedTrigger NodeAddedTrigger node_added_trigger1 firing registered processor for nodes: [127.0.0.1:59353_solr] added at times [1816224602920017], now=1816224603432309
   [junit4]   2> 4042181 DEBUG (ScheduledTrigger-10882-thread-1) [n:127.0.0.1:60482_solr    ] o.a.s.c.a.NodeAddedTrigger Tracking new node: 127.0.0.1:59353_solr at time 1816224603217656
   [junit4]   2> 4042182 DEBUG (ScheduledTrigger-10882-thread-3) [n:127.0.0.1:60482_solr    ] o.a.s.c.a.ScheduledTriggers ++++++++ Cooldown inactive - processing event: {
   [junit4]   2>   "id":"673d8be4a1451T3kqgpsm7ha78iv3lqnl03dq11",
   [junit4]   2>   "source":"node_added_trigger1",
   [junit4]   2>   "eventTime":1816224602920017,
   [junit4]   2>   "eventType":"NODEADDED",
   [junit4]   2>   "properties":{
   [junit4]   2>     "eventTimes":[1816224602920017],
   [junit4]   2>     "nodeNames":["127.0.0.1:59353_solr"]}}
   [junit4]   2> 4042182 DEBUG (ScheduledTrigger-10882-thread-1) [n:127.0.0.1:60482_solr    ] o.a.s.c.a.NodeAddedTrigger NodeAddedTrigger node_added_trigger2 firing registered processor for nodes: [127.0.0.1:59353_solr] added at times [1816224603217656], now=1816224603731447
   [junit4]   2> 4042182 DEBUG (ScheduledTrigger-10882-thread-1) [n:127.0.0.1:60482_solr    ] o.a.s.c.a.ScheduledTriggers ++++++++ Cooldown inactive - processing event: {
   [junit4]   2>   "id":"673d8be4e9ef8T3kqgpsm7ha78iv3lqnl03dq12",
   [junit4]   2>   "source":"node_added_trigger2",
   [junit4]   2>   "eventTime":1816224603217656,
   [junit4]   2>   "eventType":"NODEADDED",
   [junit4]   2>   "properties":{
   [junit4]   2>     "eventTimes":[1816224603217656],
   [junit4]   2>     "nodeNames":["127.0.0.1:59353_solr"]}}
   [junit4]   2> 4042183 INFO  (ScheduledTrigger-10882-thread-1) [n:127.0.0.1:60482_solr    ] o.a.s.c.a.SystemLogListener Collection .system does not exist, disabling logging.
   [junit4]   2> 4042184 INFO  (ScheduledTrigger-10882-thread-3) [n:127.0.0.1:60482_solr    ] o.a.s.c.a.SystemLogListener Collection .system does not exist, disabling logging.
   [junit4]   2> 4042184 DEBUG (AutoscalingActionExecutor-10883-thread-1-processing-n:127.0.0.1:60482_solr) [n:127.0.0.1:60482_solr    ] o.a.s.c.a.ScheduledTriggers -- processing actions for {
   [junit4]   2>   "id":"673d8be4a1451T3kqgpsm7ha78iv3lqnl03dq11",
   [junit4]   2>   "source":"node_added_trigger1",
   [junit4]   2>   "eventTime":1816224602920017,
   [junit4]   2>   "eventType":"NODEADDED",
   [junit4]   2>   "properties":{
   [junit4]   2>     "eventTimes":[1816224602920017],
   [junit4]   2>     "_enqueue_time_":1816224603890775,
   [junit4]   2>     "nodeNames":["127.0.0.1:59353_solr"]}}
   [junit4]   2> 4042185 INFO  (AutoscalingActionExecutor-10883-thread-1-processing-n:127.0.0.1:60482_solr) [n:127.0.0.1:60482_solr    ] o.a.s.c.a.TriggerIntegrationTest action executed from node_added_trigger1
   [junit4]   2> 4042188 DEBUG (AutoscalingActionExecutor-10883-thread-1-processing-n:127.0.0.1:60482_solr) [n:127.0.0.1:60482_solr    ] o.a.s.c.a.ScheduledTriggers -- processing took 4 ms for event id=673d8be4a1451T3kqgpsm7ha78iv3lqnl03dq11
   [junit4]   2> 4043188 DEBUG (ScheduledTrigger-10882-thread-1) [n:127.0.0.1:60482_solr    ] o.a.s.c.a.NodeAddedTrigger Running NodeAddedTrigger node_added_trigger2
   [junit4]   2> 4043188 DEBUG (ScheduledTrigger-10882-thread-1) [n:127.0.0.1:60482_solr    ] o.a.s.c.a.NodeAddedTrigger Found livenodes: 5
   [junit4]   2> 4043188 DEBUG (ScheduledTrigger-10882-thread-1) [n:127.0.0.1:60482_solr    ] o.a.s.c.a.NodeAddedTrigger NodeAddedTrigger node_added_trigger2 firing registered processor for nodes: [127.0.0.1:59353_solr] added at times [1816224603217656], now=1816225610121145
   [junit4]   2> 4043188 DEBUG (ScheduledTrigger-10882-thread-1) [n:127.0.0.1:60482_solr    ] o.a.s.c.a.ScheduledTriggers -------- Cooldown period - rejecting event: {
   [junit4]   2>   "id":"673d8be4e9ef8T3kqgpsm7ha78iv3lqnl03dq15",
   [junit4]   2>   "source":"node_added_trigger2",
   [junit4]   2>   "eventTime":1816224603217656,
   [junit4]   2>   "eventType":"NODEADDED",
   [junit4]   2>   "properties":{
   [junit4]   2>     "eventTimes":[1816224603217656],
   [junit4]   2>     "nodeNames":["127.0.0.1:59353_solr"]}}
   [junit4]   2> 4043188 DEBUG (ScheduledTrigger-10882-thread-1) [n:127.0.0.1:60482_solr    ] o.a.s.c.a.NodeAddedTrigger Running NodeAddedTrigger node_added_trigger1
   [junit4]   2> 4043188 DEBUG (ScheduledTrigger-10882-thread-1) [n:127.0.0.1:60482_solr    ] o.a.s.c.a.NodeAddedTrigger Found livenodes: 5
   [junit4]   2> 4044189 DEBUG (ScheduledTrigger-10882-thread-4) [n:127.0.0.1:60482_solr    ] o.a.s.c.a.NodeAddedTrigger Running NodeAddedTrigger node_added_trigger2
   [junit4]   2> 4044189 DEBUG (ScheduledTrigger-10882-thread-2) [n:127.0.0.1:60482_solr    ] o.a.s.c.a.NodeAddedTrigger Running NodeAddedTrigger node_added_trigger1
   [junit4]   2> 4044190 DEBUG (ScheduledTrigger-10882-thread-2) [n:127.0.0.1:60482_solr    ] o.a.s.c.a.NodeAddedTrigger Found livenodes: 5
   [junit4]   2> 4044190 DEBUG (ScheduledTrigger-10882-thread-4) [n:127.0.0.1:60482_solr    ] o.a.s.c.a.NodeAddedTrigger Found livenodes: 5
   [junit4]   2> 4044190 DEBUG (ScheduledTrigger-10882-thread-4) [n:127.0.0.1:60482_solr    ] o.a.s.c.a.NodeAddedTrigger NodeAddedTrigger node_added_trigger2 firing registered processor for nodes: [127.0.0.1:59353_solr] added at times [1816224603217656], now=1816226612181575
   [junit4]   2> 4044190 DEBUG (ScheduledTrigger-10882-thread-4) [n:127.0.0.1:60482_solr    ] o.a.s.c.a.ScheduledTriggers -------- Cooldown period - rejecting event: {
   [junit4]   2>   "id":"673d8be4e9ef8T3kqgpsm7ha78iv3lqnl03dq16",
   [junit4]   2>   "source":"node_added_trigger2",
   [junit4]   2>   "eventTime":1816224603217656,
   [junit4]   2>   "eventType":"NODEADDED",
   [junit4]   2>   "properties":{
   [junit4]   2>     "eventTimes":[1816224603217656],
   [junit4]   2>     "nodeNames":["127.0.0.1:59353_solr"]}}
   [junit4]   2> 4045194 DEBUG (ScheduledTrigger-10882-thread-2) [n:127.0.0.1:60482_solr    ] o.a.s.c.a.NodeAddedTrigger Running NodeAddedTrigger node_added_trigger1
   [junit4]   2> 4045194 DEBUG (ScheduledTrigger-10882-thread-1) [n:127.0.0.1:60482_solr    ] o.a.s.c.a.NodeAddedTrigger Running NodeAddedTrigger node_added_trigger2
   [junit4]   2> 4045195 DEBUG (ScheduledTrigger-10882-thread-1) [n:127.0.0.1:60482_solr    ] o.a.s.c.a.Nod

[...truncated too long message...]

essing-n:127.0.0.1:55954_solr) [n:127.0.0.1:55954_solr    ] o.a.s.c.c.ZkStateReader ZooKeeper watch triggered, but Solr cannot talk to ZK: [KeeperErrorCode = Session expired for /live_nodes]
   [junit4]   2> 4177198 INFO  (jetty-closer-7478-thread-2) [    ] o.e.j.s.h.ContextHandler Stopped o.e.j.s.ServletContextHandler@20536a5a{/solr,null,UNAVAILABLE}
   [junit4]   2> 4177200 ERROR (SUITE-TriggerIntegrationTest-seed#[BA6033656271A3FE]-worker) [    ] o.a.z.s.ZooKeeperServer ZKShutdownHandler is not registered, so ZooKeeper server won't take any action on ERROR or SHUTDOWN server state changes
   [junit4]   2> 4177201 INFO  (SUITE-TriggerIntegrationTest-seed#[BA6033656271A3FE]-worker) [    ] o.a.s.c.ZkTestServer connecting to 127.0.0.1:61580 61580
   [junit4]   2> 4188035 INFO  (Thread-7456) [    ] o.a.s.c.ZkTestServer connecting to 127.0.0.1:61580 61580
   [junit4]   2> 4188048 WARN  (Thread-7456) [    ] o.a.s.c.ZkTestServer Watch limit violations: 
   [junit4]   2> Maximum concurrent create/delete watches above limit:
   [junit4]   2> 
   [junit4]   2> 	20	/solr/aliases.json
   [junit4]   2> 	20	/solr/clusterprops.json
   [junit4]   2> 	19	/solr/security.json
   [junit4]   2> 	3	/solr/configs/conf
   [junit4]   2> 
   [junit4]   2> Maximum concurrent data watches above limit:
   [junit4]   2> 
   [junit4]   2> 	26	/solr/collections/testMetricTrigger/state.json
   [junit4]   2> 	20	/solr/clusterstate.json
   [junit4]   2> 	6	/solr/autoscaling.json
   [junit4]   2> 	3	/solr/overseer_elect/election/99226283980750881-127.0.0.1:55954_solr-n_0000000009
   [junit4]   2> 	2	/solr/overseer_elect/election/99226283980750884-127.0.0.1:57557_solr-n_0000000010
   [junit4]   2> 	2	/solr/overseer_elect/election/99226283980750862-127.0.0.1:54485_solr-n_0000000003
   [junit4]   2> 	2	/solr/overseer_elect/election/99226283980750865-127.0.0.1:42777_solr-n_0000000004
   [junit4]   2> 	2	/solr/overseer_elect/election/99226283980750896-127.0.0.1:41195_solr-n_0000000014
   [junit4]   2> 
   [junit4]   2> Maximum concurrent children watches above limit:
   [junit4]   2> 
   [junit4]   2> 	20	/solr/live_nodes
   [junit4]   2> 	20	/solr/collections
   [junit4]   2> 	6	/solr/overseer/queue-work
   [junit4]   2> 	6	/solr/autoscaling/events/.auto_add_replicas
   [junit4]   2> 	6	/solr/overseer/queue
   [junit4]   2> 	6	/solr/overseer/collection-queue-work
   [junit4]   2> 	3	/solr/autoscaling/events/node_added_trigger
   [junit4]   2> 	2	/solr/autoscaling/events/node_lost_trigger
   [junit4]   2> 
   [junit4]   2> NOTE: leaving temporary files on disk at: /export/home/jenkins/workspace/Lucene-Solr-7.x-Solaris/solr/build/solr-core/test/J1/temp/solr.cloud.autoscaling.TriggerIntegrationTest_BA6033656271A3FE-001
   [junit4]   2> NOTE: test params are: codec=Asserting(Lucene70): {id=PostingsFormat(name=Memory), x_s=PostingsFormat(name=Direct)}, docValues:{_version_=DocValuesFormat(name=Lucene70)}, maxPointsInLeafNode=1965, maxMBSortInHeap=6.457579397827075, sim=RandomSimilarity(queryNorm=true): {}, locale=sl, timezone=America/Mexico_City
   [junit4]   2> NOTE: SunOS 5.11 amd64/Oracle Corporation 1.8.0_152 (64-bit)/cpus=3,threads=1,free=159538136,total=518979584
   [junit4]   2> NOTE: All tests run in this JVM: [TestFastWriter, TestXmlQParser, AliasIntegrationTest, TestBM25SimilarityFactory, TestSuggestSpellingConverter, TestGraphTermsQParserPlugin, DOMUtilTest, TestShardHandlerFactory, TestCoreContainer, CdcrUpdateLogTest, LeaderFailoverAfterPartitionTest, TestOnReconnectListenerSupport, DirectSolrSpellCheckerTest, AnalyticsMergeStrategyTest, TestInPlaceUpdatesStandalone, TestFastOutputStream, DeleteStatusTest, TestSchemaVersionResource, TermsComponentTest, CustomCollectionTest, TestStressReorder, TestDocSet, TestRandomFaceting, DocValuesMultiTest, TestReRankQParserPlugin, PKIAuthenticationIntegrationTest, HdfsTlogReplayBufferedWhileIndexingTest, OverseerTaskQueueTest, SystemInfoHandlerTest, CoreAdminHandlerTest, TestHdfsUpdateLog, TestNestedDocsSort, OpenCloseCoreStressTest, TestSlowCompositeReaderWrapper, TestSolrFieldCacheBean, TestLMJelinekMercerSimilarityFactory, ShardSplitTest, LegacyCloudClusterPropTest, SolrCoreCheckLockOnStartupTest, BlockCacheTest, RestartWhileUpdatingTest, TestRTGBase, TestSolrConfigHandler, HdfsAutoAddReplicasIntegrationTest, TestStressUserVersions, BasicFunctionalityTest, TestSolr4Spatial2, TestCloudManagedSchema, PingRequestHandlerTest, SolrJmxReporterTest, TestCoreBackup, ActionThrottleTest, AddBlockUpdateTest, TestRandomCollapseQParserPlugin, TestCloudPivotFacet, TestRestoreCore, DistributedFacetExistsSmallTest, DistanceUnitsTest, TestMultiWordSynonyms, TestExclusionRuleCollectionAccess, TestCloudRecovery, TestReload, CollectionStateFormat2Test, OverseerCollectionConfigSetProcessorTest, FileUtilsTest, TestHashPartitioner, TestValueSourceCache, TestRetrieveFieldsOptimizer, PropertiesRequestHandlerTest, MoveReplicaHDFSTest, TestPartialUpdateDeduplication, MoreLikeThisHandlerTest, MergeStrategyTest, ShufflingReplicaListTransformerTest, HdfsNNFailoverTest, CachingDirectoryFactoryTest, SOLR749Test, NodeLostTriggerTest, ConnectionManagerTest, AutoscalingHistoryHandlerTest, FullSolrCloudDistribCmdsTest, TestSolrConfigHandlerConcurrent, UpdateRequestProcessorFactoryTest, TestLockTree, CloudExitableDirectoryReaderTest, DistributedFacetSimpleRefinementLongTailTest, LeaderInitiatedRecoveryOnCommitTest, TestGroupingSearch, CursorMarkTest, AutoAddReplicasPlanActionTest, TestLeaderInitiatedRecoveryThread, TestSkipOverseerOperations, TestRandomFlRTGCloud, TestConfigOverlay, TestLargeCluster, ExternalFileFieldSortTest, BlobRepositoryCloudTest, TestZkAclsWithHadoopAuth, TestSimpleQParserPlugin, WrapperMergePolicyFactoryTest, BadCopyFieldTest, TestIndexSearcher, TestLegacyFieldCache, TestConfigSetsAPIExclusivity, StatelessScriptUpdateProcessorFactoryTest, SolrCoreTest, FieldMutatingUpdateProcessorTest, TestElisionMultitermQuery, TestManagedSynonymFilterFactory, BufferStoreTest, TestSSLRandomization, SolrPluginUtilsTest, SolrCloudExampleTest, SpellCheckCollatorWithCollapseTest, TestFieldResource, TestSystemIdResolver, LeaderElectionIntegrationTest, AssignTest, SimpleFacetsTest, RequestLoggingTest, SuggestComponentContextFilterQueryTest, SpellingQueryConverterTest, ZkFailoverTest, TestFreeTextSuggestions, ChaosMonkeyNothingIsSafeWithPullReplicasTest, TestDistributedMissingSort, DocValuesNotIndexedTest, TestSimDistributedQueue, ChaosMonkeySafeLeaderTest, HttpPartitionTest, TestDistribDocBasedVersion, TriLevelCompositeIdRoutingTest, ClassificationUpdateProcessorFactoryTest, DistributedQueryComponentCustomSortTest, TestDocBasedVersionConstraints, TestFieldTypeResource, SolrIndexSplitterTest, SSLMigrationTest, TestBadConfig, TestApiFramework, TestStressLiveNodes, TestUniqueKeyFieldResource, TestJavabinTupleStreamParser, HighlighterMaxOffsetTest, TestOrdValues, LukeRequestHandlerTest, TestManagedSchema, DebugComponentTest, TestCustomDocTransformer, DateRangeFieldTest, ConcurrentDeleteAndCreateCollectionTest, TestMaxTokenLenTokenizer, DistribDocExpirationUpdateProcessorTest, ZkStateWriterTest, GraphQueryTest, DistributedFacetPivotSmallTest, DocumentBuilderTest, DistributedMLTComponentTest, TestPerFieldSimilarity, TestFieldCacheVsDocValues, TestRemoteStreaming, MultiThreadedOCPTest, SmileWriterTest, TestLRUCache, TestManagedResource, TestDynamicLoading, TestZkChroot, TestInitQParser, HdfsSyncSliceTest, TestFoldingMultitermQuery, TestMultiValuedNumericRangeQuery, CoreAdminRequestStatusTest, SoftAutoCommitTest, MBeansHandlerTest, SegmentsInfoRequestHandlerTest, TestManagedSchemaThreadSafety, TestRawResponseWriter, CdcrBootstrapTest, TestCSVLoader, PeerSyncWithIndexFingerprintCachingTest, BJQParserTest, TestRebalanceLeaders, EnumFieldTest, RecoveryAfterSoftCommitTest, FileBasedSpellCheckerTest, ZkSolrClientTest, TestTrie, SuggesterWFSTTest, NoCacheHeaderTest, TestAtomicUpdateErrorCases, TestWordDelimiterFilterFactory, DefaultValueUpdateProcessorTest, DistanceFunctionTest, SolrInfoBeanTest, CacheHeaderTest, TestQueryUtils, DocumentAnalysisRequestHandlerTest, PrimitiveFieldTypeTest, TermVectorComponentTest, TestSolrQueryParser, LoggingHandlerTest, TestCollationField, ReturnFieldsTest, TestAnalyzedSuggestions, TestComponentsName, HighlighterConfigTest, UpdateParamsTest, AlternateDirectoryTest, TestSolrIndexConfig, CopyFieldTest, ResponseLogComponentTest, SolrIndexConfigTest, BadComponentTest, TestMergePolicyConfig, TestSolrDeletionPolicy2, MultiTermTest, SampleTest, TestBinaryField, TestSearchPerf, NumericFieldsTest, MinimalSchemaTest, TestConfig, OutputWriterTest, TestFuzzyAnalyzedSuggestions, TestSolrCoreProperties, TestPostingsSolrHighlighter, DirectSolrConnectionTest, NotRequiredUniqueKeyTest, TestLuceneMatchVersion, SpellPossibilityIteratorTest, TestCharFilters, TestCodecSupport, SynonymTokenizerTest, TestXIncludeConfig, EchoParamsTest, TestSweetSpotSimilarityFactory, TestDFRSimilarityFactory, OpenExchangeRatesOrgProviderTest, PluginInfoTest, TestFastLRUCache, ChaosMonkeyNothingIsSafeTest, CollectionsAPISolrJTest, DeleteShardTest, DistributedVersionInfoTest, MissingSegmentRecoveryTest, OutOfBoxZkACLAndCredentialsProvidersTest, OverseerModifyCollectionTest, OverseerRolesTest, ReplaceNodeTest, SolrCLIZkUtilsTest, TestAuthenticationFramework, TestCloudInspectUtil, TestCloudJSONFacetJoinDomain, TestCloudPseudoReturnFields, TestCollectionsAPIViaSolrCloudCluster, TestDownShardTolerantSearch, TestMiniSolrCloudClusterSSL, TestRandomRequestDistribution, TestRequestForwarding, TestRequestStatusCollectionAPI, TestSolrCloudWithDelegationTokens, TestSolrCloudWithKerberosAlt, TestStressInPlaceUpdates, TestTolerantUpdateProcessorCloud, TestUtilizeNode, VMParamsZkACLAndCredentialsProvidersTest, ComputePlanActionTest, ExecutePlanActionTest, MetricTriggerTest, NodeAddedTriggerTest, SystemLogListenerTest, TriggerIntegrationTest]
   [junit4] Completed [591/764 (1!)] on J1 in 174.47s, 14 tests, 1 failure, 1 skipped <<< FAILURES!

[...truncated 48645 lines...]

Mime
View raw message