lucene-dev mailing list archives

Site index · List index
Message view « Date » · « Thread »
Top « Date » · « Thread »
From Policeman Jenkins Server <jenk...@thetaphi.de>
Subject [JENKINS] Lucene-Solr-7.x-Linux (64bit/jdk1.8.0_144) - Build # 1064 - Still Unstable!
Date Thu, 28 Dec 2017 06:31:55 GMT
Build: https://jenkins.thetaphi.de/job/Lucene-Solr-7.x-Linux/1064/
Java: 64bit/jdk1.8.0_144 -XX:-UseCompressedOops -XX:+UseG1GC

2 tests failed.
FAILED:  org.apache.solr.cloud.autoscaling.AutoScalingHandlerTest.testReadApi

Error Message:
Error from server at http://127.0.0.1:44795/solr: create the collection time out:180s

Stack Trace:
org.apache.solr.client.solrj.impl.HttpSolrClient$RemoteSolrException: Error from server at http://127.0.0.1:44795/solr: create the collection time out:180s
	at __randomizedtesting.SeedInfo.seed([E0D68ADB8CBEE7C4:B7FF716E574C05DF]:0)
	at org.apache.solr.client.solrj.impl.HttpSolrClient.executeMethod(HttpSolrClient.java:643)
	at org.apache.solr.client.solrj.impl.HttpSolrClient.request(HttpSolrClient.java:255)
	at org.apache.solr.client.solrj.impl.HttpSolrClient.request(HttpSolrClient.java:244)
	at org.apache.solr.client.solrj.impl.LBHttpSolrClient.doRequest(LBHttpSolrClient.java:483)
	at org.apache.solr.client.solrj.impl.LBHttpSolrClient.request(LBHttpSolrClient.java:413)
	at org.apache.solr.client.solrj.impl.CloudSolrClient.sendRequest(CloudSolrClient.java:1104)
	at org.apache.solr.client.solrj.impl.CloudSolrClient.requestWithRetryOnStaleState(CloudSolrClient.java:884)
	at org.apache.solr.client.solrj.impl.CloudSolrClient.request(CloudSolrClient.java:817)
	at org.apache.solr.client.solrj.SolrRequest.process(SolrRequest.java:194)
	at org.apache.solr.client.solrj.SolrRequest.process(SolrRequest.java:211)
	at org.apache.solr.cloud.autoscaling.AutoScalingHandlerTest.testReadApi(AutoScalingHandlerTest.java:693)
	at sun.reflect.NativeMethodAccessorImpl.invoke0(Native Method)
	at sun.reflect.NativeMethodAccessorImpl.invoke(NativeMethodAccessorImpl.java:62)
	at sun.reflect.DelegatingMethodAccessorImpl.invoke(DelegatingMethodAccessorImpl.java:43)
	at java.lang.reflect.Method.invoke(Method.java:498)
	at com.carrotsearch.randomizedtesting.RandomizedRunner.invoke(RandomizedRunner.java:1737)
	at com.carrotsearch.randomizedtesting.RandomizedRunner$8.evaluate(RandomizedRunner.java:934)
	at com.carrotsearch.randomizedtesting.RandomizedRunner$9.evaluate(RandomizedRunner.java:970)
	at com.carrotsearch.randomizedtesting.RandomizedRunner$10.evaluate(RandomizedRunner.java:984)
	at com.carrotsearch.randomizedtesting.rules.SystemPropertiesRestoreRule$1.evaluate(SystemPropertiesRestoreRule.java:57)
	at org.apache.lucene.util.TestRuleSetupTeardownChained$1.evaluate(TestRuleSetupTeardownChained.java:49)
	at org.apache.lucene.util.AbstractBeforeAfterRule$1.evaluate(AbstractBeforeAfterRule.java:45)
	at org.apache.lucene.util.TestRuleThreadAndTestName$1.evaluate(TestRuleThreadAndTestName.java:48)
	at org.apache.lucene.util.TestRuleIgnoreAfterMaxFailures$1.evaluate(TestRuleIgnoreAfterMaxFailures.java:64)
	at org.apache.lucene.util.TestRuleMarkFailure$1.evaluate(TestRuleMarkFailure.java:47)
	at com.carrotsearch.randomizedtesting.rules.StatementAdapter.evaluate(StatementAdapter.java:36)
	at com.carrotsearch.randomizedtesting.ThreadLeakControl$StatementRunner.run(ThreadLeakControl.java:368)
	at com.carrotsearch.randomizedtesting.ThreadLeakControl.forkTimeoutingTask(ThreadLeakControl.java:817)
	at com.carrotsearch.randomizedtesting.ThreadLeakControl$3.evaluate(ThreadLeakControl.java:468)
	at com.carrotsearch.randomizedtesting.RandomizedRunner.runSingleTest(RandomizedRunner.java:943)
	at com.carrotsearch.randomizedtesting.RandomizedRunner$5.evaluate(RandomizedRunner.java:829)
	at com.carrotsearch.randomizedtesting.RandomizedRunner$6.evaluate(RandomizedRunner.java:879)
	at com.carrotsearch.randomizedtesting.RandomizedRunner$7.evaluate(RandomizedRunner.java:890)
	at com.carrotsearch.randomizedtesting.rules.StatementAdapter.evaluate(StatementAdapter.java:36)
	at com.carrotsearch.randomizedtesting.rules.SystemPropertiesRestoreRule$1.evaluate(SystemPropertiesRestoreRule.java:57)
	at org.apache.lucene.util.AbstractBeforeAfterRule$1.evaluate(AbstractBeforeAfterRule.java:45)
	at com.carrotsearch.randomizedtesting.rules.StatementAdapter.evaluate(StatementAdapter.java:36)
	at org.apache.lucene.util.TestRuleStoreClassName$1.evaluate(TestRuleStoreClassName.java:41)
	at com.carrotsearch.randomizedtesting.rules.NoShadowingOrOverridesOnMethodsRule$1.evaluate(NoShadowingOrOverridesOnMethodsRule.java:40)
	at com.carrotsearch.randomizedtesting.rules.NoShadowingOrOverridesOnMethodsRule$1.evaluate(NoShadowingOrOverridesOnMethodsRule.java:40)
	at com.carrotsearch.randomizedtesting.rules.StatementAdapter.evaluate(StatementAdapter.java:36)
	at com.carrotsearch.randomizedtesting.rules.StatementAdapter.evaluate(StatementAdapter.java:36)
	at com.carrotsearch.randomizedtesting.rules.StatementAdapter.evaluate(StatementAdapter.java:36)
	at org.apache.lucene.util.TestRuleAssertionsRequired$1.evaluate(TestRuleAssertionsRequired.java:53)
	at org.apache.lucene.util.TestRuleMarkFailure$1.evaluate(TestRuleMarkFailure.java:47)
	at org.apache.lucene.util.TestRuleIgnoreAfterMaxFailures$1.evaluate(TestRuleIgnoreAfterMaxFailures.java:64)
	at org.apache.lucene.util.TestRuleIgnoreTestSuites$1.evaluate(TestRuleIgnoreTestSuites.java:54)
	at com.carrotsearch.randomizedtesting.rules.StatementAdapter.evaluate(StatementAdapter.java:36)
	at com.carrotsearch.randomizedtesting.ThreadLeakControl$StatementRunner.run(ThreadLeakControl.java:368)
	at java.lang.Thread.run(Thread.java:748)


FAILED:  org.apache.solr.cloud.autoscaling.AutoScalingHandlerTest.testDeleteUsedPolicy

Error Message:
Error from server at http://127.0.0.1:44795/solr: Could not fully create collection: COLL1

Stack Trace:
org.apache.solr.client.solrj.impl.HttpSolrClient$RemoteSolrException: Error from server at http://127.0.0.1:44795/solr: Could not fully create collection: COLL1
	at __randomizedtesting.SeedInfo.seed([E0D68ADB8CBEE7C4:ECB521C615ACDB0D]:0)
	at org.apache.solr.client.solrj.impl.HttpSolrClient.executeMethod(HttpSolrClient.java:643)
	at org.apache.solr.client.solrj.impl.HttpSolrClient.request(HttpSolrClient.java:255)
	at org.apache.solr.client.solrj.impl.HttpSolrClient.request(HttpSolrClient.java:244)
	at org.apache.solr.client.solrj.impl.LBHttpSolrClient.doRequest(LBHttpSolrClient.java:483)
	at org.apache.solr.client.solrj.impl.LBHttpSolrClient.request(LBHttpSolrClient.java:413)
	at org.apache.solr.client.solrj.impl.CloudSolrClient.sendRequest(CloudSolrClient.java:1104)
	at org.apache.solr.client.solrj.impl.CloudSolrClient.requestWithRetryOnStaleState(CloudSolrClient.java:884)
	at org.apache.solr.client.solrj.impl.CloudSolrClient.request(CloudSolrClient.java:817)
	at org.apache.solr.client.solrj.SolrRequest.process(SolrRequest.java:194)
	at org.apache.solr.client.solrj.SolrRequest.process(SolrRequest.java:211)
	at org.apache.solr.cloud.autoscaling.AutoScalingHandlerTest.testDeleteUsedPolicy(AutoScalingHandlerTest.java:803)
	at sun.reflect.NativeMethodAccessorImpl.invoke0(Native Method)
	at sun.reflect.NativeMethodAccessorImpl.invoke(NativeMethodAccessorImpl.java:62)
	at sun.reflect.DelegatingMethodAccessorImpl.invoke(DelegatingMethodAccessorImpl.java:43)
	at java.lang.reflect.Method.invoke(Method.java:498)
	at com.carrotsearch.randomizedtesting.RandomizedRunner.invoke(RandomizedRunner.java:1737)
	at com.carrotsearch.randomizedtesting.RandomizedRunner$8.evaluate(RandomizedRunner.java:934)
	at com.carrotsearch.randomizedtesting.RandomizedRunner$9.evaluate(RandomizedRunner.java:970)
	at com.carrotsearch.randomizedtesting.RandomizedRunner$10.evaluate(RandomizedRunner.java:984)
	at com.carrotsearch.randomizedtesting.rules.SystemPropertiesRestoreRule$1.evaluate(SystemPropertiesRestoreRule.java:57)
	at org.apache.lucene.util.TestRuleSetupTeardownChained$1.evaluate(TestRuleSetupTeardownChained.java:49)
	at org.apache.lucene.util.AbstractBeforeAfterRule$1.evaluate(AbstractBeforeAfterRule.java:45)
	at org.apache.lucene.util.TestRuleThreadAndTestName$1.evaluate(TestRuleThreadAndTestName.java:48)
	at org.apache.lucene.util.TestRuleIgnoreAfterMaxFailures$1.evaluate(TestRuleIgnoreAfterMaxFailures.java:64)
	at org.apache.lucene.util.TestRuleMarkFailure$1.evaluate(TestRuleMarkFailure.java:47)
	at com.carrotsearch.randomizedtesting.rules.StatementAdapter.evaluate(StatementAdapter.java:36)
	at com.carrotsearch.randomizedtesting.ThreadLeakControl$StatementRunner.run(ThreadLeakControl.java:368)
	at com.carrotsearch.randomizedtesting.ThreadLeakControl.forkTimeoutingTask(ThreadLeakControl.java:817)
	at com.carrotsearch.randomizedtesting.ThreadLeakControl$3.evaluate(ThreadLeakControl.java:468)
	at com.carrotsearch.randomizedtesting.RandomizedRunner.runSingleTest(RandomizedRunner.java:943)
	at com.carrotsearch.randomizedtesting.RandomizedRunner$5.evaluate(RandomizedRunner.java:829)
	at com.carrotsearch.randomizedtesting.RandomizedRunner$6.evaluate(RandomizedRunner.java:879)
	at com.carrotsearch.randomizedtesting.RandomizedRunner$7.evaluate(RandomizedRunner.java:890)
	at com.carrotsearch.randomizedtesting.rules.StatementAdapter.evaluate(StatementAdapter.java:36)
	at com.carrotsearch.randomizedtesting.rules.SystemPropertiesRestoreRule$1.evaluate(SystemPropertiesRestoreRule.java:57)
	at org.apache.lucene.util.AbstractBeforeAfterRule$1.evaluate(AbstractBeforeAfterRule.java:45)
	at com.carrotsearch.randomizedtesting.rules.StatementAdapter.evaluate(StatementAdapter.java:36)
	at org.apache.lucene.util.TestRuleStoreClassName$1.evaluate(TestRuleStoreClassName.java:41)
	at com.carrotsearch.randomizedtesting.rules.NoShadowingOrOverridesOnMethodsRule$1.evaluate(NoShadowingOrOverridesOnMethodsRule.java:40)
	at com.carrotsearch.randomizedtesting.rules.NoShadowingOrOverridesOnMethodsRule$1.evaluate(NoShadowingOrOverridesOnMethodsRule.java:40)
	at com.carrotsearch.randomizedtesting.rules.StatementAdapter.evaluate(StatementAdapter.java:36)
	at com.carrotsearch.randomizedtesting.rules.StatementAdapter.evaluate(StatementAdapter.java:36)
	at com.carrotsearch.randomizedtesting.rules.StatementAdapter.evaluate(StatementAdapter.java:36)
	at org.apache.lucene.util.TestRuleAssertionsRequired$1.evaluate(TestRuleAssertionsRequired.java:53)
	at org.apache.lucene.util.TestRuleMarkFailure$1.evaluate(TestRuleMarkFailure.java:47)
	at org.apache.lucene.util.TestRuleIgnoreAfterMaxFailures$1.evaluate(TestRuleIgnoreAfterMaxFailures.java:64)
	at org.apache.lucene.util.TestRuleIgnoreTestSuites$1.evaluate(TestRuleIgnoreTestSuites.java:54)
	at com.carrotsearch.randomizedtesting.rules.StatementAdapter.evaluate(StatementAdapter.java:36)
	at com.carrotsearch.randomizedtesting.ThreadLeakControl$StatementRunner.run(ThreadLeakControl.java:368)
	at java.lang.Thread.run(Thread.java:748)




Build Log:
[...truncated 13611 lines...]
   [junit4] Suite: org.apache.solr.cloud.autoscaling.AutoScalingHandlerTest
   [junit4]   2> Creating dataDir: /home/jenkins/workspace/Lucene-Solr-7.x-Linux/solr/build/solr-core/test/J2/temp/solr.cloud.autoscaling.AutoScalingHandlerTest_E0D68ADB8CBEE7C4-001/init-core-data-001
   [junit4]   2> 2174637 WARN  (SUITE-AutoScalingHandlerTest-seed#[E0D68ADB8CBEE7C4]-worker) [    ] o.a.s.SolrTestCaseJ4 startTrackingSearchers: numOpens=17 numCloses=17
   [junit4]   2> 2174637 INFO  (SUITE-AutoScalingHandlerTest-seed#[E0D68ADB8CBEE7C4]-worker) [    ] o.a.s.SolrTestCaseJ4 Using TrieFields (NUMERIC_POINTS_SYSPROP=false) w/NUMERIC_DOCVALUES_SYSPROP=true
   [junit4]   2> 2174638 INFO  (SUITE-AutoScalingHandlerTest-seed#[E0D68ADB8CBEE7C4]-worker) [    ] o.a.s.SolrTestCaseJ4 Randomized ssl (false) and clientAuth (true) via: @org.apache.solr.util.RandomizeSSL(reason=, value=NaN, ssl=NaN, clientAuth=NaN)
   [junit4]   2> 2174638 INFO  (SUITE-AutoScalingHandlerTest-seed#[E0D68ADB8CBEE7C4]-worker) [    ] o.a.s.SolrTestCaseJ4 SecureRandom sanity checks: test.solr.allowed.securerandom=null & java.security.egd=file:/dev/./urandom
   [junit4]   2> 2174638 INFO  (SUITE-AutoScalingHandlerTest-seed#[E0D68ADB8CBEE7C4]-worker) [    ] o.a.s.c.MiniSolrCloudCluster Starting cluster of 2 servers in /home/jenkins/workspace/Lucene-Solr-7.x-Linux/solr/build/solr-core/test/J2/temp/solr.cloud.autoscaling.AutoScalingHandlerTest_E0D68ADB8CBEE7C4-001/tempDir-001
   [junit4]   2> 2174638 INFO  (SUITE-AutoScalingHandlerTest-seed#[E0D68ADB8CBEE7C4]-worker) [    ] o.a.s.c.ZkTestServer STARTING ZK TEST SERVER
   [junit4]   2> 2174639 INFO  (Thread-10635) [    ] o.a.s.c.ZkTestServer client port:0.0.0.0/0.0.0.0:0
   [junit4]   2> 2174639 INFO  (Thread-10635) [    ] o.a.s.c.ZkTestServer Starting server
   [junit4]   2> 2174640 ERROR (Thread-10635) [    ] o.a.z.s.ZooKeeperServer ZKShutdownHandler is not registered, so ZooKeeper server won't take any action on ERROR or SHUTDOWN server state changes
   [junit4]   2> 2174739 INFO  (SUITE-AutoScalingHandlerTest-seed#[E0D68ADB8CBEE7C4]-worker) [    ] o.a.s.c.ZkTestServer start zk server on port:39461
   [junit4]   2> 2174741 INFO  (zkConnectionManagerCallback-9533-thread-1) [    ] o.a.s.c.c.ConnectionManager zkClient has connected
   [junit4]   2> 2174743 INFO  (jetty-launcher-9530-thread-1) [    ] o.e.j.s.Server jetty-9.3.20.v20170531
   [junit4]   2> 2174743 INFO  (jetty-launcher-9530-thread-2) [    ] o.e.j.s.Server jetty-9.3.20.v20170531
   [junit4]   2> 2174747 INFO  (jetty-launcher-9530-thread-2) [    ] o.e.j.s.h.ContextHandler Started o.e.j.s.ServletContextHandler@524e6b09{/solr,null,AVAILABLE}
   [junit4]   2> 2174747 INFO  (jetty-launcher-9530-thread-1) [    ] o.e.j.s.h.ContextHandler Started o.e.j.s.ServletContextHandler@361e9b31{/solr,null,AVAILABLE}
   [junit4]   2> 2174747 INFO  (jetty-launcher-9530-thread-1) [    ] o.e.j.s.AbstractConnector Started ServerConnector@eec704a{HTTP/1.1,[http/1.1]}{127.0.0.1:41145}
   [junit4]   2> 2174748 INFO  (jetty-launcher-9530-thread-1) [    ] o.e.j.s.Server Started @2176322ms
   [junit4]   2> 2174748 INFO  (jetty-launcher-9530-thread-1) [    ] o.a.s.c.s.e.JettySolrRunner Jetty properties: {hostContext=/solr, hostPort=41145}
   [junit4]   2> 2174748 ERROR (jetty-launcher-9530-thread-1) [    ] o.a.s.u.StartupLoggingUtils Missing Java Option solr.log.dir. Logging may be missing or incomplete.
   [junit4]   2> 2174748 INFO  (jetty-launcher-9530-thread-1) [    ] o.a.s.s.SolrDispatchFilter  ___      _       Welcome to Apache Solr™ version 7.3.0
   [junit4]   2> 2174748 INFO  (jetty-launcher-9530-thread-1) [    ] o.a.s.s.SolrDispatchFilter / __| ___| |_ _   Starting in cloud mode on port null
   [junit4]   2> 2174748 INFO  (jetty-launcher-9530-thread-1) [    ] o.a.s.s.SolrDispatchFilter \__ \/ _ \ | '_|  Install dir: null
   [junit4]   2> 2174748 INFO  (jetty-launcher-9530-thread-1) [    ] o.a.s.s.SolrDispatchFilter |___/\___/_|_|    Start time: 2017-12-28T06:08:01.969Z
   [junit4]   2> 2174749 INFO  (jetty-launcher-9530-thread-2) [    ] o.e.j.s.AbstractConnector Started ServerConnector@670485b8{HTTP/1.1,[http/1.1]}{127.0.0.1:44795}
   [junit4]   2> 2174749 INFO  (jetty-launcher-9530-thread-2) [    ] o.e.j.s.Server Started @2176323ms
   [junit4]   2> 2174749 INFO  (jetty-launcher-9530-thread-2) [    ] o.a.s.c.s.e.JettySolrRunner Jetty properties: {hostContext=/solr, hostPort=44795}
   [junit4]   2> 2174749 ERROR (jetty-launcher-9530-thread-2) [    ] o.a.s.u.StartupLoggingUtils Missing Java Option solr.log.dir. Logging may be missing or incomplete.
   [junit4]   2> 2174749 INFO  (jetty-launcher-9530-thread-2) [    ] o.a.s.s.SolrDispatchFilter  ___      _       Welcome to Apache Solr™ version 7.3.0
   [junit4]   2> 2174749 INFO  (jetty-launcher-9530-thread-2) [    ] o.a.s.s.SolrDispatchFilter / __| ___| |_ _   Starting in cloud mode on port null
   [junit4]   2> 2174749 INFO  (zkConnectionManagerCallback-9535-thread-1) [    ] o.a.s.c.c.ConnectionManager zkClient has connected
   [junit4]   2> 2174749 INFO  (jetty-launcher-9530-thread-2) [    ] o.a.s.s.SolrDispatchFilter \__ \/ _ \ | '_|  Install dir: null
   [junit4]   2> 2174749 INFO  (jetty-launcher-9530-thread-2) [    ] o.a.s.s.SolrDispatchFilter |___/\___/_|_|    Start time: 2017-12-28T06:08:01.970Z
   [junit4]   2> 2174750 INFO  (jetty-launcher-9530-thread-1) [    ] o.a.s.s.SolrDispatchFilter solr.xml found in ZooKeeper. Loading...
   [junit4]   2> 2174750 INFO  (zkConnectionManagerCallback-9537-thread-1) [    ] o.a.s.c.c.ConnectionManager zkClient has connected
   [junit4]   2> 2174750 INFO  (jetty-launcher-9530-thread-2) [    ] o.a.s.s.SolrDispatchFilter solr.xml found in ZooKeeper. Loading...
   [junit4]   2> 2174755 INFO  (jetty-launcher-9530-thread-2) [    ] o.a.s.c.ZkContainer Zookeeper client=127.0.0.1:39461/solr
   [junit4]   2> 2174755 INFO  (jetty-launcher-9530-thread-1) [    ] o.a.s.c.ZkContainer Zookeeper client=127.0.0.1:39461/solr
   [junit4]   2> 2174755 INFO  (zkConnectionManagerCallback-9543-thread-1) [    ] o.a.s.c.c.ConnectionManager zkClient has connected
   [junit4]   2> 2174755 INFO  (zkConnectionManagerCallback-9545-thread-1) [    ] o.a.s.c.c.ConnectionManager zkClient has connected
   [junit4]   2> 2174755 WARN  (NIOServerCxn.Factory:0.0.0.0/0.0.0.0:0) [    ] o.a.z.s.NIOServerCnxn caught end of stream exception
   [junit4]   2> EndOfStreamException: Unable to read additional data from client sessionid 0x1609bbc11440004, likely client has closed socket
   [junit4]   2> 	at org.apache.zookeeper.server.NIOServerCnxn.doIO(NIOServerCnxn.java:239)
   [junit4]   2> 	at org.apache.zookeeper.server.NIOServerCnxnFactory.run(NIOServerCnxnFactory.java:203)
   [junit4]   2> 	at java.lang.Thread.run(Thread.java:748)
   [junit4]   2> 2174756 INFO  (zkConnectionManagerCallback-9549-thread-1-processing-n:127.0.0.1:41145_solr) [n:127.0.0.1:41145_solr    ] o.a.s.c.c.ConnectionManager zkClient has connected
   [junit4]   2> 2174756 INFO  (zkConnectionManagerCallback-9548-thread-1-processing-n:127.0.0.1:44795_solr) [n:127.0.0.1:44795_solr    ] o.a.s.c.c.ConnectionManager zkClient has connected
   [junit4]   2> 2174779 INFO  (jetty-launcher-9530-thread-1) [n:127.0.0.1:41145_solr    ] o.a.s.c.Overseer Overseer (id=null) closing
   [junit4]   2> 2174779 INFO  (jetty-launcher-9530-thread-2) [n:127.0.0.1:44795_solr    ] o.a.s.c.Overseer Overseer (id=null) closing
   [junit4]   2> 2174780 INFO  (jetty-launcher-9530-thread-1) [n:127.0.0.1:41145_solr    ] o.a.s.c.OverseerElectionContext I am going to be the leader 127.0.0.1:41145_solr
   [junit4]   2> 2174780 INFO  (jetty-launcher-9530-thread-2) [n:127.0.0.1:44795_solr    ] o.a.s.c.ZkController Register node as live in ZooKeeper:/live_nodes/127.0.0.1:44795_solr
   [junit4]   2> 2174780 INFO  (jetty-launcher-9530-thread-1) [n:127.0.0.1:41145_solr    ] o.a.s.c.Overseer Overseer (id=99250423847976965-127.0.0.1:41145_solr-n_0000000000) starting
   [junit4]   2> 2174783 INFO  (zkCallback-9546-thread-1-processing-n:127.0.0.1:44795_solr) [n:127.0.0.1:44795_solr    ] o.a.s.c.c.ZkStateReader Updated live nodes from ZooKeeper... (0) -> (1)
   [junit4]   2> 2174783 INFO  (zkCallback-9547-thread-1-processing-n:127.0.0.1:41145_solr) [n:127.0.0.1:41145_solr    ] o.a.s.c.c.ZkStateReader Updated live nodes from ZooKeeper... (0) -> (1)
   [junit4]   2> 2174787 INFO  (jetty-launcher-9530-thread-1) [n:127.0.0.1:41145_solr    ] o.a.s.c.ZkController Register node as live in ZooKeeper:/live_nodes/127.0.0.1:41145_solr
   [junit4]   2> 2174787 INFO  (zkCallback-9546-thread-1-processing-n:127.0.0.1:44795_solr) [n:127.0.0.1:44795_solr    ] o.a.s.c.c.ZkStateReader Updated live nodes from ZooKeeper... (1) -> (2)
   [junit4]   2> 2174793 INFO  (zkCallback-9547-thread-1-processing-n:127.0.0.1:41145_solr) [n:127.0.0.1:41145_solr    ] o.a.s.c.c.ZkStateReader Updated live nodes from ZooKeeper... (1) -> (2)
   [junit4]   2> 2174853 INFO  (jetty-launcher-9530-thread-1) [n:127.0.0.1:41145_solr    ] o.a.s.m.r.SolrJmxReporter JMX monitoring for 'solr_41145.solr.node' (registry 'solr.node') enabled at server: com.sun.jmx.mbeanserver.JmxMBeanServer@292cfbf1
   [junit4]   2> 2174861 INFO  (jetty-launcher-9530-thread-1) [n:127.0.0.1:41145_solr    ] o.a.s.m.r.SolrJmxReporter JMX monitoring for 'solr_41145.solr.jvm' (registry 'solr.jvm') enabled at server: com.sun.jmx.mbeanserver.JmxMBeanServer@292cfbf1
   [junit4]   2> 2174861 INFO  (jetty-launcher-9530-thread-1) [n:127.0.0.1:41145_solr    ] o.a.s.m.r.SolrJmxReporter JMX monitoring for 'solr_41145.solr.jetty' (registry 'solr.jetty') enabled at server: com.sun.jmx.mbeanserver.JmxMBeanServer@292cfbf1
   [junit4]   2> 2174862 INFO  (jetty-launcher-9530-thread-1) [n:127.0.0.1:41145_solr    ] o.a.s.c.CorePropertiesLocator Found 0 core definitions underneath /home/jenkins/workspace/Lucene-Solr-7.x-Linux/solr/build/solr-core/test/J2/temp/solr.cloud.autoscaling.AutoScalingHandlerTest_E0D68ADB8CBEE7C4-001/tempDir-001/node1/.
   [junit4]   2> 2174866 INFO  (jetty-launcher-9530-thread-2) [n:127.0.0.1:44795_solr    ] o.a.s.m.r.SolrJmxReporter JMX monitoring for 'solr_44795.solr.node' (registry 'solr.node') enabled at server: com.sun.jmx.mbeanserver.JmxMBeanServer@292cfbf1
   [junit4]   2> 2174873 INFO  (jetty-launcher-9530-thread-2) [n:127.0.0.1:44795_solr    ] o.a.s.m.r.SolrJmxReporter JMX monitoring for 'solr_44795.solr.jvm' (registry 'solr.jvm') enabled at server: com.sun.jmx.mbeanserver.JmxMBeanServer@292cfbf1
   [junit4]   2> 2174873 INFO  (jetty-launcher-9530-thread-2) [n:127.0.0.1:44795_solr    ] o.a.s.m.r.SolrJmxReporter JMX monitoring for 'solr_44795.solr.jetty' (registry 'solr.jetty') enabled at server: com.sun.jmx.mbeanserver.JmxMBeanServer@292cfbf1
   [junit4]   2> 2174874 INFO  (jetty-launcher-9530-thread-2) [n:127.0.0.1:44795_solr    ] o.a.s.c.CorePropertiesLocator Found 0 core definitions underneath /home/jenkins/workspace/Lucene-Solr-7.x-Linux/solr/build/solr-core/test/J2/temp/solr.cloud.autoscaling.AutoScalingHandlerTest_E0D68ADB8CBEE7C4-001/tempDir-001/node2/.
   [junit4]   2> 2174890 INFO  (zkConnectionManagerCallback-9555-thread-1) [    ] o.a.s.c.c.ConnectionManager zkClient has connected
   [junit4]   2> 2174891 INFO  (zkConnectionManagerCallback-9559-thread-1) [    ] o.a.s.c.c.ConnectionManager zkClient has connected
   [junit4]   2> 2174892 INFO  (SUITE-AutoScalingHandlerTest-seed#[E0D68ADB8CBEE7C4]-worker) [    ] o.a.s.c.c.ZkStateReader Updated live nodes from ZooKeeper... (0) -> (2)
   [junit4]   2> 2174892 INFO  (SUITE-AutoScalingHandlerTest-seed#[E0D68ADB8CBEE7C4]-worker) [    ] o.a.s.c.s.i.ZkClientClusterStateProvider Cluster at 127.0.0.1:39461/solr ready
   [junit4]   2> 2174910 INFO  (TEST-AutoScalingHandlerTest.testErrorHandling-seed#[E0D68ADB8CBEE7C4]) [    ] o.a.s.SolrTestCaseJ4 ###Starting testErrorHandling
   [junit4]   2> 2174912 ERROR (qtp1381085712-36882) [n:127.0.0.1:41145_solr    ] o.a.s.h.RequestHandlerBase org.apache.solr.api.ApiBag$ExceptionWithErrObject: Error in command payload, errors: [{set-cluster-policy=[{cores=<10, node=#ANY}, {shard=#EACH, node=#ANY}, {nodeRole=overseer, replica=0}], errorMessages=[replica is required in {
   [junit4]   2>   "shard":"#EACH",
   [junit4]   2>   "node":"#ANY"}]}], 
   [junit4]   2> 	at org.apache.solr.cloud.autoscaling.AutoScalingHandler.processOps(AutoScalingHandler.java:207)
   [junit4]   2> 	at org.apache.solr.cloud.autoscaling.AutoScalingHandler.handleRequestBody(AutoScalingHandler.java:145)
   [junit4]   2> 	at org.apache.solr.handler.RequestHandlerBase.handleRequest(RequestHandlerBase.java:177)
   [junit4]   2> 	at org.apache.solr.api.ApiBag$ReqHandlerToApi.call(ApiBag.java:242)
   [junit4]   2> 	at org.apache.solr.api.V2HttpCall.handleAdmin(V2HttpCall.java:311)
   [junit4]   2> 	at org.apache.solr.servlet.HttpSolrCall.handleAdminRequest(HttpSolrCall.java:717)
   [junit4]   2> 	at org.apache.solr.servlet.HttpSolrCall.call(HttpSolrCall.java:498)
   [junit4]   2> 	at org.apache.solr.servlet.SolrDispatchFilter.doFilter(SolrDispatchFilter.java:382)
   [junit4]   2> 	at org.apache.solr.servlet.SolrDispatchFilter.doFilter(SolrDispatchFilter.java:326)
   [junit4]   2> 	at org.eclipse.jetty.servlet.ServletHandler$CachedChain.doFilter(ServletHandler.java:1759)
   [junit4]   2> 	at org.apache.solr.client.solrj.embedded.JettySolrRunner$DebugFilter.doFilter(JettySolrRunner.java:139)
   [junit4]   2> 	at org.eclipse.jetty.servlet.ServletHandler$CachedChain.doFilter(ServletHandler.java:1759)
   [junit4]   2> 	at org.eclipse.jetty.servlet.ServletHandler.doHandle(ServletHandler.java:582)
   [junit4]   2> 	at org.eclipse.jetty.server.session.SessionHandler.doHandle(SessionHandler.java:224)
   [junit4]   2> 	at org.eclipse.jetty.server.handler.ContextHandler.doHandle(ContextHandler.java:1180)
   [junit4]   2> 	at org.eclipse.jetty.servlet.ServletHandler.doScope(ServletHandler.java:512)
   [junit4]   2> 	at org.eclipse.jetty.server.session.SessionHandler.doScope(SessionHandler.java:185)
   [junit4]   2> 	at org.eclipse.jetty.server.handler.ContextHandler.doScope(ContextHandler.java:1112)
   [junit4]   2> 	at org.eclipse.jetty.server.handler.ScopedHandler.handle(ScopedHandler.java:141)
   [junit4]   2> 	at org.eclipse.jetty.server.handler.gzip.GzipHandler.handle(GzipHandler.java:426)
   [junit4]   2> 	at org.eclipse.jetty.server.handler.HandlerWrapper.handle(HandlerWrapper.java:134)
   [junit4]   2> 	at org.eclipse.jetty.server.Server.handle(Server.java:534)
   [junit4]   2> 	at org.eclipse.jetty.server.HttpChannel.handle(HttpChannel.java:320)
   [junit4]   2> 	at org.eclipse.jetty.server.HttpConnection.onFillable(HttpConnection.java:251)
   [junit4]   2> 	at org.eclipse.jetty.io.AbstractConnection$ReadCallback.succeeded(AbstractConnection.java:283)
   [junit4]   2> 	at org.eclipse.jetty.io.FillInterest.fillable(FillInterest.java:108)
   [junit4]   2> 	at org.eclipse.jetty.io.SelectChannelEndPoint$2.run(SelectChannelEndPoint.java:93)
   [junit4]   2> 	at org.eclipse.jetty.util.thread.strategy.ExecuteProduceConsume.executeProduceConsume(ExecuteProduceConsume.java:303)
   [junit4]   2> 	at org.eclipse.jetty.util.thread.strategy.ExecuteProduceConsume.produceConsume(ExecuteProduceConsume.java:148)
   [junit4]   2> 	at org.eclipse.jetty.util.thread.strategy.ExecuteProduceConsume.run(ExecuteProduceConsume.java:136)
   [junit4]   2> 	at org.eclipse.jetty.util.thread.QueuedThreadPool.runJob(QueuedThreadPool.java:671)
   [junit4]   2> 	at org.eclipse.jetty.util.thread.QueuedThreadPool$2.run(QueuedThreadPool.java:589)
   [junit4]   2> 	at java.lang.Thread.run(Thread.java:748)
   [junit4]   2> 
   [junit4]   2> 2174912 INFO  (qtp1381085712-36882) [n:127.0.0.1:41145_solr    ] o.a.s.s.HttpSolrCall [admin] webapp=null path=/cluster/autoscaling params={wt=javabin&version=2} status=400 QTime=0
   [junit4]   2> 2174913 INFO  (TEST-AutoScalingHandlerTest.testErrorHandling-seed#[E0D68ADB8CBEE7C4]) [    ] o.a.s.SolrTestCaseJ4 ###Ending testErrorHandling
   [junit4]   2> 2174929 INFO  (TEST-AutoScalingHandlerTest.testReadApi-seed#[E0D68ADB8CBEE7C4]) [    ] o.a.s.SolrTestCaseJ4 ###Starting testReadApi
   [junit4]   2> 2174930 INFO  (qtp1381085712-36886) [n:127.0.0.1:41145_solr    ] o.a.s.s.HttpSolrCall [admin] webapp=null path=/admin/metrics params={prefix=CORE.coreName&wt=javabin&version=2&group=solr.core} status=0 QTime=0
   [junit4]   2> 2174931 INFO  (qtp1110992179-36887) [n:127.0.0.1:44795_solr    ] o.a.s.s.HttpSolrCall [admin] webapp=null path=/admin/metrics params={prefix=CORE.coreName&wt=javabin&version=2&group=solr.core} status=0 QTime=0
   [junit4]   2> 2174931 INFO  (qtp1110992179-36883) [n:127.0.0.1:44795_solr    ] o.a.s.s.HttpSolrCall [admin] webapp=null path=/admin/autoscaling params={wt=javabin&version=2} status=0 QTime=1
   [junit4]   2> 2174932 INFO  (qtp1381085712-36872) [n:127.0.0.1:41145_solr    ] o.a.s.s.HttpSolrCall [admin] webapp=null path=/admin/metrics params={prefix=CORE.coreName&wt=javabin&version=2&group=solr.core} status=0 QTime=0
   [junit4]   2> 2174933 INFO  (qtp1110992179-36873) [n:127.0.0.1:44795_solr    ] o.a.s.s.HttpSolrCall [admin] webapp=null path=/admin/metrics params={prefix=CORE.coreName&wt=javabin&version=2&group=solr.core} status=0 QTime=0
   [junit4]   2> 2174933 INFO  (qtp1110992179-36885) [n:127.0.0.1:44795_solr    ] o.a.s.s.HttpSolrCall [admin] webapp=null path=/admin/autoscaling params={wt=javabin&version=2} status=0 QTime=1
   [junit4]   2> 2174935 INFO  (qtp1381085712-36882) [n:127.0.0.1:41145_solr    ] o.a.s.s.HttpSolrCall [admin] webapp=null path=/admin/metrics params={prefix=CONTAINER.fs.usableSpace,CORE.coreName,os.systemLoadAverage,memory.heap.usage&wt=javabin&version=2&group=solr.jvm,solr.node,solr.core} status=0 QTime=0
   [junit4]   2> 2174935 INFO  (qtp1110992179-36887) [n:127.0.0.1:44795_solr    ] o.a.s.s.HttpSolrCall [admin] webapp=null path=/admin/metrics params={prefix=CONTAINER.fs.usableSpace,CORE.coreName,os.systemLoadAverage,memory.heap.usage&wt=javabin&version=2&group=solr.jvm,solr.node,solr.core} status=0 QTime=0
   [junit4]   2> 2174936 INFO  (qtp1110992179-36875) [n:127.0.0.1:44795_solr    ] o.a.s.s.HttpSolrCall [admin] webapp=null path=/admin/autoscaling params={wt=javabin&version=2} status=0 QTime=2
   [junit4]   2> 2174939 INFO  (qtp1381085712-36872) [n:127.0.0.1:41145_solr    ] o.a.s.s.HttpSolrCall [admin] webapp=null path=/admin/metrics params={prefix=CONTAINER.fs.usableSpace,CORE.coreName,os.systemLoadAverage,memory.heap.usage&wt=javabin&version=2&group=solr.jvm,solr.node,solr.core} status=0 QTime=0
   [junit4]   2> 2174939 INFO  (qtp1110992179-36877) [n:127.0.0.1:44795_solr    ] o.a.s.s.HttpSolrCall [admin] webapp=null path=/admin/metrics params={prefix=CONTAINER.fs.usableSpace,CORE.coreName,os.systemLoadAverage,memory.heap.usage&wt=javabin&version=2&group=solr.jvm,solr.node,solr.core} status=0 QTime=0
   [junit4]   2> 2174940 INFO  (qtp1381085712-36884) [n:127.0.0.1:41145_solr    ] o.a.s.s.HttpSolrCall [admin] webapp=null path=/cluster/autoscaling params={wt=javabin&version=2} status=0 QTime=4
   [junit4]   2> 2174941 INFO  (qtp1110992179-36883) [n:127.0.0.1:44795_solr    ] o.a.s.s.HttpSolrCall [admin] webapp=null path=/cluster/autoscaling params={wt=javabin&version=2} status=0 QTime=0
   [junit4]   2> 2174943 INFO  (qtp1381085712-36874) [n:127.0.0.1:41145_solr    ] o.a.s.s.HttpSolrCall [admin] webapp=null path=/admin/metrics params={prefix=CONTAINER.fs.usableSpace,CORE.coreName,os.systemLoadAverage,memory.heap.usage&wt=javabin&version=2&group=solr.jvm,solr.node,solr.core} status=0 QTime=0
   [junit4]   2> 2174944 INFO  (qtp1110992179-36873) [n:127.0.0.1:44795_solr    ] o.a.s.s.HttpSolrCall [admin] webapp=null path=/admin/metrics params={prefix=CONTAINER.fs.usableSpace,CORE.coreName,os.systemLoadAverage,memory.heap.usage&wt=javabin&version=2&group=solr.jvm,solr.node,solr.core} status=0 QTime=0
   [junit4]   2> 2174945 INFO  (qtp1110992179-36887) [n:127.0.0.1:44795_solr    ] o.a.s.s.HttpSolrCall [admin] webapp=null path=/admin/autoscaling/diagnostics params={wt=javabin&version=2} status=0 QTime=2
   [junit4]   2> 2174945 INFO  (qtp1110992179-36875) [n:127.0.0.1:44795_solr    ] o.a.s.h.a.CollectionsHandler Invoked Collection Action :create with params replicationFactor=6&collection.configName=conf&maxShardsPerNode=10&name=readApiTestViolations&nrtReplicas=6&action=CREATE&numShards=1&wt=javabin&version=2 and sendToOCPQueue=true
   [junit4]   2> 2174946 INFO  (OverseerThreadFactory-10169-thread-1-processing-n:127.0.0.1:41145_solr) [n:127.0.0.1:41145_solr    ] o.a.s.c.CreateCollectionCmd Create collection readApiTestViolations
   [junit4]   2> 2174946 ERROR (OverseerThreadFactory-10169-thread-1-processing-n:127.0.0.1:41145_solr) [n:127.0.0.1:41145_solr    ] o.a.s.c.OverseerCollectionMessageHandler Collection: readApiTestViolations operation: create failed:org.apache.solr.common.SolrException: 'maxShardsPerNode>0' is not supported when autoScaling policies are used
   [junit4]   2> 	at org.apache.solr.cloud.CreateCollectionCmd.buildReplicaPositions(CreateCollectionCmd.java:294)
   [junit4]   2> 	at org.apache.solr.cloud.CreateCollectionCmd.call(CreateCollectionCmd.java:123)
   [junit4]   2> 	at org.apache.solr.cloud.OverseerCollectionMessageHandler.processMessage(OverseerCollectionMessageHandler.java:242)
   [junit4]   2> 	at org.apache.solr.cloud.OverseerTaskProcessor$Runner.run(OverseerTaskProcessor.java:464)
   [junit4]   2> 	at org.apache.solr.common.util.ExecutorUtil$MDCAwareThreadPoolExecutor.lambda$execute$0(ExecutorUtil.java:188)
   [junit4]   2> 	at java.util.concurrent.ThreadPoolExecutor.runWorker(ThreadPoolExecutor.java:1149)
   [junit4]   2> 	at java.util.concurrent.ThreadPoolExecutor$Worker.run(ThreadPoolExecutor.java:624)
   [junit4]   2> 	at java.lang.Thread.run(Thread.java:748)
   [junit4]   2> 
   [junit4]   2> 2174951 INFO  (qtp1110992179-36875) [n:127.0.0.1:44795_solr    ] o.a.s.s.HttpSolrCall [admin] webapp=null path=/admin/collections params={replicationFactor=6&collection.configName=conf&maxShardsPerNode=10&name=readApiTestViolations&nrtReplicas=6&action=CREATE&numShards=1&wt=javabin&version=2} status=400 QTime=6
   [junit4]   2> 2174953 INFO  (qtp1381085712-36876) [n:127.0.0.1:41145_solr    ] o.a.s.s.HttpSolrCall [admin] webapp=null path=/admin/metrics params={prefix=CONTAINER.fs.usableSpace,CORE.coreName,os.systemLoadAverage,memory.heap.usage&wt=javabin&version=2&group=solr.jvm,solr.node,solr.core} status=0 QTime=0
   [junit4]   2> 2174953 INFO  (qtp1110992179-36877) [n:127.0.0.1:44795_solr    ] o.a.s.s.HttpSolrCall [admin] webapp=null path=/admin/metrics params={prefix=CONTAINER.fs.usableSpace,CORE.coreName,os.systemLoadAverage,memory.heap.usage&wt=javabin&version=2&group=solr.jvm,solr.node,solr.core} status=0 QTime=0
   [junit4]   2> 2174954 INFO  (qtp1110992179-36883) [n:127.0.0.1:44795_solr    ] o.a.s.s.HttpSolrCall [admin] webapp=null path=/admin/autoscaling params={wt=javabin&version=2} status=0 QTime=2
   [junit4]   2> 2174954 INFO  (qtp1110992179-36873) [n:127.0.0.1:44795_solr    ] o.a.s.h.a.CollectionsHandler Invoked Collection Action :create with params replicationFactor=6&collection.configName=conf&name=readApiTestViolations&nrtReplicas=6&action=CREATE&numShards=1&wt=javabin&version=2 and sendToOCPQueue=true
   [junit4]   2> 2174955 INFO  (OverseerThreadFactory-10169-thread-2-processing-n:127.0.0.1:41145_solr) [n:127.0.0.1:41145_solr    ] o.a.s.c.CreateCollectionCmd Create collection readApiTestViolations
   [junit4]   2> 2174955 INFO  (OverseerCollectionConfigSetProcessor-99250423847976965-127.0.0.1:41145_solr-n_0000000000) [n:127.0.0.1:41145_solr    ] o.a.s.c.OverseerTaskQueue Response ZK path: /overseer/collection-queue-work/qnr-0000000000 doesn't exist.  Requestor may have disconnected from ZooKeeper
   [junit4]   2> 2174956 WARN  (OverseerThreadFactory-10169-thread-2-processing-n:127.0.0.1:41145_solr) [n:127.0.0.1:41145_solr    ] o.a.s.c.CreateCollectionCmd Specified number of replicas of 6 on collection readApiTestViolations is higher than the number of Solr instances currently live or live and part of your createNodeSet(2). It's unusual to run two replica of the same slice on the same Solr-instance.
   [junit4]   2> 2174957 INFO  (qtp1381085712-36882) [n:127.0.0.1:41145_solr    ] o.a.s.s.HttpSolrCall [admin] webapp=null path=/admin/metrics params={prefix=CONTAINER.fs.usableSpace,CORE.coreName,os.systemLoadAverage,memory.heap.usage&wt=javabin&version=2&group=solr.jvm,solr.node,solr.core} status=0 QTime=0
   [junit4]   2> 2174958 INFO  (qtp1110992179-36885) [n:127.0.0.1:44795_solr    ] o.a.s.s.HttpSolrCall [admin] webapp=null path=/admin/metrics params={prefix=CONTAINER.fs.usableSpace,CORE.coreName,os.systemLoadAverage,memory.heap.usage&wt=javabin&version=2&group=solr.jvm,solr.node,solr.core} status=0 QTime=0
   [junit4]   2> 2174959 INFO  (OverseerThreadFactory-10169-thread-2-processing-n:127.0.0.1:41145_solr) [n:127.0.0.1:41145_solr    ] o.a.s.c.s.c.a.PolicyHelper returnSession, curr-time 2142424152 sessionWrapper.createTime 2142424151284140, this.sessionWrapper.createTime 2142424151284140 
   [junit4]   2> 2175062 INFO  (OverseerStateUpdate-99250423847976965-127.0.0.1:41145_solr-n_0000000000) [n:127.0.0.1:41145_solr    ] o.a.s.c.o.SliceMutator createReplica() {
   [junit4]   2>   "operation":"ADDREPLICA",
   [junit4]   2>   "collection":"readApiTestViolations",
   [junit4]   2>   "shard":"shard1",
   [junit4]   2>   "core":"readApiTestViolations_shard1_replica_n1",
   [junit4]   2>   "state":"down",
   [junit4]   2>   "base_url":"http://127.0.0.1:44795/solr",
   [junit4]   2>   "type":"NRT",
   [junit4]   2>   "waitForFinalState":"false"} 
   [junit4]   2> 2175062 INFO  (OverseerStateUpdate-99250423847976965-127.0.0.1:41145_solr-n_0000000000) [n:127.0.0.1:41145_solr    ] o.a.s.c.o.SliceMutator createReplica() {
   [junit4]   2>   "operation":"ADDREPLICA",
   [junit4]   2>   "collection":"readApiTestViolations",
   [junit4]   2>   "shard":"shard1",
   [junit4]   2>   "core":"readApiTestViolations_shard1_replica_n2",
   [junit4]   2>   "state":"down",
   [junit4]   2>   "base_url":"http://127.0.0.1:41145/solr",
   [junit4]   2>   "type":"NRT",
   [junit4]   2>   "waitForFinalState":"false"} 
   [junit4]   2> 2175063 INFO  (OverseerStateUpdate-99250423847976965-127.0.0.1:41145_solr-n_0000000000) [n:127.0.0.1:41145_solr    ] o.a.s.c.o.SliceMutator createReplica() {
   [junit4]   2>   "operation":"ADDREPLICA",
   [junit4]   2>   "collection":"readApiTestViolations",
   [junit4]   2>   "shard":"shard1",
   [junit4]   2>   "core":"readApiTestViolations_shard1_replica_n4",
   [junit4]   2>   "state":"down",
   [junit4]   2>   "base_url":"http://127.0.0.1:41145/solr",
   [junit4]   2>   "type":"NRT",
   [junit4]   2>   "waitForFinalState":"false"} 
   [junit4]   2> 2175064 INFO  (OverseerStateUpdate-99250423847976965-127.0.0.1:41145_solr-n_0000000000) [n:127.0.0.1:41145_solr    ] o.a.s.c.o.SliceMutator createReplica() {
   [junit4]   2>   "operation":"ADDREPLICA",
   [junit4]   2>   "collection":"readApiTestViolations",
   [junit4]   2>   "shard":"shard1",
   [junit4]   2>   "core":"readApiTestViolations_shard1_replica_n6",
   [junit4]   2>   "state":"down",
   [junit4]   2>   "base_url":"http://127.0.0.1:44795/solr",
   [junit4]   2>   "type":"NRT",
   [junit4]   2>   "waitForFinalState":"false"} 
   [junit4]   2> 2175064 INFO  (OverseerStateUpdate-99250423847976965-127.0.0.1:41145_solr-n_0000000000) [n:127.0.0.1:41145_solr    ] o.a.s.c.o.SliceMutator createReplica() {
   [junit4]   2>   "operation":"ADDREPLICA",
   [junit4]   2>   "collection":"readApiTestViolations",
   [junit4]   2>   "shard":"shard1",
   [junit4]   2>   "core":"readApiTestViolations_shard1_replica_n8",
   [junit4]   2>   "state":"down",
   [junit4]   2>   "base_url":"http://127.0.0.1:44795/solr",
   [junit4]   2>   "type":"NRT",
   [junit4]   2>   "waitForFinalState":"false"} 
   [junit4]   2> 2175065 INFO  (OverseerStateUpdate-99250423847976965-127.0.0.1:41145_solr-n_0000000000) [n:127.0.0.1:41145_solr    ] o.a.s.c.o.SliceMutator createReplica() {
   [junit4]   2>   "operation":"ADDREPLICA",
   [junit4]   2>   "collection":"readApiTestViolations",
   [junit4]   2>   "shard":"shard1",
   [junit4]   2>   "core":"readApiTestViolations_shard1_replica_n10",
   [junit4]   2>   "state":"down",
   [junit4]   2>   "base_url":"http://127.0.0.1:41145/solr",
   [junit4]   2>   "type":"NRT",
   [junit4]   2>   "waitForFinalState":"false"} 
   [junit4]   2> 2175266 INFO  (qtp1381085712-36874) [n:127.0.0.1:41145_solr    ] o.a.s.h.a.CoreAdminOperation core create command qt=/admin/cores&coreNodeName=core_node5&collection.configName=conf&newCollection=true&name=readApiTestViolations_shard1_replica_n2&action=CREATE&numShards=1&collection=readApiTestViolations&shard=shard1&wt=javabin&version=2&replicaType=NRT
   [junit4]   2> 2175266 INFO  (qtp1110992179-36883) [n:127.0.0.1:44795_solr    ] o.a.s.h.a.CoreAdminOperation core create command qt=/admin/cores&coreNodeName=core_node3&collection.configName=conf&newCollection=true&name=readApiTestViolations_shard1_replica_n1&action=CREATE&numShards=1&collection=readApiTestViolations&shard=shard1&wt=javabin&version=2&replicaType=NRT
   [junit4]   2> 2175266 INFO  (qtp1110992179-36887) [n:127.0.0.1:44795_solr    ] o.a.s.h.a.CoreAdminOperation core create command qt=/admin/cores&coreNodeName=core_node9&collection.configName=conf&newCollection=true&name=readApiTestViolations_shard1_replica_n6&action=CREATE&numShards=1&collection=readApiTestViolations&shard=shard1&wt=javabin&version=2&replicaType=NRT
   [junit4]   2> 2175266 INFO  (qtp1381085712-36874) [n:127.0.0.1:41145_solr    ] o.a.s.c.TransientSolrCoreCacheDefault Allocating transient cache for 2147483647 transient cores
   [junit4]   2> 2175266 INFO  (qtp1110992179-36883) [n:127.0.0.1:44795_solr    ] o.a.s.c.TransientSolrCoreCacheDefault Allocating transient cache for 2147483647 transient cores
   [junit4]   2> 2175266 INFO  (qtp1381085712-36872) [n:127.0.0.1:41145_solr    ] o.a.s.h.a.CoreAdminOperation core create command qt=/admin/cores&coreNodeName=core_node12&collection.configName=conf&newCollection=true&name=readApiTestViolations_shard1_replica_n10&action=CREATE&numShards=1&collection=readApiTestViolations&shard=shard1&wt=javabin&version=2&replicaType=NRT
   [junit4]   2> 2175267 INFO  (qtp1381085712-36878) [n:127.0.0.1:41145_solr    ] o.a.s.h.a.CoreAdminOperation core create command qt=/admin/cores&coreNodeName=core_node7&collection.configName=conf&newCollection=true&name=readApiTestViolations_shard1_replica_n4&action=CREATE&numShards=1&collection=readApiTestViolations&shard=shard1&wt=javabin&version=2&replicaType=NRT
   [junit4]   2> 2175268 INFO  (qtp1110992179-36879) [n:127.0.0.1:44795_solr    ] o.a.s.h.a.CoreAdminOperation core create command qt=/admin/cores&coreNodeName=core_node11&collection.configName=conf&newCollection=true&name=readApiTestViolations_shard1_replica_n8&action=CREATE&numShards=1&collection=readApiTestViolations&shard=shard1&wt=javabin&version=2&replicaType=NRT
   [junit4]   2> 2175370 INFO  (zkCallback-9546-thread-1-processing-n:127.0.0.1:44795_solr) [n:127.0.0.1:44795_solr    ] o.a.s.c.c.ZkStateReader A cluster state change: [WatchedEvent state:SyncConnected type:NodeDataChanged path:/collections/readApiTestViolations/state.json] for collection [readApiTestViolations] has occurred - updating... (live nodes size: [2])
   [junit4]   2> 2175370 INFO  (zkCallback-9546-thread-2-processing-n:127.0.0.1:44795_solr) [n:127.0.0.1:44795_solr    ] o.a.s.c.c.ZkStateReader A cluster state change: [WatchedEvent state:SyncConnected type:NodeDataChanged path:/collections/readApiTestViolations/state.json] for collection [readApiTestViolations] has occurred - updating... (live nodes size: [2])
   [junit4]   2> 2175370 INFO  (zkCallback-9547-thread-1-processing-n:127.0.0.1:41145_solr) [n:127.0.0.1:41145_solr    ] o.a.s.c.c.ZkStateReader A cluster state change: [WatchedEvent state:SyncConnected type:NodeDataChanged path:/collections/readApiTestViolations/state.json] for collection [readApiTestViolations] has occurred - updating... (live nodes size: [2])
   [junit4]   2> 2175370 INFO  (zkCallback-9546-thread-3-processing-n:127.0.0.1:44795_solr) [n:127.0.0.1:44795_solr    ] o.a.s.c.c.ZkStateReader A cluster state change: [WatchedEvent state:SyncConnected type:NodeDataChanged path:/collections/readApiTestViolations/state.json] for collection [readApiTestViolations] has occurred - updating... (live nodes size: [2])
   [junit4]   2> 2175370 INFO  (zkCallback-9547-thread-2-processing-n:127.0.0.1:41145_solr) [n:127.0.0.1:41145_solr    ] o.a.s.c.c.ZkStateReader A cluster state change: [WatchedEvent state:SyncConnected type:NodeDataChanged path:/collections/readApiTestViolations/state.json] for collection [readApiTestViolations] has occurred - updating... (live nodes size: [2])
   [junit4]   2> 2176276 INFO  (qtp1110992179-36887) [n:127.0.0.1:44795_solr c:readApiTestViolations s:shard1 r:core_node9 x:readApiTestViolations_shard1_replica_n6] o.a.s.c.SolrConfig Using Lucene MatchVersion: 7.3.0
   [junit4]   2> 2176277 INFO  (qtp1110992179-36883) [n:127.0.0.1:44795_solr c:readApiTestViolations s:shard1 r:core_node3 x:readApiTestViolations_shard1_replica_n1] o.a.s.c.SolrConfig Using Lucene MatchVersion: 7.3.0
   [junit4]   2> 2176277 INFO  (qtp1381085712-36874) [n:127.0.0.1:41145_solr c:readApiTestViolations s:shard1 r:core_node5 x:readApiTestViolations_shard1_replica_n2] o.a.s.c.SolrConfig Using Lucene MatchVersion: 7.3.0
   [junit4]   2> 2176277 INFO  (qtp1110992179-36879) [n:127.0.0.1:44795_solr c:readApiTestViolations s:shard1 r:core_node11 x:readApiTestViolations_shard1_replica_n8] o.a.s.c.SolrConfig Using Lucene MatchVersion: 7.3.0
   [junit4]   2> 2176300 INFO  (qtp1381085712-36878) [n:127.0.0.1:41145_solr c:readApiTestViolations s:shard1 r:core_node7 x:readApiTestViolations_shard1_replica_n4] o.a.s.c.SolrConfig Using Lucene MatchVersion: 7.3.0
   [junit4]   2> 2176302 INFO  (qtp1381085712-36872) [n:127.0.0.1:41145_solr c:readApiTestViolations s:shard1 r:core_node12 x:readApiTestViolations_shard1_replica_n10] o.a.s.c.SolrConfig Using Lucene MatchVersion: 7.3.0
   [junit4]   2> 2176305 INFO  (qtp1110992179-36887) [n:127.0.0.1:44795_solr c:readApiTestViolations s:shard1 r:core_node9 x:readApiTestViolations_shard1_replica_n6] o.a.s.s.IndexSchema [readApiTestViolations_shard1_replica_n6] Schema name=minimal
   [junit4]   2> 2176305 INFO  (qtp1110992179-36883) [n:127.0.0.1:44795_solr c:readApiTestViolations s:shard1 r:core_node3 x:readApiTestViolations_shard1_replica_n1] o.a.s.s.IndexSchema [readApiTestViolations_shard1_replica_n1] Schema name=minimal
   [junit4]   2> 2176305 INFO  (qtp1381085712-36874) [n:127.0.0.1:41145_solr c:readApiTestViolations s:shard1 r:core_node5 x:readApiTestViolations_shard1_replica_n2] o.a.s.s.IndexSchema [readApiTestViolations_shard1_replica_n2] Schema name=minimal
   [junit4]   2> 2176308 INFO  (qtp1381085712-36874) [n:127.0.0.1:41145_solr c:readApiTestViolations s:shard1 r:core_node5 x:readApiTestViolations_shard1_replica_n2] o.a.s.s.IndexSchema Loaded schema minimal/1.1 with uniqueid field id
   [junit4]   2> 2176308 INFO  (qtp1381085712-36874) [n:127.0.0.1:41145_solr c:readApiTestViolations s:shard1 r:core_node5 x:readApiTestViolations_shard1_replica_n2] o.a.s.c.CoreContainer Creating SolrCore 'readApiTestViolations_shard1_replica_n2' using configuration from collection readApiTestViolations, trusted=true
   [junit4]   2> 2176308 INFO  (qtp1110992179-36883) [n:127.0.0.1:44795_solr c:readApiTestViolations s:shard1 r:core_node3 x:readApiTestViolations_shard1_replica_n1] o.a.s.s.IndexSchema Loaded schema minimal/1.1 with uniqueid field id
   [junit4]   2> 2176308 INFO  (qtp1110992179-36887) [n:127.0.0.1:44795_solr c:readApiTestViolations s:shard1 r:core_node9 x:readApiTestViolations_shard1_replica_n6] o.a.s.s.IndexSchema Loaded schema minimal/1.1 with uniqueid field id
   [junit4]   2> 2176308 INFO  (qtp1110992179-36887) [n:127.0.0.1:44795_solr c:readApiTestViolations s:shard1 r:core_node9 x:readApiTestViolations_shard1_replica_n6] o.a.s.c.CoreContainer Creating SolrCore 'readApiTestViolations_shard1_replica_n6' using configuration from collection readApiTestViolations, trusted=true
   [junit4]   2> 2176308 INFO  (qtp1110992179-36883) [n:127.0.0.1:44795_solr c:readApiTestViolations s:shard1 r:core_node3 x:readApiTestViolations_shard1_replica_n1] o.a.s.c.CoreContainer Creating SolrCore 'readApiTestViolations_shard1_replica_n1' using configuration from collection readApiTestViolations, trusted=true
   [junit4]   2> 2176308 INFO  (qtp1381085712-36874) [n:127.0.0.1:41145_solr c:readApiTestViolations s:shard1 r:core_node5 x:readApiTestViolations_shard1_replica_n2] o.a.s.m.r.SolrJmxReporter JMX monitoring for 'solr_41145.solr.core.readApiTestViolations.shard1.replica_n2' (registry 'solr.core.readApiTestViolations.shard1.replica_n2') enabled at server: com.sun.jmx.mbeanserver.JmxMBeanServer@292cfbf1
   [junit4]   2> 2176308 INFO  (qtp1381085712-36874) [n:127.0.0.1:41145_solr c:readApiTestViolations s:shard1 r:core_node5 x:readApiTestViolations_shard1_replica_n2] o.a.s.c.SolrCore solr.RecoveryStrategy.Builder
   [junit4]   2> 2176308 INFO  (qtp1381085712-36874) [n:127.0.0.1:41145_solr c:readApiTestViolations s:shard1 r:core_node5 x:readApiTestViolations_shard1_replica_n2] o.a.s.c.SolrCore [[readApiTestViolations_shard1_replica_n2] ] Opening new SolrCore at [/home/jenkins/workspace/Lucene-Solr-7.x-Linux/solr/build/solr-core/test/J2/temp/solr.cloud.autoscaling.AutoScalingHandlerTest_E0D68ADB8CBEE7C4-001/tempDir-001/node1/readApiTestViolations_shard1_replica_n2], dataDir=[/home/jenkins/workspace/Lucene-Solr-7.x-Linux/solr/build/solr-core/test/J2/temp/solr.cloud.autoscaling.AutoScalingHandlerTest_E0D68ADB8CBEE7C4-001/tempDir-001/node1/./readApiTestViolations_shard1_replica_n2/data/]
   [junit4]   2> 2176309 INFO  (qtp1110992179-36887) [n:127.0.0.1:44795_solr c:readApiTestViolations s:shard1 r:core_node9 x:readApiTestViolations_shard1_replica_n6] o.a.s.m.r.SolrJmxReporter JMX monitoring for 'solr_44795.solr.core.readApiTestViolations.shard1.replica_n6' (registry 'solr.core.readApiTestViolations.shard1.replica_n6') enabled at server: com.sun.jmx.mbeanserver.JmxMBeanServer@292cfbf1
   [junit4]   2> 2176309 INFO  (qtp1110992179-36883) [n:127.0.0.1:44795_solr c:readApiTestViolations s:shard1 r:core_node3 x:readApiTestViolations_shard1_replica_n1] o.a.s.m.r.SolrJmxReporter JMX monitoring for 'solr_44795.solr.core.readApiTestViolations.shard1.replica_n1' (registry 'solr.core.readApiTestViolations.shard1.replica_n1') enabled at server: com.sun.jmx.mbeanserver.JmxMBeanServer@292cfbf1
   [junit4]   2> 2176309 INFO  (qtp1110992179-36887) [n:127.0.0.1:44795_solr c:readApiTestViolations s:shard1 r:core_node9 x:readApiTestViolations_shard1_replica_n6] o.a.s.c.SolrCore solr.RecoveryStrategy.Builder
   [junit4]   2> 2176309 INFO  (qtp1110992179-36883) [n:127.0.0.1:44795_solr c:readApiTestViolations s:shard1 r:core_node3 x:readApiTestViolations_shard1_replica_n1] o.a.s.c.SolrCore solr.RecoveryStrategy.Builder
   [junit4]   2> 2176309 INFO  (qtp1110992179-36887) [n:127.0.0.1:44795_solr c:readApiTestViolations s:shard1 r:core_node9 x:readApiTestViolations_shard1_replica_n6] o.a.s.c.SolrCore [[readApiTestViolations_shard1_replica_n6] ] Opening new SolrCore at [/home/jenkins/workspace/Lucene-Solr-7.x-Linux/solr/build/solr-core/test/J2/temp/solr.cloud.autoscaling.AutoScalingHandlerTest_E0D68ADB8CBEE7C4-001/tempDir-001/node2/readApiTestViolations_shard1_replica_n6], dataDir=[/home/jenkins/workspace/Lucene-Solr-7.x-Linux/solr/build/solr-core/test/J2/temp/solr.cloud.autoscaling.AutoScalingHandlerTest_E0D68ADB8CBEE7C4-001/tempDir-001/node2/./readApiTestViolations_shard1_replica_n6/data/]
   [junit4]   2> 2176309 INFO  (qtp1110992179-36883) [n:127.0.0.1:44795_solr c:readApiTestViolations s:shard1 r:core_node3 x:readApiTestViolations_shard1_replica_n1] o.a.s.c.SolrCore [[readApiTestViolations_shard1_replica_n1] ] Opening new SolrCore at [/home/jenkins/workspace/Lucene-Solr-7.x-Linux/solr/build/solr-core/test/J2/temp/solr.cloud.autoscaling.AutoScalingHandlerTest_E0D68ADB8CBEE7C4-001/tempDir-001/node2/readApiTestViolations_shard1_replica_n1], dataDir=[/home/jenkins/workspace/Lucene-Solr-7.x-Linux/solr/build/solr-core/test/J2/temp/solr.cloud.autoscaling.AutoScalingHandlerTest_E0D68ADB8CBEE7C4-001/tempDir-001/node2/./readApiTestViolations_shard1_replica_n1/data/]
   [junit4]   2> 2176309 INFO  (qtp1110992179-36879) [n:127.0.0.1:44795_solr c:readApiTestViolations s:shard1 r:core_node11 x:readApiTestViolations_shard1_replica_n8] o.a.s.s.IndexSchema [readApiTestViolations_shard1_replica_n8] Schema name=minimal
   [junit4]   2> 2176309 INFO  (qtp1381085712-36878) [n:127.0.0.1:41145_solr c:readApiTestViolations s:shard1 r:core_node7 x:readApiTestViolations_shard1_replica_n4] o.a.s.s.IndexSchema [readApiTestViolations_shard1_replica_n4] Schema name=minimal
   [junit4]   2> 2176309 INFO  (qtp1381085712-36872) [n:127.0.0.1:41145_solr c:readApiTestViolations s:shard1 r:core_node12 x:readApiTestViolations_shard1_replica_n10] o.a.s.s.IndexSchema [readApiTestViolations_shard1_replica_n10] Schema name=minimal
   [junit4]   2> 2176311 INFO  (qtp1110992179-36879) [n:127.0.0.1:44795_solr c:readApiTestViolations s:shard1 r:core_node11 x:readApiTestViolations_shard1_replica_n8] o.a.s.s.IndexSchema Loaded schema minimal/1.1 with uniqueid field id
   [junit4]   2> 2176311 INFO  (qtp1110992179-36879) [n:127.0.0.1:44795_solr c:readApiTestViolations s:shard1 r:core_node11 x:readApiTestViolations_shard1_replica_n8] o.a.s.c.CoreContainer Creating SolrCore 'readApiTestViolations_shard1_replica_n8' using configuration from collection readApiTestViolations, trusted=true
   [junit4]   2> 2176312 INFO  (qtp1110992179-36879) [n:127.0.0.1:44795_solr c:readApiTestViolations s:shard1 r:core_node11 x:readApiTestViolations_shard1_replica_n8] o.a.s.m.r.SolrJmxReporter JMX monitoring for 'solr_44795.solr.core.readApiTestViolations.shard1.replica_n8' (registry 'solr.core.readApiTestViolations.shard1.replica_n8') enabled at server: com.sun.jmx.mbeanserver.JmxMBeanServer@292cfbf1
   [junit4]   2> 2176312 INFO  (qtp1110992179-36879) [n:127.0.0.1:44795_solr c:readApiTestViolations s:shard1 r:core_node11 x:readApiTestViolations_shard1_replica_n8] o.a.s.c.SolrCore solr.RecoveryStrategy.Builder
   [junit4]   2> 2176312 INFO  (qtp1381085712-36878) [n:127.0.0.1:41145_solr c:readApiTestViolations s:shard1 r:core_node7 x:readApiTestViolations_shard1_replica_n4] o.a.s.s.IndexSchema Loaded schema minimal/1.1 with uniqueid field id
   [junit4]   2> 2176312 INFO  (qtp1110992179-36879) [n:127.0.0.1:44795_solr c:readApiTestViolations s:shard1 r:core_node11 x:readApiTestViolations_shard1_replica_n8] o.a.s.c.SolrCore [[readApiTestViolations_shard1_replica_n8] ] Opening new SolrCore at [/home/jenkins/workspace/Lucene-Solr-7.x-Linux/solr/build/solr-core/test/J2/temp/solr.cloud.autoscaling.AutoScalingHandlerTest_E0D68ADB8CBEE7C4-001/tempDir-001/node2/readApiTestViolations_shard1_replica_n8], dataDir=[/home/jenkins/workspace/Lucene-Solr-7.x-Linux/solr/build/solr-core/test/J2/temp/solr.cloud.autoscaling.AutoScalingHandlerTest_E0D68ADB8CBEE7C4-001/tempDir-001/node2/./readApiTestViolations_shard1_replica_n8/data/]
   [junit4]   2> 2176312 INFO  (qtp1381085712-36872) [n:127.0.0.1:41145_solr c:readApiTestViolations s:shard1 r:core_node12 x:readApiTestViolations_shard1_replica_n10] o.a.s.s.IndexSchema Loaded schema minimal/1.1 with uniqueid field id
   [junit4]   2> 2176312 INFO  (qtp1381085712-36878) [n:127.0.0.1:41145_solr c:readApiTestViolations s:shard1 r:core_node7 x:readApiTestViolations_shard1_replica_n4] o.a.s.c.CoreContainer Creating SolrCore 'readApiTestViolations_shard1_replica_n4' using configuration from collection readApiTestViolations, trusted=true
   [junit4]   2> 2176312 INFO  (qtp1381085712-36872) [n:127.0.0.1:41145_solr c:readApiTestViolations s:shard1 r:core_node12 x:readApiTestViolations_shard1_replica_n10] o.a.s.c.CoreContainer Creating SolrCore 'readApiTestViolations_shard1_replica_n10' using configuration from collection readApiTestViolations, trusted=true
   [junit4]   2> 2176312 INFO  (qtp1381085712-36872) [n:127.0.0.1:41145_solr c:readApiTestViolations s:shard1 r:core_node12 x:readApiTestViolations_shard1_replica_n10] o.a.s.m.r.SolrJmxReporter JMX monitoring for 'solr_41145.solr.core.readApiTestViolations.shard1.replica_n10' (registry 'solr.core.readApiTestViolations.shard1.replica_n10') enabled at server: com.sun.jmx.mbeanserver.JmxMBeanServer@292cfbf1
   [junit4]   2> 2176312 INFO  (qtp1381085712-36878) [n:127.0.0.1:41145_solr c:readApiTestViolations s:shard1 r:core_node7 x:readApiTestViolations_shard1_replica_n4] o.a.s.m.r.SolrJmxReporter JMX monitoring for 'solr_41145.solr.core.readApiTestViolations.shard1.replica_n4' (registry 'solr.core.readApiTestViolations.shard1.replica_n4') enabled at server: com.sun.jmx.mbeanserver.JmxMBeanServer@292cfbf1
   [junit4]   2> 2176312 INFO  (qtp1381085712-36872) [n:127.0.0.1:41145_solr c:readApiTestViolations s:shard1 r:core_node12 x:readApiTestViolations_shard1_replica_n10] o.a.s.c.SolrCore solr.RecoveryStrategy.Builder
   [junit4]   2> 2176312 INFO  (qtp1381085712-36878) [n:127.0.0.1:41145_solr c:readApiTestViolations s:shard1 r:core_node7 x:readApiTestViolations_shard1_replica_n4] o.a.s.c.SolrCore solr.RecoveryStrategy.Builder
   [junit4]   2> 2176312 INFO  (qtp1381085712-36872) [n:127.0.0.1:41145_solr c:readApiTestViolations s:shard1 r:core_node12 x:readApiTestViolations_shard1_replica_n10] o.a.s.c.SolrCore [[readApiTestViolations_shard1_replica_n10] ] Opening new SolrCore at [/home/jenkins/workspace/Lucene-Solr-7.x-Linux/solr/build/solr-core/test/J2/temp/solr.cloud.autoscaling.AutoScalingHandlerTest_E0D68ADB8CBEE7C4-001/tempDir-001/node1/readApiTestViolations_shard1_replica_n10], dataDir=[/home/jenkins/workspace/Lucene-Solr-7.x-Linux/solr/build/solr-core/test/J2/temp/solr.cloud.autoscaling.AutoScalingHandlerTest_E0D68ADB8CBEE7C4-001/tempDir-001/node1/./readApiTestViolations_shard1_replica_n10/data/]
   [junit4]   2> 2176312 INFO  (qtp1381085712-36878) [n:127.0.0.1:41145_solr c:readApiTestViolations s:shard1 r:core_node7 x:readApiTestViolations_shard1_replica_n4] o.a.s.c.SolrCore [[readApiTestViolations_shard1_replica_n4] ] Opening new SolrCore at [/home/jenkins/workspace/Lucene-Solr-7.x-Linux/solr/build/solr-core/test/J2/temp/solr.cloud.autoscaling.AutoScalingHandlerTest_E0D68ADB8CBEE7C4-001/tempDir-001/node1/readApiTestViolations_shard1_replica_n4], dataDir=[/home/jenkins/workspace/Lucene-Solr-7.x-Linux/solr/build/solr-core/test/J2/temp/solr.cloud.autoscaling.AutoScalingHandlerTest_E0D68ADB8CBEE7C4-001/tempDir-001/node1/./readApiTestViolations_shard1_replica_n4/data/]
   [junit4]   2> 2176364 INFO  (qtp1381085712-36874) [n:127.0.0.1:41145_solr c:readApiTestViolations s:shard1 r:core_node5 x:readApiTestViolations_shard1_replica_n2] o.a.s.u.UpdateHandler Using UpdateLog implementation: org.apache.solr.update.UpdateLog
   [junit4]   2> 2176364 INFO  (qtp1381085712-36874) [n:127.0.0.1:41145_solr c:readApiTestViolations s:shard1 r:core_node5 x:readApiTestViolations_shard1_replica_n2] o.a.s.u.UpdateLog Initializing UpdateLog: dataDir=null defaultSyncLevel=FLUSH numRecordsToKeep=100 maxNumLogsToKeep=10 numVersionBuckets=65536
   [junit4]   2> 2176366 INFO  (qtp1381085712-36874) [n:127.0.0.1:41145_solr c:readApiTestViolations s:shard1 r:core_node5 x:readApiTestViolations_shard1_replica_n2] o.a.s.u.CommitTracker Hard AutoCommit: disabled
   [junit4]   2> 2176366 INFO  (qtp1381085712-36874) [n:127.0.0.1:41145_solr c:readApiTestViolations s:shard1 r:core_node5 x:readApiTestViolations_shard1_replica_n2] o.a.s.u.CommitTracker Soft AutoCommit: disabled
   [junit4]   2> 2176367 INFO  (qtp1381085712-36874) [n:127.0.0.1:41145_solr c:readApiTestViolations s:shard1 r:core_node5 x:readApiTestViolations_shard1_replica_n2] o.a.s.s.SolrIndexSearcher Opening [Searcher@7f9dd75e[readApiTestViolations_shard1_replica_n2] main]
   [junit4]   2> 2176367 INFO  (qtp1110992179-36879) [n:127.0.0.1:44795_solr c:readApiTestViolations s:shard1 r:core_node11 x:readApiTestViolations_shard1_replica_n8] o.a.s.u.UpdateHandler Using UpdateLog implementation: org.apache.solr.update.UpdateLog
   [junit4]   2> 2176367 INFO  (qtp1110992179-36879) [n:127.0.0.1:44795_solr c:readApiTestViolations s:shard1 r:core_node11 x:readApiTestViolations_shard1_replica_n8] o.a.s.u.UpdateLog Initializing UpdateLog: dataDir=null defaultSyncLevel=FLUSH numRecordsToKeep=100 maxNumLogsToKeep=10 numVersionBuckets=65536
   [junit4]   2> 2176368 INFO  (qtp1110992179-36879) [n:127.0.0.1:44795_solr c:readApiTestViolations s:shard1 r:core_node11 x:readApiTestViolations_shard1_replica_n8] o.a.s.u.CommitTracker Hard AutoCommit: disabled
   [junit4]   2> 2176368 INFO  (qtp1110992179-36879) [n:127.0.0.1:44795_solr c:readApiTestViolations s:shard1 r:core_node11 x:readApiTestViolations_shard1_replica_n8] o.a.s.u.CommitTracker Soft AutoCommit: disabled
   [junit4]   2> 2176369 INFO  (qtp1110992179-36879) [n:127.0.0.1:44795_solr c:readApiTestViolations s:shard1 r:core_node11 x:readApiTestViolations_shard1_replica_n8] o.a.s.s.SolrIndexSearcher Opening [Searcher@2621a7cd[readApiTestViolations_shard1_replica_n8] main]
   [junit4]   2> 2176369 INFO  (qtp1381085712-36874) [n:127.0.0.1:41145_solr c:readApiTestViolations s:shard1 r:core_node5 x:readApiTestViolations_shard1_replica_n2] o.a.s.r.ManagedResourceStorage Configured ZooKeeperStorageIO with znodeBase: /configs/conf
   [junit4]   2> 2176370 INFO  (qtp1110992179-36887) [n:127.0.0.1:44795_solr c:readApiTestViolations s:shard1 r:core_node9 x:readApiTestViolations_shard1_replica_n6] o.a.s.u.UpdateHandler Using UpdateLog implementation: org.apache.solr.update.UpdateLog
   [junit4]   2> 2176370 INFO  (qtp1381085712-36874) [n:127.0.0.1:41145_solr c:readApiTestViolations s:shard1 r:core_node5 x:readApiTestViolations_shard1_replica_n2] o.a.s.r.ManagedResourceStorage Loaded null at path _rest_managed.json using ZooKeeperStorageIO:path=/configs/conf
   [junit4]   2> 2176370 INFO  (qtp1110992179-36887) [n:127.0.0.1:44795_solr c:readApiTestViolations s:shard1 r:core_node9 x:readApiTestViolations_shard1_replica_n6] o.a.s.u.UpdateLog Initializing UpdateLog: dataDir=null defaultSyncLevel=FLUSH numRecordsToKeep=100 maxNumLogsToKeep=10 numVersionBuckets=65536
   [junit4]   2> 2176370 INFO  (qtp1110992179-36879) [n:127.0.0.1:44795_solr c:readApiTestViolations s:shard1 r:core_node11 x:readApiTestViolations_shard1_replica_n8] o.a.s.r.ManagedResourceStorage Configured ZooKeeperStorageIO with znodeBase: /configs/conf
   [junit4]   2> 2176370 INFO  (qtp1110992179-36879) [n:127.0.0.1:44795_solr c:readApiTestViolations s:shard1 r:core_node11 x:readApiTestViolations_shard1_replica_n8] o.a.s.r.ManagedResourceStorage Loaded null at path _rest_managed.json using ZooKeeperStorageIO:path=/configs/conf
   [junit4]   2> 2176370 INFO  (qtp1381085712-36874) [n:127.0.0.1:41145_solr c:readApiTestViolations s:shard1 r:core_node5 x:readApiTestViolations_shard1_replica_n2] o.a.s.h.ReplicationHandler Commits will be reserved for 10000ms.
   [junit4]   2> 2176370 INFO  (qtp1110992179-36879) [n:127.0.0.1:44795_solr c:readApiTestViolations s:shard1 r:core_node11 x:readApiTestViolations_shard1_replica_n8] o.a.s.h.ReplicationHandler Commits will be reserved for 10000ms.
   [junit4]   2> 2176371 INFO  (qtp1110992179-36879) [n:127.0.0.1:44795_solr c:readApiTestViolations s:shard1 r:core_node11 x:readApiTestViolations_shard1_replica_n8] o.a.s.u.UpdateLog Could not find max version in index or recent updates, using new clock 1588006783383764992
   [junit4]   2> 2176371 INFO  (searcherExecutor-10174-thread-1-processing-n:127.0.0.1:41145_solr x:readApiTestViolations_shard1_replica_n2 s:shard1 c:readApiTestViolations r:core_node5) [n:127.0.0.1:41145_solr c:readApiTestViolations s:shard1 r:core_node5 x:readApiTestViolations_shard1_replica_n2] o.a.s.c.SolrCore [readApiTestViolations_shard1_replica_n2] Registered new searcher Searcher@7f9dd75e[readApiTestViolations_shard1_replica_n2] main{ExitableDirectoryReader(UninvertingDirectoryReader())}
   [junit4]   2> 2176371 INFO  (searcherExecutor-10177-thread-1-processing-n:127.0.0.1:44795_solr x:readApiTestViolations_shard1_replica_n8 s:shard1 c:readApiTestViolations r:core_node11) [n:127.0.0.1:44795_solr c:readApiTestViolations s:shard1 r:core_node11 x:readApiTestViolations_shard1_replica_n8] o.a.s.c.SolrCore [readApiTestViolations_shard1_replica_n8] Registered new searcher Searcher@2621a7cd[readApiTestViolations_shard1_replica_n8] main{ExitableDirectoryReader(UninvertingDirectoryReader())}
   [junit4]   2> 2176372 INFO  (qtp1110992179-36887) [n:127.0.0.1:44795_solr c:readApiTestViolations s:shard1 r:core_node9 x:readApiTestViolations_shard1_replica_n6] o.a.s.u.CommitTracker Hard AutoCommit: disabled
   [junit4]   2> 2176372 INFO  (qtp1110992179-36887) [n:127.0.0.1:44795_solr c:readApiTestViolations s:shard1 r:core_node9 x:readApiTestViolations_shard1_replica_n6] o.a.s.u.CommitTracker Soft AutoCommit: disabled
   [junit4]   2> 2176372 INFO  (qtp1381085712-36878) [n:127.0.0.1:41145_solr c:readApiTestViolations s:shard1 r:core_node7 x:readApiTestViolations_shard1_replica_n4] o.a.s.u.UpdateHandler Using UpdateLog implementation: org.apache.solr.update.UpdateLog
   [junit4]   2> 2176372 INFO  (qtp1381085712-36878) [n:127.0.0.1:41145_solr c:readApiTestViolations s:shard1 r:core_node7 x:readApiTestViolations_shard1_replica_n4] o.a.s.u.UpdateLog Initializing UpdateLog: dataDir=null defaultSyncLevel=FLUSH numRecordsToKeep=100 maxNumLogsToKeep=10 numVersionBuckets=65536
   [junit4]   2> 2176373 INFO  (qtp1381085712-36874) [n:127.0.0.1:41145_solr c:readApiTestViolations s:shard1 r:core_node5 x:readApiTestViolations_shard1_replica_n2] o.a.s.u.UpdateLog Could not find max version in index or recent updates, using new clock 1588006783385862144
   [junit4]   2> 2176373 INFO  (qtp1110992179-36887) [n:127.0.0.1:44795_solr c:readApiTestViolations s:shard1 r:core_node9 x:readApiTestViolations_shard1_replica_n6] o.a.s.s.SolrIndexSearcher Opening [Searcher@f3a3b44[readApiTestViolations_shard1_replica_n6] main]
   [junit4]   2> 2176374 INFO  (qtp1110992179-36887) [n:127.0.0.1:44795_solr c:readApiTestViolations s:shard1 r:core_node9 x:readApiTestViolations_shard1_replica_n6] o.a.s.r.ManagedResourceStorage Configured ZooKeeperStorageIO with znodeBase: /configs/conf
   [junit4]   2> 2176374 INFO  (qtp1381085712-36878) [n:127.0.0.1:41145_solr c:readApiTestViolations s:shard1 r:core_node7 x:readApiTestViolations_shard1_replica_n4] o.a.s.u.CommitTracker Hard AutoCommit: disabled
   [junit4]   2> 2176374 INFO  (qtp1110992179-36887) [n:127.0.0.1:44795_solr c:readApiTestViolations s:shard1 r:core_node9 x:readApiTestViolations_shard1_replica_n6] o.a.s.r.ManagedResourceStorage Loaded null at path _rest_managed.json using ZooKeeperStorageIO:path=/configs/conf
   [junit4]   2> 2176374 INFO  (qtp1381085712-36878) [n:127.0.0.1:41145_solr c:readApiTestViolations s:shard1 r:core_node7 x:readApiTestViolations_shard1_replica_n4] o.a.s.u.CommitTracker Soft AutoCommit: disabled
   [junit4]   2> 2176374 INFO  (qtp1110992179-36879) [n:127.0.0.1:44795_solr c:readApiTestViolations s:shard1 r:core_node11 x:readApiTestViolations_shard1_replica_n8] o.a.s.c.ShardLeaderElectionContext Waiting until we see more replicas up for shard shard1: total=6 found=1 timeoutin=9999ms
   [junit4]   2> 2176374 INFO  (qtp1110992179-36883) [n:127.0.0.1:44795_solr c:readApiTestViolations s:shard1 r:core_node3 x:readApiTestViolations_shard1_replica_n1] o.a.s.u.UpdateHandler Using UpdateLog implementation: org.apache.solr.update.UpdateLog
   [junit4]   2> 2176375 INFO  (qtp1110992179-36883) [n:127.0.0.1:44795_solr c:readApiTestViolations s:shard1 r:core_node3 x:readApiTestViolations_shard1_replica_n1] o.a.s.u.UpdateLog Initializing UpdateLog: dataDir=null defaultSyncLevel=FLUSH numRecordsToKeep=100 maxNumLogsToKeep=10 numVersionBuckets=65536
   [junit4]   2> 2176375 INFO  (qtp1381085712-36872) [n:127.0.0.1:41145_solr c:readApiTestViolations s:shard1 r:core_node12 x:readApiTestViolations_shard1_replica_n10] o.a.s.u.UpdateHandler Using UpdateLog implementation: org.apache.solr.update.UpdateLog
   [junit4]   2> 2176375 INFO  (qtp1381085712-36872) [n:127.0.0.1:41145_solr c:readApiTestViolations s:shard1 r:core_node12 x:readApiTestViolations_shard1_replica_n10] o.a.s.u.UpdateLog Initializing UpdateLog: dataDir=null defaultSyncLevel=FLUSH numRecordsToKeep=100 maxNumLogsToKeep=10 numVersionBuckets=65536
   [junit4]   2> 2176376 INFO  (qtp1110992179-36883) [n:127.0.0.1:44795_solr c:readApiTestViolations s:shard1 r:core_node3 x:readApiTestViolations_shard1_replica_n1] o.a.s.u.CommitTracker Hard AutoCommit: disabled
   [junit4]   2> 2176376 INFO  (qtp1110992179-36883) [n:127.0.0.1:44795_solr c:readApiTestViolations s:shard1 r:core_node3 x:readApiTestViolations_shard1_replica_n1] o.a.s.u.CommitTracker Soft AutoCommit: disabled
   [junit4]   2> 2176376 INFO  (qtp1381085712-36872) [n:127.0.0.1:41145_solr c:readApiTestViolations s:shard1 r:core_node12 x:readApiTestViolations_shard1_replica_n10] o.a.s.u.CommitTracker Hard AutoCommit: disabled
   [junit4]   2> 2176376 INFO  (qtp1381085712-36872) [n:127.0.0.1:41145_solr c:readApiTestViolations s:shard1 r:core_node12 x:readApiTestViolations_shard1_replica_n10] o.a.s.u.CommitTracker Soft AutoCommit: disabled
   [junit4]   2> 2176376 INFO  (qtp1110992179-36887) [n:127.0.0.1:44795_solr c:readApiTestViolations s:shard1 r:core_node9 x:readApiTestViolations_shard1_replica_n6] o.a.s.h.ReplicationHandler Commits will be reserved for 10000ms.
   [junit4]   2> 2176377 INFO  (qtp1381085712-36878) [n:127.0.0.1:41145_solr c:readApiTestViolations s:shard1 r:core_node7 x:readApiTestViolations_shard1_replica_n4] o.a.s.s.SolrIndexSearcher Opening [Searcher@19e5825[readApiTestViolations_shard1_replica_n4] main]
   [junit4]   2> 2176377 INFO  (qtp1110992179-36883) [n:127.0.0.1:44795_solr c:readApiTestViolations s:shard1 r:core_node3 x:readApiTestViolations_shard1_replica_n1] o.a.s.s.SolrIndexSearcher Opening [Searcher@113d5273[readApiTestViolations_shard1_replica_n1] main]
   [junit4]   2> 2176377 INFO  (qtp1381085712-36872) [n:127.0.0.1:41145_solr c:readApiTestViolations s:shard1 r:core_node12 x:readApiTestViolations_shard1_replica_n10] o.a.s.s.SolrIndexSearcher Opening [Searcher@39263d0[readApiTestViolations_shard1_replica_n10] main]
   [junit4]   2> 2176377 INFO  (searcherExecutor-10175-thread-1-processing-n:127.0.0.1:44795_solr x:readApiTestViolations_shard1_replica_n6 s:shard1 c:readApiTestViolations r:core_node9) [n:127.0.0.1:44795_solr c:readApiTestViolations s:shard1 r:core_node9 x:readApiTestViolations_shard1_replica_n6] o.a.s.c.SolrCore [readApiTestViolations_shard1_replica_n6] Registered new searcher Searcher@f3a3b44[readApiTestViolations_shard1_replica_n6] main{ExitableDirectoryReader(UninvertingDirectoryReader())}
   [junit4]   2> 2176377 INFO  (qtp1110992179-36887) [n:127.0.0.1:44795_solr c:readApiTestViolations s:shard1 r:core_node9 x:readApiTestViolations_shard1_replica_n6] o.a.s.u.UpdateLog Could not find max version in index or recent updates, using new clock 1588006783390056448
   [junit4]   2> 2176377 INFO  (qtp1110992179-36883) [n:127.0.0.1:44795_solr c:readApiTestViolations s:shard1 r:core_node3 x:readApiTestViolations_shard1_replica_n1] o.a.s.r.ManagedResourceStorage Configured ZooKeeperStorageIO with znodeBase: /configs/conf
   [junit4]   2> 2176377 INFO  (qtp1381085712-36872) [n:127.0.0.1:41145_solr c:readApiTestViolations s:shard1 r:core_node12 x:readApiTestViolations_shard1_replica_n10] o.a.s.r.ManagedResourceStorage Configured ZooKeeperStorageIO with znodeBase: /configs/conf
   [junit4]   2> 2176378 INFO  (qtp1110992179-36883) [n:127.0.0.1:44795_solr c:readApiTestViolations s:shard1 r:core_node3 x:readApiTestViolations_shard1_replica_n1] o.a.s.r.ManagedResourceStorage Loaded null at path _rest_managed.json using ZooKeeperStorageIO:path=/configs/conf
   [junit4]   2> 2176378 INFO  (qtp1381085712-36872) [n:127.0.0.1:41145_solr c:readApiTestViolations s:shard1 r:core_node12 x:readApiTestViolations_shard1_replica_n10] o.a.s.r.ManagedResourceStorage Loaded null at path _rest_managed.json using ZooKeeperStorageIO:path=/configs/conf
   [junit4]   2> 2176378 INFO  (qtp1110992179-36883) [n:127.0.0.1:44795_solr c:readApiTestViolations s:shard1 r:core_node3 x:readApiTestViolations_shard1_replica_n1] o.a.s.h.ReplicationHandler Commits will be reserved for 10000ms.
   [junit4]   2> 2176378 INFO  (qtp1381085712-36872) [n:127.0.0.1:41145_solr c:readApiTestViolations s:shard1 r:core_node12 x:readApiTestViolations_shard1_replica_n10] o.a.s.h.ReplicationHandler Commits will be reserved for 10000ms.
   [junit4]   2> 2176378 INFO  (qtp1381085712-36872) [n:127.0.0.1:41145_solr c:readApiTestViolations s:shard1 r:core_node12 x:readApiTestViolations_shard1_replica_n10] o.a.s.u.UpdateLog Could not find max version in index or recent updates, using new clock 1588006783391105024
   [junit4]   2> 2176379 INFO  (searcherExecutor-10176-thread-1-processing-n:127.0.0.1:44795_solr x:readApiTestViolations_shard1_replica_n1 s:shard1 c:readApiTestViolations r:core_node3) [n:127.0.0.1:44795_solr c:readApiTestViolations s:shard1 r:core_node3 x:readApiTestViolations_shard1_replica_n1] o.a.s.c.SolrCore [readApiTestViolations_shard1_replica_n1] Registered new searcher Searcher@113d5273[readApiTestViolations_shard1_replica_n1] main{ExitableDirectoryReader(UninvertingDirectoryReader())}
   [junit4]   2> 2176379 INFO  (searcherExecutor-10179-thread-1-processing-n:127.0.0.1:41145_solr x:readApiTestViolations_shard1_replica_n10 s:shard1 c:readApiTestViolations r:core_node12) [n:127.0.0.1:41145_solr c:readApiTestViolations s:shard1 r:core_node12 x:readApiTestViolations_shard1_replica_n10] o.a.s.c.SolrCore [readApiTestViolations_shard1_replica_n10] Registered new searcher Searcher@39263d0[readApiTestViolations_shard1_replica_n10] main{ExitableDirectoryReader(UninvertingDirectoryReader())}
   [junit4]   2> 2176379 INFO  (qtp1110992179-36883) [n:127.0.0.1:44795_solr c:readApiTestViolations s:shard1 r:core_node3 x:readApiTestViolations_shard1_replica_n1] o.a.s.u.UpdateLog Could not find max version in index or recent updates, using new clock 1588006783392153600
   [junit4]   2> 2176380 INFO  (qtp1381085712-36878) [n:127.0.0.1:41145_solr c:readApiTestViolations s:shard1 r:core_node7 x:readApiTestViolations_shard1_replica_n4] o.a.s.r.ManagedResourceStorage Configured ZooKeeperStorageIO with znodeBase: /configs/conf
   [junit4]   2> 2176380 INFO  (qtp1381085712-36878) [n:127.0.0.1:41145_solr c:readApiTestViolations s:shard1 r:core_node7 x:readApiTestViolations_shard1_replica_n4] o.a.s.r.ManagedResourceStorage Loaded null at path _rest_managed.json using ZooKeeperStorageIO:path=/configs/conf
   [junit4]   2> 2176381 INFO  (qtp1381085712-36878) [n:127.0.0.1:41145_solr c:readApiTestViolations s:shard1 r:core_node7 x:readApiTestViolations_shard1_replica_n4] o.a.s.h.ReplicationHandler Commits will be reserved for 10000ms.
   [junit4]   2> 2176381 INFO  (searcherExecutor-10178-thread-1-processing-n:127.0.0.1:41145_solr x:readApiTestViolations_shard1_replica_n4 s:shard1 c:readApiTestViolations r:core_node7) [n:127.0.0.1:41145_solr c:readApiTestViolations s:shard1 r:core_node7 x:readApiTestViolations_shard1_replica_n4] o.a.s.c.SolrCore [readApiTestViolations_shard1_replica_n4] Registered new searcher Searcher@19e5825[readApiTestViolations_shard1_replica_n4] main{ExitableDirectoryReader(UninvertingDirectoryReader())}
   [junit4]   2> 2176381 INFO  (qtp1381085712-36878) [n:127.0.0.1:41145_solr c:readApiTestViolations s:shard1 r:core_node7 x:readApiTestViolations_shard1_replica_n4] o.a.s.u.UpdateLog Could not find max version in index or recent updates, using new clock 1588006783394250752
   [junit4]   2> 2176875 INFO  (qtp1110992179-36879) [n:127.0.0.1:44795_solr c:readApiTestViolations s:shard1 r:core_node11 x:readApiTestViolations_shard1_replica_n8] o.a.s.c.ShardLeaderElectionContext Enough replicas found to continue.
   [junit4]   2> 2176875 INFO  (qtp1110992179-36879) [n:127.0.0.1:44795_solr c:readApiTestViolations s:shard1 r:core_node11 x:readApiTestViolations_shard1_replica_n8] o.a.s.c.ShardLeaderElectionContext I may be the new leader - try and sync
   [junit4]   2> 2176875 INFO  (qtp1110992179-36879) [n:127.0.0.1:44795_solr c:readApiTestViolations s:shard1 r:core_node11 x:readApiTestViolations_shard1_replica_n8] o.a.s.c.SyncStrategy Sync replicas to http://127.0.0.1:44795/solr/readApiTestViolations_shard1_replica_n8/
   [junit4]   2> 2176875 INFO  (qtp1110992179-36879) [n:127.0.0.1:44795_solr c:readApiTestViolations s:shard1 r:core_node11 x:readApiTestViolations_shard1_replica_n8] o.a.s.u.PeerSync PeerSync: core=readApiTestViolations_shard1_replica_n8 url=http://127.0.0.1:44795/solr START replicas=[http://127.0.0.1:44795/solr/readApiTestViolations_shard1_replica_n1/, http://127.0.0.1:41145/solr/readApiTestViolations_shard1_replica_n2/, http://127.0.0.1:41145/solr/readApiTestViolations_shard1_replica_n4/, http://127.0.0.1:44795/solr/readApiTestViolations_shard1_replica_n6/, http://127.0.0.1:41145/solr/readApiTestViolations_shard1_replica_n10/] nUpdates=100
   [junit4]   2> 2176876 INFO  (qtp1110992179-36877) [n:127.0.0.1:44795_solr c:readApiTestViolations s:shard1 r:core_node3 x:readApiTestViolations_shard1_replica_n1] o.a.s.c.S.Request [readApiTestViolations_shard1_replica_n1]  webapp=/solr path=/get params={distrib=false&qt=/get&fingerprint=false&getVersions=100&wt=javabin&version=2} status=0 QTime=0
   [junit4]   2> 2176876 INFO  (qtp1381085712-36876) [n:127.0.0.1:41145_solr c:readApiTestViolations s:shard1 r:core_node7 x:readApiTestViolations_shard1_replica_n4] o.a.s.c.S.Request [readApiTestViolations_shard1_replica_n4]  webapp=/solr path=/get params={distrib=false&qt=/get&fingerprint=false&getVersions=100&wt=javabin&version=2} status=0 QTime=0
   [junit4]   2> 2176876 INFO  (qtp1110992179-36885) [n:127.0.0.1:44795_solr c:readApiTestViolations s:shard1 r:core_node9 x:readApiTestViolations_shard1_replica_n6] o.a.s.c.S.Request [readApiTestViolations_shard1_replica_n6]  webapp=/solr path=/get params={distrib=false&qt=/get&fingerprint=false&getVersions=100&wt=javabin&version=2} status=0 QTime=0
   [junit4]   2> 2176876 INFO  (qtp1381085712-36884) [n:127.0.0.1:41145_solr c:readApiTestViolations s:shard1 r:core_node5 x:readApiTestViolations_shard1_replica_n2] o.a.s.c.S.Request [readApiTestViolations_shard1_replica_n2]  webapp=/solr path=/get params={distrib=false&qt=/get&fingerprint=false&getVersions=100&wt=javabin&version=2} status=0 QTime=0
   [junit4]   2> 2176876 INFO  (qtp1381085712-36876) [n:127.0.0.1:41145_solr c:readApiTestViolations s:shard1 r:core_node12 x:readApiTestViolations_shard1_replica_n10] o.a.s.c.S.Request [readApiTestViolations_shard1_replica_n10]  webapp=/solr path=/get params={distrib=false&qt=/get&fingerprint=false&getVersions=100&wt=javabin&version=2} status=0 QTime=0
   [junit4]   2> 2177176 INFO  (qtp1110992179-36879) [n:127.0.0.1:44795_solr c:readApiTestViolations s:shard1 r:core_node11 x:readApiTestViolations_shard1_replica_n8] o.a.s.u.PeerSync PeerSync: core=readApiTestViolations_shard1_replica_n8 url=http://127.0.0.1:44795/solr DONE.  We have no versions.  sync failed.
   [junit4]   2> 2177176 INFO  (qtp1110992179-36879) [n:127.0.0.1:44795_solr c:readApiTestViolations s:shard1 r:core_node11 x:readApiTestViolations_shard1_replica_n8] o.a.s.c.SyncStrategy Leader's attempt to sync with shard failed, moving to the next candidate
   [junit4]   2> 2177176 INFO  (qtp1110992179-36879) [n:127.0.0.1:44795_solr c:readApiTestViolations s:shard1 r:core_node11 x:readApiTestViolations_shard1_replica_n8] o.a.s.c.ShardLeaderElectionContext We failed sync, but we have no versions - we can't sync in that case - we were active before, so become leader anyway
   [junit4]   2> 2177176 INFO  (qtp1110992179-36879) [n:127.0.0.1:44795_solr c:readApiTestViolations s:shard1 r:core_node11 x:readApiTestViolations_shard1_replica_n8] o.a.s.c.ShardLeaderElectionContext Found all replicas participating in election, clear LIR
   [junit4]   2> 2177178 INFO  (qtp1110992179-36879) [n:127.0.0.1:44795_solr c:readApiTestViolations s:shard1 r:core_node11 x:readApiTestViolations_shard1_replica_n8] o.a.s.c.ShardLeaderElectionContext I am the new leader: http://127.0.0.1:44795/solr/readApiTestViolations_shard1_replica_n8/ shard1
   [junit4]   2> 2354956 ERROR (qtp1110992179-36873) [n:127.0.0.1:44795_solr    ] o.a.s.h.RequestHandlerBase org.apache.solr.common.SolrException: create the collection time out:180s
   [junit4]   2> 	at org.apache.solr.handler.admin.CollectionsHandler.handleResponse(CollectionsHandler.java:314)
   [junit4]   2> 	at org.apache.solr.handler.admin.CollectionsHandler.invokeAction(CollectionsHandler.java:246)
   [junit4]   2> 	at org.apache.solr.handler.admin.CollectionsHandler.handleRequestBody(CollectionsHandler.java:224)
   [junit4]   2> 	at org.apache.solr.handler.RequestHandlerBase.handleRequest(RequestHandlerBase.java:177)
   [junit4]   2> 	at org.apache.solr.servlet.HttpSolrCall.handleAdmin(HttpSolrCall.java:736)
   [junit4]   2> 	at org.apache.solr.servlet.HttpSolrCall.handleAdminRequest(HttpSolrCall.java:717)
   [junit4]   2> 	at org.apache.solr.servlet.HttpSolrCall.call(HttpSolrCall.java:498)
   [junit4]   2> 	at org.apache.solr.servlet.SolrDispatchFilter.doFilter(SolrDispatchFilter.java:382)
   [junit4]   2> 	at org.apache.solr.servlet.SolrDispatchFilter.doFilter(SolrDispatchFilter.java:326)
   [junit4]   2> 	at org.eclipse.jetty.servlet.ServletHandler$CachedChain.doFilter(ServletHandler.java:1759)
   [junit4]   2> 	at org.apache.solr.client.solrj.embedded.JettySolrRunner$DebugFilter.doFilter(JettySolrRunner.java:139)
   [junit4]   2> 	at org.eclipse.jetty.servlet.ServletHandler$CachedChain.doFilter(ServletHandler.java:1759)
   [junit4]   2> 	at org.eclipse.jetty.servlet.ServletHandler.doHandle(ServletHandler.java:582)
   [junit4]   2> 	at org.eclipse.jetty.server.session.SessionHandler.doHandle(SessionHandler.java:224)
   [junit4]   2> 	at org.eclipse.jetty.server.handler.ContextHandler.doHandle(ContextHandler.java:1180)
   [junit4]   2> 	at org.eclipse.jetty.servlet.ServletHandler.doScope(ServletHandler.java:512)
   [junit4]   2> 	at org.eclipse.jetty.server.session.SessionHandler.doScope(SessionHandler.java:185)
   [junit4]   2> 	at org.eclipse.jetty.server.handler.ContextHandler.doScope(ContextHandler.java:1112)
   [junit4]   2> 	at org.eclipse.jetty.server.handler.ScopedHandler.handle(ScopedHandler.java:141)
   [junit4]   2> 	at org.eclipse.jetty.server.handler.gzip.GzipHandler.handle(GzipHandler.java:493)
   [junit4]   2> 	at org.eclipse.jetty.server.handler.HandlerWrapper.handle(HandlerWrapper.java:134)
   [junit4]   2> 	at org.eclipse.jetty.server.Server.handle(Server.java:534)
   [junit4]   2> 	at org.eclipse.jetty.server.HttpChannel.handle(HttpChannel.java:320)
   [junit4]   2> 	at org.eclipse.jetty.server.HttpConnection.onFillable(HttpConnection.java:251)
   [junit4]   2> 	at org.eclipse.jetty.io.AbstractConnection$ReadCallback.succeeded(AbstractConnection.java:283)
   [junit4]   2> 	at org.eclipse.jetty.io.FillInterest.fillable(FillInterest.java:108)
   [junit4]   2> 	at org.eclipse.jetty.io.SelectChannelEndPoint$2.run(SelectChannelEndPoint.java:93)
   [junit4]   2> 	at org.eclipse.jetty.util.thread.strategy.ExecuteProduceConsume.executeProduceConsume(ExecuteProduceConsume.java:303)
   [junit4]   2> 	at org.eclipse.jetty.util.thread.strategy.ExecuteProduceConsume.produceConsume(ExecuteProduceConsume.java:148)
   [junit4]   2> 	at org.eclipse.jetty.util.thread.strategy.ExecuteProduceConsume.run(ExecuteProduceConsume.java:136)
   [junit4]   2> 	at org.eclipse.jetty.util.thread.QueuedThreadPool.runJob(QueuedThreadPool.java:671)
   [junit4]   2> 	at org.eclipse.jetty.util.thread.QueuedThreadPool$2.run(QueuedThreadPool.java:589)
   [junit4]   2> 	at java.lang.Thread.run(Thread.java:748)
   [junit4]   2> 
   [junit4]   2> 2354956 INFO  (qtp1110992179-36873) [n:127.0.0.1:44795_solr    ] o.a.s.s.HttpSolrCall [admin] webapp=null path=/admin/collections params={replicationFactor=6&collection.configName=conf&name=readApiTestViolations&nrtReplicas=6&action=CREATE&numShards=1&wt=javabin&version=2} status=500 QTime=180002
   [junit4]   2> 2354956 ERROR (qtp1110992179-36873) [n:127.0.0.1:44795_solr    ] o.a.s.s.HttpSolrCall null:org.apache.solr.common.SolrException: create the collection time out:180s
   [junit4]   2> 	at org.apache.solr.handler.admin.CollectionsHandler.handleResponse(CollectionsHandler.java:314)
   [junit4]   2> 	at org.apache.solr.handler.admin.CollectionsHandler.invokeAction(CollectionsHandler.java:246)
   [junit4]   2> 	at org.apache.solr.handler.admin.CollectionsHandler.handleRequestBody(CollectionsHandler.java:224)
   [junit4]   2> 	at org.apache.solr.handler.RequestHandlerBase.handleRequest(RequestHandlerBase.java:177)
   [junit4]   2> 	at org.apache.solr.servlet.HttpSolrCall.handleAdmin(HttpSolrCall.java:736)
   [junit4]   2> 	at org.apache.solr.servlet.HttpSolrCall.handleAdminRequest(HttpSolrCall.java:717)
   [junit4]   2> 	at org.apache.solr.servlet.HttpSolrCall.call(HttpSolrCall.java:498)
   [junit4]   2> 	at org.apache.solr.servlet.SolrDispatchFilter.doFilter(SolrDispatchFilter.java:382)
   [junit4]   2> 	at org.apache.solr.servlet.SolrDispatchFilter.doFilter(SolrDispatchFilter.java:326)
   [junit4]   2> 	at org.eclipse.jetty.servlet.ServletHandler$CachedChain.doFilter(ServletHandler.java:1759)
   [junit4]   2> 	at org.apache.solr.client.solrj.embedded.JettySolrRunner$DebugFilter.doFilter(JettySolrRunner.java:139)
   [junit4]   2> 	at org.eclipse.jetty.servlet.ServletHandler$CachedChain.doFilter(ServletHandler.java:1759)
   [junit4]   2> 	at org.eclipse.jetty.servlet.ServletHandler.doHandle(ServletHandler.java:582)
   [junit4]   2> 	at org.eclipse.jetty.server.session.SessionHandler.doHandle(SessionHandler.java:224)
   [junit4]   2> 	at org.eclipse.jetty.server.handler.ContextHandler.doHandle(ContextHandler.java:1180)
   [junit4]   2> 	at org.eclipse.jetty.servlet.ServletHandler.doScope(ServletHandler.java:512)
   [junit4]   2> 	at org.eclipse.jetty.server.session.SessionHandler.doScope(SessionHandler.java:185)
   [junit4]   2> 	at org.eclipse.jetty.server.handler.ContextHandler.doScope(ContextHandler.java:1112)
   [junit4]   2> 	at org.eclipse.jetty.server.handler.ScopedHandler.handle(ScopedHandler.java:141)
   [junit4]   2> 	at org.eclipse.jetty.server.handler.gzip.GzipHandler.handle(GzipHandler.java:493)
   [junit4]   2> 	at org.eclipse.jetty.server.handler.HandlerWrapper.handle(HandlerWrapper.java:134)
   [junit4]   2> 	at org.eclipse.jetty.server.Server.handle(Server.java:534)
   [junit4]   2> 	at org.eclipse.jetty.server.HttpChannel.handle(HttpChannel.java:320)
   [junit4]   2> 	at org.eclipse.jetty.server.HttpConnection.onFillable(HttpConnection.java:251)
   [junit4]   2> 	at org.eclipse.jetty.io.AbstractConnection$ReadCallback.succeeded(AbstractConnection.java:283)
   [junit4]   2> 	at org.eclipse.jetty.io.FillInterest.fillable(FillInterest.java:108)
   [junit4]   2> 	at org.eclipse.jetty.io.SelectChannelEndPoint$2.run(SelectChannelEndPoint.java:93)
   [junit4]   2> 	at org.eclipse.jetty.util.thread.strategy.ExecuteProduceConsume.executeProduceConsume(ExecuteProduceConsume.java:303)
   [junit4]   2> 	at org.eclipse.jetty.util.thread.strategy.ExecuteProduceConsume.produceConsume(ExecuteProduceConsume.java:148)
   [junit4]   2> 	at org.eclipse.jetty.util.thread.strategy.ExecuteProduceConsume.run(ExecuteProduceConsume.java:136)
   [junit4]   2> 	at org.eclipse.jetty.util.thread.QueuedThreadPool.runJob(QueuedThreadPool.java:671)
   [junit4]   2> 	at org.eclipse.jetty.util.thread.QueuedThreadPool$2.run(QueuedThreadPool.java:589)
   [junit4]   2> 	at java.lang.Thread.run(Thread.java:748)
   [junit4]   2> 
   [junit4]   2> 2354957 INFO  (TEST-AutoScalingHandlerTest.testReadApi-seed#[E0D68ADB8CBEE7C4]) [    ] o.a.s.SolrTestCaseJ4 ###Ending testReadApi
   [junit4]   2> NOTE: reproduce with: ant test  -Dtestcase=AutoScalingHandlerTest -Dtests.method=testReadApi -Dtests.seed=E0D68ADB8CBEE7C4 -Dtests.multiplier=3 -Dtests.slow=true -Dtests.locale=es-CU -Dtests.timezone=Pacific/Auckland -Dtests.asserts=true -Dtests.file.encoding=UTF-8
   [junit4] ERROR    180s J2 | AutoScalingHandlerTest.testReadApi <<<
   [junit4]    > Throwable #1: org.apache.solr.client.solrj.impl.HttpSolrClient$RemoteSolrException: Error from server at http://127.0.0.1:44795/solr: create the collection time out:180s
   [junit4]    > 	at __randomizedtesting.SeedInfo.seed([E0D68ADB8CBEE7C4:B7FF716E574C05DF]:0)
   [junit4]    > 	at org.apache.solr.client.solrj.impl.HttpSolrClient.executeMethod(HttpSolrClient.java:643)
   [junit4]    > 	at org.apache.solr.client.solrj.impl.HttpSolrClient.request(HttpSolrClient.java:255)
   [junit4]    > 	at org.apache.solr.client.solrj.impl.HttpSolrClient.request(HttpSolrClient.java:244)
   [junit4]    > 	at org.apache.solr.client.solrj.impl.LBHttpSolrClient.doRequest(LBHttpSolrClient.java:483)
   [junit4]    > 	at org.apache.solr.client.solrj.impl.LBHttpSolrClient.request(LBHttpSolrClient.java:413)
   [junit4]    > 	at org.apache.solr.client.solrj.impl.CloudSolrClient.sendRequest(CloudSolrClient.java:1104)
   [junit4]    > 	at org.apache.solr.client.solrj.impl.CloudSolrClient.requestWithRetryOnStaleState(CloudSolrClient.java:884)
   [junit4]    > 	at org.apache.solr.client.solrj.impl.CloudSolrClient.request(CloudSolrClient.java:817)
   [junit4]    > 	at org.apache.solr.client.solrj.SolrRequest.process(SolrRequest.java:194)
   [junit4]    > 	at org.apache.solr.client.solrj.SolrRequest.process(SolrRequest.java:211)
   [junit4]    > 	at org.apache.solr.cloud.autoscaling.AutoScalingHandlerTest.testReadApi(AutoScalingHandlerTest.java:693)
   [junit4]    > 	at java.lang.Thread.run(Thread.java:748)
   [junit4]   2> 2354987 INFO  (TEST-AutoScalingHandlerTest.testConcurrentUpdates-seed#[E0D68ADB8CBEE7C4]) [    ] o.a.s.SolrTestCaseJ4 ###Starting testConcurrentUpdates
   [junit4]   2> 2354991 INFO  (qtp1110992179-36950) [n:127.0.0.1:44795_solr    ] o.a.s.s.HttpSolrCall [admin] webapp=null path=/admin/metrics params={prefix=CORE.coreName&wt=javabin&version=2&group=solr.core} status=0 QTime=0
   [junit4]   2> 2354991 INFO  (qtp1110992179-36975) [n:127.0.0.1:44795_solr    ] o.a.s.s.HttpSolrCall [admin] webapp=null path=/admin/metrics params={prefix=CORE.coreName&wt=javabin&version=2&group=solr.core} status=0 QTime=0
   [junit4]   2> 2354992 INFO  (qtp1381085712-36976) [n:127.0.0.1:41145_solr    ] o.a.s.s.HttpSolrCall [admin] webapp=null path=/admin/metrics params={prefix=CORE.coreName&wt=javabin&version=2&group=solr.core} status=0 QTime=0
   [junit4]   2> 2354992 INFO  (qtp1381085712-36977) [n:127.0.0.1:41145_solr    ] o.a.s.s.HttpSolrCall [admin] webapp=null path=/admin/metrics params={prefix=CORE.coreName&wt=javabin&version=2&group=solr.core} status=0 QTime=0
   [junit4]   2> 2354992 INFO  (qtp1381085712-36886) [n:127.0.0.1:41145_solr    ] o.a.s.s.HttpSolrCall [admin] webapp=null path=/cluster/autoscaling params={wt=javabin&version=2} status=0 QTime=3
   [junit4]   2> 2354994 INFO  (qtp1110992179-36877) [n:127.0.0.1:44795_solr    ] o.

[...truncated too long message...]

  2> 	at org.eclipse.jetty.util.thread.strategy.ExecuteProduceConsume.executeProduceConsume(ExecuteProduceConsume.java:303)
   [junit4]   2> 	at org.eclipse.jetty.util.thread.strategy.ExecuteProduceConsume.produceConsume(ExecuteProduceConsume.java:148)
   [junit4]   2> 	at org.eclipse.jetty.util.thread.strategy.ExecuteProduceConsume.run(ExecuteProduceConsume.java:136)
   [junit4]   2> 	at org.eclipse.jetty.util.thread.QueuedThreadPool.runJob(QueuedThreadPool.java:671)
   [junit4]   2> 	at org.eclipse.jetty.util.thread.QueuedThreadPool$2.run(QueuedThreadPool.java:589)
   [junit4]   2> 	at java.lang.Thread.run(Thread.java:748)
   [junit4]   2> Caused by: org.apache.solr.common.SolrException: No registered leader was found after waiting for 1220000ms , collection: readApiTestViolations slice: shard1 saw state=null with live_nodes=[]
   [junit4]   2> 	at org.apache.solr.common.cloud.ZkStateReader.getLeaderRetry(ZkStateReader.java:771)
   [junit4]   2> 	at org.apache.solr.common.cloud.ZkStateReader.getLeaderUrl(ZkStateReader.java:736)
   [junit4]   2> 	at org.apache.solr.cloud.ZkController.getLeader(ZkController.java:1178)
   [junit4]   2> 	... 41 more
   [junit4]   2> 
   [junit4]   2> 2415674 INFO  (qtp1381085712-36872) [n:127.0.0.1:41145_solr c:readApiTestViolations s:shard1 r:core_node12 x:readApiTestViolations_shard1_replica_n10] o.a.s.s.HttpSolrCall [admin] webapp=null path=/admin/cores params={qt=/admin/cores&coreNodeName=core_node12&collection.configName=conf&newCollection=true&name=readApiTestViolations_shard1_replica_n10&action=CREATE&numShards=1&collection=readApiTestViolations&shard=shard1&wt=javabin&version=2&replicaType=NRT} status=0 QTime=240407
   [junit4]   2> 2415680 INFO  (qtp1381085712-36874) [n:127.0.0.1:41145_solr c:readApiTestViolations s:shard1 r:core_node5 x:readApiTestViolations_shard1_replica_n2] o.a.s.s.HttpSolrCall [admin] webapp=null path=/admin/cores params={qt=/admin/cores&coreNodeName=core_node5&collection.configName=conf&newCollection=true&name=readApiTestViolations_shard1_replica_n2&action=CREATE&numShards=1&collection=readApiTestViolations&shard=shard1&wt=javabin&version=2&replicaType=NRT} status=0 QTime=240414
   [junit4]   2> 2415680 INFO  (qtp1381085712-36878) [n:127.0.0.1:41145_solr c:readApiTestViolations s:shard1 r:core_node7 x:readApiTestViolations_shard1_replica_n4] o.a.s.s.HttpSolrCall [admin] webapp=null path=/admin/cores params={qt=/admin/cores&coreNodeName=core_node7&collection.configName=conf&newCollection=true&name=readApiTestViolations_shard1_replica_n4&action=CREATE&numShards=1&collection=readApiTestViolations&shard=shard1&wt=javabin&version=2&replicaType=NRT} status=0 QTime=240412
   [junit4]   2> 2415681 ERROR (SUITE-AutoScalingHandlerTest-seed#[E0D68ADB8CBEE7C4]-worker) [    ] o.a.z.s.ZooKeeperServer ZKShutdownHandler is not registered, so ZooKeeper server won't take any action on ERROR or SHUTDOWN server state changes
   [junit4]   2> 2415681 INFO  (SUITE-AutoScalingHandlerTest-seed#[E0D68ADB8CBEE7C4]-worker) [    ] o.a.s.c.ZkTestServer connecting to 127.0.0.1:39461 39461
   [junit4]   2> 2421866 INFO  (Thread-10635) [    ] o.a.s.c.ZkTestServer connecting to 127.0.0.1:39461 39461
   [junit4]   2> 2421866 WARN  (Thread-10635) [    ] o.a.s.c.ZkTestServer Watch limit violations: 
   [junit4]   2> Maximum concurrent create/delete watches above limit:
   [junit4]   2> 
   [junit4]   2> 	3	/solr/aliases.json
   [junit4]   2> 	3	/solr/clusterprops.json
   [junit4]   2> 	2	/solr/security.json
   [junit4]   2> 	2	/solr/configs/conf
   [junit4]   2> 
   [junit4]   2> Maximum concurrent data watches above limit:
   [junit4]   2> 
   [junit4]   2> 	8	/solr/collections/readApiTestViolations/state.json
   [junit4]   2> 	3	/solr/clusterstate.json
   [junit4]   2> 	2	/solr/collections/readApiTestViolations/leader_elect/shard1/election/99250423847976965-core_node12-n_0000000003
   [junit4]   2> 	2	/solr/collections/readApiTestViolations/leader_elect/shard1/election/99250423847976965-core_node5-n_0000000001
   [junit4]   2> 
   [junit4]   2> Maximum concurrent children watches above limit:
   [junit4]   2> 
   [junit4]   2> 	3	/solr/live_nodes
   [junit4]   2> 	3	/solr/autoscaling/events/node_lost_trigger
   [junit4]   2> 	3	/solr/collections
   [junit4]   2> 	2	/solr/autoscaling/events/node_added_trigger
   [junit4]   2> 	2	/solr/autoscaling/events/node_added_trigger1
   [junit4]   2> 
   [junit4]   2> NOTE: leaving temporary files on disk at: /home/jenkins/workspace/Lucene-Solr-7.x-Linux/solr/build/solr-core/test/J2/temp/solr.cloud.autoscaling.AutoScalingHandlerTest_E0D68ADB8CBEE7C4-001
   [junit4]   2> NOTE: test params are: codec=Asserting(Lucene70): {}, docValues:{}, maxPointsInLeafNode=2044, maxMBSortInHeap=6.3327913680740835, sim=RandomSimilarity(queryNorm=true): {}, locale=es-CU, timezone=Pacific/Auckland
   [junit4]   2> NOTE: Linux 4.10.0-40-generic amd64/Oracle Corporation 1.8.0_144 (64-bit)/cpus=8,threads=1,free=259099480,total=536870912
   [junit4]   2> NOTE: All tests run in this JVM: [TestRandomRequestDistribution, TestReload, TestSmileRequest, TestCollectionsAPIViaSolrCloudCluster, HdfsCollectionsAPIDistributedZkTest, TestHalfAndHalfDocValues, DistanceFunctionTest, OverseerStatusTest, TestManagedStopFilterFactory, TestJsonRequest, SimplePostToolTest, ZkNodePropsTest, SolrJmxReporterTest, AlternateDirectoryTest, SolrCoreCheckLockOnStartupTest, TestSubQueryTransformerDistrib, TestClassicSimilarityFactory, TestPivotHelperCode, ReturnFieldsTest, ReplicationFactorTest, TestLegacyFieldCache, FullSolrCloudDistribCmdsTest, TestSolrCLIRunExample, TestExportWriter, SolrIndexMetricsTest, TestCloudSearcherWarming, DefaultValueUpdateProcessorTest, DocValuesNotIndexedTest, TestRealTimeGet, TestCharFilters, TestTrieFacet, LeaderElectionTest, TestRestManager, TestPayloadScoreQParserPlugin, SolrTestCaseJ4Test, DistributedFacetSimpleRefinementLongTailTest, BJQParserTest, CoreAdminHandlerTest, EnumFieldTest, TestMinMaxOnMultiValuedField, TestComplexPhraseLeadingWildcard, TestLeaderInitiatedRecoveryThread, TestFieldSortValues, RequestLoggingTest, TestSearchPerf, PreAnalyzedUpdateProcessorTest, EchoParamsTest, HdfsRecoveryZkTest, SortByFunctionTest, TestTolerantUpdateProcessorRandomCloud, NodeLostTriggerTest, TestDistributedMissingSort, TriLevelCompositeIdRoutingTest, ChaosMonkeyNothingIsSafeTest, TestEmbeddedSolrServerConstructors, TestCoreDiscovery, MigrateRouteKeyTest, CollectionsAPIAsyncDistributedZkTest, DistributedQueryComponentOptimizationTest, BlockCacheTest, HdfsDirectoryTest, HighlighterMaxOffsetTest, TestZkChroot, TestTolerantSearch, TestDistributedGrouping, FileBasedSpellCheckerTest, IndexSchemaTest, TestSchemalessBufferedUpdates, RecoveryZkTest, TestPerFieldSimilarityWithDefaultOverride, TestCollectionAPIs, DistributedFacetPivotLargeTest, HttpTriggerListenerTest, TestRequestForwarding, TestCloudDeleteByQuery, ComputePlanActionTest, TestIndexSearcher, AtomicUpdateProcessorFactoryTest, TestSolrFieldCacheBean, TestTriggerIntegration, TestMacroExpander, TestDistribDocBasedVersion, SpatialHeatmapFacetsTest, TestNoOpRegenerator, LeaderElectionContextKeyTest, RecoveryAfterSoftCommitTest, TestCloudPivotFacet, CustomCollectionTest, TestNestedDocsSort, SuggesterWFSTTest, TestHdfsUpdateLog, TestConfigOverlay, CopyFieldTest, UninvertDocValuesMergePolicyTest, TestImpersonationWithHadoopAuth, TestDynamicLoading, TestFieldCache, BitVectorTest, XmlUpdateRequestHandlerTest, TestSchemaVersionResource, TestHdfsCloudBackupRestore, AliasIntegrationTest, SolrShardReporterTest, TestDistribIDF, SystemInfoHandlerTest, PluginInfoTest, NodeMutatorTest, TestSolrCoreProperties, SharedFSAutoReplicaFailoverTest, ClusterStateTest, TestStressLiveNodes, SpellPossibilityIteratorTest, XsltUpdateRequestHandlerTest, FieldMutatingUpdateProcessorTest, BlockJoinFacetSimpleTest, TestMaxTokenLenTokenizer, SuggesterTest, TestNumericRangeQuery64, UniqFieldsUpdateProcessorFactoryTest, TestGroupingSearch, BasicDistributedZk2Test, BasicDistributedZkTest, OverseerTest, TestReplicationHandler, TestFaceting, TestRecovery, TestHashPartitioner, TestJoin, SimpleFacetsTest, StatsComponentTest, TestFiltering, ShowFileRequestHandlerTest, TestExtendedDismaxParser, TestFoldingMultitermQuery, DocValuesTest, TestStressLucene, TestTrie, WordBreakSolrSpellCheckerTest, TestPseudoReturnFields, TestWordDelimiterFilterFactory, StatelessScriptUpdateProcessorFactoryTest, SolrInfoBeanTest, DebugComponentTest, CacheHeaderTest, IndexBasedSpellCheckerTest, TestSurroundQueryParser, DisMaxRequestHandlerTest, TestWriterPerf, DirectSolrSpellCheckerTest, DocumentAnalysisRequestHandlerTest, TestQueryTypes, RequestHandlersTest, DocumentBuilderTest, TestValueSourceCache, TermVectorComponentTest, RequiredFieldsTest, FieldAnalysisRequestHandlerTest, TestSolrQueryParser, LoggingHandlerTest, RegexBoostProcessorTest, TestJmxIntegration, TestCollationField, TestCSVResponseWriter, MBeansHandlerTest, QueryParsingTest, JsonLoaderTest, BinaryUpdateRequestHandlerTest, TestPartialUpdateDeduplication, PingRequestHandlerTest, CSVRequestHandlerTest, SearchHandlerTest, TestLFUCache, TestLMDirichletSimilarityFactory, TestFastWriter, ScriptEngineTest, DateMathParserTest, TestSolrJ, TestUtils, SliceStateTest, CircularListTest, TestRTGBase, CursorPagingTest, TestCrossCoreJoin, TestCursorMarkWithoutUniqueKey, TestEmbeddedSolrServerAdminHandler, ConnectionReuseTest, AssignTest, CleanupOldIndexTest, CollectionsAPISolrJTest, DeleteLastCustomShardedReplicaTest, DeleteShardTest, DistribCursorPagingTest, DistribJoinFromCollectionTest, DistributedQueueTest, LeaderFailureAfterFreshStartTest, MoveReplicaHDFSTest, ReplaceNodeTest, SSLMigrationTest, SaslZkACLProviderTest, SolrCloudExampleTest, TestConfigSetsAPI, TestPullReplica, TestSkipOverseerOperations, TestSolrCloudWithSecureImpersonation, TestTlogReplica, AutoAddReplicasPlanActionTest, AutoScalingHandlerTest]
   [junit4] Completed [581/764 (1!)] on J2 in 247.24s, 8 tests, 2 errors <<< FAILURES!

[...truncated 48760 lines...]

Mime
View raw message