lucene-dev mailing list archives

Site index · List index
Message view « Date » · « Thread »
Top « Date » · « Thread »
From Policeman Jenkins Server <jenk...@thetaphi.de>
Subject [JENKINS-EA] Lucene-Solr-7.x-Linux (64bit/jdk-10-ea+32) - Build # 1009 - Still Unstable!
Date Mon, 18 Dec 2017 09:02:49 GMT
Build: https://jenkins.thetaphi.de/job/Lucene-Solr-7.x-Linux/1009/
Java: 64bit/jdk-10-ea+32 -XX:+UseCompressedOops -XX:+UseParallelGC

1 tests failed.
FAILED:  org.apache.solr.cloud.TestAuthenticationFramework.testBasics

Error Message:
Error from server at https://127.0.0.1:41489/solr/testcollection_shard1_replica_n2: Expected mime type application/octet-stream but got text/html. <html> <head> <meta http-equiv="Content-Type" content="text/html;charset=ISO-8859-1"/> <title>Error 404 </title> </head> <body> <h2>HTTP ERROR: 404</h2> <p>Problem accessing /solr/testcollection_shard1_replica_n2/update. Reason: <pre>    Can not find: /solr/testcollection_shard1_replica_n2/update</pre></p> <hr /><a href="http://eclipse.org/jetty">Powered by Jetty:// 9.3.20.v20170531</a><hr/> </body> </html> 

Stack Trace:
org.apache.solr.client.solrj.impl.CloudSolrClient$RouteException: Error from server at https://127.0.0.1:41489/solr/testcollection_shard1_replica_n2: Expected mime type application/octet-stream but got text/html. <html>
<head>
<meta http-equiv="Content-Type" content="text/html;charset=ISO-8859-1"/>
<title>Error 404 </title>
</head>
<body>
<h2>HTTP ERROR: 404</h2>
<p>Problem accessing /solr/testcollection_shard1_replica_n2/update. Reason:
<pre>    Can not find: /solr/testcollection_shard1_replica_n2/update</pre></p>
<hr /><a href="http://eclipse.org/jetty">Powered by Jetty:// 9.3.20.v20170531</a><hr/>
</body>
</html>

	at __randomizedtesting.SeedInfo.seed([46E1B959ED02D05C:7B391775D5EC8E2C]:0)
	at org.apache.solr.client.solrj.impl.CloudSolrClient.directUpdate(CloudSolrClient.java:550)
	at org.apache.solr.client.solrj.impl.CloudSolrClient.sendRequest(CloudSolrClient.java:1013)
	at org.apache.solr.client.solrj.impl.CloudSolrClient.requestWithRetryOnStaleState(CloudSolrClient.java:884)
	at org.apache.solr.client.solrj.impl.CloudSolrClient.requestWithRetryOnStaleState(CloudSolrClient.java:946)
	at org.apache.solr.client.solrj.impl.CloudSolrClient.requestWithRetryOnStaleState(CloudSolrClient.java:946)
	at org.apache.solr.client.solrj.impl.CloudSolrClient.requestWithRetryOnStaleState(CloudSolrClient.java:946)
	at org.apache.solr.client.solrj.impl.CloudSolrClient.requestWithRetryOnStaleState(CloudSolrClient.java:946)
	at org.apache.solr.client.solrj.impl.CloudSolrClient.requestWithRetryOnStaleState(CloudSolrClient.java:946)
	at org.apache.solr.client.solrj.impl.CloudSolrClient.request(CloudSolrClient.java:817)
	at org.apache.solr.client.solrj.SolrRequest.process(SolrRequest.java:194)
	at org.apache.solr.client.solrj.request.UpdateRequest.commit(UpdateRequest.java:233)
	at org.apache.solr.cloud.TestAuthenticationFramework.collectionCreateSearchDeleteTwice(TestAuthenticationFramework.java:126)
	at org.apache.solr.cloud.TestAuthenticationFramework.testBasics(TestAuthenticationFramework.java:74)
	at java.base/jdk.internal.reflect.NativeMethodAccessorImpl.invoke0(Native Method)
	at java.base/jdk.internal.reflect.NativeMethodAccessorImpl.invoke(NativeMethodAccessorImpl.java:62)
	at java.base/jdk.internal.reflect.DelegatingMethodAccessorImpl.invoke(DelegatingMethodAccessorImpl.java:43)
	at java.base/java.lang.reflect.Method.invoke(Method.java:564)
	at com.carrotsearch.randomizedtesting.RandomizedRunner.invoke(RandomizedRunner.java:1737)
	at com.carrotsearch.randomizedtesting.RandomizedRunner$8.evaluate(RandomizedRunner.java:934)
	at com.carrotsearch.randomizedtesting.RandomizedRunner$9.evaluate(RandomizedRunner.java:970)
	at com.carrotsearch.randomizedtesting.RandomizedRunner$10.evaluate(RandomizedRunner.java:984)
	at com.carrotsearch.randomizedtesting.rules.SystemPropertiesRestoreRule$1.evaluate(SystemPropertiesRestoreRule.java:57)
	at org.apache.lucene.util.TestRuleSetupTeardownChained$1.evaluate(TestRuleSetupTeardownChained.java:49)
	at org.apache.lucene.util.AbstractBeforeAfterRule$1.evaluate(AbstractBeforeAfterRule.java:45)
	at org.apache.lucene.util.TestRuleThreadAndTestName$1.evaluate(TestRuleThreadAndTestName.java:48)
	at org.apache.lucene.util.TestRuleIgnoreAfterMaxFailures$1.evaluate(TestRuleIgnoreAfterMaxFailures.java:64)
	at org.apache.lucene.util.TestRuleMarkFailure$1.evaluate(TestRuleMarkFailure.java:47)
	at com.carrotsearch.randomizedtesting.rules.StatementAdapter.evaluate(StatementAdapter.java:36)
	at com.carrotsearch.randomizedtesting.ThreadLeakControl$StatementRunner.run(ThreadLeakControl.java:368)
	at com.carrotsearch.randomizedtesting.ThreadLeakControl.forkTimeoutingTask(ThreadLeakControl.java:817)
	at com.carrotsearch.randomizedtesting.ThreadLeakControl$3.evaluate(ThreadLeakControl.java:468)
	at com.carrotsearch.randomizedtesting.RandomizedRunner.runSingleTest(RandomizedRunner.java:943)
	at com.carrotsearch.randomizedtesting.RandomizedRunner$5.evaluate(RandomizedRunner.java:829)
	at com.carrotsearch.randomizedtesting.RandomizedRunner$6.evaluate(RandomizedRunner.java:879)
	at com.carrotsearch.randomizedtesting.RandomizedRunner$7.evaluate(RandomizedRunner.java:890)
	at com.carrotsearch.randomizedtesting.rules.StatementAdapter.evaluate(StatementAdapter.java:36)
	at com.carrotsearch.randomizedtesting.rules.SystemPropertiesRestoreRule$1.evaluate(SystemPropertiesRestoreRule.java:57)
	at org.apache.lucene.util.AbstractBeforeAfterRule$1.evaluate(AbstractBeforeAfterRule.java:45)
	at com.carrotsearch.randomizedtesting.rules.StatementAdapter.evaluate(StatementAdapter.java:36)
	at org.apache.lucene.util.TestRuleStoreClassName$1.evaluate(TestRuleStoreClassName.java:41)
	at com.carrotsearch.randomizedtesting.rules.NoShadowingOrOverridesOnMethodsRule$1.evaluate(NoShadowingOrOverridesOnMethodsRule.java:40)
	at com.carrotsearch.randomizedtesting.rules.NoShadowingOrOverridesOnMethodsRule$1.evaluate(NoShadowingOrOverridesOnMethodsRule.java:40)
	at com.carrotsearch.randomizedtesting.rules.StatementAdapter.evaluate(StatementAdapter.java:36)
	at com.carrotsearch.randomizedtesting.rules.StatementAdapter.evaluate(StatementAdapter.java:36)
	at org.apache.lucene.util.TestRuleAssertionsRequired$1.evaluate(TestRuleAssertionsRequired.java:53)
	at org.apache.lucene.util.TestRuleMarkFailure$1.evaluate(TestRuleMarkFailure.java:47)
	at org.apache.lucene.util.TestRuleIgnoreAfterMaxFailures$1.evaluate(TestRuleIgnoreAfterMaxFailures.java:64)
	at org.apache.lucene.util.TestRuleIgnoreTestSuites$1.evaluate(TestRuleIgnoreTestSuites.java:54)
	at com.carrotsearch.randomizedtesting.rules.StatementAdapter.evaluate(StatementAdapter.java:36)
	at com.carrotsearch.randomizedtesting.ThreadLeakControl$StatementRunner.run(ThreadLeakControl.java:368)
	at java.base/java.lang.Thread.run(Thread.java:844)
Caused by: org.apache.solr.client.solrj.impl.HttpSolrClient$RemoteSolrException: Error from server at https://127.0.0.1:41489/solr/testcollection_shard1_replica_n2: Expected mime type application/octet-stream but got text/html. <html>
<head>
<meta http-equiv="Content-Type" content="text/html;charset=ISO-8859-1"/>
<title>Error 404 </title>
</head>
<body>
<h2>HTTP ERROR: 404</h2>
<p>Problem accessing /solr/testcollection_shard1_replica_n2/update. Reason:
<pre>    Can not find: /solr/testcollection_shard1_replica_n2/update</pre></p>
<hr /><a href="http://eclipse.org/jetty">Powered by Jetty:// 9.3.20.v20170531</a><hr/>
</body>
</html>

	at org.apache.solr.client.solrj.impl.HttpSolrClient.executeMethod(HttpSolrClient.java:607)
	at org.apache.solr.client.solrj.impl.HttpSolrClient.request(HttpSolrClient.java:255)
	at org.apache.solr.client.solrj.impl.HttpSolrClient.request(HttpSolrClient.java:244)
	at org.apache.solr.client.solrj.impl.LBHttpSolrClient.doRequest(LBHttpSolrClient.java:483)
	at org.apache.solr.client.solrj.impl.LBHttpSolrClient.request(LBHttpSolrClient.java:413)
	at org.apache.solr.client.solrj.impl.CloudSolrClient.lambda$directUpdate$0(CloudSolrClient.java:527)
	at java.base/java.util.concurrent.FutureTask.run(FutureTask.java:264)
	at org.apache.solr.common.util.ExecutorUtil$MDCAwareThreadPoolExecutor.lambda$execute$0(ExecutorUtil.java:188)
	at java.base/java.util.concurrent.ThreadPoolExecutor.runWorker(ThreadPoolExecutor.java:1135)
	at java.base/java.util.concurrent.ThreadPoolExecutor$Worker.run(ThreadPoolExecutor.java:635)
	... 1 more




Build Log:
[...truncated 11691 lines...]
   [junit4] Suite: org.apache.solr.cloud.TestAuthenticationFramework
   [junit4]   2> 31867 INFO  (SUITE-TestAuthenticationFramework-seed#[46E1B959ED02D05C]-worker) [    ] o.a.s.SolrTestCaseJ4 SecureRandom sanity checks: test.solr.allowed.securerandom=null & java.security.egd=file:/dev/./urandom
   [junit4]   2> Creating dataDir: /home/jenkins/workspace/Lucene-Solr-7.x-Linux/solr/build/solr-core/test/J1/temp/solr.cloud.TestAuthenticationFramework_46E1B959ED02D05C-001/init-core-data-001
   [junit4]   2> 31867 WARN  (SUITE-TestAuthenticationFramework-seed#[46E1B959ED02D05C]-worker) [    ] o.a.s.SolrTestCaseJ4 startTrackingSearchers: numOpens=9 numCloses=9
   [junit4]   2> 31868 INFO  (SUITE-TestAuthenticationFramework-seed#[46E1B959ED02D05C]-worker) [    ] o.a.s.SolrTestCaseJ4 Using PointFields (NUMERIC_POINTS_SYSPROP=true) w/NUMERIC_DOCVALUES_SYSPROP=true
   [junit4]   2> 31868 INFO  (SUITE-TestAuthenticationFramework-seed#[46E1B959ED02D05C]-worker) [    ] o.a.s.SolrTestCaseJ4 Randomized ssl (true) and clientAuth (false) via: @org.apache.solr.util.RandomizeSSL(reason="", ssl=0.0/0.0, value=0.0/0.0, clientAuth=0.0/0.0)
   [junit4]   2> 31880 INFO  (TEST-TestAuthenticationFramework.testBasics-seed#[46E1B959ED02D05C]) [    ] o.a.s.c.MiniSolrCloudCluster Starting cluster of 2 servers in /home/jenkins/workspace/Lucene-Solr-7.x-Linux/solr/build/solr-core/test/J1/temp/solr.cloud.TestAuthenticationFramework_46E1B959ED02D05C-001/tempDir-001
   [junit4]   2> 31880 INFO  (TEST-TestAuthenticationFramework.testBasics-seed#[46E1B959ED02D05C]) [    ] o.a.s.c.ZkTestServer STARTING ZK TEST SERVER
   [junit4]   2> 31899 INFO  (Thread-145) [    ] o.a.s.c.ZkTestServer client port:0.0.0.0/0.0.0.0:0
   [junit4]   2> 31899 INFO  (Thread-145) [    ] o.a.s.c.ZkTestServer Starting server
   [junit4]   2> 31937 ERROR (Thread-145) [    ] o.a.z.s.ZooKeeperServer ZKShutdownHandler is not registered, so ZooKeeper server won't take any action on ERROR or SHUTDOWN server state changes
   [junit4]   2> 31991 INFO  (TEST-TestAuthenticationFramework.testBasics-seed#[46E1B959ED02D05C]) [    ] o.a.s.c.ZkTestServer start zk server on port:43779
   [junit4]   2> 32059 INFO  (zkConnectionManagerCallback-87-thread-1) [    ] o.a.s.c.c.ConnectionManager zkClient has connected
   [junit4]   2> 32194 INFO  (jetty-launcher-84-thread-2) [    ] o.e.j.s.Server jetty-9.3.20.v20170531
   [junit4]   2> 32196 INFO  (jetty-launcher-84-thread-1) [    ] o.e.j.s.Server jetty-9.3.20.v20170531
   [junit4]   2> 32227 INFO  (jetty-launcher-84-thread-2) [    ] o.e.j.s.h.ContextHandler Started o.e.j.s.ServletContextHandler@31eae44f{/solr,null,AVAILABLE}
   [junit4]   2> 32229 INFO  (jetty-launcher-84-thread-2) [    ] o.e.j.s.AbstractConnector Started ServerConnector@44102d74{SSL,[ssl, http/1.1]}{127.0.0.1:41489}
   [junit4]   2> 32229 INFO  (jetty-launcher-84-thread-2) [    ] o.e.j.s.Server Started @33656ms
   [junit4]   2> 32230 INFO  (jetty-launcher-84-thread-2) [    ] o.a.s.c.s.e.JettySolrRunner Jetty properties: {hostContext=/solr, hostPort=41489}
   [junit4]   2> 32230 ERROR (jetty-launcher-84-thread-2) [    ] o.a.s.u.StartupLoggingUtils Missing Java Option solr.log.dir. Logging may be missing or incomplete.
   [junit4]   2> 32230 INFO  (jetty-launcher-84-thread-2) [    ] o.a.s.s.SolrDispatchFilter  ___      _       Welcome to Apache Solr™ version 7.3.0
   [junit4]   2> 32230 INFO  (jetty-launcher-84-thread-2) [    ] o.a.s.s.SolrDispatchFilter / __| ___| |_ _   Starting in cloud mode on port null
   [junit4]   2> 32230 INFO  (jetty-launcher-84-thread-2) [    ] o.a.s.s.SolrDispatchFilter \__ \/ _ \ | '_|  Install dir: null
   [junit4]   2> 32230 INFO  (jetty-launcher-84-thread-2) [    ] o.a.s.s.SolrDispatchFilter |___/\___/_|_|    Start time: 2017-12-18T08:08:25.699613Z
   [junit4]   2> 32302 INFO  (jetty-launcher-84-thread-1) [    ] o.e.j.s.h.ContextHandler Started o.e.j.s.ServletContextHandler@44f758e0{/solr,null,AVAILABLE}
   [junit4]   2> 32303 INFO  (jetty-launcher-84-thread-1) [    ] o.e.j.s.AbstractConnector Started ServerConnector@1bf884fa{SSL,[ssl, http/1.1]}{127.0.0.1:43245}
   [junit4]   2> 32303 INFO  (jetty-launcher-84-thread-1) [    ] o.e.j.s.Server Started @33730ms
   [junit4]   2> 32303 INFO  (jetty-launcher-84-thread-1) [    ] o.a.s.c.s.e.JettySolrRunner Jetty properties: {hostContext=/solr, hostPort=43245}
   [junit4]   2> 32304 ERROR (jetty-launcher-84-thread-1) [    ] o.a.s.u.StartupLoggingUtils Missing Java Option solr.log.dir. Logging may be missing or incomplete.
   [junit4]   2> 32304 INFO  (jetty-launcher-84-thread-1) [    ] o.a.s.s.SolrDispatchFilter  ___      _       Welcome to Apache Solr™ version 7.3.0
   [junit4]   2> 32304 INFO  (jetty-launcher-84-thread-1) [    ] o.a.s.s.SolrDispatchFilter / __| ___| |_ _   Starting in cloud mode on port null
   [junit4]   2> 32304 INFO  (jetty-launcher-84-thread-1) [    ] o.a.s.s.SolrDispatchFilter \__ \/ _ \ | '_|  Install dir: null
   [junit4]   2> 32304 INFO  (jetty-launcher-84-thread-1) [    ] o.a.s.s.SolrDispatchFilter |___/\___/_|_|    Start time: 2017-12-18T08:08:25.773807Z
   [junit4]   2> 32305 INFO  (zkConnectionManagerCallback-89-thread-1) [    ] o.a.s.c.c.ConnectionManager zkClient has connected
   [junit4]   2> 32308 INFO  (jetty-launcher-84-thread-2) [    ] o.a.s.s.SolrDispatchFilter solr.xml found in ZooKeeper. Loading...
   [junit4]   2> 32326 INFO  (zkConnectionManagerCallback-91-thread-1) [    ] o.a.s.c.c.ConnectionManager zkClient has connected
   [junit4]   2> 32328 INFO  (jetty-launcher-84-thread-2) [    ] o.a.s.c.ZkContainer Zookeeper client=127.0.0.1:43779/solr
   [junit4]   2> 32331 INFO  (jetty-launcher-84-thread-1) [    ] o.a.s.s.SolrDispatchFilter solr.xml found in ZooKeeper. Loading...
   [junit4]   2> 32363 INFO  (jetty-launcher-84-thread-1) [    ] o.a.s.c.ZkContainer Zookeeper client=127.0.0.1:43779/solr
   [junit4]   2> 32379 INFO  (zkConnectionManagerCallback-95-thread-1) [    ] o.a.s.c.c.ConnectionManager zkClient has connected
   [junit4]   2> 32409 INFO  (zkConnectionManagerCallback-99-thread-1) [    ] o.a.s.c.c.ConnectionManager zkClient has connected
   [junit4]   2> 32409 INFO  (zkConnectionManagerCallback-101-thread-1) [    ] o.a.s.c.c.ConnectionManager zkClient has connected
   [junit4]   2> 32483 INFO  (zkConnectionManagerCallback-104-thread-1) [    ] o.a.s.c.c.ConnectionManager zkClient has connected
   [junit4]   2> 32496 INFO  (jetty-launcher-84-thread-1) [    ] o.a.s.c.Overseer Overseer (id=null) closing
   [junit4]   2> 32496 INFO  (jetty-launcher-84-thread-1) [    ] o.a.s.c.OverseerElectionContext I am going to be the leader 127.0.0.1:43245_solr
   [junit4]   2> 32497 INFO  (jetty-launcher-84-thread-1) [    ] o.a.s.c.Overseer Overseer (id=99194274144583686-127.0.0.1:43245_solr-n_0000000000) starting
   [junit4]   2> 32530 INFO  (jetty-launcher-84-thread-1) [    ] o.a.s.c.ZkController Register node as live in ZooKeeper:/live_nodes/127.0.0.1:43245_solr
   [junit4]   2> 32545 INFO  (OverseerStateUpdate-99194274144583686-127.0.0.1:43245_solr-n_0000000000) [    ] o.a.s.c.c.ZkStateReader Updated live nodes from ZooKeeper... (0) -> (1)
   [junit4]   2> 32566 INFO  (jetty-launcher-84-thread-2) [    ] o.a.s.c.c.ZkStateReader Updated live nodes from ZooKeeper... (0) -> (1)
   [junit4]   2> 32568 INFO  (jetty-launcher-84-thread-2) [    ] o.a.s.c.Overseer Overseer (id=null) closing
   [junit4]   2> 32574 INFO  (jetty-launcher-84-thread-2) [    ] o.a.s.c.ZkController Register node as live in ZooKeeper:/live_nodes/127.0.0.1:41489_solr
   [junit4]   2> 32583 INFO  (jetty-launcher-84-thread-1) [    ] o.a.s.c.CoreContainer Initializing authentication plugin: org.apache.solr.cloud.TestAuthenticationFramework$MockAuthenticationPlugin
   [junit4]   2> 32627 INFO  (zkCallback-100-thread-1) [    ] o.a.s.c.c.ZkStateReader Updated live nodes from ZooKeeper... (1) -> (2)
   [junit4]   2> 32634 INFO  (zkCallback-103-thread-2) [    ] o.a.s.c.c.ZkStateReader Updated live nodes from ZooKeeper... (1) -> (2)
   [junit4]   2> 32667 INFO  (jetty-launcher-84-thread-2) [    ] o.a.s.c.CoreContainer Initializing authentication plugin: org.apache.solr.cloud.TestAuthenticationFramework$MockAuthenticationPlugin
   [junit4]   2> 32685 INFO  (jetty-launcher-84-thread-1) [    ] o.a.s.m.r.SolrJmxReporter JMX monitoring for 'solr_43245.solr.node' (registry 'solr.node') enabled at server: com.sun.jmx.mbeanserver.JmxMBeanServer@42424c6b
   [junit4]   2> 32703 INFO  (jetty-launcher-84-thread-1) [    ] o.a.s.m.r.SolrJmxReporter JMX monitoring for 'solr_43245.solr.jvm' (registry 'solr.jvm') enabled at server: com.sun.jmx.mbeanserver.JmxMBeanServer@42424c6b
   [junit4]   2> 32703 INFO  (jetty-launcher-84-thread-1) [    ] o.a.s.m.r.SolrJmxReporter JMX monitoring for 'solr_43245.solr.jetty' (registry 'solr.jetty') enabled at server: com.sun.jmx.mbeanserver.JmxMBeanServer@42424c6b
   [junit4]   2> 32716 INFO  (jetty-launcher-84-thread-1) [    ] o.a.s.c.CorePropertiesLocator Found 0 core definitions underneath /home/jenkins/workspace/Lucene-Solr-7.x-Linux/solr/build/solr-core/test/J1/temp/solr.cloud.TestAuthenticationFramework_46E1B959ED02D05C-001/tempDir-001/node1/.
   [junit4]   2> 32728 INFO  (jetty-launcher-84-thread-2) [    ] o.a.s.m.r.SolrJmxReporter JMX monitoring for 'solr_41489.solr.node' (registry 'solr.node') enabled at server: com.sun.jmx.mbeanserver.JmxMBeanServer@42424c6b
   [junit4]   2> 32736 INFO  (jetty-launcher-84-thread-2) [    ] o.a.s.m.r.SolrJmxReporter JMX monitoring for 'solr_41489.solr.jvm' (registry 'solr.jvm') enabled at server: com.sun.jmx.mbeanserver.JmxMBeanServer@42424c6b
   [junit4]   2> 32737 INFO  (jetty-launcher-84-thread-2) [    ] o.a.s.m.r.SolrJmxReporter JMX monitoring for 'solr_41489.solr.jetty' (registry 'solr.jetty') enabled at server: com.sun.jmx.mbeanserver.JmxMBeanServer@42424c6b
   [junit4]   2> 32738 INFO  (jetty-launcher-84-thread-2) [    ] o.a.s.c.CorePropertiesLocator Found 0 core definitions underneath /home/jenkins/workspace/Lucene-Solr-7.x-Linux/solr/build/solr-core/test/J1/temp/solr.cloud.TestAuthenticationFramework_46E1B959ED02D05C-001/tempDir-001/node2/.
   [junit4]   2> 32833 INFO  (zkConnectionManagerCallback-109-thread-1) [    ] o.a.s.c.c.ConnectionManager zkClient has connected
   [junit4]   2> 32883 INFO  (zkConnectionManagerCallback-113-thread-1) [    ] o.a.s.c.c.ConnectionManager zkClient has connected
   [junit4]   2> 32884 INFO  (TEST-TestAuthenticationFramework.testBasics-seed#[46E1B959ED02D05C]) [    ] o.a.s.c.c.ZkStateReader Updated live nodes from ZooKeeper... (0) -> (2)
   [junit4]   2> 32885 INFO  (TEST-TestAuthenticationFramework.testBasics-seed#[46E1B959ED02D05C]) [    ] o.a.s.c.s.i.ZkClientClusterStateProvider Cluster at 127.0.0.1:43779/solr ready
   [junit4]   2> 32887 INFO  (TEST-TestAuthenticationFramework.testBasics-seed#[46E1B959ED02D05C]) [    ] o.a.s.SolrTestCaseJ4 ###Starting testBasics
   [junit4]   2> 32955 INFO  (qtp656704657-446) [    ] o.a.s.h.a.CollectionsHandler Invoked Collection Action :create with params async=0f252ea8-eba0-444e-a14b-2a4ef0aa9318&replicationFactor=2&collection.configName=solrCloudCollectionConfig&maxShardsPerNode=2&name=testcollection&nrtReplicas=2&action=CREATE&numShards=2&wt=javabin&version=2 and sendToOCPQueue=true
   [junit4]   2> 32957 INFO  (qtp656704657-446) [    ] o.a.s.s.HttpSolrCall [admin] webapp=null path=/admin/collections params={async=0f252ea8-eba0-444e-a14b-2a4ef0aa9318&replicationFactor=2&collection.configName=solrCloudCollectionConfig&maxShardsPerNode=2&name=testcollection&nrtReplicas=2&action=CREATE&numShards=2&wt=javabin&version=2} status=0 QTime=2
   [junit4]   2> 32969 INFO  (OverseerThreadFactory-205-thread-1) [    ] o.a.s.c.CreateCollectionCmd Create collection testcollection
   [junit4]   2> 32970 INFO  (qtp656704657-447) [    ] o.a.s.h.a.CollectionsHandler Invoked Collection Action :requeststatus with params requestid=0f252ea8-eba0-444e-a14b-2a4ef0aa9318&action=REQUESTSTATUS&wt=javabin&version=2 and sendToOCPQueue=true
   [junit4]   2> 32976 INFO  (qtp656704657-447) [    ] o.a.s.s.HttpSolrCall [admin] webapp=null path=/admin/collections params={requestid=0f252ea8-eba0-444e-a14b-2a4ef0aa9318&action=REQUESTSTATUS&wt=javabin&version=2} status=0 QTime=6
   [junit4]   2> 33087 INFO  (OverseerStateUpdate-99194274144583686-127.0.0.1:43245_solr-n_0000000000) [    ] o.a.s.c.o.SliceMutator createReplica() {
   [junit4]   2>   "operation":"ADDREPLICA",
   [junit4]   2>   "collection":"testcollection",
   [junit4]   2>   "shard":"shard1",
   [junit4]   2>   "core":"testcollection_shard1_replica_n1",
   [junit4]   2>   "state":"down",
   [junit4]   2>   "base_url":"https://127.0.0.1:43245/solr",
   [junit4]   2>   "type":"NRT",
   [junit4]   2>   "waitForFinalState":"false"} 
   [junit4]   2> 33091 INFO  (OverseerStateUpdate-99194274144583686-127.0.0.1:43245_solr-n_0000000000) [    ] o.a.s.c.o.SliceMutator createReplica() {
   [junit4]   2>   "operation":"ADDREPLICA",
   [junit4]   2>   "collection":"testcollection",
   [junit4]   2>   "shard":"shard1",
   [junit4]   2>   "core":"testcollection_shard1_replica_n2",
   [junit4]   2>   "state":"down",
   [junit4]   2>   "base_url":"https://127.0.0.1:41489/solr",
   [junit4]   2>   "type":"NRT",
   [junit4]   2>   "waitForFinalState":"false"} 
   [junit4]   2> 33094 INFO  (OverseerStateUpdate-99194274144583686-127.0.0.1:43245_solr-n_0000000000) [    ] o.a.s.c.o.SliceMutator createReplica() {
   [junit4]   2>   "operation":"ADDREPLICA",
   [junit4]   2>   "collection":"testcollection",
   [junit4]   2>   "shard":"shard2",
   [junit4]   2>   "core":"testcollection_shard2_replica_n4",
   [junit4]   2>   "state":"down",
   [junit4]   2>   "base_url":"https://127.0.0.1:43245/solr",
   [junit4]   2>   "type":"NRT",
   [junit4]   2>   "waitForFinalState":"false"} 
   [junit4]   2> 33097 INFO  (OverseerStateUpdate-99194274144583686-127.0.0.1:43245_solr-n_0000000000) [    ] o.a.s.c.o.SliceMutator createReplica() {
   [junit4]   2>   "operation":"ADDREPLICA",
   [junit4]   2>   "collection":"testcollection",
   [junit4]   2>   "shard":"shard2",
   [junit4]   2>   "core":"testcollection_shard2_replica_n6",
   [junit4]   2>   "state":"down",
   [junit4]   2>   "base_url":"https://127.0.0.1:41489/solr",
   [junit4]   2>   "type":"NRT",
   [junit4]   2>   "waitForFinalState":"false"} 
   [junit4]   2> 33403 INFO  (qtp656704657-442) [    ] o.a.s.s.HttpSolrCall [admin] webapp=null path=/admin/cores params={qt=/admin/cores&collection.configName=solrCloudCollectionConfig&newCollection=true&collection=testcollection&version=2&replicaType=NRT&async=0f252ea8-eba0-444e-a14b-2a4ef0aa93181285648538387254&coreNodeName=core_node8&name=testcollection_shard2_replica_n6&action=CREATE&numShards=2&shard=shard2&wt=javabin} status=0 QTime=14
   [junit4]   2> 33403 INFO  (parallelCoreAdminExecutor-207-thread-1) [    ] o.a.s.h.a.CoreAdminOperation core create command qt=/admin/cores&collection.configName=solrCloudCollectionConfig&newCollection=true&collection=testcollection&version=2&replicaType=NRT&async=0f252ea8-eba0-444e-a14b-2a4ef0aa93181285648538387254&coreNodeName=core_node8&name=testcollection_shard2_replica_n6&action=CREATE&numShards=2&shard=shard2&wt=javabin
   [junit4]   2> 33403 INFO  (parallelCoreAdminExecutor-207-thread-1) [    ] o.a.s.c.TransientSolrCoreCacheDefault Allocating transient cache for 2147483647 transient cores
   [junit4]   2> 33427 INFO  (qtp656704657-445) [    ] o.a.s.s.HttpSolrCall [admin] webapp=null path=/admin/cores params={qt=/admin/cores&collection.configName=solrCloudCollectionConfig&newCollection=true&collection=testcollection&version=2&replicaType=NRT&async=0f252ea8-eba0-444e-a14b-2a4ef0aa93181285648531601538&coreNodeName=core_node5&name=testcollection_shard1_replica_n2&action=CREATE&numShards=2&shard=shard1&wt=javabin} status=0 QTime=0
   [junit4]   2> 33432 INFO  (parallelCoreAdminExecutor-207-thread-2) [    ] o.a.s.h.a.CoreAdminOperation core create command qt=/admin/cores&collection.configName=solrCloudCollectionConfig&newCollection=true&collection=testcollection&version=2&replicaType=NRT&async=0f252ea8-eba0-444e-a14b-2a4ef0aa93181285648531601538&coreNodeName=core_node5&name=testcollection_shard1_replica_n2&action=CREATE&numShards=2&shard=shard1&wt=javabin
   [junit4]   2> 33438 INFO  (qtp243644160-441) [    ] o.a.s.s.HttpSolrCall [admin] webapp=null path=/admin/cores params={qt=/admin/cores&collection.configName=solrCloudCollectionConfig&newCollection=true&collection=testcollection&version=2&replicaType=NRT&async=0f252ea8-eba0-444e-a14b-2a4ef0aa93181285648535273635&coreNodeName=core_node7&name=testcollection_shard2_replica_n4&action=CREATE&numShards=2&shard=shard2&wt=javabin} status=0 QTime=4
   [junit4]   2> 33440 INFO  (parallelCoreAdminExecutor-206-thread-1) [    ] o.a.s.h.a.CoreAdminOperation core create command qt=/admin/cores&collection.configName=solrCloudCollectionConfig&newCollection=true&collection=testcollection&version=2&replicaType=NRT&async=0f252ea8-eba0-444e-a14b-2a4ef0aa93181285648535273635&coreNodeName=core_node7&name=testcollection_shard2_replica_n4&action=CREATE&numShards=2&shard=shard2&wt=javabin
   [junit4]   2> 33441 INFO  (parallelCoreAdminExecutor-206-thread-1) [    ] o.a.s.c.TransientSolrCoreCacheDefault Allocating transient cache for 2147483647 transient cores
   [junit4]   2> 33441 INFO  (qtp243644160-454) [    ] o.a.s.s.HttpSolrCall [admin] webapp=null path=/admin/cores params={qt=/admin/cores&collection.configName=solrCloudCollectionConfig&newCollection=true&collection=testcollection&version=2&replicaType=NRT&async=0f252ea8-eba0-444e-a14b-2a4ef0aa93181285648528298238&coreNodeName=core_node3&name=testcollection_shard1_replica_n1&action=CREATE&numShards=2&shard=shard1&wt=javabin} status=0 QTime=0
   [junit4]   2> 33441 INFO  (parallelCoreAdminExecutor-206-thread-2) [    ] o.a.s.h.a.CoreAdminOperation core create command qt=/admin/cores&collection.configName=solrCloudCollectionConfig&newCollection=true&collection=testcollection&version=2&replicaType=NRT&async=0f252ea8-eba0-444e-a14b-2a4ef0aa93181285648528298238&coreNodeName=core_node3&name=testcollection_shard1_replica_n1&action=CREATE&numShards=2&shard=shard1&wt=javabin
   [junit4]   2> 33445 INFO  (qtp656704657-446) [    ] o.a.s.h.a.CoreAdminOperation Checking request status for : 0f252ea8-eba0-444e-a14b-2a4ef0aa93181285648538387254
   [junit4]   2> 33446 INFO  (qtp656704657-446) [    ] o.a.s.s.HttpSolrCall [admin] webapp=null path=/admin/cores params={qt=/admin/cores&requestid=0f252ea8-eba0-444e-a14b-2a4ef0aa93181285648538387254&action=REQUESTSTATUS&wt=javabin&version=2} status=0 QTime=0
   [junit4]   2> 33575 INFO  (zkCallback-100-thread-1) [    ] o.a.s.c.c.ZkStateReader A cluster state change: [WatchedEvent state:SyncConnected type:NodeDataChanged path:/collections/testcollection/state.json] for collection [testcollection] has occurred - updating... (live nodes size: [2])
   [junit4]   2> 33579 INFO  (zkCallback-103-thread-2) [    ] o.a.s.c.c.ZkStateReader A cluster state change: [WatchedEvent state:SyncConnected type:NodeDataChanged path:/collections/testcollection/state.json] for collection [testcollection] has occurred - updating... (live nodes size: [2])
   [junit4]   2> 33587 INFO  (zkCallback-100-thread-2) [    ] o.a.s.c.c.ZkStateReader A cluster state change: [WatchedEvent state:SyncConnected type:NodeDataChanged path:/collections/testcollection/state.json] for collection [testcollection] has occurred - updating... (live nodes size: [2])
   [junit4]   2> 33981 INFO  (qtp656704657-439) [    ] o.a.s.h.a.CollectionsHandler Invoked Collection Action :requeststatus with params requestid=0f252ea8-eba0-444e-a14b-2a4ef0aa9318&action=REQUESTSTATUS&wt=javabin&version=2 and sendToOCPQueue=true
   [junit4]   2> 33997 INFO  (qtp656704657-439) [    ] o.a.s.s.HttpSolrCall [admin] webapp=null path=/admin/collections params={requestid=0f252ea8-eba0-444e-a14b-2a4ef0aa9318&action=REQUESTSTATUS&wt=javabin&version=2} status=0 QTime=16
   [junit4]   2> 34437 INFO  (parallelCoreAdminExecutor-207-thread-1) [    ] o.a.s.c.SolrConfig Using Lucene MatchVersion: 7.3.0
   [junit4]   2> 34448 INFO  (parallelCoreAdminExecutor-207-thread-2) [    ] o.a.s.c.SolrConfig Using Lucene MatchVersion: 7.3.0
   [junit4]   2> 34450 INFO  (qtp656704657-446) [    ] o.a.s.h.a.CoreAdminOperation Checking request status for : 0f252ea8-eba0-444e-a14b-2a4ef0aa93181285648538387254
   [junit4]   2> 34450 INFO  (qtp656704657-446) [    ] o.a.s.s.HttpSolrCall [admin] webapp=null path=/admin/cores params={qt=/admin/cores&requestid=0f252ea8-eba0-444e-a14b-2a4ef0aa93181285648538387254&action=REQUESTSTATUS&wt=javabin&version=2} status=0 QTime=0
   [junit4]   2> 34465 INFO  (parallelCoreAdminExecutor-207-thread-2) [    ] o.a.s.s.IndexSchema [testcollection_shard1_replica_n2] Schema name=minimal
   [junit4]   2> 34467 INFO  (parallelCoreAdminExecutor-206-thread-1) [    ] o.a.s.c.SolrConfig Using Lucene MatchVersion: 7.3.0
   [junit4]   2> 34467 INFO  (parallelCoreAdminExecutor-207-thread-1) [    ] o.a.s.s.IndexSchema [testcollection_shard2_replica_n6] Schema name=minimal
   [junit4]   2> 34503 INFO  (parallelCoreAdminExecutor-207-thread-2) [    ] o.a.s.s.IndexSchema Loaded schema minimal/1.1 with uniqueid field id
   [junit4]   2> 34503 INFO  (parallelCoreAdminExecutor-207-thread-2) [    ] o.a.s.c.CoreContainer Creating SolrCore 'testcollection_shard1_replica_n2' using configuration from collection testcollection, trusted=true
   [junit4]   2> 34503 INFO  (parallelCoreAdminExecutor-207-thread-2) [    ] o.a.s.m.r.SolrJmxReporter JMX monitoring for 'solr_41489.solr.core.testcollection.shard1.replica_n2' (registry 'solr.core.testcollection.shard1.replica_n2') enabled at server: com.sun.jmx.mbeanserver.JmxMBeanServer@42424c6b
   [junit4]   2> 34504 INFO  (parallelCoreAdminExecutor-207-thread-2) [    ] o.a.s.c.SolrCore solr.RecoveryStrategy.Builder
   [junit4]   2> 34504 INFO  (parallelCoreAdminExecutor-207-thread-2) [    ] o.a.s.c.SolrCore [[testcollection_shard1_replica_n2] ] Opening new SolrCore at [/home/jenkins/workspace/Lucene-Solr-7.x-Linux/solr/build/solr-core/test/J1/temp/solr.cloud.TestAuthenticationFramework_46E1B959ED02D05C-001/tempDir-001/node2/testcollection_shard1_replica_n2], dataDir=[/home/jenkins/workspace/Lucene-Solr-7.x-Linux/solr/build/solr-core/test/J1/temp/solr.cloud.TestAuthenticationFramework_46E1B959ED02D05C-001/tempDir-001/node2/./testcollection_shard1_replica_n2/data/]
   [junit4]   2> 34505 INFO  (parallelCoreAdminExecutor-206-thread-1) [    ] o.a.s.s.IndexSchema [testcollection_shard2_replica_n4] Schema name=minimal
   [junit4]   2> 34507 INFO  (parallelCoreAdminExecutor-206-thread-1) [    ] o.a.s.s.IndexSchema Loaded schema minimal/1.1 with uniqueid field id
   [junit4]   2> 34507 INFO  (parallelCoreAdminExecutor-206-thread-1) [    ] o.a.s.c.CoreContainer Creating SolrCore 'testcollection_shard2_replica_n4' using configuration from collection testcollection, trusted=true
   [junit4]   2> 34507 INFO  (parallelCoreAdminExecutor-206-thread-1) [    ] o.a.s.m.r.SolrJmxReporter JMX monitoring for 'solr_43245.solr.core.testcollection.shard2.replica_n4' (registry 'solr.core.testcollection.shard2.replica_n4') enabled at server: com.sun.jmx.mbeanserver.JmxMBeanServer@42424c6b
   [junit4]   2> 34508 INFO  (parallelCoreAdminExecutor-206-thread-1) [    ] o.a.s.c.SolrCore solr.RecoveryStrategy.Builder
   [junit4]   2> 34508 INFO  (parallelCoreAdminExecutor-206-thread-1) [    ] o.a.s.c.SolrCore [[testcollection_shard2_replica_n4] ] Opening new SolrCore at [/home/jenkins/workspace/Lucene-Solr-7.x-Linux/solr/build/solr-core/test/J1/temp/solr.cloud.TestAuthenticationFramework_46E1B959ED02D05C-001/tempDir-001/node1/testcollection_shard2_replica_n4], dataDir=[/home/jenkins/workspace/Lucene-Solr-7.x-Linux/solr/build/solr-core/test/J1/temp/solr.cloud.TestAuthenticationFramework_46E1B959ED02D05C-001/tempDir-001/node1/./testcollection_shard2_replica_n4/data/]
   [junit4]   2> 34519 INFO  (parallelCoreAdminExecutor-206-thread-2) [    ] o.a.s.c.SolrConfig Using Lucene MatchVersion: 7.3.0
   [junit4]   2> 34521 INFO  (parallelCoreAdminExecutor-207-thread-1) [    ] o.a.s.s.IndexSchema Loaded schema minimal/1.1 with uniqueid field id
   [junit4]   2> 34521 INFO  (parallelCoreAdminExecutor-207-thread-1) [    ] o.a.s.c.CoreContainer Creating SolrCore 'testcollection_shard2_replica_n6' using configuration from collection testcollection, trusted=true
   [junit4]   2> 34522 INFO  (parallelCoreAdminExecutor-207-thread-1) [    ] o.a.s.m.r.SolrJmxReporter JMX monitoring for 'solr_41489.solr.core.testcollection.shard2.replica_n6' (registry 'solr.core.testcollection.shard2.replica_n6') enabled at server: com.sun.jmx.mbeanserver.JmxMBeanServer@42424c6b
   [junit4]   2> 34522 INFO  (parallelCoreAdminExecutor-207-thread-1) [    ] o.a.s.c.SolrCore solr.RecoveryStrategy.Builder
   [junit4]   2> 34522 INFO  (parallelCoreAdminExecutor-207-thread-1) [    ] o.a.s.c.SolrCore [[testcollection_shard2_replica_n6] ] Opening new SolrCore at [/home/jenkins/workspace/Lucene-Solr-7.x-Linux/solr/build/solr-core/test/J1/temp/solr.cloud.TestAuthenticationFramework_46E1B959ED02D05C-001/tempDir-001/node2/testcollection_shard2_replica_n6], dataDir=[/home/jenkins/workspace/Lucene-Solr-7.x-Linux/solr/build/solr-core/test/J1/temp/solr.cloud.TestAuthenticationFramework_46E1B959ED02D05C-001/tempDir-001/node2/./testcollection_shard2_replica_n6/data/]
   [junit4]   2> 34528 INFO  (parallelCoreAdminExecutor-206-thread-2) [    ] o.a.s.s.IndexSchema [testcollection_shard1_replica_n1] Schema name=minimal
   [junit4]   2> 34529 INFO  (parallelCoreAdminExecutor-206-thread-2) [    ] o.a.s.s.IndexSchema Loaded schema minimal/1.1 with uniqueid field id
   [junit4]   2> 34529 INFO  (parallelCoreAdminExecutor-206-thread-2) [    ] o.a.s.c.CoreContainer Creating SolrCore 'testcollection_shard1_replica_n1' using configuration from collection testcollection, trusted=true
   [junit4]   2> 34530 INFO  (parallelCoreAdminExecutor-206-thread-2) [    ] o.a.s.m.r.SolrJmxReporter JMX monitoring for 'solr_43245.solr.core.testcollection.shard1.replica_n1' (registry 'solr.core.testcollection.shard1.replica_n1') enabled at server: com.sun.jmx.mbeanserver.JmxMBeanServer@42424c6b
   [junit4]   2> 34530 INFO  (parallelCoreAdminExecutor-206-thread-2) [    ] o.a.s.c.SolrCore solr.RecoveryStrategy.Builder
   [junit4]   2> 34530 INFO  (parallelCoreAdminExecutor-206-thread-2) [    ] o.a.s.c.SolrCore [[testcollection_shard1_replica_n1] ] Opening new SolrCore at [/home/jenkins/workspace/Lucene-Solr-7.x-Linux/solr/build/solr-core/test/J1/temp/solr.cloud.TestAuthenticationFramework_46E1B959ED02D05C-001/tempDir-001/node1/testcollection_shard1_replica_n1], dataDir=[/home/jenkins/workspace/Lucene-Solr-7.x-Linux/solr/build/solr-core/test/J1/temp/solr.cloud.TestAuthenticationFramework_46E1B959ED02D05C-001/tempDir-001/node1/./testcollection_shard1_replica_n1/data/]
   [junit4]   2> 34668 INFO  (parallelCoreAdminExecutor-206-thread-1) [    ] o.a.s.u.UpdateHandler Using UpdateLog implementation: org.apache.solr.update.UpdateLog
   [junit4]   2> 34668 INFO  (parallelCoreAdminExecutor-206-thread-1) [    ] o.a.s.u.UpdateLog Initializing UpdateLog: dataDir=null defaultSyncLevel=FLUSH numRecordsToKeep=100 maxNumLogsToKeep=10 numVersionBuckets=65536
   [junit4]   2> 34670 INFO  (parallelCoreAdminExecutor-206-thread-1) [    ] o.a.s.u.CommitTracker Hard AutoCommit: disabled
   [junit4]   2> 34670 INFO  (parallelCoreAdminExecutor-206-thread-1) [    ] o.a.s.u.CommitTracker Soft AutoCommit: disabled
   [junit4]   2> 34687 INFO  (parallelCoreAdminExecutor-206-thread-1) [    ] o.a.s.s.SolrIndexSearcher Opening [Searcher@7e4bf060[testcollection_shard2_replica_n4] main]
   [junit4]   2> 34689 INFO  (parallelCoreAdminExecutor-206-thread-1) [    ] o.a.s.r.ManagedResourceStorage Configured ZooKeeperStorageIO with znodeBase: /configs/solrCloudCollectionConfig
   [junit4]   2> 34690 INFO  (parallelCoreAdminExecutor-206-thread-1) [    ] o.a.s.r.ManagedResourceStorage Loaded null at path _rest_managed.json using ZooKeeperStorageIO:path=/configs/solrCloudCollectionConfig
   [junit4]   2> 34690 INFO  (parallelCoreAdminExecutor-206-thread-1) [    ] o.a.s.h.ReplicationHandler Commits will be reserved for 10000ms.
   [junit4]   2> 34719 INFO  (searcherExecutor-211-thread-1) [    ] o.a.s.c.SolrCore [testcollection_shard2_replica_n4] Registered new searcher Searcher@7e4bf060[testcollection_shard2_replica_n4] main{ExitableDirectoryReader(UninvertingDirectoryReader())}
   [junit4]   2> 34720 INFO  (parallelCoreAdminExecutor-206-thread-1) [    ] o.a.s.u.UpdateLog Could not find max version in index or recent updates, using new clock 1587108389258788864
   [junit4]   2> 34763 INFO  (parallelCoreAdminExecutor-206-thread-1) [    ] o.a.s.c.ShardLeaderElectionContext Waiting until we see more replicas up for shard shard2: total=2 found=1 timeoutin=9991ms
   [junit4]   2> 34831 INFO  (parallelCoreAdminExecutor-207-thread-1) [    ] o.a.s.u.UpdateHandler Using UpdateLog implementation: org.apache.solr.update.UpdateLog
   [junit4]   2> 34831 INFO  (parallelCoreAdminExecutor-207-thread-1) [    ] o.a.s.u.UpdateLog Initializing UpdateLog: dataDir=null defaultSyncLevel=FLUSH numRecordsToKeep=100 maxNumLogsToKeep=10 numVersionBuckets=65536
   [junit4]   2> 34831 INFO  (parallelCoreAdminExecutor-206-thread-2) [    ] o.a.s.u.UpdateHandler Using UpdateLog implementation: org.apache.solr.update.UpdateLog
   [junit4]   2> 34832 INFO  (parallelCoreAdminExecutor-206-thread-2) [    ] o.a.s.u.UpdateLog Initializing UpdateLog: dataDir=null defaultSyncLevel=FLUSH numRecordsToKeep=100 maxNumLogsToKeep=10 numVersionBuckets=65536
   [junit4]   2> 34833 INFO  (parallelCoreAdminExecutor-206-thread-2) [    ] o.a.s.u.CommitTracker Hard AutoCommit: disabled
   [junit4]   2> 34833 INFO  (parallelCoreAdminExecutor-207-thread-1) [    ] o.a.s.u.CommitTracker Hard AutoCommit: disabled
   [junit4]   2> 34833 INFO  (parallelCoreAdminExecutor-207-thread-1) [    ] o.a.s.u.CommitTracker Soft AutoCommit: disabled
   [junit4]   2> 34834 INFO  (parallelCoreAdminExecutor-207-thread-1) [    ] o.a.s.s.SolrIndexSearcher Opening [Searcher@656005d6[testcollection_shard2_replica_n6] main]
   [junit4]   2> 34835 INFO  (parallelCoreAdminExecutor-207-thread-1) [    ] o.a.s.r.ManagedResourceStorage Configured ZooKeeperStorageIO with znodeBase: /configs/solrCloudCollectionConfig
   [junit4]   2> 34836 INFO  (parallelCoreAdminExecutor-207-thread-1) [    ] o.a.s.r.ManagedResourceStorage Loaded null at path _rest_managed.json using ZooKeeperStorageIO:path=/configs/solrCloudCollectionConfig
   [junit4]   2> 34833 INFO  (parallelCoreAdminExecutor-206-thread-2) [    ] o.a.s.u.CommitTracker Soft AutoCommit: disabled
   [junit4]   2> 34836 INFO  (parallelCoreAdminExecutor-207-thread-1) [    ] o.a.s.h.ReplicationHandler Commits will be reserved for 10000ms.
   [junit4]   2> 34839 INFO  (parallelCoreAdminExecutor-207-thread-2) [    ] o.a.s.u.UpdateHandler Using UpdateLog implementation: org.apache.solr.update.UpdateLog
   [junit4]   2> 34839 INFO  (parallelCoreAdminExecutor-207-thread-2) [    ] o.a.s.u.UpdateLog Initializing UpdateLog: dataDir=null defaultSyncLevel=FLUSH numRecordsToKeep=100 maxNumLogsToKeep=10 numVersionBuckets=65536
   [junit4]   2> 34840 INFO  (parallelCoreAdminExecutor-207-thread-2) [    ] o.a.s.u.CommitTracker Hard AutoCommit: disabled
   [junit4]   2> 34840 INFO  (parallelCoreAdminExecutor-207-thread-2) [    ] o.a.s.u.CommitTracker Soft AutoCommit: disabled
   [junit4]   2> 34842 INFO  (parallelCoreAdminExecutor-207-thread-2) [    ] o.a.s.s.SolrIndexSearcher Opening [Searcher@26d7e0ad[testcollection_shard1_replica_n2] main]
   [junit4]   2> 34847 INFO  (searcherExecutor-212-thread-1) [    ] o.a.s.c.SolrCore [testcollection_shard2_replica_n6] Registered new searcher Searcher@656005d6[testcollection_shard2_replica_n6] main{ExitableDirectoryReader(UninvertingDirectoryReader())}
   [junit4]   2> 34848 INFO  (parallelCoreAdminExecutor-207-thread-1) [    ] o.a.s.u.UpdateLog Could not find max version in index or recent updates, using new clock 1587108389393006592
   [junit4]   2> 34849 INFO  (parallelCoreAdminExecutor-206-thread-2) [    ] o.a.s.s.SolrIndexSearcher Opening [Searcher@35b917bd[testcollection_shard1_replica_n1] main]
   [junit4]   2> 34854 INFO  (parallelCoreAdminExecutor-206-thread-2) [    ] o.a.s.r.ManagedResourceStorage Configured ZooKeeperStorageIO with znodeBase: /configs/solrCloudCollectionConfig
   [junit4]   2> 34856 INFO  (parallelCoreAdminExecutor-207-thread-2) [    ] o.a.s.r.ManagedResourceStorage Configured ZooKeeperStorageIO with znodeBase: /configs/solrCloudCollectionConfig
   [junit4]   2> 34856 INFO  (parallelCoreAdminExecutor-206-thread-2) [    ] o.a.s.r.ManagedResourceStorage Loaded null at path _rest_managed.json using ZooKeeperStorageIO:path=/configs/solrCloudCollectionConfig
   [junit4]   2> 34857 INFO  (zkCallback-103-thread-2) [    ] o.a.s.c.c.ZkStateReader A cluster state change: [WatchedEvent state:SyncConnected type:NodeDataChanged path:/collections/testcollection/state.json] for collection [testcollection] has occurred - updating... (live nodes size: [2])
   [junit4]   2> 34857 INFO  (parallelCoreAdminExecutor-206-thread-2) [    ] o.a.s.h.ReplicationHandler Commits will be reserved for 10000ms.
   [junit4]   2> 34857 INFO  (zkCallback-100-thread-2) [    ] o.a.s.c.c.ZkStateReader A cluster state change: [WatchedEvent state:SyncConnected type:NodeDataChanged path:/collections/testcollection/state.json] for collection [testcollection] has occurred - updating... (live nodes size: [2])
   [junit4]   2> 34857 INFO  (parallelCoreAdminExecutor-207-thread-2) [    ] o.a.s.r.ManagedResourceStorage Loaded null at path _rest_managed.json using ZooKeeperStorageIO:path=/configs/solrCloudCollectionConfig
   [junit4]   2> 34857 INFO  (zkCallback-100-thread-1) [    ] o.a.s.c.c.ZkStateReader A cluster state change: [WatchedEvent state:SyncConnected type:NodeDataChanged path:/collections/testcollection/state.json] for collection [testcollection] has occurred - updating... (live nodes size: [2])
   [junit4]   2> 34857 INFO  (parallelCoreAdminExecutor-206-thread-2) [    ] o.a.s.u.UpdateLog Could not find max version in index or recent updates, using new clock 1587108389402443776
   [junit4]   2> 34858 INFO  (searcherExecutor-213-thread-1) [    ] o.a.s.c.SolrCore [testcollection_shard1_replica_n1] Registered new searcher Searcher@35b917bd[testcollection_shard1_replica_n1] main{ExitableDirectoryReader(UninvertingDirectoryReader())}
   [junit4]   2> 34859 INFO  (parallelCoreAdminExecutor-207-thread-2) [    ] o.a.s.h.ReplicationHandler Commits will be reserved for 10000ms.
   [junit4]   2> 34860 INFO  (searcherExecutor-210-thread-1) [    ] o.a.s.c.SolrCore [testcollection_shard1_replica_n2] Registered new searcher Searcher@26d7e0ad[testcollection_shard1_replica_n2] main{ExitableDirectoryReader(UninvertingDirectoryReader())}
   [junit4]   2> 34860 INFO  (parallelCoreAdminExecutor-207-thread-2) [    ] o.a.s.u.UpdateLog Could not find max version in index or recent updates, using new clock 1587108389405589504
   [junit4]   2> 34867 INFO  (parallelCoreAdminExecutor-207-thread-2) [    ] o.a.s.c.ShardLeaderElectionContext Waiting until we see more replicas up for shard shard1: total=2 found=1 timeoutin=9999ms
   [junit4]   2> 34968 INFO  (zkCallback-103-thread-2) [    ] o.a.s.c.c.ZkStateReader A cluster state change: [WatchedEvent state:SyncConnected type:NodeDataChanged path:/collections/testcollection/state.json] for collection [testcollection] has occurred - updating... (live nodes size: [2])
   [junit4]   2> 34968 INFO  (zkCallback-100-thread-2) [    ] o.a.s.c.c.ZkStateReader A cluster state change: [WatchedEvent state:SyncConnected type:NodeDataChanged path:/collections/testcollection/state.json] for collection [testcollection] has occurred - updating... (live nodes size: [2])
   [junit4]   2> 34968 INFO  (zkCallback-100-thread-1) [    ] o.a.s.c.c.ZkStateReader A cluster state change: [WatchedEvent state:SyncConnected type:NodeDataChanged path:/collections/testcollection/state.json] for collection [testcollection] has occurred - updating... (live nodes size: [2])
   [junit4]   2> 35001 INFO  (qtp656704657-442) [    ] o.a.s.h.a.CollectionsHandler Invoked Collection Action :requeststatus with params requestid=0f252ea8-eba0-444e-a14b-2a4ef0aa9318&action=REQUESTSTATUS&wt=javabin&version=2 and sendToOCPQueue=true
   [junit4]   2> 35002 INFO  (qtp656704657-442) [    ] o.a.s.s.HttpSolrCall [admin] webapp=null path=/admin/collections params={requestid=0f252ea8-eba0-444e-a14b-2a4ef0aa9318&action=REQUESTSTATUS&wt=javabin&version=2} status=0 QTime=0
   [junit4]   2> 35267 INFO  (parallelCoreAdminExecutor-206-thread-1) [    ] o.a.s.c.ShardLeaderElectionContext Enough replicas found to continue.
   [junit4]   2> 35267 INFO  (parallelCoreAdminExecutor-206-thread-1) [    ] o.a.s.c.ShardLeaderElectionContext I may be the new leader - try and sync
   [junit4]   2> 35267 INFO  (parallelCoreAdminExecutor-206-thread-1) [    ] o.a.s.c.SyncStrategy Sync replicas to https://127.0.0.1:43245/solr/testcollection_shard2_replica_n4/
   [junit4]   2> 35267 INFO  (parallelCoreAdminExecutor-206-thread-1) [    ] o.a.s.u.PeerSync PeerSync: core=testcollection_shard2_replica_n4 url=https://127.0.0.1:43245/solr START replicas=[https://127.0.0.1:41489/solr/testcollection_shard2_replica_n6/] nUpdates=100
   [junit4]   2> 35275 INFO  (qtp656704657-439) [    ] o.a.s.c.S.Request [testcollection_shard2_replica_n6]  webapp=/solr path=/get params={distrib=false&qt=/get&fingerprint=false&getVersions=100&wt=javabin&version=2} status=0 QTime=0
   [junit4]   2> 35367 INFO  (parallelCoreAdminExecutor-207-thread-2) [    ] o.a.s.c.ShardLeaderElectionContext Enough replicas found to continue.
   [junit4]   2> 35367 INFO  (parallelCoreAdminExecutor-207-thread-2) [    ] o.a.s.c.ShardLeaderElectionContext I may be the new leader - try and sync
   [junit4]   2> 35367 INFO  (parallelCoreAdminExecutor-207-thread-2) [    ] o.a.s.c.SyncStrategy Sync replicas to https://127.0.0.1:41489/solr/testcollection_shard1_replica_n2/
   [junit4]   2> 35367 INFO  (parallelCoreAdminExecutor-207-thread-2) [    ] o.a.s.u.PeerSync PeerSync: core=testcollection_shard1_replica_n2 url=https://127.0.0.1:41489/solr START replicas=[https://127.0.0.1:43245/solr/testcollection_shard1_replica_n1/] nUpdates=100
   [junit4]   2> 35394 INFO  (qtp243644160-450) [    ] o.a.s.c.S.Request [testcollection_shard1_replica_n1]  webapp=/solr path=/get params={distrib=false&qt=/get&fingerprint=false&getVersions=100&wt=javabin&version=2} status=0 QTime=0
   [junit4]   2> 35453 INFO  (qtp656704657-446) [    ] o.a.s.h.a.CoreAdminOperation Checking request status for : 0f252ea8-eba0-444e-a14b-2a4ef0aa93181285648538387254
   [junit4]   2> 35453 INFO  (qtp656704657-446) [    ] o.a.s.s.HttpSolrCall [admin] webapp=null path=/admin/cores params={qt=/admin/cores&requestid=0f252ea8-eba0-444e-a14b-2a4ef0aa93181285648538387254&action=REQUESTSTATUS&wt=javabin&version=2} status=0 QTime=0
   [junit4]   2> 35568 INFO  (parallelCoreAdminExecutor-206-thread-1) [    ] o.a.s.u.PeerSync PeerSync: core=testcollection_shard2_replica_n4 url=https://127.0.0.1:43245/solr DONE.  We have no versions.  sync failed.
   [junit4]   2> 35568 INFO  (parallelCoreAdminExecutor-206-thread-1) [    ] o.a.s.c.SyncStrategy Leader's attempt to sync with shard failed, moving to the next candidate
   [junit4]   2> 35568 INFO  (parallelCoreAdminExecutor-206-thread-1) [    ] o.a.s.c.ShardLeaderElectionContext We failed sync, but we have no versions - we can't sync in that case - we were active before, so become leader anyway
   [junit4]   2> 35568 INFO  (parallelCoreAdminExecutor-206-thread-1) [    ] o.a.s.c.ShardLeaderElectionContext Found all replicas participating in election, clear LIR
   [junit4]   2> 35577 INFO  (parallelCoreAdminExecutor-206-thread-1) [    ] o.a.s.c.ShardLeaderElectionContext I am the new leader: https://127.0.0.1:43245/solr/testcollection_shard2_replica_n4/ shard2
   [junit4]   2> 35680 INFO  (zkCallback-100-thread-2) [    ] o.a.s.c.c.ZkStateReader A cluster state change: [WatchedEvent state:SyncConnected type:NodeDataChanged path:/collections/testcollection/state.json] for collection [testcollection] has occurred - updating... (live nodes size: [2])
   [junit4]   2> 35680 INFO  (zkCallback-100-thread-1) [    ] o.a.s.c.c.ZkStateReader A cluster state change: [WatchedEvent state:SyncConnected type:NodeDataChanged path:/collections/testcollection/state.json] for collection [testcollection] has occurred - updating... (live nodes size: [2])
   [junit4]   2> 35680 INFO  (zkCallback-103-thread-2) [    ] o.a.s.c.c.ZkStateReader A cluster state change: [WatchedEvent state:SyncConnected type:NodeDataChanged path:/collections/testcollection/state.json] for collection [testcollection] has occurred - updating... (live nodes size: [2])
   [junit4]   2> 35683 INFO  (parallelCoreAdminExecutor-207-thread-2) [    ] o.a.s.u.PeerSync PeerSync: core=testcollection_shard1_replica_n2 url=https://127.0.0.1:41489/solr DONE.  We have no versions.  sync failed.
   [junit4]   2> 35683 INFO  (parallelCoreAdminExecutor-207-thread-2) [    ] o.a.s.c.SyncStrategy Leader's attempt to sync with shard failed, moving to the next candidate
   [junit4]   2> 35683 INFO  (parallelCoreAdminExecutor-207-thread-2) [    ] o.a.s.c.ShardLeaderElectionContext We failed sync, but we have no versions - we can't sync in that case - we were active before, so become leader anyway
   [junit4]   2> 35683 INFO  (parallelCoreAdminExecutor-207-thread-2) [    ] o.a.s.c.ShardLeaderElectionContext Found all replicas participating in election, clear LIR
   [junit4]   2> 35702 INFO  (parallelCoreAdminExecutor-207-thread-2) [    ] o.a.s.c.ShardLeaderElectionContext I am the new leader: https://127.0.0.1:41489/solr/testcollection_shard1_replica_n2/ shard1
   [junit4]   2> 35729 INFO  (parallelCoreAdminExecutor-206-thread-1) [    ] o.a.s.c.ZkController I am the leader, no recovery necessary
   [junit4]   2> 35849 INFO  (zkCallback-103-thread-2) [    ] o.a.s.c.c.ZkStateReader A cluster state change: [WatchedEvent state:SyncConnected type:NodeDataChanged path:/collections/testcollection/state.json] for collection [testcollection] has occurred - updating... (live nodes size: [2])
   [junit4]   2> 35850 INFO  (zkCallback-100-thread-2) [    ] o.a.s.c.c.ZkStateReader A cluster state change: [WatchedEvent state:SyncConnected type:NodeDataChanged path:/collections/testcollection/state.json] for collection [testcollection] has occurred - updating... (live nodes size: [2])
   [junit4]   2> 35850 INFO  (zkCallback-100-thread-1) [    ] o.a.s.c.c.ZkStateReader A cluster state change: [WatchedEvent state:SyncConnected type:NodeDataChanged path:/collections/testcollection/state.json] for collection [testcollection] has occurred - updating... (live nodes size: [2])
   [junit4]   2> 35855 INFO  (parallelCoreAdminExecutor-207-thread-2) [    ] o.a.s.c.ZkController I am the leader, no recovery necessary
   [junit4]   2> 35995 INFO  (zkCallback-103-thread-2) [    ] o.a.s.c.c.ZkStateReader A cluster state change: [WatchedEvent state:SyncConnected type:NodeDataChanged path:/collections/testcollection/state.json] for collection [testcollection] has occurred - updating... (live nodes size: [2])
   [junit4]   2> 35995 INFO  (zkCallback-100-thread-2) [    ] o.a.s.c.c.ZkStateReader A cluster state change: [WatchedEvent state:SyncConnected type:NodeDataChanged path:/collections/testcollection/state.json] for collection [testcollection] has occurred - updating... (live nodes size: [2])
   [junit4]   2> 35995 INFO  (zkCallback-100-thread-1) [    ] o.a.s.c.c.ZkStateReader A cluster state change: [WatchedEvent state:SyncConnected type:NodeDataChanged path:/collections/testcollection/state.json] for collection [testcollection] has occurred - updating... (live nodes size: [2])
   [junit4]   2> 36008 INFO  (qtp656704657-440) [    ] o.a.s.h.a.CollectionsHandler Invoked Collection Action :requeststatus with params requestid=0f252ea8-eba0-444e-a14b-2a4ef0aa9318&action=REQUESTSTATUS&wt=javabin&version=2 and sendToOCPQueue=true
   [junit4]   2> 36008 INFO  (qtp656704657-440) [    ] o.a.s.s.HttpSolrCall [admin] webapp=null path=/admin/collections params={requestid=0f252ea8-eba0-444e-a14b-2a4ef0aa9318&action=REQUESTSTATUS&wt=javabin&version=2} status=0 QTime=0
   [junit4]   2> 36461 INFO  (qtp656704657-446) [    ] o.a.s.h.a.CoreAdminOperation Checking request status for : 0f252ea8-eba0-444e-a14b-2a4ef0aa93181285648538387254
   [junit4]   2> 36461 INFO  (qtp656704657-446) [    ] o.a.s.s.HttpSolrCall [admin] webapp=null path=/admin/cores params={qt=/admin/cores&requestid=0f252ea8-eba0-444e-a14b-2a4ef0aa93181285648538387254&action=REQUESTSTATUS&wt=javabin&version=2} status=0 QTime=0
   [junit4]   2> 36467 INFO  (qtp243644160-449) [    ] o.a.s.h.a.CoreAdminOperation Checking request status for : 0f252ea8-eba0-444e-a14b-2a4ef0aa93181285648535273635
   [junit4]   2> 36467 INFO  (qtp243644160-449) [    ] o.a.s.s.HttpSolrCall [admin] webapp=null path=/admin/cores params={qt=/admin/cores&requestid=0f252ea8-eba0-444e-a14b-2a4ef0aa93181285648535273635&action=REQUESTSTATUS&wt=javabin&version=2} status=0 QTime=0
   [junit4]   2> 36476 INFO  (OverseerThreadFactory-205-thread-1) [    ] o.a.s.c.OverseerTaskQueue Response ZK path: /overseer/collection-queue-work/qnr-0000000000 doesn't exist.  Requestor may have disconnected from ZooKeeper
   [junit4]   2> 36975 INFO  (OverseerCollectionConfigSetProcessor-99194274144583686-127.0.0.1:43245_solr-n_0000000000) [    ] o.a.s.c.OverseerTaskQueue Response ZK path: /overseer/collection-queue-work/qnr-0000000000 doesn't exist.  Requestor may have disconnected from ZooKeeper
   [junit4]   2> 37011 INFO  (qtp656704657-443) [    ] o.a.s.h.a.CollectionsHandler Invoked Collection Action :requeststatus with params requestid=0f252ea8-eba0-444e-a14b-2a4ef0aa9318&action=REQUESTSTATUS&wt=javabin&version=2 and sendToOCPQueue=true
   [junit4]   2> 37014 INFO  (qtp656704657-443) [    ] o.a.s.s.HttpSolrCall [admin] webapp=null path=/admin/collections params={requestid=0f252ea8-eba0-444e-a14b-2a4ef0aa9318&action=REQUESTSTATUS&wt=javabin&version=2} status=0 QTime=2
   [junit4]   2> 37017 INFO  (qtp656704657-442) [    ] o.a.s.h.a.CollectionsHandler Invoked Collection Action :deletestatus with params requestid=0f252ea8-eba0-444e-a14b-2a4ef0aa9318&action=DELETESTATUS&wt=javabin&version=2 and sendToOCPQueue=true
   [junit4]   2> 37018 INFO  (qtp656704657-442) [    ] o.a.s.s.HttpSolrCall [admin] webapp=null path=/admin/collections params={requestid=0f252ea8-eba0-444e-a14b-2a4ef0aa9318&action=DELETESTATUS&wt=javabin&version=2} status=0 QTime=0
   [junit4]   2> 37021 INFO  (TEST-TestAuthenticationFramework.testBasics-seed#[46E1B959ED02D05C]) [    ] o.a.s.c.AbstractDistribZkTestBase Wait for recoveries to finish - collection: testcollection failOnTimeout:true timeout (sec):330
   [junit4]   1> -
   [junit4]   1> replica:core_node3 rstate:active live:true
   [junit4]   1> replica:core_node5 rstate:active live:true
   [junit4]   1> replica:core_node7 rstate:active live:true
   [junit4]   1> replica:core_node8 rstate:active live:true
   [junit4]   1> no one is recoverying
   [junit4]   2> 37022 INFO  (TEST-TestAuthenticationFramework.testBasics-seed#[46E1B959ED02D05C]) [    ] o.a.s.c.AbstractDistribZkTestBase Recoveries finished - collection: testcollection
   [junit4]   2> 37041 INFO  (qtp243644160-455) [    ] o.a.s.c.S.Request [testcollection_shard2_replica_n4]  webapp=/solr path=/select params={df=text&distrib=false&_stateVer_=testcollection:7&fl=id&fl=score&shards.purpose=4&start=0&fsv=true&shard.url=https://127.0.0.1:43245/solr/testcollection_shard2_replica_n4/|https://127.0.0.1:41489/solr/testcollection_shard2_replica_n6/&rows=10&version=2&q=*:*&NOW=1513584510493&isShard=true&wt=javabin} hits=0 status=0 QTime=0
   [junit4]   2> 37057 INFO  (qtp243644160-454) [    ] o.a.s.c.S.Request [testcollection_shard1_replica_n1]  webapp=/solr path=/select params={df=text&distrib=false&_stateVer_=testcollection:7&fl=id&fl=score&shards.purpose=4&start=0&fsv=true&shard.url=https://127.0.0.1:43245/solr/testcollection_shard1_replica_n1/|https://127.0.0.1:41489/solr/testcollection_shard1_replica_n2/&rows=10&version=2&q=*:*&NOW=1513584510493&isShard=true&wt=javabin} hits=0 status=0 QTime=0
   [junit4]   2> 37060 INFO  (qtp656704657-440) [    ] o.a.s.c.S.Request [testcollection_shard1_replica_n2]  webapp=/solr path=/select params={q=*:*&_stateVer_=testcollection:7&wt=javabin&version=2} hits=0 status=0 QTime=35
   [junit4]   2> 37218 INFO  (qtp243644160-441) [    ] o.a.s.u.p.LogUpdateProcessorFactory [testcollection_shard1_replica_n1]  webapp=/solr path=/update params={update.distrib=FROMLEADER&distrib.from=https://127.0.0.1:41489/solr/testcollection_shard1_replica_n2/&wt=javabin&version=2}{add=[1 (1587108391791099904)]} 0 14
   [junit4]   2> 37219 INFO  (qtp656704657-439) [    ] o.a.s.u.p.LogUpdateProcessorFactory [testcollection_shard1_replica_n2]  webapp=/solr path=/update params={_stateVer_=testcollection:7&wt=javabin&version=2}{add=[1 (1587108391791099904)]} 0 140
   [junit4]   2> 37233 INFO  (qtp243644160-453) [    ] o.a.s.u.DirectUpdateHandler2 start commit{_version_=1587108391893860352,optimize=false,openSearcher=true,waitSearcher=true,expungeDeletes=false,softCommit=false,prepareCommit=false}
   [junit4]   2> 37233 INFO  (qtp243644160-453) [    ] o.a.s.u.SolrIndexWriter Calling setCommitData with IW:org.apache.solr.update.SolrIndexWriter@4776369e commitCommandVersion:1587108391893860352
   [junit4]   2> 37253 INFO  (qtp243644160-455) [    ] o.a.s.u.DirectUpdateHandler2 start commit{_version_=1587108391914831872,optimize=false,openSearcher=true,waitSearcher=true,expungeDeletes=false,softCommit=false,prepareCommit=false}
   [junit4]   2> 37264 INFO  (qtp243644160-455) [    ] o.a.s.u.DirectUpdateHandler2 No uncommitted changes. Skipping IW.commit.
   [junit4]   2> 37280 INFO  (qtp656704657-439) [    ] o.a.s.u.DirectUpdateHandler2 start commit{_version_=1587108391943143424,optimize=false,openSearcher=true,waitSearcher=true,expungeDeletes=false,softCommit=false,prepareCommit=false}
   [junit4]   2> 37280 INFO  (qtp656704657-439) [    ] o.a.s.u.SolrIndexWriter Calling setCommitData with IW:org.apache.solr.update.SolrIndexWriter@33a0d3f2 commitCommandVersion:1587108391943143424
   [junit4]   2> 37287 INFO  (qtp243644160-455) [    ] o.a.s.u.DirectUpdateHandler2 end_commit_flush
   [junit4]   2> 37291 INFO  (qtp243644160-455) [    ] o.a.s.u.p.LogUpdateProcessorFactory [testcollection_shard2_replica_n4]  webapp=/solr path=/update params={update.distrib=FROMLEADER&waitSearcher=true&openSearcher=true&commit=true&softCommit=false&distrib.from=https://127.0.0.1:41489/solr/testcollection_shard1_replica_n2/&commit_end_point=true&wt=javabin&version=2&expungeDeletes=false}{commit=} 0 38
   [junit4]   2> 37297 INFO  (qtp656704657-440) [    ] o.a.s.u.DirectUpdateHandler2 start commit{_version_=1587108391960969216,optimize=false,openSearcher=true,waitSearcher=true,expungeDeletes=false,softCommit=false,prepareCommit=false}
   [junit4]   2> 37315 INFO  (qtp656704657-440) [    ] o.a.s.u.DirectUpdateHandler2 No uncommitted changes. Skipping IW.commit.
   [junit4]   2> 37329 INFO  (qtp656704657-440) [    ] o.a.s.u.DirectUpdateHandler2 end_commit_flush
   [junit4]   2> 37329 INFO  (qtp656704657-440) [    ] o.a.s.u.p.LogUpdateProcessorFactory [testcollection_shard2_replica_n6]  webapp=/solr path=/update params={update.distrib=FROMLEADER&waitSearcher=true&openSearcher=true&commit=true&softCommit=false&distrib.from=https://127.0.0.1:41489/solr/testcollection_shard1_replica_n2/&commit_end_point=true&wt=javabin&version=2&expungeDeletes=false}{commit=} 0 32
   [junit4]   2> 37438 INFO  (qtp656704657-439) [    ] o.a.s.s.SolrIndexSearcher Opening [Searcher@7d23db83[testcollection_shard1_replica_n2] main]
   [junit4]   2> 37439 INFO  (qtp656704657-439) [    ] o.a.s.u.DirectUpdateHandler2 end_commit_flush
   [junit4]   2> 37441 INFO  (searcherExecutor-210-thread-1) [    ] o.a.s.c.SolrCore [testcollection_shard1_replica_n2] Registered new searcher Searcher@7d23db83[testcollection_shard1_replica_n2] main{ExitableDirectoryReader(UninvertingDirectoryReader(Uninverting(_0(7.3.0):C1)))}
   [junit4]   2> 37441 INFO  (qtp656704657-439) [    ] o.a.s.u.p.LogUpdateProcessorFactory [testcollection_shard1_replica_n2]  webapp=/solr path=/update params={update.distrib=FROMLEADER&waitSearcher=true&openSearcher=true&commit=true&softCommit=false&distrib.from=https://127.0.0.1:41489/solr/testcollection_shard1_replica_n2/&commit_end_point=true&wt=javabin&version=2&expungeDeletes=false}{commit=} 0 161
   [junit4]   2> 37441 INFO  (qtp243644160-453) [    ] o.a.s.s.SolrIndexSearcher Opening [Searcher@649a0ad[testcollection_shard1_replica_n1] main]
   [junit4]   2> 37448 INFO  (searcherExecutor-213-thread-1) [    ] o.a.s.c.SolrCore [testcollection_shard1_replica_n1] Registered new searcher Searcher@649a0ad[testcollection_shard1_replica_n1] main{ExitableDirectoryReader(UninvertingDirectoryReader(Uninverting(_0(7.3.0):C1)))}
   [junit4]   2> 37452 INFO  (qtp243644160-453) [    ] o.a.s.u.DirectUpdateHandler2 end_commit_flush
   [junit4]   2> 37452 INFO  (qtp243644160-453) [    ] o.a.s.u.p.LogUpdateProcessorFactory [testcollection_shard1_replica_n1]  webapp=/solr path=/update params={update.distrib=FROMLEADER&waitSearcher=true&openSearcher=true&commit=true&softCommit=false&distrib.from=https://127.0.0.1:41489/solr/testcollection_shard1_replica_n2/&commit_end_point=true&wt=javabin&version=2&expungeDeletes=false}{commit=} 0 218
   [junit4]   2> 37453 INFO  (qtp656704657-442) [    ] o.a.s.u.p.LogUpdateProcessorFactory [testcollection_shard1_replica_n2]  webapp=/solr path=/update params={_stateVer_=testcollection:7&commit=true&wt=javabin&version=2}{commit=} 0 231
   [junit4]   2> 37467 INFO  (qtp243644160-449) [    ] o.a.s.c.S.Request [testcollection_shard2_replica_n4]  webapp=/solr path=/select params={df=text&distrib=false&_stateVer_=testcollection:7&fl=id&fl=score&shards.purpose=4&start=0&fsv=true&shard.url=https://127.0.0.1:43245/solr/testcollection_shard2_replica_n4/|https://127.0.0.1:41489/solr/testcollection_shard2_replica_n6/&rows=10&version=2&q=*:*&NOW=1513584510932&isShard=true&wt=javabin} hits=0 status=0 QTime=0
   [junit4]   2> 37476 INFO  (qtp243644160-454) [    ] o.a.s.c.S.Request [testcollection_shard1_replica_n1]  webapp=/solr path=/select params={df=text&distrib=false&_stateVer_=testcollection:7&fl=id&fl=score&shards.purpose=4&start=0&fsv=true&shard.url=https://127.0.0.1:43245/solr/testcollection_shard1_replica_n1/|https://127.0.0.1:41489/solr/testcollection_shard1_replica_n2/&rows=10&version=2&q=*:*&NOW=1513584510932&isShard=true&wt=javabin} hits=1 status=0 QTime=4
   [junit4]   2> 37511 INFO  (qtp243644160-453) [    ] o.a.s.c.S.Request [testcollection_shard1_replica_n1]  webapp=/solr path=/select params={q=*:*&df=text&distrib=false&_stateVer_=testcollection:7&shards.purpose=64&NOW=1513584510932&ids=1&isShard=true&shard.url=https://127.0.0.1:43245/solr/testcollection_shard1_replica_n1/|https://127.0.0.1:41489/solr/testcollection_shard1_replica_n2/&wt=javabin&version=2} status=0 QTime=17
   [junit4]   2> 37528 INFO  (qtp243644160-450) [    ] o.a.s.c.S.Request [testcollection_shard1_replica_n1]  webapp=/solr path=/select params={q=*:*&_stateVer_=testcollection:7&wt=javabin&version=2} hits=1 status=0 QTime=64
   [junit4]   2> 37532 INFO  (qtp656704657-443) [    ] o.a.s.h.a.CollectionsHandler Invoked Collection Action :delete with params name=testcollection&action=DELETE&wt=javabin&version=2 and sendToOCPQueue=true
   [junit4]   2> 37540 INFO  (OverseerThreadFactory-205-thread-2) [    ] o.a.s.c.OverseerCollectionMessageHandler Executing Collection Cmd : action=UNLOAD&deleteInstanceDir=true&deleteDataDir=true
   [junit4]   2> 37542 INFO  (qtp243644160-441) [    ] o.a.s.m.SolrMetricManager Closing metric reporters for registry=solr.core.testcollection.shard1.replica_n1, tag=null
   [junit4]   2> 37542 INFO  (qtp243644160-441) [    ] o.a.s.m.r.SolrJmxReporter Closing reporter [org.apache.solr.metrics.reporters.SolrJmxReporter@399b7a75: rootName = solr_43245, domain = solr.core.testcollection.shard1.replica_n1, service url = null, agent id = null] for registry solr.core.testcollection.shard1.replica_n1 / com.codahale.metrics.MetricRegistry@4444ef0c
   [junit4]   2> 37558 INFO  (qtp243644160-441) [    ] o.a.s.c.SolrCore [testcollection_shard1_replica_n1]  CLOSING SolrCore org.apache.solr.core.SolrCore@56e270f4
   [junit4]   2> 37558 INFO  (qtp243644160-441) [    ] o.a.s.m.SolrMetricManager Closing metric reporters for registry=solr.core.testcollection.shard1.replica_n1, tag=1457680628
   [junit4]   2> 37558 INFO  (qtp243644160-441) [    ] o.a.s.m.SolrMetricManager Closing metric reporters for registry=solr.collection.testcollection.shard1.leader, tag=1457680628
   [junit4]   2> 37565 INFO  (qtp243644160-449) [    ] o.a.s.m.SolrMetricManager Closing metric reporters for registry=solr.core.testcollection.shard2.replica_n4, tag=null
   [junit4]   2> 37565 INFO  (qtp243644160-449) [    ] o.a.s.m.r.SolrJmxReporter Closing reporter [org.apache.solr.metrics.reporters.SolrJmxReporter@5bd21c2: rootName = solr_43245, domain = solr.core.testcollection.shard2.replica_n4, service url = null, agent id = null] for registry solr.core.testcollection.shard2.replica_n4 / com.codahale.metrics.MetricRegistry@478a6375
   [junit4]   2> 37573 INFO  (qtp656704657-447) [    ] o.a.s.m.SolrMetricManager Closing metric reporters for registry=solr.core.testcollection.shard1.replica_n2, tag=null
   [junit4]   2> 37580 INFO  (qtp243644160-449) [    ] o.a.s.c.SolrCore [testcollection_shard2_replica_n4]  CLOSING SolrCore org.apache.solr.core.SolrCore@77a3a5e4
   [junit4]   2> 37580 INFO  (qtp243644160-449) [    ] o.a.s.m.SolrMetricManager Closing metric reporters for registry=solr.core.testcollection.shard2.replica_n4, tag=2007213540
   [junit4]   2> 37580 INFO  (qtp243644160-449) [    ] o.a.s.m.SolrMetricManager Closing metric reporters for registry=solr.collection.testcollection.shard2.leader, tag=2007213540
   [junit4]   2> 37580 INFO  (qtp656704657-447) [    ] o.a.s.m.r.SolrJmxReporter Closing reporter [org.apache.solr.metrics.reporters.SolrJmxReporter@68839a00: rootName = solr_41489, domain = solr.core.testcollection.shard1.replica_n2, service url = null, agent id = null] for registry solr.core.testcollection.shard1.replica_n2 / com.codahale.metrics.MetricRegistry@65691c06
   [junit4]   2> 37604 INFO  (qtp656704657-446) [    ] o.a.s.m.SolrMetricManager Closing metric reporters for registry=solr.core.testcollection.shard2.replica_n6, tag=null
   [junit4]   2> 37604 INFO  (qtp656704657-446) [    ] o.a.s.m.r.SolrJmxReporter Closing reporter [org.apache.solr.metrics.reporters.SolrJmxReporter@49078c83: rootName = solr_41489, domain = solr.core.testcollection.shard2.replica_n6, service url = null, agent id = null] for registry solr.core.testcollection.shard2.replica_n6 / com.codahale.metrics.MetricRegistry@76337b0b
   [junit4]   2> 37611 INFO  (qtp243644160-441) [    ] o.a.s.c.ShardLeaderElectionContextBase No version found for ephemeral leader parent node, won't remove previous leader registration.
   [junit4]   2> 37613 INFO  (qtp243644160-441) [    ] o.a.s.s.HttpSolrCall [admin] webapp=null path=/admin/cores params={deleteInstanceDir=true&core=testcollection_shard1_replica_n1&qt=/admin/cores&deleteDataDir=true&action=UNLOAD&wt=javabin&version=2} status=0 QTime=72
   [junit4]   2> 37614 INFO  (qtp656704657-447) [    ] o.a.s.c.SolrCore [testcollection_shard1_replica_n2]  CLOSING SolrCore org.apache.solr.core.SolrCore@192bd636
   [junit4]   2> 37642 INFO  (qtp656704657-446) [    ] o.a.s.c.SolrCore [testcollection_shard2_replica_n6]  CLOSING SolrCore org.apache.solr.core.SolrCore@1779604d
   [junit4]   2> 37642 INFO  (qtp656704657-446) [    ] o.a.s.m.SolrMetricManager Closing metric reporters for registry=solr.core.testcollection.shard2.replica_n6, tag=393830477
   [junit4]   2> 37642 INFO  (qtp656704657-446) [    ] o.a.s.m.SolrMetricManager Closing metric reporters for registry=solr.collection.testcollection.shard2.leader, tag=393830477
   [junit4]   2> 37642 INFO  (qtp656704657-447) [    ] o.a.s.m.SolrMetricManager Closing metric reporters for registry=solr.core.testcollection.shard1.replica_n2, tag=422303286
   [junit4]   2> 37642 INFO  (qtp656704657-447) [    ] o.a.s.m.SolrMetricManager Closing metric reporters for registry=solr.collection.testcollection.shard1.leader, tag=422303286
   [junit4]   2> 37673 INFO  (qtp656704657-446) [    ] o.a.s.c.ShardLeaderElectionContextBase No version found for ephemeral leader parent node, won't remove previous leader registration.
   [junit4]   2> 37675 INFO  (qtp656704657-446) [    ] o.a.s.s.HttpSolrCall [admin] webapp=null path=/admin/cores params={deleteInstanceDir=true&core=testcollection_shard2_replica_n6&qt=/admin/cores&deleteDataDir=true&action=UNLOAD&wt=javabin&version=2} status=0 QTime=100
   [junit4]   2> 37684 WARN  (zkCallback-103-thread-2) [    ] o.a.s.c.LeaderElector Our node is no longer in line to be leader
   [junit4]   2> 37686 INFO  (qtp656704657-447) [    ] o.a.s.s.HttpSolrCall [admin] webapp=null path=/admin/cores params={deleteInstanceDir=true&core=testcollection_shard1_replica_n2&qt=/admin/cores&deleteDataDir=true&action=UNLOAD&wt=javabin&version=2} status=0 QTime=113
   [junit4]   2> 37687 INFO  (qtp243644160-449) [    ] o.a.s.s.HttpSolrCall [admin] webapp=null path=/admin/cores params={deleteInstanceDir=true&core=testcollection_shard2_replica_n4&qt=/admin/cores&deleteDataDir=true&action=UNLOAD&wt=javabin&version=2} status=0 QTime=123
   [junit4]   2> 37688 WARN  (zkCallback-100-thread-2) [    ] o.a.s.c.LeaderElector Our node is no longer in line to be leader
   [junit4]   2> 38399 INFO  (qtp656704657-443) [    ] o.a.s.s.HttpSolrCall [admin] webapp=null path=/admin/collections params={name=testcollection&action=DELETE&wt=javabin&version=2} status=0 QTime=867
   [junit4]   2> 38401 INFO  (TEST-TestAuthenticationFramework.testBasics-seed#[46E1B959ED02D05C]) [    ] o.a.s.c.AbstractDistribZkTestBase Wait for collection to disappear - collection: testcollection failOnTimeout:true timeout (sec):330
   [junit4]   1> -
   [junit4]   2> 38402 INFO  (TEST-TestAuthenticationFramework.testBasics-seed#[46E1B959ED02D05C]) [    ] o.a.s.c.AbstractDistribZkTestBase Collection has disappeared - collection: testcollection
   [junit4]   2> 38403 INFO  (qtp656704657-440) [    ] o.a.s.h.a.CollectionsHandler Invoked Collection Action :create with params replicationFactor=2&collection.configName=solrCloudCollectionConfig&maxShardsPerNode=2&name=testcollection&nrtReplicas=2&action=CREATE&numShards=2&wt=javabin&version=2 and sendToOCPQueue=true
   [junit4]   2> 38412 INFO  (OverseerThreadFactory-205-thread-3) [    ] o.a.s.c.CreateCollectionCmd Create collection testcollection
   [junit4]   2> 38414 INFO  (OverseerCollectionConfigSetProcessor-99194274144583686-127.0.0.1:43245_solr-n_0000000000) [    ] o.a.s.c.OverseerTaskQueue Response ZK path: /overseer/collection-queue-work/qnr-0000000001 doesn't exist.  Requestor may have disconnected from ZooKeeper
   [junit4]   2> 38620 INFO  (OverseerStateUpdate-99194274144583686-127.0.0.1:43245_solr-n_0000000000) [    ] o.a.s.c.o.SliceMutator createReplica() {
   [junit4]   2>   "operation":"ADDREPLICA",
   [junit4]   2>   "collection":"testcollection",
   [junit4]   2>   "shard":"shard1",
   [junit4]   2>   "core":"testcollection_shard1_replica_n1",
   [junit4]   2>   "state":"down",
   [junit4]   2>   "base_url":"https://127.0.0.1:41489/solr",
   [junit4]   2>   "type":"NRT",
   [junit4]   2>   "waitForFinalState":"false"} 
   [junit4]   2> 38624 INFO  (OverseerStateUpdate-99194274144583686-127.0.0.1:43245_solr-n_0000000000) [    ] o.a.s.c.o.SliceMutator createReplica() {
   [junit4]   2>   "operation":"ADDREPLICA",
   [junit4]   2>   "collection":"testcollection",
   [junit4]   2>   "shard":"shard1",
   [junit4]   2>   "core":"testcollection_shard1_replica_n3",
   [junit4]   2>   "state":"down",
   [junit4]   2>   "base_url":"https://127.0.0.1:43245/solr",
   [junit4]   2>   "type":"NRT",
   [junit4]   2>   "waitForFinalState":"false"} 
   [junit4]   2> 38627 INFO  (OverseerStateUpdate-99194274144583686-127.0.0.1:43245_solr-n_0000000000) [    ] o.a.s.c.o.SliceMutator createReplica() {
   [junit4]   2>   "operation":"ADDREPLICA",
   [junit4]   2>   "collection":"testcollection",
   [junit4]   2>   "shard":"shard2",
   [junit4]   2>   "core":"testcollection_shard2_replica_n5",
   [junit4]   2>   "state":"down",
   [junit4]   2>   "base_url":"https://127.0.0.1:41489/solr",
   [junit4]   2>   "type":"NRT",
   [junit4]   2>   "waitForFinalState":"false"} 
   [junit4]   2> 38634 INFO  (OverseerStateUpdate-99194274144583686-127.0.0.1:43245_solr-n_0000000000) [    ] o.a.s.c.o.SliceMutator createReplica() {
   [junit4]   2>   "operation":"ADDREPLICA",
   [junit4]   2>   "collection":"testcollection",
   [junit4]   2>   "shard":"shard2",
   [junit4]   2>   "core":"testcollection_shard2_replica_n6",
   [junit4]   2>   "state":"down",
   [junit4]   2>   "base_url":"https://127.0.0.1:43245/solr",
   [junit4]   2>   "type":"NRT",
   [junit4]   2>   "waitForFinalState":"false"} 
   [junit4]   2> 38834 INFO  (qtp656704657-439) [    ] o.a.s.h.a.CoreAdminOperation core create command qt=/admin/cores&coreNodeName=core_node2&collection.configName=solrCloudCollectionConfig&newCollection=true&name=testcollection_shard1_replica_n1&action=CREATE&numShards=2&collection=testcollection&shard=shard1&wt=javabin&version=2&replicaType=NRT
   [junit4]   2> 38834 INFO  (qtp243644160-453) [    ] o.a.s.h.a.CoreAdminOperation core create command qt=/admin/cores&coreNodeName=core_node8&collection.configName=solrCloudCollectionConfig&newCollection=true&name=testcollection_shard2_replica_n6&action=CREATE&numShards=2&collection=testcollection&shard=shard2&wt=javabin&version=2&replicaType=NRT
   [junit4]   2> 38837 INFO  (qtp656704657-534) [    ] o.a.s.h.a.CoreAdminOperation core create command qt=/admin/cores&coreNodeName=core_node7&collection.configName=solrCloudCollectionConfig&newCollection=true&name=testcollection_shard2_replica_n5&action=CREATE&numShards=2&collection=testcollection&shard=shard2&wt=javabin&version=2&replicaType=NRT
   [junit4]   2> 38838 INFO  (qtp243644160-454) [    ] o.a.s.h.a.CoreAdminOperation core create command qt=/admin/cores&coreNodeName=core_node4&collection.configName=solrCloudCollectionConfig&newCollection=true&name=testcollection_shard1_replica_n3&action=CREATE&numShards=2&collection=testcollection&shard=shard1&wt=javabin&version=2&replicaType=NRT
   [junit4]   2> 38949 INFO  (zkCallback-100-thread-1) [    ] o.a.s.c.c.ZkStateReader A cluster state change: [WatchedEvent state:SyncConnected type:NodeDataChanged path:/collections/testcollection/state.json] for collection [testcollection] has occurred - updating... (live nodes size: [2])
   [junit4]   2> 38949 INFO  (zkCallback-103-thread-2) [    ] o.a.s.c.c.ZkStateReader A cluster state change: [WatchedEvent state:SyncConnected type:NodeDataChanged path:/collections/testcollection/state.json] for collection [testcollection] has occurred - updating... (live nodes size: [2])
   [junit4]   2> 38949 INFO  (zkCallback-100-thread-2) [    ] o.a.s.c.c.ZkStateReader A cluster state change: [WatchedEvent state:SyncConnected type:NodeDataChanged path:/collections/testcollection/state.json] for collection [testcollection] has occurred - updating... (live nodes size: [2])
   [junit4]   2> 38949 INFO  (zkCallback-103-thread-1) [    ] o.a.s.c.c.ZkStateReader A cluster state change: [WatchedEvent state:SyncConnected type:NodeDataChanged path:/collections/testcollection/state.json] for collection [testcollection] has occurred - updating... (live nodes size: [2])
   [junit4]   2> 38959 INFO  (zkCallback-103-thread-3) [    ] o.a.s.c.c.ZkStateReader A cluster state change: [WatchedEvent state:SyncConnected type:NodeDataChanged path:/collections/testcollection/state.json] for collection [testcollection] has occurred - updating... (live nodes size: [2])
   [junit4]   2> 39866 INFO  (qtp243644160-453) [    ] o.a.s.c.SolrConfig Using Lucene MatchVersion: 7.3.0
   [junit4]   2> 39871 INFO  (qtp243644160-453) [    ] o.a.s.s.IndexSchema [testcollection_shard2_replica_n6] Schema name=minimal
   [junit4]   2> 39873 INFO  (qtp243644160-453) [    ] o.a.s.s.IndexSchema Loaded schema minimal/1.1 with uniqueid field id
   [junit4]   2> 39873 INFO  (qtp243644160-453) [    ] o.a.s.c.CoreContainer Creating SolrCore 'testcollection_shard2_replica_n6' using configuration from collection testcollection, trusted=true
   [junit4]   2> 39874 INFO  (qtp243644160-453) [    ] o.a.s.m.r.SolrJmxReporter JMX monitoring for 'solr_43245.solr.core.testcollection.shard2.replica_n6' (registry 'solr.core.testcollection.shard2.replica_n6') enabled at server: com.sun.jmx.mbeanserver.JmxMBeanServer@42424c6b
   [junit4]   2> 39874 INFO  (qtp243644160-453) [    ] o.a.s.c.SolrCore solr.RecoveryStrategy.Builder
   [junit4]   2> 39874 INFO  (qtp243644160-453) [    ] o.a.s.c.SolrCore [[testcollection_shard2_replica_n6] ] Opening new SolrCore at [/home/jenkins/workspace/Lucene-Solr-7.x-Linux/solr/build/solr-core/test/J1/temp/solr.cloud.TestAuthenticationFramework_46E1B959ED02D05C-001/tempDir-001/node1/testcollection_shard2_replica_n6], dataDir=[/home/jenkins/workspace/Lucene-Solr-7.x-Linux/solr/build/solr-core/test/J1/temp/solr.cloud.TestAuthenticationFramework_46E1B959ED02D05C-001/tempDir-001/node1/./testcollection_shard2_replica_n6/data/]
   [junit4]   2> 39875 INFO  (qtp656704657-439) [    ] o.a.s.c.SolrConfig Using Lucene MatchVersion: 7.3.0
   [junit4]   2> 39887 INFO  (qtp656704657-534) [    ] o.a.s.c.SolrConfig Using Lucene MatchVersion: 7.3.0
   [junit4]   2> 39975 INFO  (qtp656704657-534) [    ] o.a.s.s.IndexSchema [testcollection_shard2_replica_n5] Schema name=minimal
   [junit4]   2> 39976 INFO  (qtp656704657-534) [    ] o.a.s.s.IndexSchema Loaded schema minimal/1.1 with uniqueid field id
   [junit4]   2> 39976 INFO  (qtp656704657-534) [    ] o.a.s.c.CoreContainer Creating SolrCore 'testcollection_shard2_replica_n5' using configuration from collection testcollection, trusted=true
   [junit4]   2> 39977 INFO  (qtp656704657-534) [    ] o.a.s.m.r.SolrJmxReporter JMX monitoring for 'solr_41489.solr.core.testcollection.shard2.replica_n5' (registry 'solr.core.testcollection.shard2.replica_n5') enabled at server: com.sun.jmx.mbeanserver.JmxMBeanServer@42424c6b
   [junit4]   2> 39977 INFO  (qtp656704657-534) [    ] o.a.s.c.SolrCore solr.RecoveryStrategy.Builder
   [junit4]   2> 39977 INFO  (qtp656704657-534) [    ] o.a.s.c.SolrCore [[testcollection_shard2_replica_n5] ] Opening new SolrCore at [/home/jenkins/workspace/Lucene-Solr-7.x-Linux/solr/build/solr-core/test/J1/temp/solr.cloud.TestAuthenticationFramework_46E1B959ED02D05C-001/tempDir-001/node2/testcollection_shard2_replica_n5], dataDir=[/home/jenkins/workspace/Lucene-Solr-7.x-Linux/solr/build/solr-core/test/J1/temp/solr.cloud.TestAuthenticationFramework_46E1B959ED02D05C-001/tempDir-001/node2/./testcollection_shard2_replica_n5/data/]
   [junit4]   2> 39983 INFO  (qtp243644160-454) [    ] o.a.s.c.SolrConfig Using Lucene MatchVersion: 7.3.0
   [junit4]   2> 39989 INFO  (qtp656704657-439) [    ] o.a.s.s.IndexSchema [testcollection_shard1_replica_n1] Schema name=minimal
   [junit4]   2> 39990 INFO  (qtp656704657-439) [    ] o.a.s.s.IndexSchema Loaded schema minimal/1.1 with uniqueid field id
   [junit4]   2> 39990 INFO  (qtp656704657-439) [    ] o.a.s.c.CoreContainer Creating SolrCore 'testcollection_shard1_replica_n1' using configuration from collection testcollection, trusted=true
   [junit4]   2> 39991 INFO  (qtp656704657-439) [    ] o.a.s.m.r.SolrJmxReporter JMX monitoring for 'solr_41489.solr.core.testcollection.shard1.replica_n1' (registry 'solr.core.testcollection.shard1.replica_n1') enabled at server: com.sun.jmx.mbeanserver.JmxMBeanServer@42424c6b
   [junit4]   2> 39991 INFO  (qtp656704657-439) [    ] o.a.s.c.SolrCore solr.RecoveryStrategy.Builder
   [junit4]   2> 39991 INFO  (qtp656704657-439) [    ] o.a.s.c.SolrCore [[testcollection_shard1_replica_n1] ] Opening new SolrCore at [/home/jenkins/workspace/Lucene-Solr-7.x-Linux/solr/build/solr-core/test/J1/temp/solr.cloud.TestAuthenticationFramework_46E1B959ED02D05C-001/tempDir-001/node2/testcollection_shard1_replica_n1], dataDir=[/home/jenkins/workspace/Lucene-Solr-7.x-Linux/solr/build/solr-core/test/J1/temp/solr.cloud.TestAuthenticationFramework_46E1B959ED02D05C-001/tempDir-001/node2/./testcollection_shard1_replica_n1/data/]
   [junit4]   2> 39993 INFO  (qtp243644160-454) [    ] o.a.s.s.IndexSchema [testcollection_shard1_replica_n3] Schema name=minimal
   [junit4]   2> 39994 INFO  (qtp243644160-454) [    ] o.a.s.s.IndexSchema Loaded schema minimal/1.1 with uniqueid field id
   [junit4]   2> 39994 INFO  (qtp243644160-454) [    ] o.a.s.c.CoreContainer Creating SolrCore 'testcollection_shard1_replica_n3' using configuration from collection testcollection, trusted=true
   [junit4]   2> 40003 INFO  (qtp243644160-454) [    ] o.a.s.m.r.SolrJmxReporter JMX monitoring for 'solr_43245.solr.core.testcollection.shard1.replica_n3' (registry 'solr.core.testcollection.shard1.replica_n3') enabled at server: com.sun.jmx.mbeanserver.JmxMBeanServer@42424c6b
   [junit4]   2> 40003 INFO  (qtp243644160-454) [    ] o.a.s.c.SolrCore solr.RecoveryStrategy.Builder
   [junit4]   2> 40003 INFO  (qtp243644160-454) [    ] o.a.s.c.SolrCore [[testcollection_shard1_replica_n3] ] Opening new SolrCore at [/home/jenkins/workspace/Lucene-Solr-7.x-Linux/solr/build/solr-core/test/J1/temp/solr.cloud.TestAuthenticationFramework_46E1B959ED02D05C-001/tempDir-001/node1/testcollection_shard1_replica_n3], dataDir=[/home/jenkins/workspace/Lucene-Solr-7.x-Linux/solr/build/solr-core/test/J1/temp/solr.cloud.TestAuthenticationFramework_46E1B959ED02D05C-001/tempDir-001/node1/./testcollection_shard1_replica_n3/data/]
   [junit4]   2> 40095 INFO  (qtp243644160-453) [    ] o.a.s.u.UpdateHandler Using UpdateLog implementation: org.apache.solr.update.UpdateLog
   [junit4]   2> 40095 INFO  (qtp243644160-453) [    ] o.a.s.u.UpdateLog Initializing UpdateLog: dataDir=null defaultSyncLevel=FLUSH numRecordsToKeep=100 maxNumLogsToKeep=10 numVersionBuckets=65536
   [junit4]   2> 40096 INFO  (qtp243644160-453) [    ] o.a.s.u.CommitTracker Hard AutoCommit: disabled
   [junit4]   2> 40096 INFO  (qtp243644160-453) [    ] o.a.s.u.CommitTracker Soft AutoCommit: disabled
   [junit4]   2> 40097 INFO  (qtp243644160-453) [    ] o.a.s.s.SolrIndexSearcher Opening [Searcher@11f92378[testcollection_shard2_replica_n6] main]
   [junit4]   2> 40104 INFO  (qtp243644160-453) [    ] o.a.s.r.ManagedResourceStorage Configured ZooKeeperStorageIO with znodeBase: /configs/solrCloudCollectionConfig
   [junit4]   2> 40105 INFO  (qtp243644160-453) [    ] o.a.s.r.ManagedResourceStorage Loaded null at path _rest_managed.json using ZooKeeperStorageIO:path=/configs/solrCloudCollectionConfig
   [junit4]   2> 40105 INFO  (qtp243644160-453) [    ] o.a.s.h.ReplicationHandler Commits will be reserved for 10000ms.
   [junit4]   2> 40106 INFO  (qtp243644160-453) [    ] o.a.s.u.UpdateLog Could not find max version in index or recent updates, using new clock 1587108394906419200
   [junit4]   2> 40109 INFO  (qtp243644160-453) [    ] o.a.s.c.ShardLeaderElectionContext Waiting until we see more replicas up for shard shard2: total=2 found=1 timeoutin=9999ms
   [junit4]   2> 40160 INFO  (searcherExecutor-230-thread-1) [    ] o.a.s.c.SolrCore [testcollection_shard2_replica_n6] Registered new searcher Searcher@11f92378[testcollection_shard2_replica_n6] main{ExitableDirectoryReader(UninvertingDirectoryReader())}
   [junit4]   2> 40210 INFO  (qtp656704657-534) [    ] o.a.s.u.UpdateHandler Using UpdateLog implementation: org.apache.solr.update.UpdateLog
   [junit4]   2> 40210 INFO  (qtp656704657-534) [    ] o.a.s.u.UpdateLog Initializing UpdateLog: dataDir=null defaultSyncLevel=FLUSH numRecordsToKeep=100 maxNumLogsToKeep=10 numVersionBuckets=65536
   [junit4]   2> 40212 INFO  (qtp656704657-534) [    ] o.a.s.u.CommitTracker Hard AutoCommit: disabled
   [junit4]   2> 40212 INFO  (qtp656704657-534) [    ] o.a.s.u.CommitTracker Soft AutoCommit: disabled
   [junit4]   2> 40212 INFO  (zkCallback-103-thread-1) [    ] o.a.s.c.c.ZkStateReader A cluster state change: [WatchedEvent state:SyncConnected type:NodeDataChanged path:/collections/testcollection/state.json] for collection [testcollection] has occurred - updating... (live nodes size: [2])
   [junit4]   2> 40212 INFO  (zkCallback-103-thread-2) [    ] o.a.s.c.c.ZkStateReader A cluster state change: [WatchedEvent state:SyncConnected type:NodeDataChanged path:/collections/testcollection/state.json] for collection [testcollection] has occurred - updating... (live nodes size: [2])
   [junit4]   2> 40215 INFO  (zkCallback-103-thread-3) [    ] o.a.s.c.c.ZkStateReader A cluster state change: [WatchedEvent state:SyncConnected type:NodeDataChanged path:/collections/testcollection/state.json] for collection [testcollection] has occurred - updating... (live nodes size: [2])
   [junit4]   2> 40223 INFO  (zkCallback-100-thread-1) [    ] o.a.s.c.c.ZkStateReader A cluster state change: [WatchedEvent state:SyncConnected type:NodeDataChanged path:/collections/testcollection/state.json] for collection [testcollection] has occurred - updating... (live nodes size: [2])
   [junit4]   2> 40223 INFO  (zkCallback-100-thread-2) [    ] o.a.s.c.c.ZkStateReader A cluster state change: [WatchedEvent state:SyncConnected type:NodeDataChanged path:/collections/testcollection/state.json] for collection [testcollection] has occurred - updating... (live nodes size: [2])
   [junit4]   2> 40243 INFO  (qtp656704657-534) [    ] o.a.s.s.SolrIndexSearcher Opening [Searcher@7ad9116a[testcollection_shard2_replica_n5] main]
   [junit4]   2> 40246 INFO  (qtp656704657-534) [    ] o.a.s.r.ManagedResourceStorage Configured ZooKeeperStorageIO with znodeBase: /configs/solrCloudCollectionConfig
   [junit4]   2> 40246 INFO  (qtp656704657-534) [    ] o.a.s.r.ManagedResourceStorage Loaded null at path _rest_managed.json using ZooKeeperStorageIO:path=/configs/solrCloudCollectionConfig
   [junit4]   2> 40246 INFO  (qtp656704657-534) [    ] o.a.s.h.ReplicationHandler Commits will be reserved for 10000ms.
   [junit4]   2> 40251 INFO  (qtp656704657-534) [    ] o.a.s.u.UpdateLog Could not find max version in index or recent updates, using new clock 1587108395058462720
   [junit4]   2> 40252 INFO  (qtp656704657-439) [    ] o.a.s.u.UpdateHandler Using UpdateLog implementation: org.apache.solr.update.UpdateLog
   [junit4]   2> 40252 INFO  (qtp656704657-439) [    ] o.a.s.u.UpdateLog Initializing UpdateLog: dataDir=null defaultSyncLevel=FLUSH numRecordsToKeep=100 maxNumLogsToKeep=10 numVersionBuckets=65536
   [junit4]   2> 40253 INFO  (qtp656704657-439) [    ] o.a.s.u.CommitTracker Hard AutoCommit: disabled
   [junit4]   2> 40253 INFO  (qtp656704657-439) [    ] o.a.s.u.CommitTracker Soft AutoCommit: disabled
   [junit4]   2> 40257 INFO  (qtp656704657-439) [    ] o.a.s.s.SolrIndexSearcher Opening [Searcher@2c260029[testcollection_shard1_replica_n1] main]
   [junit4]   2> 40258 INFO  (searcherExecutor-231-thread-1) [    ] o.a.s.c.SolrCore [testcollection_shard2_replica_n5] Registered new searcher Searcher@7ad9116a[testcollection_shard2_replica_n5] main{ExitableDirectoryReader(UninvertingDirectoryReader())}
   [junit4]   2> 40258 INFO  (qtp656704657-439) [    ] o.a.s.r.ManagedResourceStorage Configured ZooKeeperStorageIO with znodeBase: /configs/solrCloudCollectionConfig
   [junit4]   2> 40258 INFO  (qtp656704657-439) [    ] o.a.s.r.ManagedResourceStorage Loaded null at path _rest_managed.json using ZooKeeperStorageIO:path=/configs/solrCloudCollectionConfig
   [junit4]   2> 40259 INFO  (qtp656704657-439) [    ] o.a.s.h.ReplicationHandler Commits will be reserved for 10000ms.
   [junit4]   2> 40259 INFO  (qtp656704657-439) [    ] o.a.s.u.UpdateLog Could not find max version in index or recent updates, using new clock 1587108395066851328
   [junit4]   2> 40260 INFO  (searcherExecutor-232-thread-1) [    ] o.a.s.c.SolrCore [testcollection_shard1_replica_n1] Registered new searcher Searcher@2c260029[testcollection_shard1_replica_n1] main{ExitableDirectoryReader(UninvertingDirectoryReader())}
   [junit4]   2> 40263 INFO  (qtp243644160-454) [    ] o.a.s.u.UpdateHandler Using UpdateLog implementation: org.apache.solr.update.UpdateLog
   [junit4]   2> 40263 INFO  (qtp243644160-454) [    ] o.a.s.u.UpdateLog Initializing UpdateLog: dataDir=null defaultSyncLevel=FLUSH numRecordsToKeep=100 maxNumLogsToKeep=10 numVersionBuckets=65536
   [junit4]   2> 40264 INFO  (qtp243644160-454) [    ] o.a.s.u.CommitTracker Hard AutoCommit: disabled
   [junit4]   2> 40264 INFO  (qtp243644160-454) [    ] o.a.s.u.CommitTracker Soft AutoCommit: disabled
   [junit4]   2> 40267 INFO  (qtp243644160-454) [    ] o.a.s.s.SolrIndexSearcher Opening [Searcher@156d707e[testcollection_shard1_replica_n3] main]
   [junit4]   2> 40270 INFO  (qtp656704657-439) [    ] o.a.s.c.ShardLeaderElectionContext Waiting until we see more replicas up for shard shard1: total=2 found=1 timeoutin=9999ms
   [junit4]   2> 40273 INFO  (qtp243644160-454) [    ] o.a.s.r.ManagedResourceStorage Configured ZooKeeperStorageIO with znodeBase: /configs/solrCloudCollectionConfig
   [junit4]   2> 40273 INFO  (qtp243644160-454) [    ] o.a.s.r.ManagedResourceStorage Loaded null at path _rest_managed.json using ZooKeeperStorageIO:pat

[...truncated too long message...]

losing metric reporters for registry=solr.jvm, tag=null
   [junit4]   2> 42356 INFO  (jetty-closer-85-thread-1) [    ] o.a.s.m.r.SolrJmxReporter Closing reporter [org.apache.solr.metrics.reporters.SolrJmxReporter@c50233f: rootName = solr_43245, domain = solr.jvm, service url = null, agent id = null] for registry solr.jvm / com.codahale.metrics.MetricRegistry@51300c79
   [junit4]   2> 42357 INFO  (jetty-closer-85-thread-2) [    ] o.a.s.m.SolrMetricManager Closing metric reporters for registry=solr.jvm, tag=null
   [junit4]   2> 42358 INFO  (jetty-closer-85-thread-2) [    ] o.a.s.m.r.SolrJmxReporter Closing reporter [org.apache.solr.metrics.reporters.SolrJmxReporter@ccb017e: rootName = solr_41489, domain = solr.jvm, service url = null, agent id = null] for registry solr.jvm / com.codahale.metrics.MetricRegistry@51300c79
   [junit4]   2> 42359 INFO  (jetty-closer-85-thread-1) [    ] o.a.s.m.SolrMetricManager Closing metric reporters for registry=solr.jetty, tag=null
   [junit4]   2> 42359 INFO  (jetty-closer-85-thread-1) [    ] o.a.s.m.r.SolrJmxReporter Closing reporter [org.apache.solr.metrics.reporters.SolrJmxReporter@685378f2: rootName = solr_43245, domain = solr.jetty, service url = null, agent id = null] for registry solr.jetty / com.codahale.metrics.MetricRegistry@1432983b
   [junit4]   2> 42360 INFO  (jetty-closer-85-thread-1) [    ] o.a.s.c.ZkController Remove node as live in ZooKeeper:/live_nodes/127.0.0.1:43245_solr
   [junit4]   2> 42361 INFO  (jetty-closer-85-thread-1) [    ] o.a.s.m.SolrMetricManager Closing metric reporters for registry=solr.cluster, tag=null
   [junit4]   2> 42361 INFO  (zkCallback-103-thread-4) [    ] o.a.s.c.c.ZkStateReader Updated live nodes from ZooKeeper... (2) -> (1)
   [junit4]   2> 42362 INFO  (zkCallback-100-thread-1) [    ] o.a.s.c.c.ZkStateReader Updated live nodes from ZooKeeper... (2) -> (1)
   [junit4]   2> 42363 INFO  (coreCloseExecutor-250-thread-1) [    ] o.a.s.c.SolrCore [testcollection_shard2_replica_n6]  CLOSING SolrCore org.apache.solr.core.SolrCore@2b54b4c0
   [junit4]   2> 42363 INFO  (coreCloseExecutor-250-thread-2) [    ] o.a.s.c.SolrCore [testcollection_shard1_replica_n3]  CLOSING SolrCore org.apache.solr.core.SolrCore@3c4bae4a
   [junit4]   2> 42363 INFO  (coreCloseExecutor-250-thread-1) [    ] o.a.s.m.SolrMetricManager Closing metric reporters for registry=solr.core.testcollection.shard2.replica_n6, tag=726971584
   [junit4]   2> 42363 INFO  (coreCloseExecutor-250-thread-1) [    ] o.a.s.m.r.SolrJmxReporter Closing reporter [org.apache.solr.metrics.reporters.SolrJmxReporter@6a6db887: rootName = solr_43245, domain = solr.core.testcollection.shard2.replica_n6, service url = null, agent id = null] for registry solr.core.testcollection.shard2.replica_n6 / com.codahale.metrics.MetricRegistry@6b3d9318
   [junit4]   2> 42364 INFO  (jetty-closer-85-thread-2) [    ] o.a.s.m.SolrMetricManager Closing metric reporters for registry=solr.jetty, tag=null
   [junit4]   2> 42364 INFO  (jetty-closer-85-thread-2) [    ] o.a.s.m.r.SolrJmxReporter Closing reporter [org.apache.solr.metrics.reporters.SolrJmxReporter@7b278a41: rootName = solr_41489, domain = solr.jetty, service url = null, agent id = null] for registry solr.jetty / com.codahale.metrics.MetricRegistry@1432983b
   [junit4]   2> 42379 INFO  (coreCloseExecutor-250-thread-2) [    ] o.a.s.m.SolrMetricManager Closing metric reporters for registry=solr.core.testcollection.shard1.replica_n3, tag=1011592778
   [junit4]   2> 42379 INFO  (coreCloseExecutor-250-thread-2) [    ] o.a.s.m.r.SolrJmxReporter Closing reporter [org.apache.solr.metrics.reporters.SolrJmxReporter@422d4b8e: rootName = solr_43245, domain = solr.core.testcollection.shard1.replica_n3, service url = null, agent id = null] for registry solr.core.testcollection.shard1.replica_n3 / com.codahale.metrics.MetricRegistry@14bf77b7
   [junit4]   2> 42380 INFO  (jetty-closer-85-thread-2) [    ] o.a.s.c.ZkController Remove node as live in ZooKeeper:/live_nodes/127.0.0.1:41489_solr
   [junit4]   2> 42381 INFO  (zkCallback-103-thread-4) [    ] o.a.s.c.c.ZkStateReader Updated live nodes from ZooKeeper... (1) -> (0)
   [junit4]   2> 42381 INFO  (zkCallback-100-thread-1) [    ] o.a.s.c.c.ZkStateReader Updated live nodes from ZooKeeper... (1) -> (0)
   [junit4]   2> 42381 INFO  (jetty-closer-85-thread-2) [    ] o.a.s.m.SolrMetricManager Closing metric reporters for registry=solr.cluster, tag=null
   [junit4]   2> 42387 INFO  (coreCloseExecutor-250-thread-2) [    ] o.a.s.m.SolrMetricManager Closing metric reporters for registry=solr.collection.testcollection.shard1.leader, tag=1011592778
   [junit4]   2> 42387 INFO  (coreCloseExecutor-250-thread-1) [    ] o.a.s.m.SolrMetricManager Closing metric reporters for registry=solr.collection.testcollection.shard2.leader, tag=726971584
   [junit4]   2> 42390 INFO  (coreCloseExecutor-251-thread-1) [    ] o.a.s.c.SolrCore [testcollection_shard2_replica_n5]  CLOSING SolrCore org.apache.solr.core.SolrCore@690b6461
   [junit4]   2> 42390 INFO  (coreCloseExecutor-251-thread-1) [    ] o.a.s.m.SolrMetricManager Closing metric reporters for registry=solr.core.testcollection.shard2.replica_n5, tag=1762354273
   [junit4]   2> 42390 INFO  (coreCloseExecutor-251-thread-1) [    ] o.a.s.m.r.SolrJmxReporter Closing reporter [org.apache.solr.metrics.reporters.SolrJmxReporter@43f79b90: rootName = solr_41489, domain = solr.core.testcollection.shard2.replica_n5, service url = null, agent id = null] for registry solr.core.testcollection.shard2.replica_n5 / com.codahale.metrics.MetricRegistry@5d203ef6
   [junit4]   2> 42402 INFO  (coreCloseExecutor-251-thread-2) [    ] o.a.s.c.SolrCore [testcollection_shard1_replica_n1]  CLOSING SolrCore org.apache.solr.core.SolrCore@cc1ee8a
   [junit4]   2> 42415 INFO  (coreCloseExecutor-251-thread-1) [    ] o.a.s.m.SolrMetricManager Closing metric reporters for registry=solr.collection.testcollection.shard2.leader, tag=1762354273
   [junit4]   2> 42415 INFO  (coreCloseExecutor-251-thread-2) [    ] o.a.s.m.SolrMetricManager Closing metric reporters for registry=solr.core.testcollection.shard1.replica_n1, tag=214036106
   [junit4]   2> 42415 INFO  (coreCloseExecutor-251-thread-2) [    ] o.a.s.m.r.SolrJmxReporter Closing reporter [org.apache.solr.metrics.reporters.SolrJmxReporter@5218427e: rootName = solr_41489, domain = solr.core.testcollection.shard1.replica_n1, service url = null, agent id = null] for registry solr.core.testcollection.shard1.replica_n1 / com.codahale.metrics.MetricRegistry@1c7f722
   [junit4]   2> 42421 INFO  (OverseerCollectionConfigSetProcessor-99194274144583686-127.0.0.1:43245_solr-n_0000000000) [    ] o.a.s.c.OverseerTaskQueue Response ZK path: /overseer/collection-queue-work/qnr-0000000003 doesn't exist.  Requestor may have disconnected from ZooKeeper
   [junit4]   2> 42422 INFO  (coreCloseExecutor-251-thread-2) [    ] o.a.s.m.SolrMetricManager Closing metric reporters for registry=solr.collection.testcollection.shard1.leader, tag=214036106
   [junit4]   2> 42424 INFO  (jetty-closer-85-thread-1) [    ] o.a.s.c.Overseer Overseer (id=99194274144583686-127.0.0.1:43245_solr-n_0000000000) closing
   [junit4]   2> 42425 INFO  (OverseerStateUpdate-99194274144583686-127.0.0.1:43245_solr-n_0000000000) [    ] o.a.s.c.Overseer Overseer Loop exiting : 127.0.0.1:43245_solr
   [junit4]   2> 42428 INFO  (jetty-closer-85-thread-2) [    ] o.e.j.s.h.ContextHandler Stopped o.e.j.s.ServletContextHandler@31eae44f{/solr,null,UNAVAILABLE}
   [junit4]   2> 42429 WARN  (OverseerAutoScalingTriggerThread-99194274144583686-127.0.0.1:43245_solr-n_0000000000) [    ] o.a.s.c.a.OverseerTriggerThread OverseerTriggerThread woken up but we are closed, exiting.
   [junit4]   2> 42438 INFO  (jetty-closer-85-thread-1) [    ] o.e.j.s.h.ContextHandler Stopped o.e.j.s.ServletContextHandler@44f758e0{/solr,null,UNAVAILABLE}
   [junit4]   2> 42441 ERROR (SUITE-TestAuthenticationFramework-seed#[46E1B959ED02D05C]-worker) [    ] o.a.z.s.ZooKeeperServer ZKShutdownHandler is not registered, so ZooKeeper server won't take any action on ERROR or SHUTDOWN server state changes
   [junit4]   2> 42443 INFO  (SUITE-TestAuthenticationFramework-seed#[46E1B959ED02D05C]-worker) [    ] o.a.s.c.ZkTestServer connecting to 127.0.0.1:43779 43779
   [junit4]   2> 47479 INFO  (Thread-145) [    ] o.a.s.c.ZkTestServer connecting to 127.0.0.1:43779 43779
   [junit4]   2> 47479 WARN  (Thread-145) [    ] o.a.s.c.ZkTestServer Watch limit violations: 
   [junit4]   2> Maximum concurrent create/delete watches above limit:
   [junit4]   2> 
   [junit4]   2> 	4	/solr/configs/solrCloudCollectionConfig
   [junit4]   2> 	3	/solr/aliases.json
   [junit4]   2> 	2	/solr/security.json
   [junit4]   2> 
   [junit4]   2> Maximum concurrent data watches above limit:
   [junit4]   2> 
   [junit4]   2> 	32	/solr/collections/testcollection/state.json
   [junit4]   2> 	3	/solr/clusterstate.json
   [junit4]   2> 	3	/solr/clusterprops.json
   [junit4]   2> 
   [junit4]   2> Maximum concurrent children watches above limit:
   [junit4]   2> 
   [junit4]   2> 	3	/solr/live_nodes
   [junit4]   2> 	3	/solr/collections
   [junit4]   2> 
   [junit4]   2> NOTE: leaving temporary files on disk at: /home/jenkins/workspace/Lucene-Solr-7.x-Linux/solr/build/solr-core/test/J1/temp/solr.cloud.TestAuthenticationFramework_46E1B959ED02D05C-001
   [junit4]   2> NOTE: test params are: codec=Asserting(Lucene70): {id=Lucene50(blocksize=128)}, docValues:{_version_=DocValuesFormat(name=Direct)}, maxPointsInLeafNode=1281, maxMBSortInHeap=6.547780916415833, sim=RandomSimilarity(queryNorm=false): {}, locale=fr-TD, timezone=Africa/Lusaka
   [junit4]   2> NOTE: Linux 4.10.0-40-generic amd64/Oracle Corporation 10-ea (64-bit)/cpus=8,threads=1,free=339205248,total=527958016
   [junit4]   2> NOTE: All tests run in this JVM: [PingRequestHandlerTest, TestSimpleTrackingShardHandler, TestAuthenticationFramework]
   [junit4] Completed [4/763 (1!)] on J1 in 15.70s, 1 test, 1 error <<< FAILURES!

[...truncated 43389 lines...]

Mime
View raw message