lucene-dev mailing list archives

Site index · List index
Message view « Date » · « Thread »
Top « Date » · « Thread »
From Policeman Jenkins Server <jenk...@thetaphi.de>
Subject [JENKINS] Lucene-Solr-master-Solaris (64bit/jdk1.8.0) - Build # 1585 - Still Unstable!
Date Tue, 26 Dec 2017 09:51:02 GMT
Build: https://jenkins.thetaphi.de/job/Lucene-Solr-master-Solaris/1585/
Java: 64bit/jdk1.8.0 -XX:+UseCompressedOops -XX:+UseSerialGC

4 tests failed.
FAILED:  org.apache.solr.cloud.autoscaling.sim.TestComputePlanAction.testNodeAdded

Error Message:


Stack Trace:
java.util.ConcurrentModificationException
	at __randomizedtesting.SeedInfo.seed([1956E5BA14758DD1:7C95B3CDB6D625D2]:0)
	at java.util.ArrayList$Itr.checkForComodification(ArrayList.java:909)
	at java.util.ArrayList$Itr.next(ArrayList.java:859)
	at org.apache.solr.cloud.autoscaling.sim.SimSolrCloudTestCase.tearDown(SimSolrCloudTestCase.java:141)
	at sun.reflect.GeneratedMethodAccessor15.invoke(Unknown Source)
	at sun.reflect.DelegatingMethodAccessorImpl.invoke(DelegatingMethodAccessorImpl.java:43)
	at java.lang.reflect.Method.invoke(Method.java:498)
	at com.carrotsearch.randomizedtesting.RandomizedRunner.invoke(RandomizedRunner.java:1737)
	at com.carrotsearch.randomizedtesting.RandomizedRunner$10.evaluate(RandomizedRunner.java:992)
	at com.carrotsearch.randomizedtesting.rules.SystemPropertiesRestoreRule$1.evaluate(SystemPropertiesRestoreRule.java:57)
	at org.apache.lucene.util.TestRuleSetupTeardownChained$1.evaluate(TestRuleSetupTeardownChained.java:49)
	at org.apache.lucene.util.AbstractBeforeAfterRule$1.evaluate(AbstractBeforeAfterRule.java:45)
	at org.apache.lucene.util.TestRuleThreadAndTestName$1.evaluate(TestRuleThreadAndTestName.java:48)
	at org.apache.lucene.util.TestRuleIgnoreAfterMaxFailures$1.evaluate(TestRuleIgnoreAfterMaxFailures.java:64)
	at org.apache.lucene.util.TestRuleMarkFailure$1.evaluate(TestRuleMarkFailure.java:47)
	at com.carrotsearch.randomizedtesting.rules.StatementAdapter.evaluate(StatementAdapter.java:36)
	at com.carrotsearch.randomizedtesting.ThreadLeakControl$StatementRunner.run(ThreadLeakControl.java:368)
	at com.carrotsearch.randomizedtesting.ThreadLeakControl.forkTimeoutingTask(ThreadLeakControl.java:817)
	at com.carrotsearch.randomizedtesting.ThreadLeakControl$3.evaluate(ThreadLeakControl.java:468)
	at com.carrotsearch.randomizedtesting.RandomizedRunner.runSingleTest(RandomizedRunner.java:943)
	at com.carrotsearch.randomizedtesting.RandomizedRunner$5.evaluate(RandomizedRunner.java:829)
	at com.carrotsearch.randomizedtesting.RandomizedRunner$6.evaluate(RandomizedRunner.java:879)
	at com.carrotsearch.randomizedtesting.RandomizedRunner$7.evaluate(RandomizedRunner.java:890)
	at com.carrotsearch.randomizedtesting.rules.StatementAdapter.evaluate(StatementAdapter.java:36)
	at com.carrotsearch.randomizedtesting.rules.SystemPropertiesRestoreRule$1.evaluate(SystemPropertiesRestoreRule.java:57)
	at org.apache.lucene.util.AbstractBeforeAfterRule$1.evaluate(AbstractBeforeAfterRule.java:45)
	at com.carrotsearch.randomizedtesting.rules.StatementAdapter.evaluate(StatementAdapter.java:36)
	at org.apache.lucene.util.TestRuleStoreClassName$1.evaluate(TestRuleStoreClassName.java:41)
	at com.carrotsearch.randomizedtesting.rules.NoShadowingOrOverridesOnMethodsRule$1.evaluate(NoShadowingOrOverridesOnMethodsRule.java:40)
	at com.carrotsearch.randomizedtesting.rules.NoShadowingOrOverridesOnMethodsRule$1.evaluate(NoShadowingOrOverridesOnMethodsRule.java:40)
	at com.carrotsearch.randomizedtesting.rules.StatementAdapter.evaluate(StatementAdapter.java:36)
	at com.carrotsearch.randomizedtesting.rules.StatementAdapter.evaluate(StatementAdapter.java:36)
	at com.carrotsearch.randomizedtesting.rules.StatementAdapter.evaluate(StatementAdapter.java:36)
	at org.apache.lucene.util.TestRuleAssertionsRequired$1.evaluate(TestRuleAssertionsRequired.java:53)
	at org.apache.lucene.util.TestRuleMarkFailure$1.evaluate(TestRuleMarkFailure.java:47)
	at org.apache.lucene.util.TestRuleIgnoreAfterMaxFailures$1.evaluate(TestRuleIgnoreAfterMaxFailures.java:64)
	at org.apache.lucene.util.TestRuleIgnoreTestSuites$1.evaluate(TestRuleIgnoreTestSuites.java:54)
	at com.carrotsearch.randomizedtesting.rules.StatementAdapter.evaluate(StatementAdapter.java:36)
	at com.carrotsearch.randomizedtesting.ThreadLeakControl$StatementRunner.run(ThreadLeakControl.java:368)
	at java.lang.Thread.run(Thread.java:748)


FAILED:  junit.framework.TestSuite.org.apache.solr.security.PKIAuthenticationIntegrationTest

Error Message:
java.util.concurrent.TimeoutException: Could not connect to ZooKeeper 127.0.0.1:48208 within 30000 ms

Stack Trace:
org.apache.solr.common.SolrException: java.util.concurrent.TimeoutException: Could not connect to ZooKeeper 127.0.0.1:48208 within 30000 ms
	at __randomizedtesting.SeedInfo.seed([1956E5BA14758DD1]:0)
	at org.apache.solr.common.cloud.SolrZkClient.<init>(SolrZkClient.java:182)
	at org.apache.solr.common.cloud.SolrZkClient.<init>(SolrZkClient.java:119)
	at org.apache.solr.common.cloud.SolrZkClient.<init>(SolrZkClient.java:114)
	at org.apache.solr.common.cloud.SolrZkClient.<init>(SolrZkClient.java:101)
	at org.apache.solr.cloud.MiniSolrCloudCluster.waitForAllNodes(MiniSolrCloudCluster.java:268)
	at org.apache.solr.cloud.MiniSolrCloudCluster.<init>(MiniSolrCloudCluster.java:262)
	at org.apache.solr.cloud.SolrCloudTestCase$Builder.configure(SolrCloudTestCase.java:190)
	at org.apache.solr.security.PKIAuthenticationIntegrationTest.setupCluster(PKIAuthenticationIntegrationTest.java:52)
	at sun.reflect.NativeMethodAccessorImpl.invoke0(Native Method)
	at sun.reflect.NativeMethodAccessorImpl.invoke(NativeMethodAccessorImpl.java:62)
	at sun.reflect.DelegatingMethodAccessorImpl.invoke(DelegatingMethodAccessorImpl.java:43)
	at java.lang.reflect.Method.invoke(Method.java:498)
	at com.carrotsearch.randomizedtesting.RandomizedRunner.invoke(RandomizedRunner.java:1737)
	at com.carrotsearch.randomizedtesting.RandomizedRunner$6.evaluate(RandomizedRunner.java:874)
	at com.carrotsearch.randomizedtesting.RandomizedRunner$7.evaluate(RandomizedRunner.java:890)
	at com.carrotsearch.randomizedtesting.rules.StatementAdapter.evaluate(StatementAdapter.java:36)
	at com.carrotsearch.randomizedtesting.rules.SystemPropertiesRestoreRule$1.evaluate(SystemPropertiesRestoreRule.java:57)
	at org.apache.lucene.util.AbstractBeforeAfterRule$1.evaluate(AbstractBeforeAfterRule.java:45)
	at com.carrotsearch.randomizedtesting.rules.StatementAdapter.evaluate(StatementAdapter.java:36)
	at org.apache.lucene.util.TestRuleStoreClassName$1.evaluate(TestRuleStoreClassName.java:41)
	at com.carrotsearch.randomizedtesting.rules.NoShadowingOrOverridesOnMethodsRule$1.evaluate(NoShadowingOrOverridesOnMethodsRule.java:40)
	at com.carrotsearch.randomizedtesting.rules.NoShadowingOrOverridesOnMethodsRule$1.evaluate(NoShadowingOrOverridesOnMethodsRule.java:40)
	at com.carrotsearch.randomizedtesting.rules.StatementAdapter.evaluate(StatementAdapter.java:36)
	at com.carrotsearch.randomizedtesting.rules.StatementAdapter.evaluate(StatementAdapter.java:36)
	at com.carrotsearch.randomizedtesting.rules.StatementAdapter.evaluate(StatementAdapter.java:36)
	at org.apache.lucene.util.TestRuleAssertionsRequired$1.evaluate(TestRuleAssertionsRequired.java:53)
	at org.apache.lucene.util.TestRuleMarkFailure$1.evaluate(TestRuleMarkFailure.java:47)
	at org.apache.lucene.util.TestRuleIgnoreAfterMaxFailures$1.evaluate(TestRuleIgnoreAfterMaxFailures.java:64)
	at org.apache.lucene.util.TestRuleIgnoreTestSuites$1.evaluate(TestRuleIgnoreTestSuites.java:54)
	at com.carrotsearch.randomizedtesting.rules.StatementAdapter.evaluate(StatementAdapter.java:36)
	at com.carrotsearch.randomizedtesting.ThreadLeakControl$StatementRunner.run(ThreadLeakControl.java:368)
	at java.lang.Thread.run(Thread.java:748)
Caused by: java.util.concurrent.TimeoutException: Could not connect to ZooKeeper 127.0.0.1:48208 within 30000 ms
	at org.apache.solr.common.cloud.ConnectionManager.waitForConnected(ConnectionManager.java:232)
	at org.apache.solr.common.cloud.SolrZkClient.<init>(SolrZkClient.java:174)
	... 31 more


FAILED:  junit.framework.TestSuite.org.apache.solr.security.PKIAuthenticationIntegrationTest

Error Message:
27 threads leaked from SUITE scope at org.apache.solr.security.PKIAuthenticationIntegrationTest:     1) Thread[id=39849, name=NIOServerCxn.Factory:0.0.0.0/0.0.0.0:0, state=RUNNABLE, group=TGRP-PKIAuthenticationIntegrationTest]         at sun.nio.ch.DevPollArrayWrapper.poll0(Native Method)         at sun.nio.ch.DevPollArrayWrapper.poll(DevPollArrayWrapper.java:223)         at sun.nio.ch.DevPollSelectorImpl.doSelect(DevPollSelectorImpl.java:98)         at sun.nio.ch.SelectorImpl.lockAndDoSelect(SelectorImpl.java:86)         at sun.nio.ch.SelectorImpl.select(SelectorImpl.java:97)         at org.apache.zookeeper.server.NIOServerCnxnFactory.run(NIOServerCnxnFactory.java:173)         at java.lang.Thread.run(Thread.java:748)    2) Thread[id=39876, name=qtp956246034-39876, state=TIMED_WAITING, group=TGRP-PKIAuthenticationIntegrationTest]         at sun.misc.Unsafe.park(Native Method)         at java.util.concurrent.locks.LockSupport.parkNanos(LockSupport.java:215)         at java.util.concurrent.locks.AbstractQueuedSynchronizer$ConditionObject.awaitNanos(AbstractQueuedSynchronizer.java:2078)         at org.eclipse.jetty.util.BlockingArrayQueue.poll(BlockingArrayQueue.java:392)         at org.eclipse.jetty.util.thread.QueuedThreadPool.idleJobPoll(QueuedThreadPool.java:563)         at org.eclipse.jetty.util.thread.QueuedThreadPool.access$800(QueuedThreadPool.java:48)         at org.eclipse.jetty.util.thread.QueuedThreadPool$2.run(QueuedThreadPool.java:626)         at java.lang.Thread.run(Thread.java:748)    3) Thread[id=39856, name=jetty-launcher-9441-thread-1, state=TIMED_WAITING, group=TGRP-PKIAuthenticationIntegrationTest]         at sun.misc.Unsafe.park(Native Method)         at java.util.concurrent.locks.LockSupport.parkNanos(LockSupport.java:215)         at java.util.concurrent.SynchronousQueue$TransferStack.awaitFulfill(SynchronousQueue.java:460)         at java.util.concurrent.SynchronousQueue$TransferStack.transfer(SynchronousQueue.java:362)         at java.util.concurrent.SynchronousQueue.poll(SynchronousQueue.java:941)         at java.util.concurrent.ThreadPoolExecutor.getTask(ThreadPoolExecutor.java:1073)         at java.util.concurrent.ThreadPoolExecutor.runWorker(ThreadPoolExecutor.java:1134)         at java.util.concurrent.ThreadPoolExecutor$Worker.run(ThreadPoolExecutor.java:624)         at java.lang.Thread.run(Thread.java:748)    4) Thread[id=39869, name=qtp589434783-39869-acceptor-0@29bc6f7-ServerConnector@2d1a6577{HTTP/1.1,[http/1.1]}{127.0.0.1:51034}, state=RUNNABLE, group=TGRP-PKIAuthenticationIntegrationTest]         at sun.nio.ch.ServerSocketChannelImpl.accept0(Native Method)         at sun.nio.ch.ServerSocketChannelImpl.accept(ServerSocketChannelImpl.java:422)         at sun.nio.ch.ServerSocketChannelImpl.accept(ServerSocketChannelImpl.java:250)         at org.eclipse.jetty.server.ServerConnector.accept(ServerConnector.java:371)         at org.eclipse.jetty.server.AbstractConnector$Acceptor.run(AbstractConnector.java:601)         at org.eclipse.jetty.util.thread.QueuedThreadPool.runJob(QueuedThreadPool.java:671)         at org.eclipse.jetty.util.thread.QueuedThreadPool$2.run(QueuedThreadPool.java:589)         at java.lang.Thread.run(Thread.java:748)    5) Thread[id=39873, name=qtp589434783-39873, state=TIMED_WAITING, group=TGRP-PKIAuthenticationIntegrationTest]         at sun.misc.Unsafe.park(Native Method)         at java.util.concurrent.locks.LockSupport.parkNanos(LockSupport.java:215)         at java.util.concurrent.locks.AbstractQueuedSynchronizer$ConditionObject.awaitNanos(AbstractQueuedSynchronizer.java:2078)         at org.eclipse.jetty.util.BlockingArrayQueue.poll(BlockingArrayQueue.java:392)         at org.eclipse.jetty.util.thread.QueuedThreadPool.idleJobPoll(QueuedThreadPool.java:563)         at org.eclipse.jetty.util.thread.QueuedThreadPool.access$800(QueuedThreadPool.java:48)         at org.eclipse.jetty.util.thread.QueuedThreadPool$2.run(QueuedThreadPool.java:626)         at java.lang.Thread.run(Thread.java:748)    6) Thread[id=39874, name=qtp589434783-39874, state=TIMED_WAITING, group=TGRP-PKIAuthenticationIntegrationTest]         at sun.misc.Unsafe.park(Native Method)         at java.util.concurrent.locks.LockSupport.parkNanos(LockSupport.java:215)         at java.util.concurrent.locks.AbstractQueuedSynchronizer$ConditionObject.awaitNanos(AbstractQueuedSynchronizer.java:2078)         at org.eclipse.jetty.util.BlockingArrayQueue.poll(BlockingArrayQueue.java:392)         at org.eclipse.jetty.util.thread.QueuedThreadPool.idleJobPoll(QueuedThreadPool.java:563)         at org.eclipse.jetty.util.thread.QueuedThreadPool.access$800(QueuedThreadPool.java:48)         at org.eclipse.jetty.util.thread.QueuedThreadPool$2.run(QueuedThreadPool.java:626)         at java.lang.Thread.run(Thread.java:748)    7) Thread[id=39848, name=Thread-10493, state=WAITING, group=TGRP-PKIAuthenticationIntegrationTest]         at java.lang.Object.wait(Native Method)         at java.lang.Thread.join(Thread.java:1252)         at java.lang.Thread.join(Thread.java:1326)         at org.apache.zookeeper.server.NIOServerCnxnFactory.join(NIOServerCnxnFactory.java:297)         at org.apache.solr.cloud.ZkTestServer$ZKServerMain.runFromConfig(ZkTestServer.java:310)         at org.apache.solr.cloud.ZkTestServer$2.run(ZkTestServer.java:491)    8) Thread[id=39859, name=qtp956246034-39859, state=TIMED_WAITING, group=TGRP-PKIAuthenticationIntegrationTest]         at sun.misc.Unsafe.park(Native Method)         at java.util.concurrent.locks.LockSupport.parkNanos(LockSupport.java:215)         at java.util.concurrent.locks.AbstractQueuedSynchronizer$ConditionObject.awaitNanos(AbstractQueuedSynchronizer.java:2078)         at org.eclipse.jetty.util.BlockingArrayQueue.poll(BlockingArrayQueue.java:392)         at org.eclipse.jetty.util.thread.QueuedThreadPool.idleJobPoll(QueuedThreadPool.java:563)         at org.eclipse.jetty.util.thread.QueuedThreadPool.access$800(QueuedThreadPool.java:48)         at org.eclipse.jetty.util.thread.QueuedThreadPool$2.run(QueuedThreadPool.java:626)         at java.lang.Thread.run(Thread.java:748)    9) Thread[id=39857, name=jetty-launcher-9441-thread-2, state=TIMED_WAITING, group=TGRP-PKIAuthenticationIntegrationTest]         at sun.misc.Unsafe.park(Native Method)         at java.util.concurrent.locks.LockSupport.parkNanos(LockSupport.java:215)         at java.util.concurrent.SynchronousQueue$TransferStack.awaitFulfill(SynchronousQueue.java:460)         at java.util.concurrent.SynchronousQueue$TransferStack.transfer(SynchronousQueue.java:362)         at java.util.concurrent.SynchronousQueue.poll(SynchronousQueue.java:941)         at java.util.concurrent.ThreadPoolExecutor.getTask(ThreadPoolExecutor.java:1073)         at java.util.concurrent.ThreadPoolExecutor.runWorker(ThreadPoolExecutor.java:1134)         at java.util.concurrent.ThreadPoolExecutor$Worker.run(ThreadPoolExecutor.java:624)         at java.lang.Thread.run(Thread.java:748)   10) Thread[id=39878, name=org.eclipse.jetty.server.session.HashSessionManager@60abc029Timer, state=TIMED_WAITING, group=TGRP-PKIAuthenticationIntegrationTest]         at sun.misc.Unsafe.park(Native Method)         at java.util.concurrent.locks.LockSupport.parkNanos(LockSupport.java:215)         at java.util.concurrent.locks.AbstractQueuedSynchronizer$ConditionObject.awaitNanos(AbstractQueuedSynchronizer.java:2078)         at java.util.concurrent.ScheduledThreadPoolExecutor$DelayedWorkQueue.take(ScheduledThreadPoolExecutor.java:1093)         at java.util.concurrent.ScheduledThreadPoolExecutor$DelayedWorkQueue.take(ScheduledThreadPoolExecutor.java:809)         at java.util.concurrent.ThreadPoolExecutor.getTask(ThreadPoolExecutor.java:1074)         at java.util.concurrent.ThreadPoolExecutor.runWorker(ThreadPoolExecutor.java:1134)         at java.util.concurrent.ThreadPoolExecutor$Worker.run(ThreadPoolExecutor.java:624)         at java.lang.Thread.run(Thread.java:748)   11) Thread[id=39872, name=qtp589434783-39872, state=TIMED_WAITING, group=TGRP-PKIAuthenticationIntegrationTest]         at sun.misc.Unsafe.park(Native Method)         at java.util.concurrent.locks.LockSupport.parkNanos(LockSupport.java:215)         at java.util.concurrent.locks.AbstractQueuedSynchronizer$ConditionObject.awaitNanos(AbstractQueuedSynchronizer.java:2078)         at org.eclipse.jetty.util.BlockingArrayQueue.poll(BlockingArrayQueue.java:392)         at org.eclipse.jetty.util.thread.QueuedThreadPool.idleJobPoll(QueuedThreadPool.java:563)         at org.eclipse.jetty.util.thread.QueuedThreadPool.access$800(QueuedThreadPool.java:48)         at org.eclipse.jetty.util.thread.QueuedThreadPool$2.run(QueuedThreadPool.java:626)         at java.lang.Thread.run(Thread.java:748)   12) Thread[id=39883, name=Scheduler-909693309, state=TIMED_WAITING, group=TGRP-PKIAuthenticationIntegrationTest]         at sun.misc.Unsafe.park(Native Method)         at java.util.concurrent.locks.LockSupport.parkNanos(LockSupport.java:215)         at java.util.concurrent.locks.AbstractQueuedSynchronizer$ConditionObject.awaitNanos(AbstractQueuedSynchronizer.java:2078)         at java.util.concurrent.ScheduledThreadPoolExecutor$DelayedWorkQueue.take(ScheduledThreadPoolExecutor.java:1093)         at java.util.concurrent.ScheduledThreadPoolExecutor$DelayedWorkQueue.take(ScheduledThreadPoolExecutor.java:809)         at java.util.concurrent.ThreadPoolExecutor.getTask(ThreadPoolExecutor.java:1074)         at java.util.concurrent.ThreadPoolExecutor.runWorker(ThreadPoolExecutor.java:1134)         at java.util.concurrent.ThreadPoolExecutor$Worker.run(ThreadPoolExecutor.java:624)         at java.lang.Thread.run(Thread.java:748)   13) Thread[id=39870, name=qtp589434783-39870, state=TIMED_WAITING, group=TGRP-PKIAuthenticationIntegrationTest]         at sun.misc.Unsafe.park(Native Method)         at java.util.concurrent.locks.LockSupport.parkNanos(LockSupport.java:215)         at java.util.concurrent.locks.AbstractQueuedSynchronizer$ConditionObject.awaitNanos(AbstractQueuedSynchronizer.java:2078)         at org.eclipse.jetty.util.BlockingArrayQueue.poll(BlockingArrayQueue.java:392)         at org.eclipse.jetty.util.thread.QueuedThreadPool.idleJobPoll(QueuedThreadPool.java:563)         at org.eclipse.jetty.util.thread.QueuedThreadPool.access$800(QueuedThreadPool.java:48)         at org.eclipse.jetty.util.thread.QueuedThreadPool$2.run(QueuedThreadPool.java:626)         at java.lang.Thread.run(Thread.java:748)   14) Thread[id=39860, name=qtp956246034-39860, state=TIMED_WAITING, group=TGRP-PKIAuthenticationIntegrationTest]         at sun.misc.Unsafe.park(Native Method)         at java.util.concurrent.locks.LockSupport.parkNanos(LockSupport.java:215)         at java.util.concurrent.locks.AbstractQueuedSynchronizer$ConditionObject.awaitNanos(AbstractQueuedSynchronizer.java:2078)         at org.eclipse.jetty.util.BlockingArrayQueue.poll(BlockingArrayQueue.java:392)         at org.eclipse.jetty.util.thread.QueuedThreadPool.idleJobPoll(QueuedThreadPool.java:563)         at org.eclipse.jetty.util.thread.QueuedThreadPool.access$800(QueuedThreadPool.java:48)         at org.eclipse.jetty.util.thread.QueuedThreadPool$2.run(QueuedThreadPool.java:626)         at java.lang.Thread.run(Thread.java:748)   15) Thread[id=39862, name=qtp956246034-39862, state=TIMED_WAITING, group=TGRP-PKIAuthenticationIntegrationTest]         at sun.misc.Unsafe.park(Native Method)         at java.util.concurrent.locks.LockSupport.parkNanos(LockSupport.java:215)         at java.util.concurrent.locks.AbstractQueuedSynchronizer$ConditionObject.awaitNanos(AbstractQueuedSynchronizer.java:2078)         at org.eclipse.jetty.util.BlockingArrayQueue.poll(BlockingArrayQueue.java:392)         at org.eclipse.jetty.util.thread.QueuedThreadPool.idleJobPoll(QueuedThreadPool.java:563)         at org.eclipse.jetty.util.thread.QueuedThreadPool.access$800(QueuedThreadPool.java:48)         at org.eclipse.jetty.util.thread.QueuedThreadPool$2.run(QueuedThreadPool.java:626)         at java.lang.Thread.run(Thread.java:748)   16) Thread[id=39861, name=qtp956246034-39861, state=TIMED_WAITING, group=TGRP-PKIAuthenticationIntegrationTest]         at sun.misc.Unsafe.park(Native Method)         at java.util.concurrent.locks.LockSupport.parkNanos(LockSupport.java:215)         at java.util.concurrent.locks.AbstractQueuedSynchronizer$ConditionObject.awaitNanos(AbstractQueuedSynchronizer.java:2078)         at org.eclipse.jetty.util.BlockingArrayQueue.poll(BlockingArrayQueue.java:392)         at org.eclipse.jetty.util.thread.QueuedThreadPool.idleJobPoll(QueuedThreadPool.java:563)         at org.eclipse.jetty.util.thread.QueuedThreadPool.access$800(QueuedThreadPool.java:48)         at org.eclipse.jetty.util.thread.QueuedThreadPool$2.run(QueuedThreadPool.java:626)         at java.lang.Thread.run(Thread.java:748)   17) Thread[id=39852, name=ProcessThread(sid:0 cport:48208):, state=WAITING, group=TGRP-PKIAuthenticationIntegrationTest]         at sun.misc.Unsafe.park(Native Method)         at java.util.concurrent.locks.LockSupport.park(LockSupport.java:175)         at java.util.concurrent.locks.AbstractQueuedSynchronizer$ConditionObject.await(AbstractQueuedSynchronizer.java:2039)         at java.util.concurrent.LinkedBlockingQueue.take(LinkedBlockingQueue.java:442)         at org.apache.zookeeper.server.PrepRequestProcessor.run(PrepRequestProcessor.java:122)   18) Thread[id=39867, name=qtp589434783-39867, state=RUNNABLE, group=TGRP-PKIAuthenticationIntegrationTest]         at sun.nio.ch.DevPollArrayWrapper.poll0(Native Method)         at sun.nio.ch.DevPollArrayWrapper.poll(DevPollArrayWrapper.java:223)         at sun.nio.ch.DevPollSelectorImpl.doSelect(DevPollSelectorImpl.java:98)         at sun.nio.ch.SelectorImpl.lockAndDoSelect(SelectorImpl.java:86)         at sun.nio.ch.SelectorImpl.select(SelectorImpl.java:97)         at sun.nio.ch.SelectorImpl.select(SelectorImpl.java:101)         at org.eclipse.jetty.io.ManagedSelector$SelectorProducer.select(ManagedSelector.java:243)         at org.eclipse.jetty.io.ManagedSelector$SelectorProducer.produce(ManagedSelector.java:191)         at org.eclipse.jetty.util.thread.strategy.ExecuteProduceConsume.executeProduceConsume(ExecuteProduceConsume.java:249)         at org.eclipse.jetty.util.thread.strategy.ExecuteProduceConsume.produceConsume(ExecuteProduceConsume.java:148)         at org.eclipse.jetty.util.thread.strategy.ExecuteProduceConsume.execute(ExecuteProduceConsume.java:100)         at org.eclipse.jetty.io.ManagedSelector.run(ManagedSelector.java:147)         at org.eclipse.jetty.util.thread.QueuedThreadPool.runJob(QueuedThreadPool.java:671)         at org.eclipse.jetty.util.thread.QueuedThreadPool$2.run(QueuedThreadPool.java:589)         at java.lang.Thread.run(Thread.java:748)   19) Thread[id=39850, name=SessionTracker, state=TIMED_WAITING, group=TGRP-PKIAuthenticationIntegrationTest]         at java.lang.Object.wait(Native Method)         at org.apache.zookeeper.server.SessionTrackerImpl.run(SessionTrackerImpl.java:146)   20) Thread[id=39863, name=qtp956246034-39863-acceptor-0@7b600661-ServerConnector@4d04e7ed{HTTP/1.1,[http/1.1]}{127.0.0.1:48208}, state=RUNNABLE, group=TGRP-PKIAuthenticationIntegrationTest]         at sun.nio.ch.ServerSocketChannelImpl.accept0(Native Method)         at sun.nio.ch.ServerSocketChannelImpl.accept(ServerSocketChannelImpl.java:422)         at sun.nio.ch.ServerSocketChannelImpl.accept(ServerSocketChannelImpl.java:250)         at org.eclipse.jetty.server.ServerConnector.accept(ServerConnector.java:371)         at org.eclipse.jetty.server.AbstractConnector$Acceptor.run(AbstractConnector.java:601)         at org.eclipse.jetty.util.thread.QueuedThreadPool.runJob(QueuedThreadPool.java:671)         at org.eclipse.jetty.util.thread.QueuedThreadPool$2.run(QueuedThreadPool.java:589)         at java.lang.Thread.run(Thread.java:748)   21) Thread[id=39875, name=qtp956246034-39875, state=RUNNABLE, group=TGRP-PKIAuthenticationIntegrationTest]         at sun.nio.ch.DevPollArrayWrapper.poll0(Native Method)         at sun.nio.ch.DevPollArrayWrapper.poll(DevPollArrayWrapper.java:223)         at sun.nio.ch.DevPollSelectorImpl.doSelect(DevPollSelectorImpl.java:98)         at sun.nio.ch.SelectorImpl.lockAndDoSelect(SelectorImpl.java:86)         at sun.nio.ch.SelectorImpl.select(SelectorImpl.java:97)         at sun.nio.ch.SelectorImpl.select(SelectorImpl.java:101)         at org.eclipse.jetty.io.ManagedSelector$SelectorProducer.select(ManagedSelector.java:243)         at org.eclipse.jetty.io.ManagedSelector$SelectorProducer.produce(ManagedSelector.java:191)         at org.eclipse.jetty.util.thread.strategy.ExecuteProduceConsume.executeProduceConsume(ExecuteProduceConsume.java:249)         at org.eclipse.jetty.util.thread.strategy.ExecuteProduceConsume.produceConsume(ExecuteProduceConsume.java:148)         at org.eclipse.jetty.util.thread.strategy.ExecuteProduceConsume.run(ExecuteProduceConsume.java:136)         at org.eclipse.jetty.util.thread.QueuedThreadPool.runJob(QueuedThreadPool.java:671)         at org.eclipse.jetty.util.thread.QueuedThreadPool$2.run(QueuedThreadPool.java:589)         at java.lang.Thread.run(Thread.java:748)   22) Thread[id=39877, name=qtp956246034-39877, state=TIMED_WAITING, group=TGRP-PKIAuthenticationIntegrationTest]         at sun.misc.Unsafe.park(Native Method)         at java.util.concurrent.locks.LockSupport.parkNanos(LockSupport.java:215)         at java.util.concurrent.locks.AbstractQueuedSynchronizer$ConditionObject.awaitNanos(AbstractQueuedSynchronizer.java:2078)         at org.eclipse.jetty.util.BlockingArrayQueue.poll(BlockingArrayQueue.java:392)         at org.eclipse.jetty.util.thread.QueuedThreadPool.idleJobPoll(QueuedThreadPool.java:563)         at org.eclipse.jetty.util.thread.QueuedThreadPool.access$800(QueuedThreadPool.java:48)         at org.eclipse.jetty.util.thread.QueuedThreadPool$2.run(QueuedThreadPool.java:626)         at java.lang.Thread.run(Thread.java:748)   23) Thread[id=39866, name=org.eclipse.jetty.server.session.HashSessionManager@466367e6Timer, state=TIMED_WAITING, group=TGRP-PKIAuthenticationIntegrationTest]         at sun.misc.Unsafe.park(Native Method)         at java.util.concurrent.locks.LockSupport.parkNanos(LockSupport.java:215)         at java.util.concurrent.locks.AbstractQueuedSynchronizer$ConditionObject.awaitNanos(AbstractQueuedSynchronizer.java:2078)         at java.util.concurrent.ScheduledThreadPoolExecutor$DelayedWorkQueue.take(ScheduledThreadPoolExecutor.java:1093)         at java.util.concurrent.ScheduledThreadPoolExecutor$DelayedWorkQueue.take(ScheduledThreadPoolExecutor.java:809)         at java.util.concurrent.ThreadPoolExecutor.getTask(ThreadPoolExecutor.java:1074)         at java.util.concurrent.ThreadPoolExecutor.runWorker(ThreadPoolExecutor.java:1134)         at java.util.concurrent.ThreadPoolExecutor$Worker.run(ThreadPoolExecutor.java:624)         at java.lang.Thread.run(Thread.java:748)   24) Thread[id=39868, name=qtp589434783-39868, state=TIMED_WAITING, group=TGRP-PKIAuthenticationIntegrationTest]         at sun.misc.Unsafe.park(Native Method)         at java.util.concurrent.locks.LockSupport.parkNanos(LockSupport.java:215)         at java.util.concurrent.locks.AbstractQueuedSynchronizer$ConditionObject.awaitNanos(AbstractQueuedSynchronizer.java:2078)         at org.eclipse.jetty.util.BlockingArrayQueue.poll(BlockingArrayQueue.java:392)         at org.eclipse.jetty.util.thread.QueuedThreadPool.idleJobPoll(QueuedThreadPool.java:563)         at org.eclipse.jetty.util.thread.QueuedThreadPool.access$800(QueuedThreadPool.java:48)         at org.eclipse.jetty.util.thread.QueuedThreadPool$2.run(QueuedThreadPool.java:626)         at java.lang.Thread.run(Thread.java:748)   25) Thread[id=39871, name=qtp589434783-39871, state=TIMED_WAITING, group=TGRP-PKIAuthenticationIntegrationTest]         at sun.misc.Unsafe.park(Native Method)         at java.util.concurrent.locks.LockSupport.parkNanos(LockSupport.java:215)         at java.util.concurrent.locks.AbstractQueuedSynchronizer$ConditionObject.awaitNanos(AbstractQueuedSynchronizer.java:2078)         at org.eclipse.jetty.util.BlockingArrayQueue.poll(BlockingArrayQueue.java:392)         at org.eclipse.jetty.util.thread.QueuedThreadPool.idleJobPoll(QueuedThreadPool.java:563)         at org.eclipse.jetty.util.thread.QueuedThreadPool.access$800(QueuedThreadPool.java:48)         at org.eclipse.jetty.util.thread.QueuedThreadPool$2.run(QueuedThreadPool.java:626)         at java.lang.Thread.run(Thread.java:748)   26) Thread[id=39864, name=qtp956246034-39864, state=TIMED_WAITING, group=TGRP-PKIAuthenticationIntegrationTest]         at sun.misc.Unsafe.park(Native Method)         at java.util.concurrent.locks.LockSupport.parkNanos(LockSupport.java:215)         at java.util.concurrent.locks.AbstractQueuedSynchronizer$ConditionObject.awaitNanos(AbstractQueuedSynchronizer.java:2078)         at org.eclipse.jetty.util.BlockingArrayQueue.poll(BlockingArrayQueue.java:392)         at org.eclipse.jetty.util.thread.QueuedThreadPool.idleJobPoll(QueuedThreadPool.java:563)         at org.eclipse.jetty.util.thread.QueuedThreadPool.access$800(QueuedThreadPool.java:48)         at org.eclipse.jetty.util.thread.QueuedThreadPool$2.run(QueuedThreadPool.java:626)         at java.lang.Thread.run(Thread.java:748)   27) Thread[id=39858, name=qtp956246034-39858, state=TIMED_WAITING, group=TGRP-PKIAuthenticationIntegrationTest]         at sun.misc.Unsafe.park(Native Method)         at java.util.concurrent.locks.LockSupport.parkNanos(LockSupport.java:215)         at java.util.concurrent.locks.AbstractQueuedSynchronizer$ConditionObject.awaitNanos(AbstractQueuedSynchronizer.java:2078)         at org.eclipse.jetty.util.BlockingArrayQueue.poll(BlockingArrayQueue.java:392)         at org.eclipse.jetty.util.thread.QueuedThreadPool.idleJobPoll(QueuedThreadPool.java:563)         at org.eclipse.jetty.util.thread.QueuedThreadPool.access$800(QueuedThreadPool.java:48)         at org.eclipse.jetty.util.thread.QueuedThreadPool$2.run(QueuedThreadPool.java:626)         at java.lang.Thread.run(Thread.java:748)

Stack Trace:
com.carrotsearch.randomizedtesting.ThreadLeakError: 27 threads leaked from SUITE scope at org.apache.solr.security.PKIAuthenticationIntegrationTest: 
   1) Thread[id=39849, name=NIOServerCxn.Factory:0.0.0.0/0.0.0.0:0, state=RUNNABLE, group=TGRP-PKIAuthenticationIntegrationTest]
        at sun.nio.ch.DevPollArrayWrapper.poll0(Native Method)
        at sun.nio.ch.DevPollArrayWrapper.poll(DevPollArrayWrapper.java:223)
        at sun.nio.ch.DevPollSelectorImpl.doSelect(DevPollSelectorImpl.java:98)
        at sun.nio.ch.SelectorImpl.lockAndDoSelect(SelectorImpl.java:86)
        at sun.nio.ch.SelectorImpl.select(SelectorImpl.java:97)
        at org.apache.zookeeper.server.NIOServerCnxnFactory.run(NIOServerCnxnFactory.java:173)
        at java.lang.Thread.run(Thread.java:748)
   2) Thread[id=39876, name=qtp956246034-39876, state=TIMED_WAITING, group=TGRP-PKIAuthenticationIntegrationTest]
        at sun.misc.Unsafe.park(Native Method)
        at java.util.concurrent.locks.LockSupport.parkNanos(LockSupport.java:215)
        at java.util.concurrent.locks.AbstractQueuedSynchronizer$ConditionObject.awaitNanos(AbstractQueuedSynchronizer.java:2078)
        at org.eclipse.jetty.util.BlockingArrayQueue.poll(BlockingArrayQueue.java:392)
        at org.eclipse.jetty.util.thread.QueuedThreadPool.idleJobPoll(QueuedThreadPool.java:563)
        at org.eclipse.jetty.util.thread.QueuedThreadPool.access$800(QueuedThreadPool.java:48)
        at org.eclipse.jetty.util.thread.QueuedThreadPool$2.run(QueuedThreadPool.java:626)
        at java.lang.Thread.run(Thread.java:748)
   3) Thread[id=39856, name=jetty-launcher-9441-thread-1, state=TIMED_WAITING, group=TGRP-PKIAuthenticationIntegrationTest]
        at sun.misc.Unsafe.park(Native Method)
        at java.util.concurrent.locks.LockSupport.parkNanos(LockSupport.java:215)
        at java.util.concurrent.SynchronousQueue$TransferStack.awaitFulfill(SynchronousQueue.java:460)
        at java.util.concurrent.SynchronousQueue$TransferStack.transfer(SynchronousQueue.java:362)
        at java.util.concurrent.SynchronousQueue.poll(SynchronousQueue.java:941)
        at java.util.concurrent.ThreadPoolExecutor.getTask(ThreadPoolExecutor.java:1073)
        at java.util.concurrent.ThreadPoolExecutor.runWorker(ThreadPoolExecutor.java:1134)
        at java.util.concurrent.ThreadPoolExecutor$Worker.run(ThreadPoolExecutor.java:624)
        at java.lang.Thread.run(Thread.java:748)
   4) Thread[id=39869, name=qtp589434783-39869-acceptor-0@29bc6f7-ServerConnector@2d1a6577{HTTP/1.1,[http/1.1]}{127.0.0.1:51034}, state=RUNNABLE, group=TGRP-PKIAuthenticationIntegrationTest]
        at sun.nio.ch.ServerSocketChannelImpl.accept0(Native Method)
        at sun.nio.ch.ServerSocketChannelImpl.accept(ServerSocketChannelImpl.java:422)
        at sun.nio.ch.ServerSocketChannelImpl.accept(ServerSocketChannelImpl.java:250)
        at org.eclipse.jetty.server.ServerConnector.accept(ServerConnector.java:371)
        at org.eclipse.jetty.server.AbstractConnector$Acceptor.run(AbstractConnector.java:601)
        at org.eclipse.jetty.util.thread.QueuedThreadPool.runJob(QueuedThreadPool.java:671)
        at org.eclipse.jetty.util.thread.QueuedThreadPool$2.run(QueuedThreadPool.java:589)
        at java.lang.Thread.run(Thread.java:748)
   5) Thread[id=39873, name=qtp589434783-39873, state=TIMED_WAITING, group=TGRP-PKIAuthenticationIntegrationTest]
        at sun.misc.Unsafe.park(Native Method)
        at java.util.concurrent.locks.LockSupport.parkNanos(LockSupport.java:215)
        at java.util.concurrent.locks.AbstractQueuedSynchronizer$ConditionObject.awaitNanos(AbstractQueuedSynchronizer.java:2078)
        at org.eclipse.jetty.util.BlockingArrayQueue.poll(BlockingArrayQueue.java:392)
        at org.eclipse.jetty.util.thread.QueuedThreadPool.idleJobPoll(QueuedThreadPool.java:563)
        at org.eclipse.jetty.util.thread.QueuedThreadPool.access$800(QueuedThreadPool.java:48)
        at org.eclipse.jetty.util.thread.QueuedThreadPool$2.run(QueuedThreadPool.java:626)
        at java.lang.Thread.run(Thread.java:748)
   6) Thread[id=39874, name=qtp589434783-39874, state=TIMED_WAITING, group=TGRP-PKIAuthenticationIntegrationTest]
        at sun.misc.Unsafe.park(Native Method)
        at java.util.concurrent.locks.LockSupport.parkNanos(LockSupport.java:215)
        at java.util.concurrent.locks.AbstractQueuedSynchronizer$ConditionObject.awaitNanos(AbstractQueuedSynchronizer.java:2078)
        at org.eclipse.jetty.util.BlockingArrayQueue.poll(BlockingArrayQueue.java:392)
        at org.eclipse.jetty.util.thread.QueuedThreadPool.idleJobPoll(QueuedThreadPool.java:563)
        at org.eclipse.jetty.util.thread.QueuedThreadPool.access$800(QueuedThreadPool.java:48)
        at org.eclipse.jetty.util.thread.QueuedThreadPool$2.run(QueuedThreadPool.java:626)
        at java.lang.Thread.run(Thread.java:748)
   7) Thread[id=39848, name=Thread-10493, state=WAITING, group=TGRP-PKIAuthenticationIntegrationTest]
        at java.lang.Object.wait(Native Method)
        at java.lang.Thread.join(Thread.java:1252)
        at java.lang.Thread.join(Thread.java:1326)
        at org.apache.zookeeper.server.NIOServerCnxnFactory.join(NIOServerCnxnFactory.java:297)
        at org.apache.solr.cloud.ZkTestServer$ZKServerMain.runFromConfig(ZkTestServer.java:310)
        at org.apache.solr.cloud.ZkTestServer$2.run(ZkTestServer.java:491)
   8) Thread[id=39859, name=qtp956246034-39859, state=TIMED_WAITING, group=TGRP-PKIAuthenticationIntegrationTest]
        at sun.misc.Unsafe.park(Native Method)
        at java.util.concurrent.locks.LockSupport.parkNanos(LockSupport.java:215)
        at java.util.concurrent.locks.AbstractQueuedSynchronizer$ConditionObject.awaitNanos(AbstractQueuedSynchronizer.java:2078)
        at org.eclipse.jetty.util.BlockingArrayQueue.poll(BlockingArrayQueue.java:392)
        at org.eclipse.jetty.util.thread.QueuedThreadPool.idleJobPoll(QueuedThreadPool.java:563)
        at org.eclipse.jetty.util.thread.QueuedThreadPool.access$800(QueuedThreadPool.java:48)
        at org.eclipse.jetty.util.thread.QueuedThreadPool$2.run(QueuedThreadPool.java:626)
        at java.lang.Thread.run(Thread.java:748)
   9) Thread[id=39857, name=jetty-launcher-9441-thread-2, state=TIMED_WAITING, group=TGRP-PKIAuthenticationIntegrationTest]
        at sun.misc.Unsafe.park(Native Method)
        at java.util.concurrent.locks.LockSupport.parkNanos(LockSupport.java:215)
        at java.util.concurrent.SynchronousQueue$TransferStack.awaitFulfill(SynchronousQueue.java:460)
        at java.util.concurrent.SynchronousQueue$TransferStack.transfer(SynchronousQueue.java:362)
        at java.util.concurrent.SynchronousQueue.poll(SynchronousQueue.java:941)
        at java.util.concurrent.ThreadPoolExecutor.getTask(ThreadPoolExecutor.java:1073)
        at java.util.concurrent.ThreadPoolExecutor.runWorker(ThreadPoolExecutor.java:1134)
        at java.util.concurrent.ThreadPoolExecutor$Worker.run(ThreadPoolExecutor.java:624)
        at java.lang.Thread.run(Thread.java:748)
  10) Thread[id=39878, name=org.eclipse.jetty.server.session.HashSessionManager@60abc029Timer, state=TIMED_WAITING, group=TGRP-PKIAuthenticationIntegrationTest]
        at sun.misc.Unsafe.park(Native Method)
        at java.util.concurrent.locks.LockSupport.parkNanos(LockSupport.java:215)
        at java.util.concurrent.locks.AbstractQueuedSynchronizer$ConditionObject.awaitNanos(AbstractQueuedSynchronizer.java:2078)
        at java.util.concurrent.ScheduledThreadPoolExecutor$DelayedWorkQueue.take(ScheduledThreadPoolExecutor.java:1093)
        at java.util.concurrent.ScheduledThreadPoolExecutor$DelayedWorkQueue.take(ScheduledThreadPoolExecutor.java:809)
        at java.util.concurrent.ThreadPoolExecutor.getTask(ThreadPoolExecutor.java:1074)
        at java.util.concurrent.ThreadPoolExecutor.runWorker(ThreadPoolExecutor.java:1134)
        at java.util.concurrent.ThreadPoolExecutor$Worker.run(ThreadPoolExecutor.java:624)
        at java.lang.Thread.run(Thread.java:748)
  11) Thread[id=39872, name=qtp589434783-39872, state=TIMED_WAITING, group=TGRP-PKIAuthenticationIntegrationTest]
        at sun.misc.Unsafe.park(Native Method)
        at java.util.concurrent.locks.LockSupport.parkNanos(LockSupport.java:215)
        at java.util.concurrent.locks.AbstractQueuedSynchronizer$ConditionObject.awaitNanos(AbstractQueuedSynchronizer.java:2078)
        at org.eclipse.jetty.util.BlockingArrayQueue.poll(BlockingArrayQueue.java:392)
        at org.eclipse.jetty.util.thread.QueuedThreadPool.idleJobPoll(QueuedThreadPool.java:563)
        at org.eclipse.jetty.util.thread.QueuedThreadPool.access$800(QueuedThreadPool.java:48)
        at org.eclipse.jetty.util.thread.QueuedThreadPool$2.run(QueuedThreadPool.java:626)
        at java.lang.Thread.run(Thread.java:748)
  12) Thread[id=39883, name=Scheduler-909693309, state=TIMED_WAITING, group=TGRP-PKIAuthenticationIntegrationTest]
        at sun.misc.Unsafe.park(Native Method)
        at java.util.concurrent.locks.LockSupport.parkNanos(LockSupport.java:215)
        at java.util.concurrent.locks.AbstractQueuedSynchronizer$ConditionObject.awaitNanos(AbstractQueuedSynchronizer.java:2078)
        at java.util.concurrent.ScheduledThreadPoolExecutor$DelayedWorkQueue.take(ScheduledThreadPoolExecutor.java:1093)
        at java.util.concurrent.ScheduledThreadPoolExecutor$DelayedWorkQueue.take(ScheduledThreadPoolExecutor.java:809)
        at java.util.concurrent.ThreadPoolExecutor.getTask(ThreadPoolExecutor.java:1074)
        at java.util.concurrent.ThreadPoolExecutor.runWorker(ThreadPoolExecutor.java:1134)
        at java.util.concurrent.ThreadPoolExecutor$Worker.run(ThreadPoolExecutor.java:624)
        at java.lang.Thread.run(Thread.java:748)
  13) Thread[id=39870, name=qtp589434783-39870, state=TIMED_WAITING, group=TGRP-PKIAuthenticationIntegrationTest]
        at sun.misc.Unsafe.park(Native Method)
        at java.util.concurrent.locks.LockSupport.parkNanos(LockSupport.java:215)
        at java.util.concurrent.locks.AbstractQueuedSynchronizer$ConditionObject.awaitNanos(AbstractQueuedSynchronizer.java:2078)
        at org.eclipse.jetty.util.BlockingArrayQueue.poll(BlockingArrayQueue.java:392)
        at org.eclipse.jetty.util.thread.QueuedThreadPool.idleJobPoll(QueuedThreadPool.java:563)
        at org.eclipse.jetty.util.thread.QueuedThreadPool.access$800(QueuedThreadPool.java:48)
        at org.eclipse.jetty.util.thread.QueuedThreadPool$2.run(QueuedThreadPool.java:626)
        at java.lang.Thread.run(Thread.java:748)
  14) Thread[id=39860, name=qtp956246034-39860, state=TIMED_WAITING, group=TGRP-PKIAuthenticationIntegrationTest]
        at sun.misc.Unsafe.park(Native Method)
        at java.util.concurrent.locks.LockSupport.parkNanos(LockSupport.java:215)
        at java.util.concurrent.locks.AbstractQueuedSynchronizer$ConditionObject.awaitNanos(AbstractQueuedSynchronizer.java:2078)
        at org.eclipse.jetty.util.BlockingArrayQueue.poll(BlockingArrayQueue.java:392)
        at org.eclipse.jetty.util.thread.QueuedThreadPool.idleJobPoll(QueuedThreadPool.java:563)
        at org.eclipse.jetty.util.thread.QueuedThreadPool.access$800(QueuedThreadPool.java:48)
        at org.eclipse.jetty.util.thread.QueuedThreadPool$2.run(QueuedThreadPool.java:626)
        at java.lang.Thread.run(Thread.java:748)
  15) Thread[id=39862, name=qtp956246034-39862, state=TIMED_WAITING, group=TGRP-PKIAuthenticationIntegrationTest]
        at sun.misc.Unsafe.park(Native Method)
        at java.util.concurrent.locks.LockSupport.parkNanos(LockSupport.java:215)
        at java.util.concurrent.locks.AbstractQueuedSynchronizer$ConditionObject.awaitNanos(AbstractQueuedSynchronizer.java:2078)
        at org.eclipse.jetty.util.BlockingArrayQueue.poll(BlockingArrayQueue.java:392)
        at org.eclipse.jetty.util.thread.QueuedThreadPool.idleJobPoll(QueuedThreadPool.java:563)
        at org.eclipse.jetty.util.thread.QueuedThreadPool.access$800(QueuedThreadPool.java:48)
        at org.eclipse.jetty.util.thread.QueuedThreadPool$2.run(QueuedThreadPool.java:626)
        at java.lang.Thread.run(Thread.java:748)
  16) Thread[id=39861, name=qtp956246034-39861, state=TIMED_WAITING, group=TGRP-PKIAuthenticationIntegrationTest]
        at sun.misc.Unsafe.park(Native Method)
        at java.util.concurrent.locks.LockSupport.parkNanos(LockSupport.java:215)
        at java.util.concurrent.locks.AbstractQueuedSynchronizer$ConditionObject.awaitNanos(AbstractQueuedSynchronizer.java:2078)
        at org.eclipse.jetty.util.BlockingArrayQueue.poll(BlockingArrayQueue.java:392)
        at org.eclipse.jetty.util.thread.QueuedThreadPool.idleJobPoll(QueuedThreadPool.java:563)
        at org.eclipse.jetty.util.thread.QueuedThreadPool.access$800(QueuedThreadPool.java:48)
        at org.eclipse.jetty.util.thread.QueuedThreadPool$2.run(QueuedThreadPool.java:626)
        at java.lang.Thread.run(Thread.java:748)
  17) Thread[id=39852, name=ProcessThread(sid:0 cport:48208):, state=WAITING, group=TGRP-PKIAuthenticationIntegrationTest]
        at sun.misc.Unsafe.park(Native Method)
        at java.util.concurrent.locks.LockSupport.park(LockSupport.java:175)
        at java.util.concurrent.locks.AbstractQueuedSynchronizer$ConditionObject.await(AbstractQueuedSynchronizer.java:2039)
        at java.util.concurrent.LinkedBlockingQueue.take(LinkedBlockingQueue.java:442)
        at org.apache.zookeeper.server.PrepRequestProcessor.run(PrepRequestProcessor.java:122)
  18) Thread[id=39867, name=qtp589434783-39867, state=RUNNABLE, group=TGRP-PKIAuthenticationIntegrationTest]
        at sun.nio.ch.DevPollArrayWrapper.poll0(Native Method)
        at sun.nio.ch.DevPollArrayWrapper.poll(DevPollArrayWrapper.java:223)
        at sun.nio.ch.DevPollSelectorImpl.doSelect(DevPollSelectorImpl.java:98)
        at sun.nio.ch.SelectorImpl.lockAndDoSelect(SelectorImpl.java:86)
        at sun.nio.ch.SelectorImpl.select(SelectorImpl.java:97)
        at sun.nio.ch.SelectorImpl.select(SelectorImpl.java:101)
        at org.eclipse.jetty.io.ManagedSelector$SelectorProducer.select(ManagedSelector.java:243)
        at org.eclipse.jetty.io.ManagedSelector$SelectorProducer.produce(ManagedSelector.java:191)
        at org.eclipse.jetty.util.thread.strategy.ExecuteProduceConsume.executeProduceConsume(ExecuteProduceConsume.java:249)
        at org.eclipse.jetty.util.thread.strategy.ExecuteProduceConsume.produceConsume(ExecuteProduceConsume.java:148)
        at org.eclipse.jetty.util.thread.strategy.ExecuteProduceConsume.execute(ExecuteProduceConsume.java:100)
        at org.eclipse.jetty.io.ManagedSelector.run(ManagedSelector.java:147)
        at org.eclipse.jetty.util.thread.QueuedThreadPool.runJob(QueuedThreadPool.java:671)
        at org.eclipse.jetty.util.thread.QueuedThreadPool$2.run(QueuedThreadPool.java:589)
        at java.lang.Thread.run(Thread.java:748)
  19) Thread[id=39850, name=SessionTracker, state=TIMED_WAITING, group=TGRP-PKIAuthenticationIntegrationTest]
        at java.lang.Object.wait(Native Method)
        at org.apache.zookeeper.server.SessionTrackerImpl.run(SessionTrackerImpl.java:146)
  20) Thread[id=39863, name=qtp956246034-39863-acceptor-0@7b600661-ServerConnector@4d04e7ed{HTTP/1.1,[http/1.1]}{127.0.0.1:48208}, state=RUNNABLE, group=TGRP-PKIAuthenticationIntegrationTest]
        at sun.nio.ch.ServerSocketChannelImpl.accept0(Native Method)
        at sun.nio.ch.ServerSocketChannelImpl.accept(ServerSocketChannelImpl.java:422)
        at sun.nio.ch.ServerSocketChannelImpl.accept(ServerSocketChannelImpl.java:250)
        at org.eclipse.jetty.server.ServerConnector.accept(ServerConnector.java:371)
        at org.eclipse.jetty.server.AbstractConnector$Acceptor.run(AbstractConnector.java:601)
        at org.eclipse.jetty.util.thread.QueuedThreadPool.runJob(QueuedThreadPool.java:671)
        at org.eclipse.jetty.util.thread.QueuedThreadPool$2.run(QueuedThreadPool.java:589)
        at java.lang.Thread.run(Thread.java:748)
  21) Thread[id=39875, name=qtp956246034-39875, state=RUNNABLE, group=TGRP-PKIAuthenticationIntegrationTest]
        at sun.nio.ch.DevPollArrayWrapper.poll0(Native Method)
        at sun.nio.ch.DevPollArrayWrapper.poll(DevPollArrayWrapper.java:223)
        at sun.nio.ch.DevPollSelectorImpl.doSelect(DevPollSelectorImpl.java:98)
        at sun.nio.ch.SelectorImpl.lockAndDoSelect(SelectorImpl.java:86)
        at sun.nio.ch.SelectorImpl.select(SelectorImpl.java:97)
        at sun.nio.ch.SelectorImpl.select(SelectorImpl.java:101)
        at org.eclipse.jetty.io.ManagedSelector$SelectorProducer.select(ManagedSelector.java:243)
        at org.eclipse.jetty.io.ManagedSelector$SelectorProducer.produce(ManagedSelector.java:191)
        at org.eclipse.jetty.util.thread.strategy.ExecuteProduceConsume.executeProduceConsume(ExecuteProduceConsume.java:249)
        at org.eclipse.jetty.util.thread.strategy.ExecuteProduceConsume.produceConsume(ExecuteProduceConsume.java:148)
        at org.eclipse.jetty.util.thread.strategy.ExecuteProduceConsume.run(ExecuteProduceConsume.java:136)
        at org.eclipse.jetty.util.thread.QueuedThreadPool.runJob(QueuedThreadPool.java:671)
        at org.eclipse.jetty.util.thread.QueuedThreadPool$2.run(QueuedThreadPool.java:589)
        at java.lang.Thread.run(Thread.java:748)
  22) Thread[id=39877, name=qtp956246034-39877, state=TIMED_WAITING, group=TGRP-PKIAuthenticationIntegrationTest]
        at sun.misc.Unsafe.park(Native Method)
        at java.util.concurrent.locks.LockSupport.parkNanos(LockSupport.java:215)
        at java.util.concurrent.locks.AbstractQueuedSynchronizer$ConditionObject.awaitNanos(AbstractQueuedSynchronizer.java:2078)
        at org.eclipse.jetty.util.BlockingArrayQueue.poll(BlockingArrayQueue.java:392)
        at org.eclipse.jetty.util.thread.QueuedThreadPool.idleJobPoll(QueuedThreadPool.java:563)
        at org.eclipse.jetty.util.thread.QueuedThreadPool.access$800(QueuedThreadPool.java:48)
        at org.eclipse.jetty.util.thread.QueuedThreadPool$2.run(QueuedThreadPool.java:626)
        at java.lang.Thread.run(Thread.java:748)
  23) Thread[id=39866, name=org.eclipse.jetty.server.session.HashSessionManager@466367e6Timer, state=TIMED_WAITING, group=TGRP-PKIAuthenticationIntegrationTest]
        at sun.misc.Unsafe.park(Native Method)
        at java.util.concurrent.locks.LockSupport.parkNanos(LockSupport.java:215)
        at java.util.concurrent.locks.AbstractQueuedSynchronizer$ConditionObject.awaitNanos(AbstractQueuedSynchronizer.java:2078)
        at java.util.concurrent.ScheduledThreadPoolExecutor$DelayedWorkQueue.take(ScheduledThreadPoolExecutor.java:1093)
        at java.util.concurrent.ScheduledThreadPoolExecutor$DelayedWorkQueue.take(ScheduledThreadPoolExecutor.java:809)
        at java.util.concurrent.ThreadPoolExecutor.getTask(ThreadPoolExecutor.java:1074)
        at java.util.concurrent.ThreadPoolExecutor.runWorker(ThreadPoolExecutor.java:1134)
        at java.util.concurrent.ThreadPoolExecutor$Worker.run(ThreadPoolExecutor.java:624)
        at java.lang.Thread.run(Thread.java:748)
  24) Thread[id=39868, name=qtp589434783-39868, state=TIMED_WAITING, group=TGRP-PKIAuthenticationIntegrationTest]
        at sun.misc.Unsafe.park(Native Method)
        at java.util.concurrent.locks.LockSupport.parkNanos(LockSupport.java:215)
        at java.util.concurrent.locks.AbstractQueuedSynchronizer$ConditionObject.awaitNanos(AbstractQueuedSynchronizer.java:2078)
        at org.eclipse.jetty.util.BlockingArrayQueue.poll(BlockingArrayQueue.java:392)
        at org.eclipse.jetty.util.thread.QueuedThreadPool.idleJobPoll(QueuedThreadPool.java:563)
        at org.eclipse.jetty.util.thread.QueuedThreadPool.access$800(QueuedThreadPool.java:48)
        at org.eclipse.jetty.util.thread.QueuedThreadPool$2.run(QueuedThreadPool.java:626)
        at java.lang.Thread.run(Thread.java:748)
  25) Thread[id=39871, name=qtp589434783-39871, state=TIMED_WAITING, group=TGRP-PKIAuthenticationIntegrationTest]
        at sun.misc.Unsafe.park(Native Method)
        at java.util.concurrent.locks.LockSupport.parkNanos(LockSupport.java:215)
        at java.util.concurrent.locks.AbstractQueuedSynchronizer$ConditionObject.awaitNanos(AbstractQueuedSynchronizer.java:2078)
        at org.eclipse.jetty.util.BlockingArrayQueue.poll(BlockingArrayQueue.java:392)
        at org.eclipse.jetty.util.thread.QueuedThreadPool.idleJobPoll(QueuedThreadPool.java:563)
        at org.eclipse.jetty.util.thread.QueuedThreadPool.access$800(QueuedThreadPool.java:48)
        at org.eclipse.jetty.util.thread.QueuedThreadPool$2.run(QueuedThreadPool.java:626)
        at java.lang.Thread.run(Thread.java:748)
  26) Thread[id=39864, name=qtp956246034-39864, state=TIMED_WAITING, group=TGRP-PKIAuthenticationIntegrationTest]
        at sun.misc.Unsafe.park(Native Method)
        at java.util.concurrent.locks.LockSupport.parkNanos(LockSupport.java:215)
        at java.util.concurrent.locks.AbstractQueuedSynchronizer$ConditionObject.awaitNanos(AbstractQueuedSynchronizer.java:2078)
        at org.eclipse.jetty.util.BlockingArrayQueue.poll(BlockingArrayQueue.java:392)
        at org.eclipse.jetty.util.thread.QueuedThreadPool.idleJobPoll(QueuedThreadPool.java:563)
        at org.eclipse.jetty.util.thread.QueuedThreadPool.access$800(QueuedThreadPool.java:48)
        at org.eclipse.jetty.util.thread.QueuedThreadPool$2.run(QueuedThreadPool.java:626)
        at java.lang.Thread.run(Thread.java:748)
  27) Thread[id=39858, name=qtp956246034-39858, state=TIMED_WAITING, group=TGRP-PKIAuthenticationIntegrationTest]
        at sun.misc.Unsafe.park(Native Method)
        at java.util.concurrent.locks.LockSupport.parkNanos(LockSupport.java:215)
        at java.util.concurrent.locks.AbstractQueuedSynchronizer$ConditionObject.awaitNanos(AbstractQueuedSynchronizer.java:2078)
        at org.eclipse.jetty.util.BlockingArrayQueue.poll(BlockingArrayQueue.java:392)
        at org.eclipse.jetty.util.thread.QueuedThreadPool.idleJobPoll(QueuedThreadPool.java:563)
        at org.eclipse.jetty.util.thread.QueuedThreadPool.access$800(QueuedThreadPool.java:48)
        at org.eclipse.jetty.util.thread.QueuedThreadPool$2.run(QueuedThreadPool.java:626)
        at java.lang.Thread.run(Thread.java:748)
	at __randomizedtesting.SeedInfo.seed([1956E5BA14758DD1]:0)


FAILED:  junit.framework.TestSuite.org.apache.solr.security.PKIAuthenticationIntegrationTest

Error Message:
There are still zombie threads that couldn't be terminated:    1) Thread[id=39857, name=jetty-launcher-9441-thread-2, state=TIMED_WAITING, group=TGRP-PKIAuthenticationIntegrationTest]         at sun.misc.Unsafe.park(Native Method)         at java.util.concurrent.locks.LockSupport.parkNanos(LockSupport.java:215)         at java.util.concurrent.SynchronousQueue$TransferStack.awaitFulfill(SynchronousQueue.java:460)         at java.util.concurrent.SynchronousQueue$TransferStack.transfer(SynchronousQueue.java:362)         at java.util.concurrent.SynchronousQueue.poll(SynchronousQueue.java:941)         at java.util.concurrent.ThreadPoolExecutor.getTask(ThreadPoolExecutor.java:1073)         at java.util.concurrent.ThreadPoolExecutor.runWorker(ThreadPoolExecutor.java:1134)         at java.util.concurrent.ThreadPoolExecutor$Worker.run(ThreadPoolExecutor.java:624)         at java.lang.Thread.run(Thread.java:748)    2) Thread[id=39849, name=NIOServerCxn.Factory:0.0.0.0/0.0.0.0:0, state=RUNNABLE, group=TGRP-PKIAuthenticationIntegrationTest]         at sun.nio.ch.DevPollArrayWrapper.poll0(Native Method)         at sun.nio.ch.DevPollArrayWrapper.poll(DevPollArrayWrapper.java:223)         at sun.nio.ch.DevPollSelectorImpl.doSelect(DevPollSelectorImpl.java:98)         at sun.nio.ch.SelectorImpl.lockAndDoSelect(SelectorImpl.java:86)         at sun.nio.ch.SelectorImpl.select(SelectorImpl.java:97)         at org.apache.zookeeper.server.NIOServerCnxnFactory.run(NIOServerCnxnFactory.java:173)         at java.lang.Thread.run(Thread.java:748)    3) Thread[id=39856, name=jetty-launcher-9441-thread-1, state=TIMED_WAITING, group=TGRP-PKIAuthenticationIntegrationTest]         at sun.misc.Unsafe.park(Native Method)         at java.util.concurrent.locks.LockSupport.parkNanos(LockSupport.java:215)         at java.util.concurrent.SynchronousQueue$TransferStack.awaitFulfill(SynchronousQueue.java:460)         at java.util.concurrent.SynchronousQueue$TransferStack.transfer(SynchronousQueue.java:362)         at java.util.concurrent.SynchronousQueue.poll(SynchronousQueue.java:941)         at java.util.concurrent.ThreadPoolExecutor.getTask(ThreadPoolExecutor.java:1073)         at java.util.concurrent.ThreadPoolExecutor.runWorker(ThreadPoolExecutor.java:1134)         at java.util.concurrent.ThreadPoolExecutor$Worker.run(ThreadPoolExecutor.java:624)         at java.lang.Thread.run(Thread.java:748)    4) Thread[id=39878, name=org.eclipse.jetty.server.session.HashSessionManager@60abc029Timer, state=TIMED_WAITING, group=TGRP-PKIAuthenticationIntegrationTest]         at sun.misc.Unsafe.park(Native Method)         at java.util.concurrent.locks.LockSupport.parkNanos(LockSupport.java:215)         at java.util.concurrent.locks.AbstractQueuedSynchronizer$ConditionObject.awaitNanos(AbstractQueuedSynchronizer.java:2078)         at java.util.concurrent.ScheduledThreadPoolExecutor$DelayedWorkQueue.take(ScheduledThreadPoolExecutor.java:1093)         at java.util.concurrent.ScheduledThreadPoolExecutor$DelayedWorkQueue.take(ScheduledThreadPoolExecutor.java:809)         at java.util.concurrent.ThreadPoolExecutor.getTask(ThreadPoolExecutor.java:1074)         at java.util.concurrent.ThreadPoolExecutor.runWorker(ThreadPoolExecutor.java:1134)         at java.util.concurrent.ThreadPoolExecutor$Worker.run(ThreadPoolExecutor.java:624)         at java.lang.Thread.run(Thread.java:748)    5) Thread[id=39875, name=qtp956246034-39875, state=RUNNABLE, group=TGRP-PKIAuthenticationIntegrationTest]         at sun.nio.ch.DevPollArrayWrapper.poll0(Native Method)         at sun.nio.ch.DevPollArrayWrapper.poll(DevPollArrayWrapper.java:223)         at sun.nio.ch.DevPollSelectorImpl.doSelect(DevPollSelectorImpl.java:98)         at sun.nio.ch.SelectorImpl.lockAndDoSelect(SelectorImpl.java:86)         at sun.nio.ch.SelectorImpl.select(SelectorImpl.java:97)         at sun.nio.ch.SelectorImpl.select(SelectorImpl.java:101)         at org.eclipse.jetty.io.ManagedSelector$SelectorProducer.select(ManagedSelector.java:243)         at org.eclipse.jetty.io.ManagedSelector$SelectorProducer.produce(ManagedSelector.java:191)         at org.eclipse.jetty.util.thread.strategy.ExecuteProduceConsume.executeProduceConsume(ExecuteProduceConsume.java:249)         at org.eclipse.jetty.util.thread.strategy.ExecuteProduceConsume.produceConsume(ExecuteProduceConsume.java:148)         at org.eclipse.jetty.util.thread.strategy.ExecuteProduceConsume.run(ExecuteProduceConsume.java:136)         at org.eclipse.jetty.util.thread.QueuedThreadPool.runJob(QueuedThreadPool.java:671)         at org.eclipse.jetty.util.thread.QueuedThreadPool$2.run(QueuedThreadPool.java:589)         at java.lang.Thread.run(Thread.java:748)    6) Thread[id=39866, name=org.eclipse.jetty.server.session.HashSessionManager@466367e6Timer, state=TIMED_WAITING, group=TGRP-PKIAuthenticationIntegrationTest]         at sun.misc.Unsafe.park(Native Method)         at java.util.concurrent.locks.LockSupport.parkNanos(LockSupport.java:215)         at java.util.concurrent.locks.AbstractQueuedSynchronizer$ConditionObject.awaitNanos(AbstractQueuedSynchronizer.java:2078)         at java.util.concurrent.ScheduledThreadPoolExecutor$DelayedWorkQueue.take(ScheduledThreadPoolExecutor.java:1093)         at java.util.concurrent.ScheduledThreadPoolExecutor$DelayedWorkQueue.take(ScheduledThreadPoolExecutor.java:809)         at java.util.concurrent.ThreadPoolExecutor.getTask(ThreadPoolExecutor.java:1074)         at java.util.concurrent.ThreadPoolExecutor.runWorker(ThreadPoolExecutor.java:1134)         at java.util.concurrent.ThreadPoolExecutor$Worker.run(ThreadPoolExecutor.java:624)         at java.lang.Thread.run(Thread.java:748)    7) Thread[id=39883, name=Scheduler-909693309, state=WAITING, group=TGRP-PKIAuthenticationIntegrationTest]         at sun.misc.Unsafe.park(Native Method)         at java.util.concurrent.locks.LockSupport.park(LockSupport.java:175)         at java.util.concurrent.locks.AbstractQueuedSynchronizer$ConditionObject.await(AbstractQueuedSynchronizer.java:2039)         at java.util.concurrent.ScheduledThreadPoolExecutor$DelayedWorkQueue.take(ScheduledThreadPoolExecutor.java:1081)         at java.util.concurrent.ScheduledThreadPoolExecutor$DelayedWorkQueue.take(ScheduledThreadPoolExecutor.java:809)         at java.util.concurrent.ThreadPoolExecutor.getTask(ThreadPoolExecutor.java:1074)         at java.util.concurrent.ThreadPoolExecutor.runWorker(ThreadPoolExecutor.java:1134)         at java.util.concurrent.ThreadPoolExecutor$Worker.run(ThreadPoolExecutor.java:624)         at java.lang.Thread.run(Thread.java:748)    8) Thread[id=39867, name=qtp589434783-39867, state=RUNNABLE, group=TGRP-PKIAuthenticationIntegrationTest]         at sun.nio.ch.DevPollArrayWrapper.interrupt(Native Method)         at sun.nio.ch.DevPollArrayWrapper.interrupt(DevPollArrayWrapper.java:300)         at sun.nio.ch.DevPollSelectorImpl.wakeup(DevPollSelectorImpl.java:207)         at java.nio.channels.spi.AbstractSelector$1.interrupt(AbstractSelector.java:213)         at java.nio.channels.spi.AbstractSelector.begin(AbstractSelector.java:219)         at sun.nio.ch.DevPollSelectorImpl.doSelect(DevPollSelectorImpl.java:97)         at sun.nio.ch.SelectorImpl.lockAndDoSelect(SelectorImpl.java:86)         at sun.nio.ch.SelectorImpl.select(SelectorImpl.java:97)         at sun.nio.ch.SelectorImpl.select(SelectorImpl.java:101)         at org.eclipse.jetty.io.ManagedSelector$SelectorProducer.select(ManagedSelector.java:243)         at org.eclipse.jetty.io.ManagedSelector$SelectorProducer.produce(ManagedSelector.java:191)         at org.eclipse.jetty.util.thread.strategy.ExecuteProduceConsume.executeProduceConsume(ExecuteProduceConsume.java:249)         at org.eclipse.jetty.util.thread.strategy.ExecuteProduceConsume.produceConsume(ExecuteProduceConsume.java:148)         at org.eclipse.jetty.util.thread.strategy.ExecuteProduceConsume.execute(ExecuteProduceConsume.java:100)         at org.eclipse.jetty.io.ManagedSelector.run(ManagedSelector.java:147)         at org.eclipse.jetty.util.thread.QueuedThreadPool.runJob(QueuedThreadPool.java:671)         at org.eclipse.jetty.util.thread.QueuedThreadPool$2.run(QueuedThreadPool.java:589)         at java.lang.Thread.run(Thread.java:748)

Stack Trace:
com.carrotsearch.randomizedtesting.ThreadLeakError: There are still zombie threads that couldn't be terminated:
   1) Thread[id=39857, name=jetty-launcher-9441-thread-2, state=TIMED_WAITING, group=TGRP-PKIAuthenticationIntegrationTest]
        at sun.misc.Unsafe.park(Native Method)
        at java.util.concurrent.locks.LockSupport.parkNanos(LockSupport.java:215)
        at java.util.concurrent.SynchronousQueue$TransferStack.awaitFulfill(SynchronousQueue.java:460)
        at java.util.concurrent.SynchronousQueue$TransferStack.transfer(SynchronousQueue.java:362)
        at java.util.concurrent.SynchronousQueue.poll(SynchronousQueue.java:941)
        at java.util.concurrent.ThreadPoolExecutor.getTask(ThreadPoolExecutor.java:1073)
        at java.util.concurrent.ThreadPoolExecutor.runWorker(ThreadPoolExecutor.java:1134)
        at java.util.concurrent.ThreadPoolExecutor$Worker.run(ThreadPoolExecutor.java:624)
        at java.lang.Thread.run(Thread.java:748)
   2) Thread[id=39849, name=NIOServerCxn.Factory:0.0.0.0/0.0.0.0:0, state=RUNNABLE, group=TGRP-PKIAuthenticationIntegrationTest]
        at sun.nio.ch.DevPollArrayWrapper.poll0(Native Method)
        at sun.nio.ch.DevPollArrayWrapper.poll(DevPollArrayWrapper.java:223)
        at sun.nio.ch.DevPollSelectorImpl.doSelect(DevPollSelectorImpl.java:98)
        at sun.nio.ch.SelectorImpl.lockAndDoSelect(SelectorImpl.java:86)
        at sun.nio.ch.SelectorImpl.select(SelectorImpl.java:97)
        at org.apache.zookeeper.server.NIOServerCnxnFactory.run(NIOServerCnxnFactory.java:173)
        at java.lang.Thread.run(Thread.java:748)
   3) Thread[id=39856, name=jetty-launcher-9441-thread-1, state=TIMED_WAITING, group=TGRP-PKIAuthenticationIntegrationTest]
        at sun.misc.Unsafe.park(Native Method)
        at java.util.concurrent.locks.LockSupport.parkNanos(LockSupport.java:215)
        at java.util.concurrent.SynchronousQueue$TransferStack.awaitFulfill(SynchronousQueue.java:460)
        at java.util.concurrent.SynchronousQueue$TransferStack.transfer(SynchronousQueue.java:362)
        at java.util.concurrent.SynchronousQueue.poll(SynchronousQueue.java:941)
        at java.util.concurrent.ThreadPoolExecutor.getTask(ThreadPoolExecutor.java:1073)
        at java.util.concurrent.ThreadPoolExecutor.runWorker(ThreadPoolExecutor.java:1134)
        at java.util.concurrent.ThreadPoolExecutor$Worker.run(ThreadPoolExecutor.java:624)
        at java.lang.Thread.run(Thread.java:748)
   4) Thread[id=39878, name=org.eclipse.jetty.server.session.HashSessionManager@60abc029Timer, state=TIMED_WAITING, group=TGRP-PKIAuthenticationIntegrationTest]
        at sun.misc.Unsafe.park(Native Method)
        at java.util.concurrent.locks.LockSupport.parkNanos(LockSupport.java:215)
        at java.util.concurrent.locks.AbstractQueuedSynchronizer$ConditionObject.awaitNanos(AbstractQueuedSynchronizer.java:2078)
        at java.util.concurrent.ScheduledThreadPoolExecutor$DelayedWorkQueue.take(ScheduledThreadPoolExecutor.java:1093)
        at java.util.concurrent.ScheduledThreadPoolExecutor$DelayedWorkQueue.take(ScheduledThreadPoolExecutor.java:809)
        at java.util.concurrent.ThreadPoolExecutor.getTask(ThreadPoolExecutor.java:1074)
        at java.util.concurrent.ThreadPoolExecutor.runWorker(ThreadPoolExecutor.java:1134)
        at java.util.concurrent.ThreadPoolExecutor$Worker.run(ThreadPoolExecutor.java:624)
        at java.lang.Thread.run(Thread.java:748)
   5) Thread[id=39875, name=qtp956246034-39875, state=RUNNABLE, group=TGRP-PKIAuthenticationIntegrationTest]
        at sun.nio.ch.DevPollArrayWrapper.poll0(Native Method)
        at sun.nio.ch.DevPollArrayWrapper.poll(DevPollArrayWrapper.java:223)
        at sun.nio.ch.DevPollSelectorImpl.doSelect(DevPollSelectorImpl.java:98)
        at sun.nio.ch.SelectorImpl.lockAndDoSelect(SelectorImpl.java:86)
        at sun.nio.ch.SelectorImpl.select(SelectorImpl.java:97)
        at sun.nio.ch.SelectorImpl.select(SelectorImpl.java:101)
        at org.eclipse.jetty.io.ManagedSelector$SelectorProducer.select(ManagedSelector.java:243)
        at org.eclipse.jetty.io.ManagedSelector$SelectorProducer.produce(ManagedSelector.java:191)
        at org.eclipse.jetty.util.thread.strategy.ExecuteProduceConsume.executeProduceConsume(ExecuteProduceConsume.java:249)
        at org.eclipse.jetty.util.thread.strategy.ExecuteProduceConsume.produceConsume(ExecuteProduceConsume.java:148)
        at org.eclipse.jetty.util.thread.strategy.ExecuteProduceConsume.run(ExecuteProduceConsume.java:136)
        at org.eclipse.jetty.util.thread.QueuedThreadPool.runJob(QueuedThreadPool.java:671)
        at org.eclipse.jetty.util.thread.QueuedThreadPool$2.run(QueuedThreadPool.java:589)
        at java.lang.Thread.run(Thread.java:748)
   6) Thread[id=39866, name=org.eclipse.jetty.server.session.HashSessionManager@466367e6Timer, state=TIMED_WAITING, group=TGRP-PKIAuthenticationIntegrationTest]
        at sun.misc.Unsafe.park(Native Method)
        at java.util.concurrent.locks.LockSupport.parkNanos(LockSupport.java:215)
        at java.util.concurrent.locks.AbstractQueuedSynchronizer$ConditionObject.awaitNanos(AbstractQueuedSynchronizer.java:2078)
        at java.util.concurrent.ScheduledThreadPoolExecutor$DelayedWorkQueue.take(ScheduledThreadPoolExecutor.java:1093)
        at java.util.concurrent.ScheduledThreadPoolExecutor$DelayedWorkQueue.take(ScheduledThreadPoolExecutor.java:809)
        at java.util.concurrent.ThreadPoolExecutor.getTask(ThreadPoolExecutor.java:1074)
        at java.util.concurrent.ThreadPoolExecutor.runWorker(ThreadPoolExecutor.java:1134)
        at java.util.concurrent.ThreadPoolExecutor$Worker.run(ThreadPoolExecutor.java:624)
        at java.lang.Thread.run(Thread.java:748)
   7) Thread[id=39883, name=Scheduler-909693309, state=WAITING, group=TGRP-PKIAuthenticationIntegrationTest]
        at sun.misc.Unsafe.park(Native Method)
        at java.util.concurrent.locks.LockSupport.park(LockSupport.java:175)
        at java.util.concurrent.locks.AbstractQueuedSynchronizer$ConditionObject.await(AbstractQueuedSynchronizer.java:2039)
        at java.util.concurrent.ScheduledThreadPoolExecutor$DelayedWorkQueue.take(ScheduledThreadPoolExecutor.java:1081)
        at java.util.concurrent.ScheduledThreadPoolExecutor$DelayedWorkQueue.take(ScheduledThreadPoolExecutor.java:809)
        at java.util.concurrent.ThreadPoolExecutor.getTask(ThreadPoolExecutor.java:1074)
        at java.util.concurrent.ThreadPoolExecutor.runWorker(ThreadPoolExecutor.java:1134)
        at java.util.concurrent.ThreadPoolExecutor$Worker.run(ThreadPoolExecutor.java:624)
        at java.lang.Thread.run(Thread.java:748)
   8) Thread[id=39867, name=qtp589434783-39867, state=RUNNABLE, group=TGRP-PKIAuthenticationIntegrationTest]
        at sun.nio.ch.DevPollArrayWrapper.interrupt(Native Method)
        at sun.nio.ch.DevPollArrayWrapper.interrupt(DevPollArrayWrapper.java:300)
        at sun.nio.ch.DevPollSelectorImpl.wakeup(DevPollSelectorImpl.java:207)
        at java.nio.channels.spi.AbstractSelector$1.interrupt(AbstractSelector.java:213)
        at java.nio.channels.spi.AbstractSelector.begin(AbstractSelector.java:219)
        at sun.nio.ch.DevPollSelectorImpl.doSelect(DevPollSelectorImpl.java:97)
        at sun.nio.ch.SelectorImpl.lockAndDoSelect(SelectorImpl.java:86)
        at sun.nio.ch.SelectorImpl.select(SelectorImpl.java:97)
        at sun.nio.ch.SelectorImpl.select(SelectorImpl.java:101)
        at org.eclipse.jetty.io.ManagedSelector$SelectorProducer.select(ManagedSelector.java:243)
        at org.eclipse.jetty.io.ManagedSelector$SelectorProducer.produce(ManagedSelector.java:191)
        at org.eclipse.jetty.util.thread.strategy.ExecuteProduceConsume.executeProduceConsume(ExecuteProduceConsume.java:249)
        at org.eclipse.jetty.util.thread.strategy.ExecuteProduceConsume.produceConsume(ExecuteProduceConsume.java:148)
        at org.eclipse.jetty.util.thread.strategy.ExecuteProduceConsume.execute(ExecuteProduceConsume.java:100)
        at org.eclipse.jetty.io.ManagedSelector.run(ManagedSelector.java:147)
        at org.eclipse.jetty.util.thread.QueuedThreadPool.runJob(QueuedThreadPool.java:671)
        at org.eclipse.jetty.util.thread.QueuedThreadPool$2.run(QueuedThreadPool.java:589)
        at java.lang.Thread.run(Thread.java:748)
	at __randomizedtesting.SeedInfo.seed([1956E5BA14758DD1]:0)




Build Log:
[...truncated 11737 lines...]
   [junit4] Suite: org.apache.solr.cloud.autoscaling.sim.TestComputePlanAction
   [junit4]   2> 189233 INFO  (SUITE-TestComputePlanAction-seed#[1956E5BA14758DD1]-worker) [    ] o.a.s.SolrTestCaseJ4 SecureRandom sanity checks: test.solr.allowed.securerandom=null & java.security.egd=file:/dev/./urandom
   [junit4]   2> Creating dataDir: /export/home/jenkins/workspace/Lucene-Solr-master-Solaris/solr/build/solr-core/test/J0/temp/solr.cloud.autoscaling.sim.TestComputePlanAction_1956E5BA14758DD1-001/init-core-data-001
   [junit4]   2> 189235 WARN  (SUITE-TestComputePlanAction-seed#[1956E5BA14758DD1]-worker) [    ] o.a.s.SolrTestCaseJ4 startTrackingSearchers: numOpens=16 numCloses=16
   [junit4]   2> 189235 INFO  (SUITE-TestComputePlanAction-seed#[1956E5BA14758DD1]-worker) [    ] o.a.s.SolrTestCaseJ4 Using PointFields (NUMERIC_POINTS_SYSPROP=true) w/NUMERIC_DOCVALUES_SYSPROP=false
   [junit4]   2> 189236 INFO  (SUITE-TestComputePlanAction-seed#[1956E5BA14758DD1]-worker) [    ] o.a.s.SolrTestCaseJ4 Randomized ssl (false) and clientAuth (true) via: @org.apache.solr.util.RandomizeSSL(reason=, value=NaN, ssl=NaN, clientAuth=NaN)
   [junit4]   2> 189253 DEBUG (Simulated OverseerAutoScalingTriggerThread) [    ] o.a.s.c.a.OverseerTriggerThread Adding .autoAddReplicas trigger
   [junit4]   2> 189253 DEBUG (Simulated OverseerAutoScalingTriggerThread) [    ] o.a.s.c.a.OverseerTriggerThread Refreshing /autoscaling.json with znode version 0
   [junit4]   2> 189253 DEBUG (Simulated OverseerAutoScalingTriggerThread) [    ] o.a.s.c.a.NodeLostTrigger Initial livenodes: [127.0.0.1:10000_solr]
   [junit4]   2> 189253 DEBUG (Simulated OverseerAutoScalingTriggerThread) [    ] o.a.s.c.a.OverseerTriggerThread Current znodeVersion 0, lastZnodeVersion -1
   [junit4]   2> 189253 DEBUG (Simulated OverseerAutoScalingTriggerThread) [    ] o.a.s.c.a.OverseerTriggerThread Processed trigger updates upto znodeVersion 0
   [junit4]   2> 189255 DEBUG (Simulated OverseerAutoScalingTriggerThread) [    ] o.a.s.c.a.OverseerTriggerThread -- clean old nodeAdded markers
   [junit4]   2> 189255 DEBUG (Simulated OverseerAutoScalingTriggerThread) [    ] o.a.s.c.a.OverseerTriggerThread Current znodeVersion 0, lastZnodeVersion 0
   [junit4]   2> 189256 DEBUG (ScheduledTrigger-673-thread-1) [    ] o.a.s.c.a.NodeLostTrigger Running NodeLostTrigger: .auto_add_replicas with currently live nodes: 1
   [junit4]   2> 189257 INFO  (TEST-TestComputePlanAction.testNodeLost-seed#[1956E5BA14758DD1]) [    ] o.a.s.SolrTestCaseJ4 ###Starting testNodeLost
   [junit4]   2> 189257 DEBUG (TEST-TestComputePlanAction.testNodeLost-seed#[1956E5BA14758DD1]) [    ] o.a.s.c.a.OverseerTriggerThread Refreshing /autoscaling.json with znode version 1
   [junit4]   2> 189258 INFO  (TEST-TestComputePlanAction.testNodeLost-seed#[1956E5BA14758DD1]) [    ] o.a.s.c.a.s.SimCloudManager === Restarting OverseerTriggerThread and clearing object cache...
   [junit4]   2> 189259 WARN  (Simulated OverseerAutoScalingTriggerThread) [    ] o.a.s.c.a.OverseerTriggerThread OverseerTriggerThread woken up but we are closed, exiting.
   [junit4]   2> 189259 DEBUG (TEST-TestComputePlanAction.testNodeLost-seed#[1956E5BA14758DD1]) [    ] o.a.s.c.a.OverseerTriggerThread OverseerTriggerThread has been closed explicitly
   [junit4]   2> 189261 DEBUG (Simulated OverseerAutoScalingTriggerThread) [    ] o.a.s.c.a.OverseerTriggerThread Adding .autoAddReplicas trigger
   [junit4]   2> 189261 DEBUG (Simulated OverseerAutoScalingTriggerThread) [    ] o.a.s.c.a.OverseerTriggerThread Refreshing /autoscaling.json with znode version 2
   [junit4]   2> 189261 DEBUG (Simulated OverseerAutoScalingTriggerThread) [    ] o.a.s.c.a.NodeLostTrigger Initial livenodes: [127.0.0.1:10000_solr]
   [junit4]   2> 189261 DEBUG (Simulated OverseerAutoScalingTriggerThread) [    ] o.a.s.c.a.OverseerTriggerThread Current znodeVersion 2, lastZnodeVersion -1
   [junit4]   2> 189261 DEBUG (Simulated OverseerAutoScalingTriggerThread) [    ] o.a.s.c.a.OverseerTriggerThread Processed trigger updates upto znodeVersion 2
   [junit4]   2> 189261 DEBUG (Simulated OverseerAutoScalingTriggerThread) [    ] o.a.s.c.a.OverseerTriggerThread -- clean old nodeAdded markers
   [junit4]   2> 189261 DEBUG (Simulated OverseerAutoScalingTriggerThread) [    ] o.a.s.c.a.OverseerTriggerThread Current znodeVersion 2, lastZnodeVersion 2
   [junit4]   2> 189261 DEBUG (ScheduledTrigger-676-thread-1) [    ] o.a.s.c.a.NodeLostTrigger Running NodeLostTrigger: .auto_add_replicas with currently live nodes: 1
   [junit4]   2> 189281 DEBUG (ScheduledTrigger-676-thread-1) [    ] o.a.s.c.a.NodeLostTrigger Running NodeLostTrigger: .auto_add_replicas with currently live nodes: 1
   [junit4]   2> 189304 DEBUG (ScheduledTrigger-676-thread-1) [    ] o.a.s.c.a.NodeLostTrigger Running NodeLostTrigger: .auto_add_replicas with currently live nodes: 1
   [junit4]   2> 189325 DEBUG (ScheduledTrigger-676-thread-1) [    ] o.a.s.c.a.NodeLostTrigger Running NodeLostTrigger: .auto_add_replicas with currently live nodes: 1
   [junit4]   2> 189345 DEBUG (ScheduledTrigger-676-thread-1) [    ] o.a.s.c.a.NodeLostTrigger Running NodeLostTrigger: .auto_add_replicas with currently live nodes: 1
   [junit4]   2> 189379 DEBUG (ScheduledTrigger-676-thread-1) [    ] o.a.s.c.a.NodeLostTrigger Running NodeLostTrigger: .auto_add_replicas with currently live nodes: 1
   [junit4]   2> 189381 DEBUG (simCloudManagerPool-675-thread-1) [    ] o.a.s.c.a.AutoScalingHandler Verified autoscaling configuration
   [junit4]   2> 189381 DEBUG (simCloudManagerPool-675-thread-1) [    ] o.a.s.c.a.OverseerTriggerThread Refreshing /autoscaling.json with znode version 3
   [junit4]   2> 189381 DEBUG (simCloudManagerPool-675-thread-1) [    ] o.a.s.c.a.NodeLostTrigger Initial livenodes: [127.0.0.1:10000_solr]
   [junit4]   2> 189382 DEBUG (Simulated OverseerAutoScalingTriggerThread) [    ] o.a.s.c.a.OverseerTriggerThread Processed trigger updates upto znodeVersion 3
   [junit4]   2> 189382 DEBUG (Simulated OverseerAutoScalingTriggerThread) [    ] o.a.s.c.a.OverseerTriggerThread -- clean old nodeAdded markers
   [junit4]   2> 189382 DEBUG (Simulated OverseerAutoScalingTriggerThread) [    ] o.a.s.c.a.OverseerTriggerThread Current znodeVersion 3, lastZnodeVersion 3
   [junit4]   2> 189384 DEBUG (simCloudManagerPool-675-thread-2) [    ] o.a.s.c.a.AutoScalingHandler Verified autoscaling configuration
   [junit4]   2> 189384 DEBUG (simCloudManagerPool-675-thread-2) [    ] o.a.s.c.a.OverseerTriggerThread Refreshing /autoscaling.json with znode version 4
   [junit4]   2> 189384 DEBUG (simCloudManagerPool-675-thread-2) [    ] o.a.s.c.a.NodeLostTrigger Initial livenodes: [127.0.0.1:10000_solr]
   [junit4]   2> 189385 DEBUG (Simulated OverseerAutoScalingTriggerThread) [    ] o.a.s.c.a.OverseerTriggerThread Processed trigger updates upto znodeVersion 4
   [junit4]   2> 189385 DEBUG (Simulated OverseerAutoScalingTriggerThread) [    ] o.a.s.c.a.OverseerTriggerThread -- clean old nodeAdded markers
   [junit4]   2> 189385 DEBUG (Simulated OverseerAutoScalingTriggerThread) [    ] o.a.s.c.a.OverseerTriggerThread Current znodeVersion 4, lastZnodeVersion 4
   [junit4]   2> 189400 DEBUG (ScheduledTrigger-676-thread-1) [    ] o.a.s.c.a.NodeLostTrigger Running NodeLostTrigger: .auto_add_replicas with currently live nodes: 1
   [junit4]   2> 189420 DEBUG (ScheduledTrigger-676-thread-1) [    ] o.a.s.c.a.NodeLostTrigger Running NodeLostTrigger: .auto_add_replicas with currently live nodes: 1
   [junit4]   2> 189440 DEBUG (ScheduledTrigger-676-thread-1) [    ] o.a.s.c.a.NodeLostTrigger Running NodeLostTrigger: .auto_add_replicas with currently live nodes: 1
   [junit4]   2> 189461 DEBUG (ScheduledTrigger-676-thread-1) [    ] o.a.s.c.a.NodeLostTrigger Running NodeLostTrigger: .auto_add_replicas with currently live nodes: 1
   [junit4]   2> 189481 DEBUG (ScheduledTrigger-676-thread-1) [    ] o.a.s.c.a.NodeLostTrigger Running NodeLostTrigger: .auto_add_replicas with currently live nodes: 1
   [junit4]   2> 189499 DEBUG (simCloudManagerPool-675-thread-3) [    ] o.a.s.c.a.AutoScalingHandler Verified autoscaling configuration
   [junit4]   2> 189499 DEBUG (simCloudManagerPool-675-thread-3) [    ] o.a.s.c.a.OverseerTriggerThread Refreshing /autoscaling.json with znode version 5
   [junit4]   2> 189500 DEBUG (simCloudManagerPool-675-thread-3) [    ] o.a.s.c.a.NodeLostTrigger Initial livenodes: [127.0.0.1:10001_solr, 127.0.0.1:10000_solr]
   [junit4]   2> 189500 DEBUG (simCloudManagerPool-675-thread-3) [    ] o.a.s.c.a.NodeLostTrigger Initial livenodes: [127.0.0.1:10001_solr, 127.0.0.1:10000_solr]
   [junit4]   2> 189500 DEBUG (Simulated OverseerAutoScalingTriggerThread) [    ] o.a.s.c.a.OverseerTriggerThread Processed trigger updates upto znodeVersion 5
   [junit4]   2> 189500 DEBUG (Simulated OverseerAutoScalingTriggerThread) [    ] o.a.s.c.a.OverseerTriggerThread -- clean old nodeAdded markers
   [junit4]   2> 189500 DEBUG (Simulated OverseerAutoScalingTriggerThread) [    ] o.a.s.c.a.OverseerTriggerThread Current znodeVersion 5, lastZnodeVersion 5
   [junit4]   2> 189500 DEBUG (ScheduledTrigger-676-thread-4) [    ] o.a.s.c.a.NodeLostTrigger Running NodeLostTrigger: node_lost_trigger with currently live nodes: 2
   [junit4]   2> 189501 DEBUG (simCloudManagerPool-675-thread-4) [    ] o.a.s.c.o.ClusterStateMutator building a new cName: testNodeLost
   [junit4]   2> 189502 DEBUG (ScheduledTrigger-676-thread-4) [    ] o.a.s.c.a.NodeLostTrigger Running NodeLostTrigger: .auto_add_replicas with currently live nodes: 2
   [junit4]   2> 189518 DEBUG (simCloudManagerPool-675-thread-4) [    ] o.a.s.c.s.c.a.PolicyHelper Creating a new session
   [junit4]   2> 189519 DEBUG (simCloudManagerPool-675-thread-4) [    ] o.a.s.c.s.c.a.PolicyHelper New session created 
   [junit4]   2> 189521 DEBUG (ScheduledTrigger-676-thread-1) [    ] o.a.s.c.a.NodeLostTrigger Running NodeLostTrigger: node_lost_trigger with currently live nodes: 2
   [junit4]   2> 189522 DEBUG (ScheduledTrigger-676-thread-2) [    ] o.a.s.c.a.NodeLostTrigger Running NodeLostTrigger: .auto_add_replicas with currently live nodes: 2
   [junit4]   2> 189531 INFO  (simCloudManagerPool-675-thread-4) [    ] o.a.s.c.s.c.a.PolicyHelper returnSession, curr-time 2019315751 sessionWrapper.createTime 2019315163677054, this.sessionWrapper.createTime 2019315163677054 
   [junit4]   2> 189531 DEBUG (simCloudManagerPool-675-thread-4) [    ] o.a.s.c.s.c.a.PolicyHelper session set to NULL
   [junit4]   2> 189541 DEBUG (ScheduledTrigger-676-thread-2) [    ] o.a.s.c.a.NodeLostTrigger Running NodeLostTrigger: node_lost_trigger with currently live nodes: 2
   [junit4]   2> 189543 DEBUG (ScheduledTrigger-676-thread-4) [    ] o.a.s.c.a.NodeLostTrigger Running NodeLostTrigger: .auto_add_replicas with currently live nodes: 2
   [junit4]   2> 189561 DEBUG (ScheduledTrigger-676-thread-1) [    ] o.a.s.c.a.NodeLostTrigger Running NodeLostTrigger: node_lost_trigger with currently live nodes: 2
   [junit4]   2> 189561 DEBUG (TEST-TestComputePlanAction.testNodeLost-seed#[1956E5BA14758DD1]) [    ] o.a.s.c.a.s.TestComputePlanAction -- cluster state: znodeVersion: 2
   [junit4]   2> live nodes:[127.0.0.1:10001_solr, 127.0.0.1:10000_solr]
   [junit4]   2> collections:{testNodeLost=DocCollection(testNodeLost//clusterstate.json/1)={
   [junit4]   2>   "replicationFactor":"2",
   [junit4]   2>   "pullReplicas":"0",
   [junit4]   2>   "router":{"name":"compositeId"},
   [junit4]   2>   "maxShardsPerNode":"1",
   [junit4]   2>   "autoAddReplicas":"false",
   [junit4]   2>   "nrtReplicas":"2",
   [junit4]   2>   "tlogReplicas":"0",
   [junit4]   2>   "autoCreated":"true",
   [junit4]   2>   "shards":{"shard1":{
   [junit4]   2>       "replicas":{
   [junit4]   2>         "core_node1":{
   [junit4]   2>           "node_name":"127.0.0.1:10000_solr",
   [junit4]   2>           "core":"testNodeLost_shard1_replica_n1",
   [junit4]   2>           "state":"active",
   [junit4]   2>           "type":"NRT",
   [junit4]   2>           "INDEX.sizeInBytes":123450000},
   [junit4]   2>         "core_node2":{
   [junit4]   2>           "node_name":"127.0.0.1:10001_solr",
   [junit4]   2>           "core":"testNodeLost_shard1_replica_n2",
   [junit4]   2>           "state":"active",
   [junit4]   2>           "type":"NRT",
   [junit4]   2>           "INDEX.sizeInBytes":123450000}},
   [junit4]   2>       "range":"80000000-7fffffff",
   [junit4]   2>       "state":"active"}}}}
   [junit4]   2> 189563 INFO  (TEST-TestComputePlanAction.testNodeLost-seed#[1956E5BA14758DD1]) [    ] o.a.s.c.a.s.TestComputePlanAction Stopped_node : 127.0.0.1:10001_solr
   [junit4]   2> 189563 DEBUG (ScheduledTrigger-676-thread-3) [    ] o.a.s.c.a.NodeLostTrigger Running NodeLostTrigger: .auto_add_replicas with currently live nodes: 2
   [junit4]   2> 189563 DEBUG (ScheduledTrigger-676-thread-3) [    ] o.a.s.c.a.NodeLostTrigger Tracking lost node: 127.0.0.1:10001_solr
   [junit4]   2> 189565 DEBUG (simCloudManagerPool-675-thread-7) [    ] o.a.s.c.a.s.SimClusterStateProvider -- elected new leader for testNodeLost / shard1: {"core_node1":{
   [junit4]   2>     "node_name":"127.0.0.1:10000_solr",
   [junit4]   2>     "core":"testNodeLost_shard1_replica_n1",
   [junit4]   2>     "leader":"true",
   [junit4]   2>     "state":"active",
   [junit4]   2>     "type":"NRT",
   [junit4]   2>     "INDEX.sizeInBytes":123450000,
   [junit4]   2>     "shard":"shard1",
   [junit4]   2>     "collection":"testNodeLost"}}
   [junit4]   2> 189581 DEBUG (ScheduledTrigger-676-thread-2) [    ] o.a.s.c.a.NodeLostTrigger Running NodeLostTrigger: node_lost_trigger with currently live nodes: 2
   [junit4]   2> 189581 DEBUG (ScheduledTrigger-676-thread-2) [    ] o.a.s.c.a.NodeLostTrigger Tracking lost node: 127.0.0.1:10001_solr
   [junit4]   2> 189583 DEBUG (ScheduledTrigger-676-thread-4) [    ] o.a.s.c.a.NodeLostTrigger Running NodeLostTrigger: .auto_add_replicas with currently live nodes: 2
   [junit4]   2> 189620 DEBUG (ScheduledTrigger-676-thread-4) [    ] o.a.s.c.a.NodeLostTrigger Running NodeLostTrigger: node_lost_trigger with currently live nodes: 2
   [junit4]   2> 189620 DEBUG (ScheduledTrigger-676-thread-3) [    ] o.a.s.c.a.NodeLostTrigger Running NodeLostTrigger: .auto_add_replicas with currently live nodes: 2
   [junit4]   2> 189641 DEBUG (ScheduledTrigger-676-thread-3) [    ] o.a.s.c.a.NodeLostTrigger Running NodeLostTrigger: .auto_add_replicas with currently live nodes: 2
   [junit4]   2> 189641 DEBUG (ScheduledTrigger-676-thread-1) [    ] o.a.s.c.a.NodeLostTrigger Running NodeLostTrigger: node_lost_trigger with currently live nodes: 2
   [junit4]   2> 189668 DEBUG (ScheduledTrigger-676-thread-1) [    ] o.a.s.c.a.NodeLostTrigger Running NodeLostTrigger: .auto_add_replicas with currently live nodes: 2
   [junit4]   2> 189668 DEBUG (ScheduledTrigger-676-thread-4) [    ] o.a.s.c.a.NodeLostTrigger Running NodeLostTrigger: node_lost_trigger with currently live nodes: 2
   [junit4]   2> 189689 DEBUG (ScheduledTrigger-676-thread-1) [    ] o.a.s.c.a.NodeLostTrigger Running NodeLostTrigger: .auto_add_replicas with currently live nodes: 2
   [junit4]   2> 189689 DEBUG (ScheduledTrigger-676-thread-1) [    ] o.a.s.c.a.NodeLostTrigger Running NodeLostTrigger: node_lost_trigger with currently live nodes: 2
   [junit4]   2> 189709 DEBUG (ScheduledTrigger-676-thread-3) [    ] o.a.s.c.a.NodeLostTrigger Running NodeLostTrigger: .auto_add_replicas with currently live nodes: 2
   [junit4]   2> 189709 DEBUG (ScheduledTrigger-676-thread-2) [    ] o.a.s.c.a.NodeLostTrigger Running NodeLostTrigger: node_lost_trigger with currently live nodes: 2
   [junit4]   2> 189730 DEBUG (ScheduledTrigger-676-thread-3) [    ] o.a.s.c.a.NodeLostTrigger Running NodeLostTrigger: .auto_add_replicas with currently live nodes: 2
   [junit4]   2> 189730 DEBUG (ScheduledTrigger-676-thread-4) [    ] o.a.s.c.a.NodeLostTrigger Running NodeLostTrigger: node_lost_trigger with currently live nodes: 2
   [junit4]   2> 189730 DEBUG (ScheduledTrigger-676-thread-4) [    ] o.a.s.c.a.NodeLostTrigger NodeLostTrigger firing registered processor for lost nodes: [127.0.0.1:10001_solr]
   [junit4]   2> 189731 DEBUG (ScheduledTrigger-676-thread-4) [    ] o.a.s.c.a.ScheduledTriggers ++++++++ Cooldown inactive - processing event: {
   [junit4]   2>   "id":"72c8f2b396c66T7kqvg1w8dlr2ve0o7hzaj31ko",
   [junit4]   2>   "source":"node_lost_trigger",
   [junit4]   2>   "eventTime":2019318254103654,
   [junit4]   2>   "eventType":"NODELOST",
   [junit4]   2>   "properties":{
   [junit4]   2>     "eventTimes":[2019318254103654],
   [junit4]   2>     "nodeNames":["127.0.0.1:10001_solr"]}}
   [junit4]   2> 189738 DEBUG (AutoscalingActionExecutor-677-thread-1) [    ] o.a.s.c.a.ScheduledTriggers -- processing actions for {
   [junit4]   2>   "id":"72c8f2b396c66T7kqvg1w8dlr2ve0o7hzaj31ko",
   [junit4]   2>   "source":"node_lost_trigger",
   [junit4]   2>   "eventTime":2019318254103654,
   [junit4]   2>   "eventType":"NODELOST",
   [junit4]   2>   "properties":{
   [junit4]   2>     "eventTimes":[2019318254103654],
   [junit4]   2>     "_enqueue_time_":2019325738551054,
   [junit4]   2>     "nodeNames":["127.0.0.1:10001_solr"]}}
   [junit4]   2> 189740 DEBUG (AutoscalingActionExecutor-677-thread-1) [    ] o.a.s.c.a.ComputePlanAction -- processing event: {
   [junit4]   2>   "id":"72c8f2b396c66T7kqvg1w8dlr2ve0o7hzaj31ko",
   [junit4]   2>   "source":"node_lost_trigger",
   [junit4]   2>   "eventTime":2019318254103654,
   [junit4]   2>   "eventType":"NODELOST",
   [junit4]   2>   "properties":{
   [junit4]   2>     "eventTimes":[2019318254103654],
   [junit4]   2>     "_enqueue_time_":2019325738551054,
   [junit4]   2>     "nodeNames":["127.0.0.1:10001_solr"]}} with context properties: {BEFORE_ACTION=[compute_plan]}
   [junit4]   2> 189740 DEBUG (AutoscalingActionExecutor-677-thread-1) [    ] o.a.s.c.s.c.a.PolicyHelper Creating a new session
   [junit4]   2> 189743 DEBUG (AutoscalingActionExecutor-677-thread-1) [    ] o.a.s.c.s.c.a.PolicyHelper New session created 
   [junit4]   2> 189748 INFO  (AutoscalingActionExecutor-677-thread-1) [    ] o.a.s.c.a.ComputePlanAction Computed Plan: action=MOVEREPLICA&collection=testNodeLost&targetNode=127.0.0.1:10002_solr&inPlaceMove=true&replica=core_node2
   [junit4]   2> 189749 INFO  (AutoscalingActionExecutor-677-thread-1) [    ] o.a.s.c.s.c.a.PolicyHelper returnSession, curr-time 2019326654 sessionWrapper.createTime 2019326347594304, this.sessionWrapper.createTime 2019326347594304 
   [junit4]   2> 189749 DEBUG (AutoscalingActionExecutor-677-thread-1) [    ] o.a.s.c.s.c.a.PolicyHelper session set to NULL
   [junit4]   2> 189753 INFO  (TEST-TestComputePlanAction.testNodeLost-seed#[1956E5BA14758DD1]) [    ] o.a.s.c.a.s.TestComputePlanAction -------------_ FINAL STATE --------------
   [junit4]   2> 189753 INFO  (TEST-TestComputePlanAction.testNodeLost-seed#[1956E5BA14758DD1]) [    ] o.a.s.c.a.s.TestComputePlanAction * Node values: {
   [junit4]   2>   "127.0.0.1:10001_solr":{
   [junit4]   2>     "sysprop.java.vendor":"Oracle Corporation",
   [junit4]   2>     "cores":1,
   [junit4]   2>     "host":"127.0.0.1",
   [junit4]   2>     "freedisk":990,
   [junit4]   2>     "sysprop.java.version":"1.8.0_152",
   [junit4]   2>     "ip_1":"127",
   [junit4]   2>     "ip_3":"0",
   [junit4]   2>     "ip_2":"0",
   [junit4]   2>     "ip_4":"1",
   [junit4]   2>     "node":"127.0.0.1:10001_solr",
   [junit4]   2>     "metrics:solr.jvm:buffers.direct.Count":0,
   [junit4]   2>     "port":10001,
   [junit4]   2>     "heapUsage":123450000,
   [junit4]   2>     "sysLoadAvg":1.0,
   [junit4]   2>     "metrics:solr.node:ADMIN./admin/authorization.clientErrors:count":0},
   [junit4]   2>   "127.0.0.1:10000_solr":{
   [junit4]   2>     "sysprop.java.vendor":"Oracle Corporation",
   [junit4]   2>     "cores":1,
   [junit4]   2>     "host":"127.0.0.1",
   [junit4]   2>     "freedisk":990,
   [junit4]   2>     "sysprop.java.version":"1.8.0_152",
   [junit4]   2>     "ip_1":"127",
   [junit4]   2>     "ip_3":"0",
   [junit4]   2>     "ip_2":"0",
   [junit4]   2>     "ip_4":"1",
   [junit4]   2>     "node":"127.0.0.1:10000_solr",
   [junit4]   2>     "metrics:solr.jvm:buffers.direct.Count":0,
   [junit4]   2>     "port":10000,
   [junit4]   2>     "heapUsage":123450000,
   [junit4]   2>     "sysLoadAvg":1.0,
   [junit4]   2>     "metrics:solr.node:ADMIN./admin/authorization.clientErrors:count":0},
   [junit4]   2>   "127.0.0.1:10002_solr":{
   [junit4]   2>     "sysprop.java.vendor":"Oracle Corporation",
   [junit4]   2>     "cores":0,
   [junit4]   2>     "host":"127.0.0.1",
   [junit4]   2>     "freedisk":1000,
   [junit4]   2>     "sysprop.java.version":"1.8.0_152",
   [junit4]   2>     "ip_1":"127",
   [junit4]   2>     "ip_3":"0",
   [junit4]   2>     "ip_2":"0",
   [junit4]   2>     "ip_4":"1",
   [junit4]   2>     "node":"127.0.0.1:10002_solr",


[...truncated too long message...]

e still zombie threads that couldn't be terminated:
   [junit4]    >    1) Thread[id=39857, name=jetty-launcher-9441-thread-2, state=TIMED_WAITING, group=TGRP-PKIAuthenticationIntegrationTest]
   [junit4]    >         at sun.misc.Unsafe.park(Native Method)
   [junit4]    >         at java.util.concurrent.locks.LockSupport.parkNanos(LockSupport.java:215)
   [junit4]    >         at java.util.concurrent.SynchronousQueue$TransferStack.awaitFulfill(SynchronousQueue.java:460)
   [junit4]    >         at java.util.concurrent.SynchronousQueue$TransferStack.transfer(SynchronousQueue.java:362)
   [junit4]    >         at java.util.concurrent.SynchronousQueue.poll(SynchronousQueue.java:941)
   [junit4]    >         at java.util.concurrent.ThreadPoolExecutor.getTask(ThreadPoolExecutor.java:1073)
   [junit4]    >         at java.util.concurrent.ThreadPoolExecutor.runWorker(ThreadPoolExecutor.java:1134)
   [junit4]    >         at java.util.concurrent.ThreadPoolExecutor$Worker.run(ThreadPoolExecutor.java:624)
   [junit4]    >         at java.lang.Thread.run(Thread.java:748)
   [junit4]    >    2) Thread[id=39849, name=NIOServerCxn.Factory:0.0.0.0/0.0.0.0:0, state=RUNNABLE, group=TGRP-PKIAuthenticationIntegrationTest]
   [junit4]    >         at sun.nio.ch.DevPollArrayWrapper.poll0(Native Method)
   [junit4]    >         at sun.nio.ch.DevPollArrayWrapper.poll(DevPollArrayWrapper.java:223)
   [junit4]    >         at sun.nio.ch.DevPollSelectorImpl.doSelect(DevPollSelectorImpl.java:98)
   [junit4]    >         at sun.nio.ch.SelectorImpl.lockAndDoSelect(SelectorImpl.java:86)
   [junit4]    >         at sun.nio.ch.SelectorImpl.select(SelectorImpl.java:97)
   [junit4]    >         at org.apache.zookeeper.server.NIOServerCnxnFactory.run(NIOServerCnxnFactory.java:173)
   [junit4]    >         at java.lang.Thread.run(Thread.java:748)
   [junit4]    >    3) Thread[id=39856, name=jetty-launcher-9441-thread-1, state=TIMED_WAITING, group=TGRP-PKIAuthenticationIntegrationTest]
   [junit4]    >         at sun.misc.Unsafe.park(Native Method)
   [junit4]    >         at java.util.concurrent.locks.LockSupport.parkNanos(LockSupport.java:215)
   [junit4]    >         at java.util.concurrent.SynchronousQueue$TransferStack.awaitFulfill(SynchronousQueue.java:460)
   [junit4]    >         at java.util.concurrent.SynchronousQueue$TransferStack.transfer(SynchronousQueue.java:362)
   [junit4]    >         at java.util.concurrent.SynchronousQueue.poll(SynchronousQueue.java:941)
   [junit4]    >         at java.util.concurrent.ThreadPoolExecutor.getTask(ThreadPoolExecutor.java:1073)
   [junit4]    >         at java.util.concurrent.ThreadPoolExecutor.runWorker(ThreadPoolExecutor.java:1134)
   [junit4]    >         at java.util.concurrent.ThreadPoolExecutor$Worker.run(ThreadPoolExecutor.java:624)
   [junit4]    >         at java.lang.Thread.run(Thread.java:748)
   [junit4]    >    4) Thread[id=39878, name=org.eclipse.jetty.server.session.HashSessionManager@60abc029Timer, state=TIMED_WAITING, group=TGRP-PKIAuthenticationIntegrationTest]
   [junit4]    >         at sun.misc.Unsafe.park(Native Method)
   [junit4]    >         at java.util.concurrent.locks.LockSupport.parkNanos(LockSupport.java:215)
   [junit4]    >         at java.util.concurrent.locks.AbstractQueuedSynchronizer$ConditionObject.awaitNanos(AbstractQueuedSynchronizer.java:2078)
   [junit4]    >         at java.util.concurrent.ScheduledThreadPoolExecutor$DelayedWorkQueue.take(ScheduledThreadPoolExecutor.java:1093)
   [junit4]    >         at java.util.concurrent.ScheduledThreadPoolExecutor$DelayedWorkQueue.take(ScheduledThreadPoolExecutor.java:809)
   [junit4]    >         at java.util.concurrent.ThreadPoolExecutor.getTask(ThreadPoolExecutor.java:1074)
   [junit4]    >         at java.util.concurrent.ThreadPoolExecutor.runWorker(ThreadPoolExecutor.java:1134)
   [junit4]    >         at java.util.concurrent.ThreadPoolExecutor$Worker.run(ThreadPoolExecutor.java:624)
   [junit4]    >         at java.lang.Thread.run(Thread.java:748)
   [junit4]    >    5) Thread[id=39875, name=qtp956246034-39875, state=RUNNABLE, group=TGRP-PKIAuthenticationIntegrationTest]
   [junit4]    >         at sun.nio.ch.DevPollArrayWrapper.poll0(Native Method)
   [junit4]    >         at sun.nio.ch.DevPollArrayWrapper.poll(DevPollArrayWrapper.java:223)
   [junit4]    >         at sun.nio.ch.DevPollSelectorImpl.doSelect(DevPollSelectorImpl.java:98)
   [junit4]    >         at sun.nio.ch.SelectorImpl.lockAndDoSelect(SelectorImpl.java:86)
   [junit4]    >         at sun.nio.ch.SelectorImpl.select(SelectorImpl.java:97)
   [junit4]    >         at sun.nio.ch.SelectorImpl.select(SelectorImpl.java:101)
   [junit4]    >         at org.eclipse.jetty.io.ManagedSelector$SelectorProducer.select(ManagedSelector.java:243)
   [junit4]    >         at org.eclipse.jetty.io.ManagedSelector$SelectorProducer.produce(ManagedSelector.java:191)
   [junit4]    >         at org.eclipse.jetty.util.thread.strategy.ExecuteProduceConsume.executeProduceConsume(ExecuteProduceConsume.java:249)
   [junit4]    >         at org.eclipse.jetty.util.thread.strategy.ExecuteProduceConsume.produceConsume(ExecuteProduceConsume.java:148)
   [junit4]    >         at org.eclipse.jetty.util.thread.strategy.ExecuteProduceConsume.run(ExecuteProduceConsume.java:136)
   [junit4]    >         at org.eclipse.jetty.util.thread.QueuedThreadPool.runJob(QueuedThreadPool.java:671)
   [junit4]    >         at org.eclipse.jetty.util.thread.QueuedThreadPool$2.run(QueuedThreadPool.java:589)
   [junit4]    >         at java.lang.Thread.run(Thread.java:748)
   [junit4]    >    6) Thread[id=39866, name=org.eclipse.jetty.server.session.HashSessionManager@466367e6Timer, state=TIMED_WAITING, group=TGRP-PKIAuthenticationIntegrationTest]
   [junit4]    >         at sun.misc.Unsafe.park(Native Method)
   [junit4]    >         at java.util.concurrent.locks.LockSupport.parkNanos(LockSupport.java:215)
   [junit4]    >         at java.util.concurrent.locks.AbstractQueuedSynchronizer$ConditionObject.awaitNanos(AbstractQueuedSynchronizer.java:2078)
   [junit4]    >         at java.util.concurrent.ScheduledThreadPoolExecutor$DelayedWorkQueue.take(ScheduledThreadPoolExecutor.java:1093)
   [junit4]    >         at java.util.concurrent.ScheduledThreadPoolExecutor$DelayedWorkQueue.take(ScheduledThreadPoolExecutor.java:809)
   [junit4]    >         at java.util.concurrent.ThreadPoolExecutor.getTask(ThreadPoolExecutor.java:1074)
   [junit4]    >         at java.util.concurrent.ThreadPoolExecutor.runWorker(ThreadPoolExecutor.java:1134)
   [junit4]    >         at java.util.concurrent.ThreadPoolExecutor$Worker.run(ThreadPoolExecutor.java:624)
   [junit4]    >         at java.lang.Thread.run(Thread.java:748)
   [junit4]    >    7) Thread[id=39883, name=Scheduler-909693309, state=WAITING, group=TGRP-PKIAuthenticationIntegrationTest]
   [junit4]    >         at sun.misc.Unsafe.park(Native Method)
   [junit4]    >         at java.util.concurrent.locks.LockSupport.park(LockSupport.java:175)
   [junit4]    >         at java.util.concurrent.locks.AbstractQueuedSynchronizer$ConditionObject.await(AbstractQueuedSynchronizer.java:2039)
   [junit4]    >         at java.util.concurrent.ScheduledThreadPoolExecutor$DelayedWorkQueue.take(ScheduledThreadPoolExecutor.java:1081)
   [junit4]    >         at java.util.concurrent.ScheduledThreadPoolExecutor$DelayedWorkQueue.take(ScheduledThreadPoolExecutor.java:809)
   [junit4]    >         at java.util.concurrent.ThreadPoolExecutor.getTask(ThreadPoolExecutor.java:1074)
   [junit4]    >         at java.util.concurrent.ThreadPoolExecutor.runWorker(ThreadPoolExecutor.java:1134)
   [junit4]    >         at java.util.concurrent.ThreadPoolExecutor$Worker.run(ThreadPoolExecutor.java:624)
   [junit4]    >         at java.lang.Thread.run(Thread.java:748)
   [junit4]    >    8) Thread[id=39867, name=qtp589434783-39867, state=RUNNABLE, group=TGRP-PKIAuthenticationIntegrationTest]
   [junit4]    >         at sun.nio.ch.DevPollArrayWrapper.interrupt(Native Method)
   [junit4]    >         at sun.nio.ch.DevPollArrayWrapper.interrupt(DevPollArrayWrapper.java:300)
   [junit4]    >         at sun.nio.ch.DevPollSelectorImpl.wakeup(DevPollSelectorImpl.java:207)
   [junit4]    >         at java.nio.channels.spi.AbstractSelector$1.interrupt(AbstractSelector.java:213)
   [junit4]    >         at java.nio.channels.spi.AbstractSelector.begin(AbstractSelector.java:219)
   [junit4]    >         at sun.nio.ch.DevPollSelectorImpl.doSelect(DevPollSelectorImpl.java:97)
   [junit4]    >         at sun.nio.ch.SelectorImpl.lockAndDoSelect(SelectorImpl.java:86)
   [junit4]    >         at sun.nio.ch.SelectorImpl.select(SelectorImpl.java:97)
   [junit4]    >         at sun.nio.ch.SelectorImpl.select(SelectorImpl.java:101)
   [junit4]    >         at org.eclipse.jetty.io.ManagedSelector$SelectorProducer.select(ManagedSelector.java:243)
   [junit4]    >         at org.eclipse.jetty.io.ManagedSelector$SelectorProducer.produce(ManagedSelector.java:191)
   [junit4]    >         at org.eclipse.jetty.util.thread.strategy.ExecuteProduceConsume.executeProduceConsume(ExecuteProduceConsume.java:249)
   [junit4]    >         at org.eclipse.jetty.util.thread.strategy.ExecuteProduceConsume.produceConsume(ExecuteProduceConsume.java:148)
   [junit4]    >         at org.eclipse.jetty.util.thread.strategy.ExecuteProduceConsume.execute(ExecuteProduceConsume.java:100)
   [junit4]    >         at org.eclipse.jetty.io.ManagedSelector.run(ManagedSelector.java:147)
   [junit4]    >         at org.eclipse.jetty.util.thread.QueuedThreadPool.runJob(QueuedThreadPool.java:671)
   [junit4]    >         at org.eclipse.jetty.util.thread.QueuedThreadPool$2.run(QueuedThreadPool.java:589)
   [junit4]    >         at java.lang.Thread.run(Thread.java:748)
   [junit4]    > 	at __randomizedtesting.SeedInfo.seed([1956E5BA14758DD1]:0)
   [junit4] Completed [735/765 (2!)] on J1 in 85.72s, 0 tests, 3 errors <<< FAILURES!

[...truncated 48133 lines...]

Mime
View raw message