lucene-dev mailing list archives

Site index · List index
Message view « Date » · « Thread »
Top « Date » · « Thread »
From Policeman Jenkins Server <jenk...@thetaphi.de>
Subject [JENKINS] Lucene-Solr-7.2-Linux (64bit/jdk-9.0.1) - Build # 93 - Still Unstable!
Date Thu, 21 Dec 2017 01:39:26 GMT
Build: https://jenkins.thetaphi.de/job/Lucene-Solr-7.2-Linux/93/
Java: 64bit/jdk-9.0.1 -XX:+UseCompressedOops -XX:+UseParallelGC

3 tests failed.
FAILED:  junit.framework.TestSuite.org.apache.solr.core.TestLazyCores

Error Message:
1 thread leaked from SUITE scope at org.apache.solr.core.TestLazyCores:     1) Thread[id=12242, name=searcherExecutor-3875-thread-1, state=WAITING, group=TGRP-TestLazyCores]         at java.base@9.0.1/jdk.internal.misc.Unsafe.park(Native Method)         at java.base@9.0.1/java.util.concurrent.locks.LockSupport.park(LockSupport.java:194)         at java.base@9.0.1/java.util.concurrent.locks.AbstractQueuedSynchronizer$ConditionObject.await(AbstractQueuedSynchronizer.java:2062)         at java.base@9.0.1/java.util.concurrent.LinkedBlockingQueue.take(LinkedBlockingQueue.java:435)         at java.base@9.0.1/java.util.concurrent.ThreadPoolExecutor.getTask(ThreadPoolExecutor.java:1092)         at java.base@9.0.1/java.util.concurrent.ThreadPoolExecutor.runWorker(ThreadPoolExecutor.java:1152)         at java.base@9.0.1/java.util.concurrent.ThreadPoolExecutor$Worker.run(ThreadPoolExecutor.java:641)         at java.base@9.0.1/java.lang.Thread.run(Thread.java:844)

Stack Trace:
com.carrotsearch.randomizedtesting.ThreadLeakError: 1 thread leaked from SUITE scope at org.apache.solr.core.TestLazyCores: 
   1) Thread[id=12242, name=searcherExecutor-3875-thread-1, state=WAITING, group=TGRP-TestLazyCores]
        at java.base@9.0.1/jdk.internal.misc.Unsafe.park(Native Method)
        at java.base@9.0.1/java.util.concurrent.locks.LockSupport.park(LockSupport.java:194)
        at java.base@9.0.1/java.util.concurrent.locks.AbstractQueuedSynchronizer$ConditionObject.await(AbstractQueuedSynchronizer.java:2062)
        at java.base@9.0.1/java.util.concurrent.LinkedBlockingQueue.take(LinkedBlockingQueue.java:435)
        at java.base@9.0.1/java.util.concurrent.ThreadPoolExecutor.getTask(ThreadPoolExecutor.java:1092)
        at java.base@9.0.1/java.util.concurrent.ThreadPoolExecutor.runWorker(ThreadPoolExecutor.java:1152)
        at java.base@9.0.1/java.util.concurrent.ThreadPoolExecutor$Worker.run(ThreadPoolExecutor.java:641)
        at java.base@9.0.1/java.lang.Thread.run(Thread.java:844)
	at __randomizedtesting.SeedInfo.seed([63DC1D1015F35FC3]:0)


FAILED:  junit.framework.TestSuite.org.apache.solr.core.TestLazyCores

Error Message:
There are still zombie threads that couldn't be terminated:    1) Thread[id=12242, name=searcherExecutor-3875-thread-1, state=WAITING, group=TGRP-TestLazyCores]         at java.base@9.0.1/jdk.internal.misc.Unsafe.park(Native Method)         at java.base@9.0.1/java.util.concurrent.locks.LockSupport.park(LockSupport.java:194)         at java.base@9.0.1/java.util.concurrent.locks.AbstractQueuedSynchronizer$ConditionObject.await(AbstractQueuedSynchronizer.java:2062)         at java.base@9.0.1/java.util.concurrent.LinkedBlockingQueue.take(LinkedBlockingQueue.java:435)         at java.base@9.0.1/java.util.concurrent.ThreadPoolExecutor.getTask(ThreadPoolExecutor.java:1092)         at java.base@9.0.1/java.util.concurrent.ThreadPoolExecutor.runWorker(ThreadPoolExecutor.java:1152)         at java.base@9.0.1/java.util.concurrent.ThreadPoolExecutor$Worker.run(ThreadPoolExecutor.java:641)         at java.base@9.0.1/java.lang.Thread.run(Thread.java:844)

Stack Trace:
com.carrotsearch.randomizedtesting.ThreadLeakError: There are still zombie threads that couldn't be terminated:
   1) Thread[id=12242, name=searcherExecutor-3875-thread-1, state=WAITING, group=TGRP-TestLazyCores]
        at java.base@9.0.1/jdk.internal.misc.Unsafe.park(Native Method)
        at java.base@9.0.1/java.util.concurrent.locks.LockSupport.park(LockSupport.java:194)
        at java.base@9.0.1/java.util.concurrent.locks.AbstractQueuedSynchronizer$ConditionObject.await(AbstractQueuedSynchronizer.java:2062)
        at java.base@9.0.1/java.util.concurrent.LinkedBlockingQueue.take(LinkedBlockingQueue.java:435)
        at java.base@9.0.1/java.util.concurrent.ThreadPoolExecutor.getTask(ThreadPoolExecutor.java:1092)
        at java.base@9.0.1/java.util.concurrent.ThreadPoolExecutor.runWorker(ThreadPoolExecutor.java:1152)
        at java.base@9.0.1/java.util.concurrent.ThreadPoolExecutor$Worker.run(ThreadPoolExecutor.java:641)
        at java.base@9.0.1/java.lang.Thread.run(Thread.java:844)
	at __randomizedtesting.SeedInfo.seed([63DC1D1015F35FC3]:0)


FAILED:  org.apache.solr.core.TestLazyCores.testNoCommit

Error Message:
Exception during query

Stack Trace:
java.lang.RuntimeException: Exception during query
	at __randomizedtesting.SeedInfo.seed([63DC1D1015F35FC3:BCBCBCC1DED43C66]:0)
	at org.apache.solr.SolrTestCaseJ4.assertQ(SolrTestCaseJ4.java:901)
	at org.apache.solr.core.TestLazyCores.check10(TestLazyCores.java:847)
	at org.apache.solr.core.TestLazyCores.testNoCommit(TestLazyCores.java:829)
	at java.base/jdk.internal.reflect.NativeMethodAccessorImpl.invoke0(Native Method)
	at java.base/jdk.internal.reflect.NativeMethodAccessorImpl.invoke(NativeMethodAccessorImpl.java:62)
	at java.base/jdk.internal.reflect.DelegatingMethodAccessorImpl.invoke(DelegatingMethodAccessorImpl.java:43)
	at java.base/java.lang.reflect.Method.invoke(Method.java:564)
	at com.carrotsearch.randomizedtesting.RandomizedRunner.invoke(RandomizedRunner.java:1737)
	at com.carrotsearch.randomizedtesting.RandomizedRunner$8.evaluate(RandomizedRunner.java:934)
	at com.carrotsearch.randomizedtesting.RandomizedRunner$9.evaluate(RandomizedRunner.java:970)
	at com.carrotsearch.randomizedtesting.RandomizedRunner$10.evaluate(RandomizedRunner.java:984)
	at com.carrotsearch.randomizedtesting.rules.SystemPropertiesRestoreRule$1.evaluate(SystemPropertiesRestoreRule.java:57)
	at org.apache.lucene.util.TestRuleSetupTeardownChained$1.evaluate(TestRuleSetupTeardownChained.java:49)
	at org.apache.lucene.util.AbstractBeforeAfterRule$1.evaluate(AbstractBeforeAfterRule.java:45)
	at org.apache.lucene.util.TestRuleThreadAndTestName$1.evaluate(TestRuleThreadAndTestName.java:48)
	at org.apache.lucene.util.TestRuleIgnoreAfterMaxFailures$1.evaluate(TestRuleIgnoreAfterMaxFailures.java:64)
	at org.apache.lucene.util.TestRuleMarkFailure$1.evaluate(TestRuleMarkFailure.java:47)
	at com.carrotsearch.randomizedtesting.rules.StatementAdapter.evaluate(StatementAdapter.java:36)
	at com.carrotsearch.randomizedtesting.ThreadLeakControl$StatementRunner.run(ThreadLeakControl.java:368)
	at com.carrotsearch.randomizedtesting.ThreadLeakControl.forkTimeoutingTask(ThreadLeakControl.java:817)
	at com.carrotsearch.randomizedtesting.ThreadLeakControl$3.evaluate(ThreadLeakControl.java:468)
	at com.carrotsearch.randomizedtesting.RandomizedRunner.runSingleTest(RandomizedRunner.java:943)
	at com.carrotsearch.randomizedtesting.RandomizedRunner$5.evaluate(RandomizedRunner.java:829)
	at com.carrotsearch.randomizedtesting.RandomizedRunner$6.evaluate(RandomizedRunner.java:879)
	at com.carrotsearch.randomizedtesting.RandomizedRunner$7.evaluate(RandomizedRunner.java:890)
	at com.carrotsearch.randomizedtesting.rules.StatementAdapter.evaluate(StatementAdapter.java:36)
	at com.carrotsearch.randomizedtesting.rules.SystemPropertiesRestoreRule$1.evaluate(SystemPropertiesRestoreRule.java:57)
	at org.apache.lucene.util.AbstractBeforeAfterRule$1.evaluate(AbstractBeforeAfterRule.java:45)
	at com.carrotsearch.randomizedtesting.rules.StatementAdapter.evaluate(StatementAdapter.java:36)
	at org.apache.lucene.util.TestRuleStoreClassName$1.evaluate(TestRuleStoreClassName.java:41)
	at com.carrotsearch.randomizedtesting.rules.NoShadowingOrOverridesOnMethodsRule$1.evaluate(NoShadowingOrOverridesOnMethodsRule.java:40)
	at com.carrotsearch.randomizedtesting.rules.NoShadowingOrOverridesOnMethodsRule$1.evaluate(NoShadowingOrOverridesOnMethodsRule.java:40)
	at com.carrotsearch.randomizedtesting.rules.StatementAdapter.evaluate(StatementAdapter.java:36)
	at com.carrotsearch.randomizedtesting.rules.StatementAdapter.evaluate(StatementAdapter.java:36)
	at org.apache.lucene.util.TestRuleAssertionsRequired$1.evaluate(TestRuleAssertionsRequired.java:53)
	at org.apache.lucene.util.TestRuleMarkFailure$1.evaluate(TestRuleMarkFailure.java:47)
	at org.apache.lucene.util.TestRuleIgnoreAfterMaxFailures$1.evaluate(TestRuleIgnoreAfterMaxFailures.java:64)
	at org.apache.lucene.util.TestRuleIgnoreTestSuites$1.evaluate(TestRuleIgnoreTestSuites.java:54)
	at com.carrotsearch.randomizedtesting.rules.StatementAdapter.evaluate(StatementAdapter.java:36)
	at com.carrotsearch.randomizedtesting.ThreadLeakControl$StatementRunner.run(ThreadLeakControl.java:368)
	at java.base/java.lang.Thread.run(Thread.java:844)
Caused by: java.lang.RuntimeException: REQUEST FAILED: xpath=//result[@numFound='10']
	xml response was: <?xml version="1.0" encoding="UTF-8"?>
<response>
<lst name="responseHeader"><int name="status">0</int><int name="QTime">0</int><lst name="params"><str name="q">*:*</str></lst></lst><result name="response" numFound="0" start="0"></result>
</response>

	request was:q=*:*
	at org.apache.solr.SolrTestCaseJ4.assertQ(SolrTestCaseJ4.java:894)
	... 40 more




Build Log:
[...truncated 12877 lines...]
   [junit4] Suite: org.apache.solr.core.TestLazyCores
   [junit4]   2> 1426645 INFO  (SUITE-TestLazyCores-seed#[63DC1D1015F35FC3]-worker) [    ] o.a.s.SolrTestCaseJ4 SecureRandom sanity checks: test.solr.allowed.securerandom=null & java.security.egd=file:/dev/./urandom
   [junit4]   2> Creating dataDir: /home/jenkins/workspace/Lucene-Solr-7.2-Linux/solr/build/solr-core/test/J1/temp/solr.core.TestLazyCores_63DC1D1015F35FC3-001/init-core-data-001
   [junit4]   2> 1426645 WARN  (SUITE-TestLazyCores-seed#[63DC1D1015F35FC3]-worker) [    ] o.a.s.SolrTestCaseJ4 startTrackingSearchers: numOpens=1 numCloses=1
   [junit4]   2> 1426645 INFO  (SUITE-TestLazyCores-seed#[63DC1D1015F35FC3]-worker) [    ] o.a.s.SolrTestCaseJ4 Using PointFields (NUMERIC_POINTS_SYSPROP=true) w/NUMERIC_DOCVALUES_SYSPROP=false
   [junit4]   2> 1426646 INFO  (SUITE-TestLazyCores-seed#[63DC1D1015F35FC3]-worker) [    ] o.a.s.SolrTestCaseJ4 Randomized ssl (true) and clientAuth (false) via: @org.apache.solr.util.RandomizeSSL(reason="", ssl=0.0/0.0, value=0.0/0.0, clientAuth=0.0/0.0)
   [junit4]   2> 1426654 INFO  (TEST-TestLazyCores.testNoCommit-seed#[63DC1D1015F35FC3]) [    ] o.a.s.SolrTestCaseJ4 ###Starting testNoCommit
   [junit4]   2> 1426664 INFO  (TEST-TestLazyCores.testNoCommit-seed#[63DC1D1015F35FC3]) [    ] o.a.s.c.SolrXmlConfig Loading container configuration from /home/jenkins/workspace/Lucene-Solr-7.2-Linux/solr/build/solr-core/test/J1/temp/solr.core.TestLazyCores_63DC1D1015F35FC3-001/tempDir-001/solr.xml
   [junit4]   2> 1426666 INFO  (TEST-TestLazyCores.testNoCommit-seed#[63DC1D1015F35FC3]) [    ] o.a.s.c.SolrXmlConfig Configuration parameter autoReplicaFailoverWorkLoopDelay is ignored
   [junit4]   2> 1426666 INFO  (TEST-TestLazyCores.testNoCommit-seed#[63DC1D1015F35FC3]) [    ] o.a.s.c.SolrXmlConfig Configuration parameter autoReplicaFailoverBadNodeExpiration is ignored
   [junit4]   2> 1426666 INFO  (TEST-TestLazyCores.testNoCommit-seed#[63DC1D1015F35FC3]) [    ] o.a.s.c.SolrXmlConfig MBean server found: com.sun.jmx.mbeanserver.JmxMBeanServer@95a3404, but no JMX reporters were configured - adding default JMX reporter.
   [junit4]   2> 1426687 INFO  (TEST-TestLazyCores.testNoCommit-seed#[63DC1D1015F35FC3]) [    ] o.a.s.m.r.SolrJmxReporter JMX monitoring for 'solr.node' (registry 'solr.node') enabled at server: com.sun.jmx.mbeanserver.JmxMBeanServer@95a3404
   [junit4]   2> 1426692 INFO  (TEST-TestLazyCores.testNoCommit-seed#[63DC1D1015F35FC3]) [    ] o.a.s.m.r.SolrJmxReporter JMX monitoring for 'solr.jvm' (registry 'solr.jvm') enabled at server: com.sun.jmx.mbeanserver.JmxMBeanServer@95a3404
   [junit4]   2> 1426693 INFO  (TEST-TestLazyCores.testNoCommit-seed#[63DC1D1015F35FC3]) [    ] o.a.s.m.r.SolrJmxReporter JMX monitoring for 'solr.jetty' (registry 'solr.jetty') enabled at server: com.sun.jmx.mbeanserver.JmxMBeanServer@95a3404
   [junit4]   2> 1426694 INFO  (TEST-TestLazyCores.testNoCommit-seed#[63DC1D1015F35FC3]) [    ] o.a.s.c.TransientSolrCoreCacheDefault Allocating transient cache for 4 transient cores
   [junit4]   2> 1426702 INFO  (coreLoadExecutor-3842-thread-1) [    x:collection1] o.a.s.c.SolrConfig Using Lucene MatchVersion: 7.2.0
   [junit4]   2> 1426702 INFO  (coreLoadExecutor-3842-thread-2) [    x:collection2] o.a.s.c.SolrConfig Using Lucene MatchVersion: 7.2.0
   [junit4]   2> 1426702 INFO  (coreLoadExecutor-3842-thread-3) [    x:collection5] o.a.s.c.SolrConfig Using Lucene MatchVersion: 7.2.0
   [junit4]   2> 1426721 INFO  (coreLoadExecutor-3842-thread-3) [    x:collection5] o.a.s.s.IndexSchema [collection5] Schema name=tiny
   [junit4]   2> 1426731 INFO  (coreLoadExecutor-3842-thread-3) [    x:collection5] o.a.s.s.IndexSchema Loaded schema tiny/1.1 with uniqueid field id
   [junit4]   2> 1426731 INFO  (coreLoadExecutor-3842-thread-3) [    x:collection5] o.a.s.c.CoreContainer Creating SolrCore 'collection5' using configuration from instancedir /home/jenkins/workspace/Lucene-Solr-7.2-Linux/solr/build/solr-core/test/J1/temp/solr.core.TestLazyCores_63DC1D1015F35FC3-001/tempDir-001/./collection5, trusted=true
   [junit4]   2> 1426731 INFO  (coreLoadExecutor-3842-thread-3) [    x:collection5] o.a.s.m.r.SolrJmxReporter JMX monitoring for 'solr.core.collection5' (registry 'solr.core.collection5') enabled at server: com.sun.jmx.mbeanserver.JmxMBeanServer@95a3404
   [junit4]   2> 1426731 INFO  (coreLoadExecutor-3842-thread-2) [    x:collection2] o.a.s.s.IndexSchema [collection2] Schema name=tiny
   [junit4]   2> 1426731 INFO  (coreLoadExecutor-3842-thread-3) [    x:collection5] o.a.s.c.SolrCore solr.RecoveryStrategy.Builder
   [junit4]   2> 1426732 INFO  (coreLoadExecutor-3842-thread-3) [    x:collection5] o.a.s.c.SolrCore [[collection5] ] Opening new SolrCore at [/home/jenkins/workspace/Lucene-Solr-7.2-Linux/solr/build/solr-core/test/J1/temp/solr.core.TestLazyCores_63DC1D1015F35FC3-001/tempDir-001/collection5], dataDir=[/home/jenkins/workspace/Lucene-Solr-7.2-Linux/solr/build/solr-core/test/J1/temp/solr.core.TestLazyCores_63DC1D1015F35FC3-001/tempDir-001/./collection5/data/]
   [junit4]   2> 1426732 INFO  (coreLoadExecutor-3842-thread-1) [    x:collection1] o.a.s.s.IndexSchema [collection1] Schema name=tiny
   [junit4]   2> 1426733 INFO  (coreLoadExecutor-3842-thread-2) [    x:collection2] o.a.s.s.IndexSchema Loaded schema tiny/1.1 with uniqueid field id
   [junit4]   2> 1426733 INFO  (coreLoadExecutor-3842-thread-2) [    x:collection2] o.a.s.c.CoreContainer Creating SolrCore 'collection2' using configuration from instancedir /home/jenkins/workspace/Lucene-Solr-7.2-Linux/solr/build/solr-core/test/J1/temp/solr.core.TestLazyCores_63DC1D1015F35FC3-001/tempDir-001/./collection2, trusted=true
   [junit4]   2> 1426733 INFO  (coreLoadExecutor-3842-thread-2) [    x:collection2] o.a.s.m.r.SolrJmxReporter JMX monitoring for 'solr.core.collection2' (registry 'solr.core.collection2') enabled at server: com.sun.jmx.mbeanserver.JmxMBeanServer@95a3404
   [junit4]   2> 1426733 INFO  (coreLoadExecutor-3842-thread-2) [    x:collection2] o.a.s.c.SolrCore solr.RecoveryStrategy.Builder
   [junit4]   2> 1426733 INFO  (coreLoadExecutor-3842-thread-2) [    x:collection2] o.a.s.c.SolrCore [[collection2] ] Opening new SolrCore at [/home/jenkins/workspace/Lucene-Solr-7.2-Linux/solr/build/solr-core/test/J1/temp/solr.core.TestLazyCores_63DC1D1015F35FC3-001/tempDir-001/collection2], dataDir=[/home/jenkins/workspace/Lucene-Solr-7.2-Linux/solr/build/solr-core/test/J1/temp/solr.core.TestLazyCores_63DC1D1015F35FC3-001/tempDir-001/./collection2/data/]
   [junit4]   2> 1426734 INFO  (coreLoadExecutor-3842-thread-1) [    x:collection1] o.a.s.s.IndexSchema Loaded schema tiny/1.1 with uniqueid field id
   [junit4]   2> 1426734 INFO  (coreLoadExecutor-3842-thread-1) [    x:collection1] o.a.s.c.CoreContainer Creating SolrCore 'collection1' using configuration from instancedir /home/jenkins/workspace/Lucene-Solr-7.2-Linux/solr/build/solr-core/test/J1/temp/solr.core.TestLazyCores_63DC1D1015F35FC3-001/tempDir-001/./collection1, trusted=true
   [junit4]   2> 1426734 INFO  (coreLoadExecutor-3842-thread-3) [    x:collection5] o.a.s.u.RandomMergePolicy RandomMergePolicy wrapping class org.apache.lucene.index.TieredMergePolicy: [TieredMergePolicy: maxMergeAtOnce=39, maxMergeAtOnceExplicit=46, maxMergedSegmentMB=88.0703125, floorSegmentMB=1.6982421875, forceMergeDeletesPctAllowed=10.486523228703398, segmentsPerTier=8.0, maxCFSSegmentSizeMB=8.796093022207999E12, noCFSRatio=0.0
   [junit4]   2> 1426734 INFO  (coreLoadExecutor-3842-thread-1) [    x:collection1] o.a.s.m.r.SolrJmxReporter JMX monitoring for 'solr.core.collection1' (registry 'solr.core.collection1') enabled at server: com.sun.jmx.mbeanserver.JmxMBeanServer@95a3404
   [junit4]   2> 1426734 INFO  (coreLoadExecutor-3842-thread-1) [    x:collection1] o.a.s.c.SolrCore solr.RecoveryStrategy.Builder
   [junit4]   2> 1426734 INFO  (coreLoadExecutor-3842-thread-1) [    x:collection1] o.a.s.c.SolrCore [[collection1] ] Opening new SolrCore at [/home/jenkins/workspace/Lucene-Solr-7.2-Linux/solr/build/solr-core/test/J1/temp/solr.core.TestLazyCores_63DC1D1015F35FC3-001/tempDir-001/collection1], dataDir=[/home/jenkins/workspace/Lucene-Solr-7.2-Linux/solr/build/solr-core/test/J1/temp/solr.core.TestLazyCores_63DC1D1015F35FC3-001/tempDir-001/./collection1/data/]
   [junit4]   2> 1426736 INFO  (coreLoadExecutor-3842-thread-1) [    x:collection1] o.a.s.u.RandomMergePolicy RandomMergePolicy wrapping class org.apache.lucene.index.TieredMergePolicy: [TieredMergePolicy: maxMergeAtOnce=39, maxMergeAtOnceExplicit=46, maxMergedSegmentMB=88.0703125, floorSegmentMB=1.6982421875, forceMergeDeletesPctAllowed=10.486523228703398, segmentsPerTier=8.0, maxCFSSegmentSizeMB=8.796093022207999E12, noCFSRatio=0.0
   [junit4]   2> 1426738 INFO  (coreLoadExecutor-3842-thread-2) [    x:collection2] o.a.s.u.RandomMergePolicy RandomMergePolicy wrapping class org.apache.lucene.index.TieredMergePolicy: [TieredMergePolicy: maxMergeAtOnce=39, maxMergeAtOnceExplicit=46, maxMergedSegmentMB=88.0703125, floorSegmentMB=1.6982421875, forceMergeDeletesPctAllowed=10.486523228703398, segmentsPerTier=8.0, maxCFSSegmentSizeMB=8.796093022207999E12, noCFSRatio=0.0
   [junit4]   2> 1426784 INFO  (coreLoadExecutor-3842-thread-1) [    x:collection1] o.a.s.u.CommitTracker Hard AutoCommit: disabled
   [junit4]   2> 1426784 INFO  (coreLoadExecutor-3842-thread-1) [    x:collection1] o.a.s.u.CommitTracker Soft AutoCommit: disabled
   [junit4]   2> 1426785 INFO  (coreLoadExecutor-3842-thread-1) [    x:collection1] o.a.s.u.RandomMergePolicy RandomMergePolicy wrapping class org.apache.lucene.index.TieredMergePolicy: [TieredMergePolicy: maxMergeAtOnce=10, maxMergeAtOnceExplicit=20, maxMergedSegmentMB=40.1435546875, floorSegmentMB=0.3330078125, forceMergeDeletesPctAllowed=25.711654587130173, segmentsPerTier=11.0, maxCFSSegmentSizeMB=8.796093022207999E12, noCFSRatio=1.0
   [junit4]   2> 1426785 INFO  (coreLoadExecutor-3842-thread-1) [    x:collection1] o.a.s.s.SolrIndexSearcher Opening [Searcher@4858758b[collection1] main]
   [junit4]   2> 1426785 INFO  (coreLoadExecutor-3842-thread-1) [    x:collection1] o.a.s.r.ManagedResourceStorage File-based storage initialized to use dir: /home/jenkins/workspace/Lucene-Solr-7.2-Linux/solr/build/solr-core/test/J1/temp/solr.core.TestLazyCores_63DC1D1015F35FC3-001/tempDir-001/collection1/conf
   [junit4]   2> 1426786 INFO  (coreLoadExecutor-3842-thread-1) [    x:collection1] o.a.s.h.ReplicationHandler Commits will be reserved for 10000ms.
   [junit4]   2> 1426786 INFO  (searcherExecutor-3845-thread-1-processing-x:collection1) [    x:collection1] o.a.s.c.SolrCore [collection1] Registered new searcher Searcher@4858758b[collection1] main{ExitableDirectoryReader(UninvertingDirectoryReader())}
   [junit4]   2> 1426787 INFO  (coreLoadExecutor-3842-thread-2) [    x:collection2] o.a.s.u.CommitTracker Hard AutoCommit: disabled
   [junit4]   2> 1426787 INFO  (coreLoadExecutor-3842-thread-2) [    x:collection2] o.a.s.u.CommitTracker Soft AutoCommit: disabled
   [junit4]   2> 1426787 INFO  (coreLoadExecutor-3842-thread-2) [    x:collection2] o.a.s.u.RandomMergePolicy RandomMergePolicy wrapping class org.apache.lucene.index.TieredMergePolicy: [TieredMergePolicy: maxMergeAtOnce=10, maxMergeAtOnceExplicit=20, maxMergedSegmentMB=40.1435546875, floorSegmentMB=0.3330078125, forceMergeDeletesPctAllowed=25.711654587130173, segmentsPerTier=11.0, maxCFSSegmentSizeMB=8.796093022207999E12, noCFSRatio=1.0
   [junit4]   2> 1426788 INFO  (coreLoadExecutor-3842-thread-2) [    x:collection2] o.a.s.s.SolrIndexSearcher Opening [Searcher@5226da34[collection2] main]
   [junit4]   2> 1426788 INFO  (coreLoadExecutor-3842-thread-2) [    x:collection2] o.a.s.r.ManagedResourceStorage File-based storage initialized to use dir: /home/jenkins/workspace/Lucene-Solr-7.2-Linux/solr/build/solr-core/test/J1/temp/solr.core.TestLazyCores_63DC1D1015F35FC3-001/tempDir-001/collection2/conf
   [junit4]   2> 1426788 INFO  (coreLoadExecutor-3842-thread-2) [    x:collection2] o.a.s.h.ReplicationHandler Commits will be reserved for 10000ms.
   [junit4]   2> 1426789 INFO  (coreLoadExecutor-3842-thread-3) [    x:collection5] o.a.s.u.CommitTracker Hard AutoCommit: disabled
   [junit4]   2> 1426789 INFO  (coreLoadExecutor-3842-thread-3) [    x:collection5] o.a.s.u.CommitTracker Soft AutoCommit: disabled
   [junit4]   2> 1426789 INFO  (searcherExecutor-3844-thread-1-processing-x:collection2) [    x:collection2] o.a.s.c.SolrCore [collection2] Registered new searcher Searcher@5226da34[collection2] main{ExitableDirectoryReader(UninvertingDirectoryReader())}
   [junit4]   2> 1426789 INFO  (coreLoadExecutor-3842-thread-3) [    x:collection5] o.a.s.u.RandomMergePolicy RandomMergePolicy wrapping class org.apache.lucene.index.TieredMergePolicy: [TieredMergePolicy: maxMergeAtOnce=10, maxMergeAtOnceExplicit=20, maxMergedSegmentMB=40.1435546875, floorSegmentMB=0.3330078125, forceMergeDeletesPctAllowed=25.711654587130173, segmentsPerTier=11.0, maxCFSSegmentSizeMB=8.796093022207999E12, noCFSRatio=1.0
   [junit4]   2> 1426789 INFO  (coreLoadExecutor-3842-thread-3) [    x:collection5] o.a.s.s.SolrIndexSearcher Opening [Searcher@2156167e[collection5] main]
   [junit4]   2> 1426790 INFO  (coreLoadExecutor-3842-thread-3) [    x:collection5] o.a.s.r.ManagedResourceStorage File-based storage initialized to use dir: /home/jenkins/workspace/Lucene-Solr-7.2-Linux/solr/build/solr-core/test/J1/temp/solr.core.TestLazyCores_63DC1D1015F35FC3-001/tempDir-001/collection5/conf
   [junit4]   2> 1426790 INFO  (coreLoadExecutor-3842-thread-3) [    x:collection5] o.a.s.h.ReplicationHandler Commits will be reserved for 10000ms.
   [junit4]   2> 1426790 INFO  (searcherExecutor-3843-thread-1-processing-x:collection5) [    x:collection5] o.a.s.c.SolrCore [collection5] Registered new searcher Searcher@2156167e[collection5] main{ExitableDirectoryReader(UninvertingDirectoryReader())}
   [junit4]   2> 1426796 INFO  (TEST-TestLazyCores.testNoCommit-seed#[63DC1D1015F35FC3]) [    x:collection3] o.a.s.c.SolrConfig Using Lucene MatchVersion: 7.2.0
   [junit4]   2> 1426802 INFO  (TEST-TestLazyCores.testNoCommit-seed#[63DC1D1015F35FC3]) [    x:collection3] o.a.s.s.IndexSchema [collection3] Schema name=tiny
   [junit4]   2> 1426803 INFO  (TEST-TestLazyCores.testNoCommit-seed#[63DC1D1015F35FC3]) [    x:collection3] o.a.s.s.IndexSchema Loaded schema tiny/1.1 with uniqueid field id
   [junit4]   2> 1426803 INFO  (TEST-TestLazyCores.testNoCommit-seed#[63DC1D1015F35FC3]) [    x:collection3] o.a.s.c.CoreContainer Creating SolrCore 'collection3' using configuration from instancedir /home/jenkins/workspace/Lucene-Solr-7.2-Linux/solr/build/solr-core/test/J1/temp/solr.core.TestLazyCores_63DC1D1015F35FC3-001/tempDir-001/./collection3, trusted=true
   [junit4]   2> 1426803 INFO  (TEST-TestLazyCores.testNoCommit-seed#[63DC1D1015F35FC3]) [    x:collection3] o.a.s.m.r.SolrJmxReporter JMX monitoring for 'solr.core.collection3' (registry 'solr.core.collection3') enabled at server: com.sun.jmx.mbeanserver.JmxMBeanServer@95a3404
   [junit4]   2> 1426803 INFO  (TEST-TestLazyCores.testNoCommit-seed#[63DC1D1015F35FC3]) [    x:collection3] o.a.s.c.SolrCore solr.RecoveryStrategy.Builder
   [junit4]   2> 1426803 INFO  (TEST-TestLazyCores.testNoCommit-seed#[63DC1D1015F35FC3]) [    x:collection3] o.a.s.c.SolrCore [[collection3] ] Opening new SolrCore at [/home/jenkins/workspace/Lucene-Solr-7.2-Linux/solr/build/solr-core/test/J1/temp/solr.core.TestLazyCores_63DC1D1015F35FC3-001/tempDir-001/collection3], dataDir=[/home/jenkins/workspace/Lucene-Solr-7.2-Linux/solr/build/solr-core/test/J1/temp/solr.core.TestLazyCores_63DC1D1015F35FC3-001/tempDir-001/./collection3/data/]
   [junit4]   2> 1426807 INFO  (TEST-TestLazyCores.testNoCommit-seed#[63DC1D1015F35FC3]) [    x:collection3] o.a.s.u.RandomMergePolicy RandomMergePolicy wrapping class org.apache.lucene.index.LogByteSizeMergePolicy: [LogByteSizeMergePolicy: minMergeSize=1677721, mergeFactor=43, maxMergeSize=2147483648, maxMergeSizeForForcedMerge=9223372036854775807, calibrateSizeByDeletes=true, maxMergeDocs=2147483647, maxCFSSegmentSizeMB=8.796093022207999E12, noCFSRatio=0.5848306076752869]
   [junit4]   2> 1426857 INFO  (TEST-TestLazyCores.testNoCommit-seed#[63DC1D1015F35FC3]) [    x:collection3] o.a.s.u.CommitTracker Hard AutoCommit: disabled
   [junit4]   2> 1426857 INFO  (TEST-TestLazyCores.testNoCommit-seed#[63DC1D1015F35FC3]) [    x:collection3] o.a.s.u.CommitTracker Soft AutoCommit: disabled
   [junit4]   2> 1426858 INFO  (TEST-TestLazyCores.testNoCommit-seed#[63DC1D1015F35FC3]) [    x:collection3] o.a.s.u.RandomMergePolicy RandomMergePolicy wrapping class org.apache.lucene.index.LogByteSizeMergePolicy: [LogByteSizeMergePolicy: minMergeSize=1677721, mergeFactor=42, maxMergeSize=2147483648, maxMergeSizeForForcedMerge=9223372036854775807, calibrateSizeByDeletes=true, maxMergeDocs=2147483647, maxCFSSegmentSizeMB=8.796093022207999E12, noCFSRatio=0.0]
   [junit4]   2> 1426858 INFO  (TEST-TestLazyCores.testNoCommit-seed#[63DC1D1015F35FC3]) [    x:collection3] o.a.s.s.SolrIndexSearcher Opening [Searcher@7ed95942[collection3] main]
   [junit4]   2> 1426859 INFO  (TEST-TestLazyCores.testNoCommit-seed#[63DC1D1015F35FC3]) [    x:collection3] o.a.s.r.ManagedResourceStorage File-based storage initialized to use dir: /home/jenkins/workspace/Lucene-Solr-7.2-Linux/solr/build/solr-core/test/J1/temp/solr.core.TestLazyCores_63DC1D1015F35FC3-001/tempDir-001/collection3/conf
   [junit4]   2> 1426859 INFO  (TEST-TestLazyCores.testNoCommit-seed#[63DC1D1015F35FC3]) [    x:collection3] o.a.s.h.ReplicationHandler Commits will be reserved for 10000ms.
   [junit4]   2> 1426860 INFO  (searcherExecutor-3855-thread-1-processing-x:collection3) [    x:collection3] o.a.s.c.SolrCore [collection3] Registered new searcher Searcher@7ed95942[collection3] main{ExitableDirectoryReader(UninvertingDirectoryReader())}
   [junit4]   2> 1426865 INFO  (TEST-TestLazyCores.testNoCommit-seed#[63DC1D1015F35FC3]) [    x:collection3] o.a.s.c.SolrConfig Using Lucene MatchVersion: 7.2.0
   [junit4]   2> 1426869 INFO  (TEST-TestLazyCores.testNoCommit-seed#[63DC1D1015F35FC3]) [    x:collection3] o.a.s.s.IndexSchema [collection6] Schema name=tiny
   [junit4]   2> 1426871 INFO  (TEST-TestLazyCores.testNoCommit-seed#[63DC1D1015F35FC3]) [    x:collection3] o.a.s.s.IndexSchema Loaded schema tiny/1.1 with uniqueid field id
   [junit4]   2> 1426871 INFO  (TEST-TestLazyCores.testNoCommit-seed#[63DC1D1015F35FC3]) [    x:collection3] o.a.s.c.CoreContainer Creating SolrCore 'collection6' using configuration from instancedir /home/jenkins/workspace/Lucene-Solr-7.2-Linux/solr/build/solr-core/test/J1/temp/solr.core.TestLazyCores_63DC1D1015F35FC3-001/tempDir-001/./collection6, trusted=true
   [junit4]   2> 1426871 INFO  (TEST-TestLazyCores.testNoCommit-seed#[63DC1D1015F35FC3]) [    x:collection3] o.a.s.m.r.SolrJmxReporter JMX monitoring for 'solr.core.collection6' (registry 'solr.core.collection6') enabled at server: com.sun.jmx.mbeanserver.JmxMBeanServer@95a3404
   [junit4]   2> 1426871 INFO  (TEST-TestLazyCores.testNoCommit-seed#[63DC1D1015F35FC3]) [    x:collection3] o.a.s.c.SolrCore solr.RecoveryStrategy.Builder
   [junit4]   2> 1426871 INFO  (TEST-TestLazyCores.testNoCommit-seed#[63DC1D1015F35FC3]) [    x:collection3] o.a.s.c.SolrCore [[collection6] ] Opening new SolrCore at [/home/jenkins/workspace/Lucene-Solr-7.2-Linux/solr/build/solr-core/test/J1/temp/solr.core.TestLazyCores_63DC1D1015F35FC3-001/tempDir-001/collection6], dataDir=[/home/jenkins/workspace/Lucene-Solr-7.2-Linux/solr/build/solr-core/test/J1/temp/solr.core.TestLazyCores_63DC1D1015F35FC3-001/tempDir-001/./collection6/data/]
   [junit4]   2> 1426874 INFO  (TEST-TestLazyCores.testNoCommit-seed#[63DC1D1015F35FC3]) [    x:collection3] o.a.s.u.RandomMergePolicy RandomMergePolicy wrapping class org.apache.lucene.index.TieredMergePolicy: [TieredMergePolicy: maxMergeAtOnce=30, maxMergeAtOnceExplicit=10, maxMergedSegmentMB=56.0615234375, floorSegmentMB=0.470703125, forceMergeDeletesPctAllowed=21.181046950782694, segmentsPerTier=34.0, maxCFSSegmentSizeMB=8.796093022207999E12, noCFSRatio=0.40923832397973026
   [junit4]   2> 1426920 INFO  (TEST-TestLazyCores.testNoCommit-seed#[63DC1D1015F35FC3]) [    x:collection3] o.a.s.u.CommitTracker Hard AutoCommit: disabled
   [junit4]   2> 1426920 INFO  (TEST-TestLazyCores.testNoCommit-seed#[63DC1D1015F35FC3]) [    x:collection3] o.a.s.u.CommitTracker Soft AutoCommit: disabled
   [junit4]   2> 1426921 INFO  (TEST-TestLazyCores.testNoCommit-seed#[63DC1D1015F35FC3]) [    x:collection3] o.a.s.u.RandomMergePolicy RandomMergePolicy wrapping class org.apache.lucene.index.LogDocMergePolicy: [LogDocMergePolicy: minMergeSize=1000, mergeFactor=31, maxMergeSize=9223372036854775807, maxMergeSizeForForcedMerge=9223372036854775807, calibrateSizeByDeletes=false, maxMergeDocs=2147483647, maxCFSSegmentSizeMB=8.796093022207999E12, noCFSRatio=1.0]
   [junit4]   2> 1426922 INFO  (TEST-TestLazyCores.testNoCommit-seed#[63DC1D1015F35FC3]) [    x:collection3] o.a.s.s.SolrIndexSearcher Opening [Searcher@33d224c2[collection6] main]
   [junit4]   2> 1426922 INFO  (TEST-TestLazyCores.testNoCommit-seed#[63DC1D1015F35FC3]) [    x:collection3] o.a.s.r.ManagedResourceStorage File-based storage initialized to use dir: /home/jenkins/workspace/Lucene-Solr-7.2-Linux/solr/build/solr-core/test/J1/temp/solr.core.TestLazyCores_63DC1D1015F35FC3-001/tempDir-001/collection6/conf
   [junit4]   2> 1426923 INFO  (TEST-TestLazyCores.testNoCommit-seed#[63DC1D1015F35FC3]) [    x:collection3] o.a.s.h.ReplicationHandler Commits will be reserved for 10000ms.
   [junit4]   2> 1426923 INFO  (searcherExecutor-3859-thread-1-processing-x:collection3) [    x:collection3] o.a.s.c.SolrCore [collection6] Registered new searcher Searcher@33d224c2[collection6] main{ExitableDirectoryReader(UninvertingDirectoryReader())}
   [junit4]   2> 1426927 INFO  (TEST-TestLazyCores.testNoCommit-seed#[63DC1D1015F35FC3]) [    x:collection3] o.a.s.c.SolrConfig Using Lucene MatchVersion: 7.2.0
   [junit4]   2> 1426931 INFO  (TEST-TestLazyCores.testNoCommit-seed#[63DC1D1015F35FC3]) [    x:collection3] o.a.s.s.IndexSchema [collection7] Schema name=tiny
   [junit4]   2> 1426932 INFO  (TEST-TestLazyCores.testNoCommit-seed#[63DC1D1015F35FC3]) [    x:collection3] o.a.s.s.IndexSchema Loaded schema tiny/1.1 with uniqueid field id
   [junit4]   2> 1426932 INFO  (TEST-TestLazyCores.testNoCommit-seed#[63DC1D1015F35FC3]) [    x:collection3] o.a.s.c.CoreContainer Creating SolrCore 'collection7' using configuration from instancedir /home/jenkins/workspace/Lucene-Solr-7.2-Linux/solr/build/solr-core/test/J1/temp/solr.core.TestLazyCores_63DC1D1015F35FC3-001/tempDir-001/./collection7, trusted=true
   [junit4]   2> 1426933 INFO  (TEST-TestLazyCores.testNoCommit-seed#[63DC1D1015F35FC3]) [    x:collection3] o.a.s.m.r.SolrJmxReporter JMX monitoring for 'solr.core.collection7' (registry 'solr.core.collection7') enabled at server: com.sun.jmx.mbeanserver.JmxMBeanServer@95a3404
   [junit4]   2> 1426933 INFO  (TEST-TestLazyCores.testNoCommit-seed#[63DC1D1015F35FC3]) [    x:collection3] o.a.s.c.SolrCore solr.RecoveryStrategy.Builder
   [junit4]   2> 1426933 INFO  (TEST-TestLazyCores.testNoCommit-seed#[63DC1D1015F35FC3]) [    x:collection3] o.a.s.c.SolrCore [[collection7] ] Opening new SolrCore at [/home/jenkins/workspace/Lucene-Solr-7.2-Linux/solr/build/solr-core/test/J1/temp/solr.core.TestLazyCores_63DC1D1015F35FC3-001/tempDir-001/collection7], dataDir=[/home/jenkins/workspace/Lucene-Solr-7.2-Linux/solr/build/solr-core/test/J1/temp/solr.core.TestLazyCores_63DC1D1015F35FC3-001/tempDir-001/./collection7/data/]
   [junit4]   2> 1426935 INFO  (TEST-TestLazyCores.testNoCommit-seed#[63DC1D1015F35FC3]) [    x:collection3] o.a.s.u.RandomMergePolicy RandomMergePolicy wrapping class org.apache.lucene.index.LogByteSizeMergePolicy: [LogByteSizeMergePolicy: minMergeSize=1677721, mergeFactor=36, maxMergeSize=2147483648, maxMergeSizeForForcedMerge=9223372036854775807, calibrateSizeByDeletes=false, maxMergeDocs=2147483647, maxCFSSegmentSizeMB=8.796093022207999E12, noCFSRatio=0.7333738465621006]
   [junit4]   2> 1426972 INFO  (TEST-TestLazyCores.testNoCommit-seed#[63DC1D1015F35FC3]) [    x:collection3] o.a.s.u.CommitTracker Hard AutoCommit: disabled
   [junit4]   2> 1426972 INFO  (TEST-TestLazyCores.testNoCommit-seed#[63DC1D1015F35FC3]) [    x:collection3] o.a.s.u.CommitTracker Soft AutoCommit: disabled
   [junit4]   2> 1426973 INFO  (TEST-TestLazyCores.testNoCommit-seed#[63DC1D1015F35FC3]) [    x:collection3] o.a.s.u.RandomMergePolicy RandomMergePolicy wrapping class org.apache.lucene.index.TieredMergePolicy: [TieredMergePolicy: maxMergeAtOnce=27, maxMergeAtOnceExplicit=31, maxMergedSegmentMB=24.2265625, floorSegmentMB=0.810546875, forceMergeDeletesPctAllowed=16.81123725778779, segmentsPerTier=50.0, maxCFSSegmentSizeMB=8.796093022207999E12, noCFSRatio=1.0
   [junit4]   2> 1426973 INFO  (TEST-TestLazyCores.testNoCommit-seed#[63DC1D1015F35FC3]) [    x:collection3] o.a.s.s.SolrIndexSearcher Opening [Searcher@349b85f0[collection7] main]
   [junit4]   2> 1426973 INFO  (TEST-TestLazyCores.testNoCommit-seed#[63DC1D1015F35FC3]) [    x:collection3] o.a.s.r.ManagedResourceStorage File-based storage initialized to use dir: /home/jenkins/workspace/Lucene-Solr-7.2-Linux/solr/build/solr-core/test/J1/temp/solr.core.TestLazyCores_63DC1D1015F35FC3-001/tempDir-001/collection7/conf
   [junit4]   2> 1426974 INFO  (TEST-TestLazyCores.testNoCommit-seed#[63DC1D1015F35FC3]) [    x:collection3] o.a.s.h.ReplicationHandler Commits will be reserved for 10000ms.
   [junit4]   2> 1426975 INFO  (searcherExecutor-3863-thread-1-processing-x:collection3) [    x:collection3] o.a.s.c.SolrCore [collection7] Registered new searcher Searcher@349b85f0[collection7] main{ExitableDirectoryReader(UninvertingDirectoryReader())}
   [junit4]   2> 1426978 INFO  (TEST-TestLazyCores.testNoCommit-seed#[63DC1D1015F35FC3]) [    x:collection3] o.a.s.c.SolrConfig Using Lucene MatchVersion: 7.2.0
   [junit4]   2> 1426981 INFO  (TEST-TestLazyCores.testNoCommit-seed#[63DC1D1015F35FC3]) [    x:collection3] o.a.s.s.IndexSchema [collection8] Schema name=tiny
   [junit4]   2> 1426982 INFO  (TEST-TestLazyCores.testNoCommit-seed#[63DC1D1015F35FC3]) [    x:collection3] o.a.s.s.IndexSchema Loaded schema tiny/1.1 with uniqueid field id
   [junit4]   2> 1426982 INFO  (TEST-TestLazyCores.testNoCommit-seed#[63DC1D1015F35FC3]) [    x:collection3] o.a.s.c.CoreContainer Creating SolrCore 'collection8' using configuration from instancedir /home/jenkins/workspace/Lucene-Solr-7.2-Linux/solr/build/solr-core/test/J1/temp/solr.core.TestLazyCores_63DC1D1015F35FC3-001/tempDir-001/./collection8, trusted=true
   [junit4]   2> 1426983 INFO  (TEST-TestLazyCores.testNoCommit-seed#[63DC1D1015F35FC3]) [    x:collection3] o.a.s.m.r.SolrJmxReporter JMX monitoring for 'solr.core.collection8' (registry 'solr.core.collection8') enabled at server: com.sun.jmx.mbeanserver.JmxMBeanServer@95a3404
   [junit4]   2> 1426983 INFO  (TEST-TestLazyCores.testNoCommit-seed#[63DC1D1015F35FC3]) [    x:collection3] o.a.s.c.SolrCore solr.RecoveryStrategy.Builder
   [junit4]   2> 1426983 INFO  (TEST-TestLazyCores.testNoCommit-seed#[63DC1D1015F35FC3]) [    x:collection3] o.a.s.c.SolrCore [[collection8] ] Opening new SolrCore at [/home/jenkins/workspace/Lucene-Solr-7.2-Linux/solr/build/solr-core/test/J1/temp/solr.core.TestLazyCores_63DC1D1015F35FC3-001/tempDir-001/collection8], dataDir=[/home/jenkins/workspace/Lucene-Solr-7.2-Linux/solr/build/solr-core/test/J1/temp/solr.core.TestLazyCores_63DC1D1015F35FC3-001/tempDir-001/./collection8/data/]
   [junit4]   2> 1426985 INFO  (TEST-TestLazyCores.testNoCommit-seed#[63DC1D1015F35FC3]) [    x:collection3] o.a.s.u.RandomMergePolicy RandomMergePolicy wrapping class org.apache.lucene.index.TieredMergePolicy: [TieredMergePolicy: maxMergeAtOnce=22, maxMergeAtOnceExplicit=33, maxMergedSegmentMB=24.6171875, floorSegmentMB=2.041015625, forceMergeDeletesPctAllowed=1.3191975887880658, segmentsPerTier=37.0, maxCFSSegmentSizeMB=8.796093022207999E12, noCFSRatio=0.20725080816993807
   [junit4]   2> 1427042 INFO  (TEST-TestLazyCores.testNoCommit-seed#[63DC1D1015F35FC3]) [    x:collection3] o.a.s.u.CommitTracker Hard AutoCommit: disabled
   [junit4]   2> 1427042 INFO  (TEST-TestLazyCores.testNoCommit-seed#[63DC1D1015F35FC3]) [    x:collection3] o.a.s.u.CommitTracker Soft AutoCommit: disabled
   [junit4]   2> 1427043 INFO  (TEST-TestLazyCores.testNoCommit-seed#[63DC1D1015F35FC3]) [    x:collection3] o.a.s.u.RandomMergePolicy RandomMergePolicy wrapping class org.apache.lucene.index.TieredMergePolicy: [TieredMergePolicy: maxMergeAtOnce=19, maxMergeAtOnceExplicit=44, maxMergedSegmentMB=72.1328125, floorSegmentMB=0.5, forceMergeDeletesPctAllowed=9.050904470359871, segmentsPerTier=36.0, maxCFSSegmentSizeMB=8.796093022207999E12, noCFSRatio=0.1087175735435225
   [junit4]   2> 1427043 INFO  (TEST-TestLazyCores.testNoCommit-seed#[63DC1D1015F35FC3]) [    x:collection3] o.a.s.s.SolrIndexSearcher Opening [Searcher@654b48c[collection8] main]
   [junit4]   2> 1427044 INFO  (TEST-TestLazyCores.testNoCommit-seed#[63DC1D1015F35FC3]) [    x:collection3] o.a.s.r.ManagedResourceStorage File-based storage initialized to use dir: /home/jenkins/workspace/Lucene-Solr-7.2-Linux/solr/build/solr-core/test/J1/temp/solr.core.TestLazyCores_63DC1D1015F35FC3-001/tempDir-001/collection8/conf
   [junit4]   2> 1427044 INFO  (TEST-TestLazyCores.testNoCommit-seed#[63DC1D1015F35FC3]) [    x:collection3] o.a.s.h.ReplicationHandler Commits will be reserved for 10000ms.
   [junit4]   2> 1427044 INFO  (TEST-TestLazyCores.testNoCommit-seed#[63DC1D1015F35FC3]) [    x:collection3] o.a.s.c.TransientSolrCoreCacheDefault Closing transient core [collection2]
   [junit4]   2> 1427045 INFO  (searcherExecutor-3867-thread-1-processing-x:collection3) [    x:collection3] o.a.s.c.SolrCore [collection8] Registered new searcher Searcher@654b48c[collection8] main{ExitableDirectoryReader(UninvertingDirectoryReader())}
   [junit4]   2> 1427049 INFO  (TEST-TestLazyCores.testNoCommit-seed#[63DC1D1015F35FC3]) [    x:collection3] o.a.s.c.SolrConfig Using Lucene MatchVersion: 7.2.0
   [junit4]   2> 1427053 INFO  (TEST-TestLazyCores.testNoCommit-seed#[63DC1D1015F35FC3]) [    x:collection3] o.a.s.s.IndexSchema [collection9] Schema name=tiny
   [junit4]   2> 1427054 INFO  (TEST-TestLazyCores.testNoCommit-seed#[63DC1D1015F35FC3]) [    x:collection3] o.a.s.s.IndexSchema Loaded schema tiny/1.1 with uniqueid field id
   [junit4]   2> 1427054 INFO  (TEST-TestLazyCores.testNoCommit-seed#[63DC1D1015F35FC3]) [    x:collection3] o.a.s.c.CoreContainer Creating SolrCore 'collection9' using configuration from instancedir /home/jenkins/workspace/Lucene-Solr-7.2-Linux/solr/build/solr-core/test/J1/temp/solr.core.TestLazyCores_63DC1D1015F35FC3-001/tempDir-001/./collection9, trusted=true
   [junit4]   2> 1427054 INFO  (TEST-TestLazyCores.testNoCommit-seed#[63DC1D1015F35FC3]) [    x:collection3] o.a.s.m.r.SolrJmxReporter JMX monitoring for 'solr.core.collection9' (registry 'solr.core.collection9') enabled at server: com.sun.jmx.mbeanserver.JmxMBeanServer@95a3404
   [junit4]   2> 1427054 INFO  (TEST-TestLazyCores.testNoCommit-seed#[63DC1D1015F35FC3]) [    x:collection3] o.a.s.c.SolrCore solr.RecoveryStrategy.Builder
   [junit4]   2> 1427054 INFO  (TEST-TestLazyCores.testNoCommit-seed#[63DC1D1015F35FC3]) [    x:collection3] o.a.s.c.SolrCore [[collection9] ] Opening new SolrCore at [/home/jenkins/workspace/Lucene-Solr-7.2-Linux/solr/build/solr-core/test/J1/temp/solr.core.TestLazyCores_63DC1D1015F35FC3-001/tempDir-001/collection9], dataDir=[/home/jenkins/workspace/Lucene-Solr-7.2-Linux/solr/build/solr-core/test/J1/temp/solr.core.TestLazyCores_63DC1D1015F35FC3-001/tempDir-001/./collection9/data/]
   [junit4]   2> 1427056 INFO  (TEST-TestLazyCores.testNoCommit-seed#[63DC1D1015F35FC3]) [    x:collection3] o.a.s.u.RandomMergePolicy RandomMergePolicy wrapping class org.apache.lucene.index.LogDocMergePolicy: [LogDocMergePolicy: minMergeSize=1000, mergeFactor=19, maxMergeSize=9223372036854775807, maxMergeSizeForForcedMerge=9223372036854775807, calibrateSizeByDeletes=false, maxMergeDocs=2147483647, maxCFSSegmentSizeMB=8.796093022207999E12, noCFSRatio=0.59447682387638]
   [junit4]   2> 1427111 INFO  (TEST-TestLazyCores.testNoCommit-seed#[63DC1D1015F35FC3]) [    x:collection3] o.a.s.u.CommitTracker Hard AutoCommit: disabled
   [junit4]   2> 1427111 INFO  (TEST-TestLazyCores.testNoCommit-seed#[63DC1D1015F35FC3]) [    x:collection3] o.a.s.u.CommitTracker Soft AutoCommit: disabled
   [junit4]   2> 1427112 INFO  (TEST-TestLazyCores.testNoCommit-seed#[63DC1D1015F35FC3]) [    x:collection3] o.a.s.u.RandomMergePolicy RandomMergePolicy wrapping class org.apache.lucene.index.TieredMergePolicy: [TieredMergePolicy: maxMergeAtOnce=13, maxMergeAtOnceExplicit=30, maxMergedSegmentMB=41.5390625, floorSegmentMB=1.7685546875, forceMergeDeletesPctAllowed=25.200460026655698, segmentsPerTier=33.0, maxCFSSegmentSizeMB=8.796093022207999E12, noCFSRatio=1.0
   [junit4]   2> 1427112 INFO  (TEST-TestLazyCores.testNoCommit-seed#[63DC1D1015F35FC3]) [    x:collection3] o.a.s.s.SolrIndexSearcher Opening [Searcher@292c7c01[collection9] main]
   [junit4]   2> 1427113 INFO  (TEST-TestLazyCores.testNoCommit-seed#[63DC1D1015F35FC3]) [    x:collection3] o.a.s.r.ManagedResourceStorage File-based storage initialized to use dir: /home/jenkins/workspace/Lucene-Solr-7.2-Linux/solr/build/solr-core/test/J1/temp/solr.core.TestLazyCores_63DC1D1015F35FC3-001/tempDir-001/collection9/conf
   [junit4]   2> 1427114 INFO  (TEST-TestLazyCores.testNoCommit-seed#[63DC1D1015F35FC3]) [    x:collection3] o.a.s.h.ReplicationHandler Commits will be reserved for 10000ms.
   [junit4]   2> 1427114 INFO  (TEST-TestLazyCores.testNoCommit-seed#[63DC1D1015F35FC3]) [    x:collection3] o.a.s.c.TransientSolrCoreCacheDefault Closing transient core [collection3]
   [junit4]   2> 1427114 INFO  (TEST-TestLazyCores.testNoCommit-seed#[63DC1D1015F35FC3]) [    x:collection3] o.a.s.c.SolrCore [collection2]  CLOSING SolrCore org.apache.solr.core.SolrCore@376b6832
   [junit4]   2> 1427115 INFO  (TEST-TestLazyCores.testNoCommit-seed#[63DC1D1015F35FC3]) [    x:collection3] o.a.s.m.SolrMetricManager Closing metric reporters for registry=solr.core.collection2, tag=929785906
   [junit4]   2> 1427115 INFO  (TEST-TestLazyCores.testNoCommit-seed#[63DC1D1015F35FC3]) [    x:collection3] o.a.s.m.r.SolrJmxReporter Closing reporter [org.apache.solr.metrics.reporters.SolrJmxReporter@651bcf12: rootName = null, domain = solr.core.collection2, service url = null, agent id = null] for registry solr.core.collection2 / com.codahale.metrics.MetricRegistry@4c80f661
   [junit4]   2> 1427126 INFO  (searcherExecutor-3871-thread-1-processing-x:collection3) [    x:collection3] o.a.s.c.SolrCore [collection9] Registered new searcher Searcher@292c7c01[collection9] main{ExitableDirectoryReader(UninvertingDirectoryReader())}
   [junit4]   2> 1427127 INFO  (TEST-TestLazyCores.testNoCommit-seed#[63DC1D1015F35FC3]) [    x:collection3] o.a.s.c.SolrCore [collection3]  CLOSING SolrCore org.apache.solr.core.SolrCore@1c883f2f
   [junit4]   2> 1427127 INFO  (TEST-TestLazyCores.testNoCommit-seed#[63DC1D1015F35FC3]) [    x:collection3] o.a.s.m.SolrMetricManager Closing metric reporters for registry=solr.core.collection3, tag=478691119
   [junit4]   2> 1427127 INFO  (TEST-TestLazyCores.testNoCommit-seed#[63DC1D1015F35FC3]) [    x:collection3] o.a.s.m.r.SolrJmxReporter Closing reporter [org.apache.solr.metrics.reporters.SolrJmxReporter@5296785d: rootName = null, domain = solr.core.collection3, service url = null, agent id = null] for registry solr.core.collection3 / com.codahale.metrics.MetricRegistry@6f3f8a2b
   [junit4]   2> 1427148 INFO  (TEST-TestLazyCores.testNoCommit-seed#[63DC1D1015F35FC3]) [    x:collection3] o.a.s.c.SolrConfig Using Lucene MatchVersion: 7.2.0
   [junit4]   2> 1427154 INFO  (TEST-TestLazyCores.testNoCommit-seed#[63DC1D1015F35FC3]) [    x:collection3] o.a.s.s.IndexSchema [collection2] Schema name=tiny
   [junit4]   2> 1427159 INFO  (TEST-TestLazyCores.testNoCommit-seed#[63DC1D1015F35FC3]) [    x:collection3] o.a.s.s.IndexSchema Loaded schema tiny/1.1 with uniqueid field id
   [junit4]   2> 1427159 INFO  (TEST-TestLazyCores.testNoCommit-seed#[63DC1D1015F35FC3]) [    x:collection3] o.a.s.c.CoreContainer Creating SolrCore 'collection2' using configuration from instancedir /home/jenkins/workspace/Lucene-Solr-7.2-Linux/solr/build/solr-core/test/J1/temp/solr.core.TestLazyCores_63DC1D1015F35FC3-001/tempDir-001/./collection2, trusted=true
   [junit4]   2> 1427180 INFO  (TEST-TestLazyCores.testNoCommit-seed#[63DC1D1015F35FC3]) [    x:collection3] o.a.s.m.r.SolrJmxReporter JMX monitoring for 'solr.core.collection2' (registry 'solr.core.collection2') enabled at server: com.sun.jmx.mbeanserver.JmxMBeanServer@95a3404
   [junit4]   2> 1427180 INFO  (TEST-TestLazyCores.testNoCommit-seed#[63DC1D1015F35FC3]) [    x:collection3] o.a.s.c.SolrCore solr.RecoveryStrategy.Builder
   [junit4]   2> 1427180 INFO  (TEST-TestLazyCores.testNoCommit-seed#[63DC1D1015F35FC3]) [    x:collection3] o.a.s.c.SolrCore [[collection2] ] Opening new SolrCore at [/home/jenkins/workspace/Lucene-Solr-7.2-Linux/solr/build/solr-core/test/J1/temp/solr.core.TestLazyCores_63DC1D1015F35FC3-001/tempDir-001/collection2], dataDir=[/home/jenkins/workspace/Lucene-Solr-7.2-Linux/solr/build/solr-core/test/J1/temp/solr.core.TestLazyCores_63DC1D1015F35FC3-001/tempDir-001/./collection2/data/]
   [junit4]   2> 1427225 INFO  (TEST-TestLazyCores.testNoCommit-seed#[63DC1D1015F35FC3]) [    x:collection3] o.a.s.u.CommitTracker Hard AutoCommit: disabled
   [junit4]   2> 1427225 INFO  (TEST-TestLazyCores.testNoCommit-seed#[63DC1D1015F35FC3]) [    x:collection3] o.a.s.u.CommitTracker Soft AutoCommit: disabled
   [junit4]   2> 1427227 INFO  (TEST-TestLazyCores.testNoCommit-seed#[63DC1D1015F35FC3]) [    x:collection3] o.a.s.u.RandomMergePolicy RandomMergePolicy wrapping class org.apache.lucene.index.TieredMergePolicy: [TieredMergePolicy: maxMergeAtOnce=47, maxMergeAtOnceExplicit=16, maxMergedSegmentMB=44.314453125, floorSegmentMB=1.1630859375, forceMergeDeletesPctAllowed=4.142823623813534, segmentsPerTier=33.0, maxCFSSegmentSizeMB=8.796093022207999E12, noCFSRatio=1.0
   [junit4]   2> 1427228 INFO  (TEST-TestLazyCores.testNoCommit-seed#[63DC1D1015F35FC3]) [    x:collection3] o.a.s.s.SolrIndexSearcher Opening [Searcher@6fb9b1c3[collection2] main]
   [junit4]   2> 1427228 INFO  (TEST-TestLazyCores.testNoCommit-seed#[63DC1D1015F35FC3]) [    x:collection3] o.a.s.r.ManagedResourceStorage File-based storage initialized to use dir: /home/jenkins/workspace/Lucene-Solr-7.2-Linux/solr/build/solr-core/test/J1/temp/solr.core.TestLazyCores_63DC1D1015F35FC3-001/tempDir-001/collection2/conf
   [junit4]   2> 1427229 INFO  (TEST-TestLazyCores.testNoCommit-seed#[63DC1D1015F35FC3]) [    x:collection3] o.a.s.h.ReplicationHandler Commits will be reserved for 10000ms.
   [junit4]   2> 1427229 INFO  (TEST-TestLazyCores.testNoCommit-seed#[63DC1D1015F35FC3]) [    x:collection3] o.a.s.c.TransientSolrCoreCacheDefault Closing transient core [collection6]
   [junit4]   2> 1427229 INFO  (Thread-3438) [    ] o.a.s.c.SolrCore [collection6]  CLOSING SolrCore org.apache.solr.core.SolrCore@3d4b53c4
   [junit4]   2> 1427229 INFO  (Thread-3438) [    ] o.a.s.m.SolrMetricManager Closing metric reporters for registry=solr.core.collection6, tag=1028346820
   [junit4]   2> 1427229 INFO  (Thread-3438) [    ] o.a.s.m.r.SolrJmxReporter Closing reporter [org.apache.solr.metrics.reporters.SolrJmxReporter@7d0c1a6f: rootName = null, domain = solr.core.collection6, service url = null, agent id = null] for registry solr.core.collection6 / com.codahale.metrics.MetricRegistry@320f6d58
   [junit4]   2> 1427233 INFO  (searcherExecutor-3875-thread-1-processing-x:collection3) [    x:collection3] o.a.s.c.SolrCore [collection2] Registered new searcher Searcher@6fb9b1c3[collection2] main{ExitableDirectoryReader(UninvertingDirectoryReader())}
   [junit4]   2> 1427243 INFO  (TEST-TestLazyCores.testNoCommit-seed#[63DC1D1015F35FC3]) [    x:collection3] o.a.s.c.S.Request [collection2]  webapp=null path=null params={q=*:*} hits=0 status=0 QTime=0
   [junit4]   2> 1427244 ERROR (TEST-TestLazyCores.testNoCommit-seed#[63DC1D1015F35FC3]) [    x:collection3] o.a.s.SolrTestCaseJ4 REQUEST FAILED: xpath=//result[@numFound='10']
   [junit4]   2> 	xml response was: <?xml version="1.0" encoding="UTF-8"?>
   [junit4]   2> <response>
   [junit4]   2> <lst name="responseHeader"><int name="status">0</int><int name="QTime">0</int><lst name="params"><str name="q">*:*</str></lst></lst><result name="response" numFound="0" start="0"></result>
   [junit4]   2> </response>
   [junit4]   2> 
   [junit4]   2> 	request was:q=*:*
   [junit4]   2> 1427244 ERROR (TEST-TestLazyCores.testNoCommit-seed#[63DC1D1015F35FC3]) [    x:collection3] o.a.s.SolrTestCaseJ4 REQUEST FAILED: q=*:*:java.lang.RuntimeException: REQUEST FAILED: xpath=//result[@numFound='10']
   [junit4]   2> 	xml response was: <?xml version="1.0" encoding="UTF-8"?>
   [junit4]   2> <response>
   [junit4]   2> <lst name="responseHeader"><int name="status">0</int><int name="QTime">0</int><lst name="params"><str name="q">*:*</str></lst></lst><result name="response" numFound="0" start="0"></result>
   [junit4]   2> </response>
   [junit4]   2> 
   [junit4]   2> 	request was:q=*:*
   [junit4]   2> 	at org.apache.solr.SolrTestCaseJ4.assertQ(SolrTestCaseJ4.java:894)
   [junit4]   2> 	at org.apache.solr.core.TestLazyCores.check10(TestLazyCores.java:847)
   [junit4]   2> 	at org.apache.solr.core.TestLazyCores.testNoCommit(TestLazyCores.java:829)
   [junit4]   2> 	at java.base/jdk.internal.reflect.NativeMethodAccessorImpl.invoke0(Native Method)
   [junit4]   2> 	at java.base/jdk.internal.reflect.NativeMethodAccessorImpl.invoke(NativeMethodAccessorImpl.java:62)
   [junit4]   2> 	at java.base/jdk.internal.reflect.DelegatingMethodAccessorImpl.invoke(DelegatingMethodAccessorImpl.java:43)
   [junit4]   2> 	at java.base/java.lang.reflect.Method.invoke(Method.java:564)
   [junit4]   2> 	at com.carrotsearch.randomizedtesting.RandomizedRunner.invoke(RandomizedRunner.java:1737)
   [junit4]   2> 	at com.carrotsearch.randomizedtesting.RandomizedRunner$8.evaluate(RandomizedRunner.java:934)
   [junit4]   2> 	at com.carrotsearch.randomizedtesting.RandomizedRunner$9.evaluate(RandomizedRunner.java:970)
   [junit4]   2> 	at com.carrotsearch.randomizedtesting.RandomizedRunner$10.evaluate(RandomizedRunner.java:984)
   [junit4]   2> 	at com.carrotsearch.randomizedtesting.rules.SystemPropertiesRestoreRule$1.evaluate(SystemPropertiesRestoreRule.java:57)
   [junit4]   2> 	at org.apache.lucene.util.TestRuleSetupTeardownChained$1.evaluate(TestRuleSetupTeardownChained.java:49)
   [junit4]   2> 	at org.apache.lucene.util.AbstractBeforeAfterRule$1.evaluate(AbstractBeforeAfterRule.java:45)
   [junit4]   2> 	at org.apache.lucene.util.TestRuleThreadAndTestName$1.evaluate(TestRuleThreadAndTestName.java:48)
   [junit4]   2> 	at org.apache.lucene.util.TestRuleIgnoreAfterMaxFailures$1.evaluate(TestRuleIgnoreAfterMaxFailures.java:64)
   [junit4]   2> 	at org.apache.lucene.util.TestRuleMarkFailure$1.evaluate(TestRuleMarkFailure.java:47)
   [junit4]   2> 	at com.carrotsearch.randomizedtesting.rules.StatementAdapter.evaluate(StatementAdapter.java:36)
   [junit4]   2> 	at com.carrotsearch.randomizedtesting.ThreadLeakControl$StatementRunner.run(ThreadLeakControl.java:368)
   [junit4]   2> 	at com.carrotsearch.randomizedtesting.ThreadLeakControl.forkTimeoutingTask(ThreadLeakControl.java:817)
   [junit4]   2> 	at com.carrotsearch.randomizedtesting.ThreadLeakControl$3.evaluate(ThreadLeakControl.java:468)
   [junit4]   2> 	at com.carrotsearch.randomizedtesting.RandomizedRunner.runSingleTest(RandomizedRunner.java:943)
   [junit4]   2> 	at com.carrotsearch.randomizedtesting.RandomizedRunner$5.evaluate(RandomizedRunner.java:829)
   [junit4]   2> 	at com.carrotsearch.randomizedtesting.RandomizedRunner$6.evaluate(RandomizedRunner.java:879)
   [junit4]   2> 	at com.carrotsearch.randomizedtesting.RandomizedRunner$7.evaluate(RandomizedRunner.java:890)
   [junit4]   2> 	at com.carrotsearch.randomizedtesting.rules.StatementAdapter.evaluate(StatementAdapter.java:36)
   [junit4]   2> 	at com.carrotsearch.randomizedtesting.rules.SystemPropertiesRestoreRule$1.evaluate(SystemPropertiesRestoreRule.java:57)
   [junit4]   2> 	at org.apache.lucene.util.AbstractBeforeAfterRule$1.evaluate(AbstractBeforeAfterRule.java:45)
   [junit4]   2> 	at com.carrotsearch.randomizedtesting.rules.StatementAdapter.evaluate(StatementAdapter.java:36)
   [junit4]   2> 	at org.apache.lucene.util.TestRuleStoreClassName$1.evaluate(TestRuleStoreClassName.java:41)
   [junit4]   2> 	at com.carrotsearch.randomizedtesting.rules.NoShadowingOrOverridesOnMethodsRule$1.evaluate(NoShadowingOrOverridesOnMethodsRule.java:40)
   [junit4]   2> 	at com.carrotsearch.randomizedtesting.rules.NoShadowingOrOverridesOnMethodsRule$1.evaluate(NoShadowingOrOverridesOnMethodsRule.java:40)
   [junit4]   2> 	at com.carrotsearch.randomizedtesting.rules.StatementAdapter.evaluate(StatementAdapter.java:36)
   [junit4]   2> 	at com.carrotsearch.randomizedtesting.rules.StatementAdapter.evaluate(StatementAdapter.java:36)
   [junit4]   2> 	at org.apache.lucene.util.TestRuleAssertionsRequired$1.evaluate(TestRuleAssertionsRequired.java:53)
   [junit4]   2> 	at org.apache.lucene.util.TestRuleMarkFailure$1.evaluate(TestRuleMarkFailure.java:47)
   [junit4]   2> 	at org.apache.lucene.util.TestRuleIgnoreAfterMaxFailures$1.evaluate(TestRuleIgnoreAfterMaxFailures.java:64)
   [junit4]   2> 	at org.apache.lucene.util.TestRuleIgnoreTestSuites$1.evaluate(TestRuleIgnoreTestSuites.java:54)
   [junit4]   2> 	at com.carrotsearch.randomizedtesting.rules.StatementAdapter.evaluate(StatementAdapter.java:36)
   [junit4]   2> 	at com.carrotsearch.randomizedtesting.ThreadLeakControl$StatementRunner.run(ThreadLeakControl.java:368)
   [junit4]   2> 	at java.base/java.lang.Thread.run(Thread.java:844)
   [junit4]   2> 
   [junit4]   2> 1427245 INFO  (TEST-TestLazyCores.testNoCommit-seed#[63DC1D1015F35FC3]) [    x:collection3] o.a.s.c.CoreContainer Shutting down CoreContainer instance=401692375
   [junit4]   2> 1427245 INFO  (TEST-TestLazyCores.testNoCommit-seed#[63DC1D1015F35FC3]) [    x:collection3] o.a.s.m.SolrMetricManager Closing metric reporters for registry=solr.node, tag=null
   [junit4]   2> 1427245 INFO  (TEST-TestLazyCores.testNoCommit-seed#[63DC1D1015F35FC3]) [    x:collection3] o.a.s.m.r.SolrJmxReporter Closing reporter [org.apache.solr.metrics.reporters.SolrJmxReporter@7f4cd68: rootName = null, domain = solr.node, service url = null, agent id = null] for registry solr.node / com.codahale.metrics.MetricRegistry@69dc27c2
   [junit4]   2> 1427250 INFO  (TEST-TestLazyCores.testNoCommit-seed#[63DC1D1015F35FC3]) [    x:collection3] o.a.s.m.SolrMetricManager Closing metric reporters for registry=solr.jvm, tag=null
   [junit4]   2> 1427250 INFO  (TEST-TestLazyCores.testNoCommit-seed#[63DC1D1015F35FC3]) [    x:collection3] o.a.s.m.r.SolrJmxReporter Closing reporter [org.apache.solr.metrics.reporters.SolrJmxReporter@11d88eb3: rootName = null, domain = solr.jvm, service url = null, agent id = null] for registry solr.jvm / com.codahale.metrics.MetricRegistry@16ff8b20
   [junit4]   2> 1427255 INFO  (TEST-TestLazyCores.testNoCommit-seed#[63DC1D1015F35FC3]) [    x:collection3] o.a.s.m.SolrMetricManager Closing metric reporters for registry=solr.jetty, tag=null
   [junit4]   2> 1427255 INFO  (TEST-TestLazyCores.testNoCommit-seed#[63DC1D1015F35FC3]) [    x:collection3] o.a.s.m.r.SolrJmxReporter Closing reporter [org.apache.solr.metrics.reporters.SolrJmxReporter@4feca3c0: rootName = null, domain = solr.jetty, service url = null, agent id = null] for registry solr.jetty / com.codahale.metrics.MetricRegistry@12c01d27
   [junit4]   2> 1427259 INFO  (coreCloseExecutor-3879-thread-1-processing-x:collection3) [    x:collection1] o.a.s.c.SolrCore [collection1]  CLOSING SolrCore org.apache.solr.core.SolrCore@6f735f94
   [junit4]   2> 1427259 INFO  (coreCloseExecutor-3879-thread-1-processing-x:collection3) [    x:collection1] o.a.s.m.SolrMetricManager Closing metric reporters for registry=solr.core.collection1, tag=1869832084
   [junit4]   2> 1427260 INFO  (coreCloseExecutor-3879-thread-1-processing-x:collection3) [    x:collection1] o.a.s.m.r.SolrJmxReporter Closing reporter [org.apache.solr.metrics.reporters.SolrJmxReporter@51548077: rootName = null, domain = solr.core.collection1, service url = null, agent id = null] for registry solr.core.collection1 / com.codahale.metrics.MetricRegistry@6cadccc0
   [junit4]   2> 1427262 INFO  (coreCloseExecutor-3879-thread-2-processing-x:collection3) [    x:collection5] o.a.s.c.SolrCore [collection5]  CLOSING SolrCore org.apache.solr.core.SolrCore@24a3ff2c
   [junit4]   2> 1427266 INFO  (coreCloseExecutor-3879-thread-2-processing-x:collection3) [    x:collection5] o.a.s.m.SolrMetricManager Closing metric reporters for registry=solr.core.collection5, tag=614727468
   [junit4]   2> 1427266 INFO  (coreCloseExecutor-3879-thread-2-processing-x:collection3) [    x:collection5] o.a.s.m.r.SolrJmxReporter Closing reporter [org.apache.solr.metrics.reporters.SolrJmxReporter@4ba70882: rootName = null, domain = solr.core.collection5, service url = null, agent id = null] for registry solr.core.collection5 / com.codahale.metrics.MetricRegistry@3ab28918
   [junit4]   2> 1427270 INFO  (coreCloseExecutor-3879-thread-4-processing-x:collection3) [    x:collection8] o.a.s.c.SolrCore [collection8]  CLOSING SolrCore org.apache.solr.core.SolrCore@455433e
   [junit4]   2> 1427272 INFO  (coreCloseExecutor-3879-thread-3-processing-x:collection3) [    x:collection7] o.a.s.c.SolrCore [collection7]  CLOSING SolrCore org.apache.solr.core.SolrCore@33c81432
   [junit4]   2> 1427275 INFO  (coreCloseExecutor-3879-thread-5-processing-x:collection3) [    x:collection9] o.a.s.c.SolrCore [collection9]  CLOSING SolrCore org.apache.solr.core.SolrCore@f411772
   [junit4]   2> 1427286 INFO  (coreCloseExecutor-3879-thread-4-processing-x:collection3) [    x:collection8] o.a.s.m.SolrMetricManager Closing metric reporters for registry=solr.core.collection8, tag=72696638
   [junit4]   2> 1427286 INFO  (coreCloseExecutor-3879-thread-4-processing-x:collection3) [    x:collection8] o.a.s.m.r.SolrJmxReporter Closing reporter [org.apache.solr.metrics.reporters.SolrJmxReporter@5179f009: rootName = null, domain = solr.core.collection8, service url = null, agent id = null] for registry solr.core.collection8 / com.codahale.metrics.MetricRegistry@52c89c4f
   [junit4]   2> 1427298 INFO  (coreCloseExecutor-3879-thread-3-processing-x:collection3) [    x:collection7] o.a.s.m.SolrMetricManager Closing metric reporters for registry=solr.core.collection7, tag=868750386
   [junit4]   2> 1427299 INFO  (coreCloseExecutor-3879-thread-3-processing-x:collection3) [    x:collection7] o.a.s.m.r.SolrJmxReporter Closing reporter [org.apache.solr.metrics.reporters.SolrJmxReporter@776eaa47: rootName = null, domain = solr.core.collection7, service url = null, agent id = null] for registry solr.core.collection7 / com.codahale.metrics.MetricRegistry@2eb9ce46
   [junit4]   2> 1427307 INFO  (coreCloseExecutor-3879-thread-5-processing-x:collection3) [    x:collection9] o.a.s.m.SolrMetricManager Closing metric reporters for registry=solr.core.collection9, tag=255924082
   [junit4]   2> 1427307 INFO  (coreCloseExecutor-3879-thread-5-processing-x:collection3) [    x:collection9] o.a.s.m.r.SolrJmxReporter Closing reporter [org.apache.solr.metrics.reporters.SolrJmxReporter@7e6b8c9c: rootName = null, domain = solr.core.collection9, service url = null, agent id = null] for registry solr.core.collection9 / com.codahale.metrics.MetricRegistry@2f0cc25f
   [junit4]   2> 1427322 INFO  (TEST-TestLazyCores.testNoCommit-seed#[63DC1D1015F35FC3]) [    x:collection3] o.a.s.SolrTestCaseJ4 ###Ending testNoCommit
   [junit4]   2> NOTE: reproduce with: ant test  -Dtestcase=TestLazyCores -Dtests.method=testNoCommit -Dtests.seed=63DC1D1015F35FC3 -Dtests.multiplier=3 -Dtests.slow=true -Dtests.locale=zh -Dtests.timezone=Antarctica/DumontDUrville -Dtests.asserts=true -Dtests.file.encoding=UTF-8
   [junit4] ERROR   0.68s J1 | TestLazyCores.testNoCommit <<<
   [junit4]    > Throwable #1: java.lang.RuntimeException: Exception during query
   [junit4]    > 	at __randomizedtesting.SeedInfo.seed([63DC1D1015F35FC3:BCBCBCC1DED43C66]:0)
   [junit4]    > 	at org.apache.solr.SolrTestCaseJ4.assertQ(SolrTestCaseJ4.java:901)
   [junit4]    > 	at org.apache.solr.core.TestLazyCores.check10(TestLazyCores.java:847)
   [junit4]    > 	at org.apache.solr.core.TestLazyCores.testNoCommit(TestLazyCores.java:829)
   [junit4]    > 	at java.base/jdk.internal.reflect.NativeMethodAccessorImpl.invoke0(Native Method)
   [junit4]    > 	at java.base/jdk.internal.reflect.NativeMethodAccessorImpl.invoke(NativeMethodAccessorImpl.java:62)
   [junit4]    > 	at java.base/jdk.internal.reflect.DelegatingMethodAccessorImpl.invoke(DelegatingMethodAccessorImpl.java:43)
   [junit4]    > 	at java.base/java.lang.reflect.Method.invoke(Method.java:564)
   [junit4]    > 	at java.base/java.lang.Thread.run(Thread.java:844)
   [junit4]    > Caused by: java.lang.RuntimeException: REQUEST FAILED: xpath=//result[@numFound='10']
   [junit4]    > 	xml response was: <?xml version="1.0" encoding="UTF-8"?>
   [junit4]    > <response>
   [junit4]    > <lst name="responseHeader"><int name="status">0</int><int name="QTime">0</int><lst name="params"><str name="q">*:*</str></lst></lst><result name="response" numFound="0" start="0"></result>
   [junit4]    > </response>
   [junit4]    > 	request was:q=*:*
   [junit4]    > 	at org.apache.solr.SolrTestCaseJ4.assertQ(SolrTestCaseJ4.java:894)
   [junit4]    > 	... 40 more
   [junit4]   2> 1427325 INFO  (TEST-TestLazyCores.testCreateSame-seed#[63DC1D1015F35FC3]) [    x:collection3] o.a.s.SolrTestCaseJ4 ###Starting testCreateSame
   [junit4]   2> 1427333 INFO  (TEST-TestLazyCores.testCreateSame-seed#[63DC1D1015F35FC3]) [    x:collection3] o.a.s.c.SolrXmlConfig Loading container configuration from /home/jenkins/workspace/Lucene-Solr-7.2-Linux/solr/build/solr-core/test/J1/temp/solr.core.TestLazyCores_63DC1D1015F35FC3-001/tempDir-002/solr.xml
   [junit4]   2> 1427334 INFO  (TEST-TestLazyCores.testCreateSame-seed#[63DC1D1015F35FC3]) [    x:collection3] o.a.s.c.SolrXmlConfig Configuration parameter autoReplicaFailoverWorkLoopDelay is ignored
   [junit4]   2> 1427334 INFO  (TEST-TestLazyCores.testCreateSame-seed#[63DC1D1015F35FC3]) [    x:collection3] o.a.s.c.SolrXmlConfig Configuration parameter autoReplicaFailoverBadNodeExpiration is ignored
   [junit4]   2> 1427335 INFO  (TEST-TestLazyCores.testCreateSame-seed#[63DC1D1015F35FC3]) [    x:collection3] o.a.s.c.SolrXmlConfig MBean server found: com.sun.jmx.mbeanserver.JmxMBeanServer@95a3404, but no JMX reporters were configured - adding default JMX reporter.
   [junit4]   2> 1427377 INFO  (TEST-TestLazyCores.testCreateSame-seed#[63DC1D1015F35FC3]) [    x:collection3] o.a.s.m.r.SolrJmxReporter JMX monitoring for 'solr.node' (registry 'solr.node') enabled at server: com.sun.jmx.mbeanserver.JmxMBeanServer@95a3404
   [junit4]   2> 1427387 INFO  (TEST-TestLazyCores.testCreateSame-seed#[63DC1D1015F35FC3]) [    x:collection3] o.a.s.m.r.SolrJmxReporter JMX monitoring for 'solr.jvm' (registry 'solr.jvm') enabled at server: com.sun.jmx.mbeanserver.JmxMBeanServer@95a3404
   [junit4]   2> 1427387 INFO  (TEST-TestLazyCores.testCreateSame-seed#[63DC1D1015F35FC3]) [    x:collection3] o.a.s.m.r.SolrJmxReporter JMX monitoring for 'solr.jetty' (registry 'solr.jetty') enabled at server: com.sun.jmx.mbeanserver.JmxMBeanServer@95a3404
   [junit4]   2> 1427389 INFO  (TEST-TestLazyCores.testCreateSame-seed#[63DC1D1015F35FC3]) [    x:collection3] o.a.s.c.TransientSolrCoreCacheDefault Allocating transient cache for 4 transient cores
   [junit4]   2> 1427400 INFO  (coreLoadExecutor-3886-thread-1-processing-x:collection3) [    x:collection1] o.a.s.c.SolrConfig Using Lucene MatchVersion: 7.2.0
   [junit4]   2> 1427406 INFO  (coreLoadExecutor-3886-thread-3-processing-x:collection3) [    x:collection5] o.a.s.c.SolrConfig Using Lucene MatchVersion: 7.2.0
   [junit4]   2> 1427410 INFO  (coreLoadExecutor-3886-thread-3-processing-x:collection3) [    x:collection5] o.a.s.s.IndexSchema [collection5] Schema name=tiny
   [junit4]   2> 1427410 INFO  (coreLoadExecutor-3886-thread-2-processing-x:collection3) [    x:collection2] o.a.s.c.SolrConfig Using Lucene MatchVersion: 7.2.0
   [junit4]   2> 1427412 INFO  (coreLoadExecutor-3886-thread-3-processing-x:collection3) [    x:collection5] o.a.s.s.IndexSchema Loaded schema tiny/1.1 with uniqueid field id
   [junit4]   2> 1427412 INFO  (coreLoadExecutor-3886-thread-3-processing-x:collection3) [    x:collection5] o.a.s.c.CoreContainer Creating SolrCore 'collection5' using configuration from instancedir /home/jenkins/workspace/Lucene-Solr-7.2-Linux/solr/build/solr-core/test/J1/temp/solr.core.TestLazyCores_63DC1D1015F35FC3-001/tempDir-002/./collection5, trusted=true
   [junit4]   2> 1427412 INFO  (coreLoadExecutor-3886-thread-3-processing-x:collection3) [    x:collection5] o.a.s.m.r.SolrJmxReporter JMX monitoring for 'solr.core.collection5' (registry 'solr.core.collection5') enabled at server: com.sun.jmx.mbeanserver.JmxMBeanServer@95a3404
   [junit4]   2> 1427412 INFO  (coreLoadExecutor-3886-thread-3-processing-x:collection3) [    x:collection5] o.a.s.c.SolrCore solr.RecoveryStrategy.Builder
   [junit4]   2> 1427412 INFO  (coreLoadExecutor-3886-thread-3-processing-x:collection3) [    x:collection5] o.a.s.c.SolrCore [[collection5] ] Opening new SolrCore at [/home/jenkins/workspace/Lucene-Solr-7.2-Linux/solr/build/solr-core/test/J1/temp/solr.core.TestLazyCores_63DC1D1015F35FC3-001/tempDir-002/collection5], dataDir=[/home/jenkins/workspace/Lucene-Solr-7.2-Linux/solr/build/solr-core/test/J1/temp/solr.core.TestLazyCores_63DC1D1015F35FC3-001/tempDir-002/./collection5/data/]
   [junit4]   2> 1427415 INFO  (coreLoadExecutor-3886-thread-3-processing-x:collection3) [    x:collection5] o.a.s.u.RandomMergePolicy RandomMergePolicy wrapping class org.apache.lucene.index.TieredMergePolicy: [TieredMergePolicy: maxMergeAtOnce=39, maxMergeAtOnceExplicit=46, maxMergedSegmentMB=88.0703125, floorSegmentMB=1.6982421875, forceMergeDeletesPctAllowed=10.486523228703398, segmentsPerTier=8.0, maxCFSSegmentSizeMB=8.796093022207999E12, noCFSRatio=0.0
   [junit4]   2> 1427415 INFO  (coreLoadExecutor-3886-thread-2-processing-x:collection3) [    x:collection2] o.a.s.s.IndexSchema [collection2] Schema name=tiny
   [junit4]   2> 1427416 INFO  (coreLoadExecutor-3886-thread-2-processing-x:collection3) [    x:collection2] o.a.s.s.IndexSchema Loaded schema tiny/1.1 with uniqueid field id
   [junit4]   2> 1427416 INFO  (coreLoadExecutor-3886-thread-2-processing-x:collection3) [    x:collection2] o.a.s.c.CoreContainer Creating SolrCore 'collection2' using configuration from instancedir /home/jenkins/workspace/Lucene-Solr-7.2-Linux/solr/build/solr-core/test/J1/temp/solr.core.TestLazyCores_63DC1D1015F35FC3-001/tempDir-002/./collection2, trusted=true
   [junit4]   2> 1427416 INFO  (coreLoadExecutor-3886-thread-2-processing-x:collection3) [    x:collection2] o.a.s.m.r.SolrJmxReporter JMX monitoring for 'solr.core.collection2' (registry 'solr.core.collection2') enabled at server: com.sun.jmx.mbeanserver.JmxMBeanServer@95a3404
   [junit4]   2> 1427417 INFO  (coreLoadExecutor-3886-thread-2-processing-x:collection3) [    x:collection2] o.a.s.c.SolrCore solr.RecoveryStrategy.Builder
   [junit4]   2> 1427417 INFO  (coreLoadExecutor-3886-thread-2-processing-x:collection3) [    x:collection2] o.a.s.c.SolrCore [[collection2] ] Opening new SolrCore at [/home/jenkins/workspace/Lucene-Solr-7.2-Linux/solr/build/solr-core/test/J1/temp/solr.core.TestLazyCores_63DC1D1015F35FC3-001/tempDir-002/collection2], dataDir=[/home/jenkins/workspace/Lucene-Solr-7.2-Linux/solr/build/solr-core/test/J1/temp/solr.core.TestLazyCores_63DC1D1015F35FC3-001/tempDir-002/./collection2/data/]
   [junit4]   2> 1427410 INFO  (coreLoadExecutor-3886-thread-1-processing-x:collection3) [    x:collection1] o.a.s.s.IndexSchema [collection1] Schema name=tiny
   [junit4]   2> 1427419 INFO  (coreLoadExecutor-3886-thread-1-processing-x:collection3) [    x:collection1] o.a.s.s.IndexSchema Loaded schema tiny/1.1 with uniqueid field id
   [junit4]   2> 1427419 INFO  (coreLoadExecutor-3886-thread-1-processing-x:collection3) [    x:collection1] o.a.s.c.CoreContainer Creating SolrCore 'collection1' using configuration from instancedir /home/jenkins/workspace/Lucene-Solr-7.2-Linux/solr/build/solr-core/test/J1/temp/solr.core.TestLazyCores_63DC1D1015F35FC3-001/tempDir-002/./collection1, trusted=true
   [junit4]   2> 1427419 INFO  (coreLoadExecutor-3886-thread-1-processing-x:collection3) [    x:collection1] o.a.s.m.r.SolrJmxReporter JMX monitoring for 'solr.core.collection1' (registry 'solr.core.collection1') enabled at server: com.sun.jmx.mbeanserver.JmxMBeanServer@95a3404
   [junit4]   2> 1427419 INFO  (coreLoadExecutor-3886-thread-1-processing-x:collection3) [    x:collection1] o.a.s.c.SolrCore solr.RecoveryStrategy.Builder
   [junit4]   2> 1427422 INFO  (coreLoadExecutor-3886-thread-1-processing-x:collection3) [    x:collection1] o.a.s.c.SolrCore [[collection1] ] Opening new SolrCore at [/home/jenkins/workspace/Lucene-Solr-7.2-Linux/solr/build/solr-core/test/J1/temp/solr.core.TestLazyCores_63DC1D1015F35FC3-001/tempDir-002/collection1], dataDir=[/home/jenkins/workspace/Lucene-Solr-7.2-Linux/solr/build/solr-core/test/J1/temp/solr.core.TestLazyCores_63DC1D1015F35FC3-001/tempDir-002/./collection1/data/]
   [junit4]   2> 1427424 INFO  (coreLoadExecutor-3886-thread-1-processing-x:collection3) [    x:collection1] o.a.s.u.RandomMergePolicy RandomMergePolicy wrapping class org.apache.lucene.index.TieredMergePolicy: [TieredMergePolicy: maxMergeAtOnce=39, maxMergeAtOnceExplicit=46, maxMergedSegmentMB=88.0703125, floorSegmentMB=1.6982421875, forceMergeDeletesPctAllowed=10.486523228703398, segmentsPerTier=8.0, maxCFSSegmentSizeMB=8.796093022207999E12, noCFSRatio=0.0
   [junit4]   2> 1427425 INFO  (coreLoadExecutor-3886-thread-2-processing-x:collection3) [    x:collection2] o.a.s.u.RandomMergePolicy RandomMergePolicy wrapping class org.apache.lucene.index.TieredMergePolicy: [TieredMergePolicy: maxMergeAtOnce=39, maxMergeAtOnceExplicit=46, maxMergedSegmentMB=88.0703125, floorSegmentMB=1.6982421875, forceMergeDeletesPctAllowed=10.486523228703398, segmentsPerTier=8.0, maxCFSSegmentSizeMB=8.796093022207999E12, noCFSRatio=0.0
   [junit4]   2> 1427510 INFO  (coreLoadExecutor-3886-thread-1-processing-x:collection3) [    x:collection1] o.a.s.u.CommitTracker Hard AutoCommit: disabled
   [junit4]   2> 1427510 INFO  (coreLoadExecutor-3886-thread-1-processing-x:collection3) [    x:collection1] o.a.s.u.CommitTracker Soft AutoCommit: disabled
   [junit4]   2> 1427511 INFO  (coreLoadExecutor-3886-thread-1-processing-x:collection3) [    x:collection1] o.a.s.u.RandomMergePolicy RandomMergePolicy wrapping class org.apache.lucene.index.TieredMergePolicy: [TieredMergePolicy: maxMergeAtOnce=10, maxMergeAtOnceExplicit=20, maxMergedSegmentMB=40.1435546875, floorSegmentMB=0.3330078125, forceMergeDeletesPctAllowed=25.711654587130173, segmentsPerTier=11.0, maxCFSSegmentSizeMB=8.796093022207999E12, noCFSRatio=1.0
   [junit4]   2> 1427511 INFO  (coreLoadExecutor-3886-thread-1-processing-x:collection3) [    x:collection1] o.a.s.s.SolrIndexSearcher Opening [Searcher@42a6bf4c[collection1] main]
   [junit4]   2> 1427512 INFO  (coreLoadExecutor-3886-thread-1-processing-x:collection3) [    x:collection1] o.a.s.r.ManagedResourceStorage File-based storage initialized to use dir: /home/jenkins/workspace/Lucene-Solr-7.2-Linux/solr/build/solr-core/test/J1/temp/solr.core.TestLazyCores_63DC1D1015F35FC3-001/tempDir-002/collection1/conf
   [junit4]   2> 1427512 INFO  (coreLoadExecutor-3886-thread-1-processing-x:collection3) [    x:collection1] o.a.s.h.ReplicationHandler Commits will be reserved for 10000ms.
   [junit4]   2> 1427513 INFO  (searcherExecutor-3889-thread-1-processing-x:collection1) [    x:collection1] o.a.s.c.SolrCore [collection1] Registered new searcher Searcher@42a6bf4c[collection1] main{ExitableDirectoryReader(UninvertingDirectoryReader())}
   [junit4]   2> 1427517 INFO  (coreLoadExecutor-3886-thread-3-processing-x:collection3) [    x:collection5] o.a.s.u.CommitTracker Hard AutoCommit: disabled
   [junit4]   2> 1427517 INFO  (coreLoadExecutor-3886-thread-3-processing-x:collection3) [    x:collection5] o.a.s.u.CommitTracker Soft AutoCommit: disabled
   [junit4]   2> 1427518 INFO  (coreLoadExecutor-3886-thread-3-processing-x:collection3) [    x:collection5] o.a.s.u.RandomMergePolicy RandomMergePolicy wrapping class org.apache.lucene.index.TieredMergePolicy: [TieredMergePolicy: maxMergeAtOnce=10, maxMergeAtOnceExplicit=20, maxMergedSegmentMB=40.1435546875, floorSegmentMB=0.3330078125, forceMergeDeletesPctAllowed=25.711654587130173, segmentsPerTier=11.0, maxCFSSegmentSizeMB=8.796093022207999E12, noCFSRatio=1.0
   [junit4]   2> 1427518 INFO  (coreLoadExecutor-3886-thread-3-processing-x:collection3) [    x:collection5] o.a.s.s.SolrIndexSearcher Opening [Searcher@308481ce[collection5] main]
   [junit4]   2> 1427518 INFO  (coreLoadExecutor-3886-thread-3-processing-x:collection3) [    x:collection5] o.a.s.r.ManagedResourceStorage File-based storage initialized to use dir: /home/jenkins/workspace/Lucene-Solr-7.2-Linux/solr/build/solr-core/test/J1/temp/solr.core.TestLazyCores_63DC1D1015F35FC3-001/tempDir-002/collection5/conf
   [junit4]   2> 1427519 INFO  (coreLoadExecutor-3886-thread-3-processing-x:collection3) [    x:collection5] o.a.s.h.ReplicationHandler Commits will be reserved for 10000ms.
   [junit4]   2> 1427520 INFO  (searcherExecutor-3887-thread-1-processing-x:collection5) [    x:collection5] o.a.s.c.SolrCore [collection5] Registered new searcher Searcher@308481ce[collection5] main{ExitableDirectoryReader(UninvertingDirectoryReader())}
   [junit4]   2> 1427527 INFO  (coreLoadExecutor-3886-thread-2-processing-x:collection3) [    x:collection2] o.a.s.u.CommitTracker Hard AutoCommit: disabled
   [junit4]   2> 1427527 INFO  (coreLoadExecutor-3886-thread-2-processing-x:collection3) [    x:collection2] o.a.s.u.CommitTracker Soft AutoCommit: disabled
   [junit4]   2> 1427528 INFO  (coreLoadExecutor-3886-thread-2-processing-x:collection3) [    x:collection2] o.a.s.u.RandomMergePolicy RandomMergePolicy wrapping class org.apache.lucene.index.TieredMergePolicy: [TieredMergePolicy: maxMergeAtOnce=10, maxMergeAtOnceExplicit=20, maxMergedSegmentMB=40.1435546875, floorSegmentMB=0.3330078125, forceMergeDeletesPctAllowed=25.711654587130173, segmentsPerTier=11.0, maxCFSSegmentSizeMB=8.796093022207999E12, noCFSRatio=1.0
   [junit4]   2> 1427528 INFO  (coreLoadExecutor-3886-thread-2-processing-x:collection3) [    x:collection2] o.a.s.s.SolrIndexSearcher Opening [Searcher@3ba9a639[collection2] main]
   [junit4]   2> 1427529 INFO  (coreLoadExecutor-3886-thread-2-processing-x:collection3) [    x:collection2] o.a.s.r.ManagedResourceStorage File-based storage initialized to use dir: /home/jenkins/workspace/Lucene-Solr-7.2-Linux/solr/build/solr-core/test/J1/temp/solr.core.TestLazyCores_63DC1D1015F35FC3-001/tempDir-002/collection2/conf
   [junit4]   2> 1427529 INFO  (coreLoadExecutor-3886-thread-2-processing-x:collection3) [    x:collection2] o.a.s.h.ReplicationHandler Commits will be reserved for 10000ms.
   [junit4]   2> 1427529 INFO  (searcherExecutor-3888-thread-1-processing-x:collection2) [    x:collection2] o.a.s.c.SolrCore [collection2] Registered new searcher Searcher@3ba9a639[collection2] main{ExitableDirectoryReader(UninvertingDirectoryReader())}
   [junit4]   2> 1427535 INFO  (TEST-TestLazyCores.testCreateSame-seed#[63DC1D1015F35FC3]) [    x:collection3] o.a.s.c.SolrConfig Using Lucene MatchVersion: 7.2.0
   [junit4]   2> 1427542 INFO  (TEST-TestLazyCores.testCreateSame-seed#[63DC1D1015F35FC3]) [    x:collection3] o.a.s.s.IndexSchema [collection4] Schema name=tiny
   [junit4]   2> 1427543 INFO  (TEST-TestLazyCores.testCreateSame-seed#[63DC1D1015F35FC3]) [    x:collection3] o.a.s.s.IndexSchema Loaded schema tiny/1.1 with uniqueid field id
   [junit4]   2> 1427543 INFO  (TEST-TestLazyCores.testCreateSame-seed#[63DC1D1015F35FC3]) [    x:collection3] o.a.s.c.CoreContainer Creating SolrCore 'collection4' using configuration from instancedir /home/jenkins/workspace/Lucene-Solr-7.2-Linux/solr/build/solr-core/test/J1/temp/solr.core.TestLazyCores_63DC1D1015F35FC3-001/tempDir-002/./collection4, trusted=true
   [junit4]   2> 1427543 INFO  (TEST-TestLazyCores.testCreateSame-seed#[63DC1D1015F35FC3]) [    x:collection3] o.a.s.m.r.SolrJmxReporter JMX monitoring for 'solr.core.collection4' (registry 'solr.core.collection4') enabled at server: com.sun.jmx.mbeanserver.JmxMBeanServer@95a3404
   [junit4]   2> 1427544 INFO  (TEST-TestLazyCores.testCreateSame-seed#[63DC1D1015F35FC3]) [    x:collection3] o.a.s.c.SolrCore solr.RecoveryStrategy.Builder
   [junit4]   2> 1427544 INFO  (TEST-TestLazyCores.testCreateSame-seed#[63DC1D1015F35FC3]) [    x:collection3] o.a.s.c.SolrCore [[collection4] ] Opening new SolrCore at [/home/jenkins/workspace/Lucene-Solr-7.2-Linux/solr/build/solr-core/test/J1/temp/solr.core.TestLazyCores_63DC1D1015F35FC3-001/tempDir-002/collection4], dataDir=[/home/jenkins/workspace/Lucene-Solr-7.2-Linux/solr/build/solr-core/test/J1/temp/solr.core.TestLazyCores_63DC1D1015F35FC3-001/tempDir-002/./collection4/data/]
   [junit4]   2> 1427546 INFO  (TEST-TestLazyCores.testCreateSame-seed#[63DC1D1015F35FC3]) [    x:collection3] o.a.s.u.RandomMergePolicy RandomMergePolicy wrapping class org.apache.lucene.index.TieredMergePolicy: [TieredMergePolicy: maxMergeAtOnce=41, maxMergeAtOnceExplicit=26, maxMergedSegmentMB=72.7119140625, floorSegmentMB=1.1630859375, forceMergeDeletesPctAllowed=20.07530670611772, segmentsPerTier=36.0, maxCFSSegmentSizeMB=8.796093022207999E12, noCFSRatio=0.33434611387436697
   [junit4]   2> 1427601 INFO  (TEST-TestLazyCores.testCreateSame-seed#[63DC1D1015F35FC3]) [    x:collection3] o.a.s.u.CommitTracker Hard AutoCommit: disabled
   [junit4]   2> 1427601 INFO  (TEST-TestLazyCores.testCreateSame-seed#[63DC1D1015F35FC3]) [    x:collection3] o.a.s.u.CommitTracker Soft AutoCommit: disabled
   [junit4]   2> 1427602 INFO  (TEST-TestLazyCores.testCreateSame-seed#[63DC1D1015F35FC3]) [    x:collection3] o.a.s.u.RandomMergePolicy RandomMergePolicy wrapping class org.apache.lucene.index.MockRandomMergePolicy: org.apache.lucene.index.MockRandomMergePolicy@9136e32
   [junit4]   2> 1427602 INFO  (TEST-TestLazyCores.testCreateSame-seed#[63DC1D1015F35FC3]) [    x:collection3] o.a.s.s.SolrIndexSearcher Opening [Searcher@57c71b8f[collection4] main]
   [junit4]   2> 1427602 INFO  (TEST-TestLazyCores.testCreateSame-seed#[63DC1D1015F35FC3]) [    x:collection3] o.a.s.r.ManagedResourceStorage File-based storage initialized to use dir: /home/jenkins/workspace/Lucene-Solr-7.2-Linux/solr/build/solr-core/test/J1/temp/solr.core.TestLazyCores_63DC1D1015F35FC3-001/tempDir-002/collection4/conf
   [junit4]   2> 1427603 INFO  (TEST-TestLazyCores.testCreateSame-seed#[63DC1D1015F35FC3]) [    x:collection3] o.a.s.h.ReplicationHandler Commits will be reserved for 10000ms.
   [junit4]   2> 1427603 INFO  (searcherExecutor-3900-thread-1-processing-x:collection3) [    x:collection3] o.a.s.c.SolrCore [collection4] Registered new searcher Searcher@57c71b8f[collection4] main{ExitableDirectoryReader(UninvertingDirectoryReader())}
   [junit4]   2> 1427608 INFO  (TEST-TestLazyCores.testCreateSame-seed#[63DC1D1015F35FC3]) [    x:collection3] o.a.s.c.SolrConfig Using Lucene MatchVersion: 7.2.0
   [junit4]   2> 1427614 INFO  (TEST-TestLazyCores.testCreateSame-seed#[63DC1D1015F35FC3]) [    x:collection3] o.a.s.s.IndexSchema [collection6] Schema name=tiny
   [junit4]   2> 1427616 INFO  (TEST-TestLazyCores.testCreateSame-seed#[63DC1D1015F35FC3]) [    x:collection3] o.a.s.s.IndexSchema Loaded schema tiny/1.1 with uniqueid field id
   [junit4]   2> 1427616 INFO  (TEST-TestLazyCores.testCreateSame-seed#[63DC1D1015F35FC3]) [    x:collection3] o.a.s.c.CoreContainer Creating SolrCore 'collection6' using configuration from instancedir /home/jenkins/workspace/Lucene-Solr-7.2-Linux/solr/build/solr-core/test/J1/temp/solr.core.TestLazyCores_63DC1D1015F35FC3-001/tempDir-002/./collection6, trusted=true
   [junit4]   2> 1427617 INFO  (TEST-TestLazyCores.testCreateSame-seed#[63DC1D1015F35FC3]) [    x:collection3] o.a.s.m.r.SolrJmxReporter JMX monitoring for 'solr.core.collection6' (registry 'solr.core.collection6') enabled at server: com.sun.jmx.mbeanserver.JmxMBeanServer@95a3404
   [junit4]   2> 1427617 INFO  (TEST-TestLazyCores.testCreateSame-seed#[63DC1D1015F35FC3]) [    x:collection3] o.a.s.c.SolrCore solr.RecoveryStrategy.Builder
   [junit4]   2> 1427617 INFO  (TEST-TestLazyCores.testCreateSame-seed#[63DC1D1015F35FC3]) [    x:collection3] o.a.s.c.SolrCore [[collection6] ] Opening new SolrCore at [/home/jenkins/workspace/Lucene-Solr-7.2-Linux/solr/build/solr-core/test/J1/temp/solr.core.TestLazyCores_63DC1D1015F35FC3-001/tempDir-002/collection6], dataDir=[/home/jenkins/workspace/Lucene-Solr-7.2-Linux/solr/build/solr-core/test/J1/temp/solr.core.TestLazyCores_63DC1D1015F35FC3-001/tempDir-002/./collection6/data/]
   [junit4]   2> 1427630 INFO  (TEST-TestLazyCores.testCreateSame-seed#[63DC1D1015F35FC3]) [    x:collection3] o.a.s.u.RandomMergePolicy RandomMergePolicy wrapping class org.apache.lucene.index.TieredMergePolicy: [TieredMergePolicy: maxMergeAtOnce=18, maxMergeAtOnceExplicit=45, maxMergedSegmentMB=48.6455078125, floorSegmentMB=1.4912109375, forceMergeDeletesPctAllowed=17.677762974290257, segmentsPerTier=21.0, maxCFSSegmentSizeMB=8.796093022207999E12, noCFSRatio=1.0
   [junit4]   2> 1427709 INFO  (TEST-TestLazyCores.testCreateSame-seed#[63DC1D1015F35FC3]) [    x:collection3] o.a.s.u.CommitTracker Hard AutoCommit: disabled
   [junit4]   2> 1427709 INFO  (TEST-TestLazyCores.testCreateSame-seed#[63DC1D1015F35FC3]) [    x:collection3] o.a.s.u.CommitTracker Soft AutoCommit: disabled
   [junit4]   2> 1427710 INFO  (TEST-TestLazyCores.testCreateSame-seed#[63DC1D1015F35FC3]) [    x:collection3] o.a.s.u.RandomMergePolicy RandomMergePolicy wrapping class org.apache.lucene.index.TieredMergePolicy: [TieredMergePolicy: maxMergeAtOnce=23, maxMergeAtOnceExplicit=19, maxMergedSegmentMB=5.419921875, floorSegmentMB=1.775390625, forceMergeDeletesPctAllowed=6.533289007850085, segmentsPerTier=12.0, maxCFSSegmentSizeMB=8.796093022207999E12, noCFSRatio=0.0
   [junit4]   2> 1427711 INFO  (TEST-TestLazyCores.testCreateSame-seed#[63DC1D1015F35FC3]) [    x:collection3] o.a.s.s.SolrIndexSearcher Opening [Searcher@1e695d3c[collection6] main]
   [junit4]   2> 1427711 INFO  (TEST-TestLazyCores.testCreateSame-seed#[63DC1D1015F35FC3]) [    x:collection3] o.a.s.r.ManagedResourceStorage File-based storage initialized to use dir: /home/jenkins/workspace/Lucene-Solr-7.2-Linux/solr/build/solr-core/test/J1/temp/solr.core.TestLazyCores_63DC1D1015F35FC3-001/tempDir-002/collection6/conf
   [junit4]   2> 1427712 INFO  (TEST-TestLazyCores.testCreateSame-seed#[63DC1D1015F35FC3]) [    x:collection3] o.a.s.h.ReplicationHandler Commits will be reserved for 10000ms.
   [junit4]   2> 1427717 INFO  (TEST-TestLazyCores.testCreateSame-seed#[63DC1D1015F35FC3]) [    x:collection3] o.a.s.h.a.CoreAdminOperation core create command schema=schema.xml&dataDir=t12&name=collection2&action=CREATE&config=solrconfig.xml&wt=xml
   [junit4]   2> 1427717 WARN  (TEST-TestLazyCores.testCreateSame-seed#[63DC1D1015F35FC3]) [    x:collection3] o.a.s.c.CoreContainer Creating a core with existing name is not allowed
   [junit4]   2> 1427718 INFO  (TEST-TestLazyCores.testCreateSame-seed#[63DC1D1015F35FC3]) [    x:collection3] o.a.s.h.a.CoreAdminOperation core create command schema=schema.xml&dataDir=t14&name=collection4&action=CREATE&config=solrconfig.xml&wt=xml
   [junit4]   2> 1427718 WARN  (TEST-TestLazyCores.testCreateSame-seed#[63DC1D1015F35FC3]) [    x:collection3] o.a.s.c.CoreContainer Creating a core with existing name is not allowed
   [junit4]   2> 1427718 INFO  (TEST-TestLazyCores.testCreateSame-seed#[63DC1D1015F35FC3]) [    x:collection3] o.a.s.h.a.CoreAdminOperation core create command schema=schema.xml&dataDir=t15&name=collection5&action=CREATE&config=solrconfig.xml&wt=xml
   [junit4]   2> 1427718 WARN  (TEST-TestLazyCores.testCreateSame-seed#[63DC1D1015F35FC3]) [    x:collection3] o.a.s.c.CoreContainer Creating a core with existing name is not allowed
   [junit4]   2> 1427718 INFO  (TEST-TestLazyCores.testCreateSame-seed#[63DC1D1015F35FC3]) [    x:collection3] o.a.s.h.a.CoreAdminOperation core create command schema=schema.xml&dataDir=t16&name=collection6&action=CREATE&config=solrconfig.xml&wt=xml
   [junit4]   2> 1427718 WARN  (TEST-TestLazyCores.testCreateSame-seed#[63DC1D1015F35FC3]) [    x:collection3] o.a.s.c.CoreContainer Creating a core with existing name is not allowed
   [junit4]   2> 1427718 INFO  (TEST-TestLazyCores.testCreateSame-seed#[63DC1D1015F35FC3]) [    x:collection3] o.a.s.c.CoreContainer Shutting down CoreContainer instance=1463692595
   [junit4]   2> 1427718 INFO  (TEST-TestLazyCores.testCreateSame-seed#[63DC1D1015F35FC3]) [    x:collection3] o.a.s.m.SolrMetricManager Closing metric reporters for registry=solr.node, tag=null
   [junit4]   2> 1427718 INFO  (TEST-TestLazyCores.testCreateSame-seed#[63DC1D1015F35FC3]) [    x:collection3] o.a.s.m.r.SolrJmxReporter Closing reporter [org.apache.solr.metrics.reporters.SolrJmxReporter@269bdd32: rootName = null, domain = solr.node, service url = null, agent id = null] for registry solr.node / com.codahale.metrics.MetricRegistry@434f01f7
   [junit4]   2> 1427723 INFO  (TEST-TestLazyCores.testCreateSame-seed#[63DC1D1015F35FC3]) [    x:collection3] o.a.s.m.SolrMetricManager Closing metric reporters for registry=solr.jvm, tag=null
   [junit4]   2> 1427723 INFO  (TEST-TestLazyCores.testCreateSame-seed#[63DC1D1015F35FC3]) [    x:collection3] o.a.s.m.r.SolrJmxReporter Closing reporter [org.apache.solr.metrics.reporters.SolrJmxReporter@3f518412: rootName = null, domain = solr.jvm, service url = null, agent id = null] for registry solr.jvm / com.codahale.metrics.MetricRegistry@16ff8b20
   [junit4]   2> 1427726 INFO  (TEST-TestLazyCores.testCreateSame-seed#[63DC1D1015F35FC3]) [    x:collection3] o.a.s.m.SolrMetricManager Closing metric reporters for registry=solr.jetty, tag=null
   [junit4]   2> 1427726 INFO  (TEST-TestLazyCores.testCreateSame-seed#[63DC1D1015F35FC3]) [    x:collection3] o.a.s.m.r.SolrJmxReporter Closing reporter [org.apache.solr.metrics.reporters.SolrJmxReporter@617bf6f: rootName = null, domain = solr.jetty, service url = null, agent id = null] for registry solr.jetty / com.codahale.metrics.MetricRegistry@12c01d27
   [junit4]   2> 1427732 INFO  (coreCloseExecutor-3908-thread-1-processing-x:collection3) [    x:collection1] o.a.s.c.SolrCore [collection1]  CLOSING SolrCore org.apache.solr.core.SolrCore@2b2cca05
   [junit4]   2> 1427732 INFO  (coreCloseExecutor-3908-thread-1-processing-x:collection3) [    x:collection1] o.a.s.m.SolrMetricManager Closing metric reporters for registry=solr.core.collection1, tag=724355589
   [junit4]   2> 1427732 INFO  (coreCloseExecutor-3908-thread-1-processing-x:collection3) [    x:collection1] o.a.s.m.r.SolrJmxReporter Closing reporter [org.apache.solr.metrics.reporters.SolrJmxReporter@47ca9505: rootName = null, domain = solr.core.collection1, service url = null, agent id = null] for registry solr.core.collection1 / com.codahale.metrics.MetricRegistry@760d6227
   [junit4]   2> 1427750 INFO  (coreCloseExecutor-3908-thread-2-processing-x:collection3) [    x:collection5] o.a.s.c.SolrCore [collection5]  CLOSING SolrCore org.apache.solr.core.SolrCore@5c884460
   [junit4]   2> 1427750 INFO  (coreCloseExecutor-3908-thread-2-processing-x:collection3) [    x:collection5] o.a.s.m.SolrMetricManager Closing metric reporters for registry=solr.core.collection5, tag=1552434272
   [junit4]   2> 1427750 INFO  (coreCloseExecutor-3908-thread-2-processing-x:collection3) [    x:collection5] o.a.s.m.r.SolrJmxReporter Closing reporter [org.apache.solr.metrics.reporters.SolrJmxReporter@7c1fb2f2: rootName = null, domain = solr.core.collection5, service url = null, agent id = null] for registry solr.core.collection5 / com.codahale.metrics.MetricRegistry@772338cf
   [junit4]   2> 1427750 INFO  (coreCloseExecutor-3908-thread-3-processing-x:collection3) [    x:collection4] o.a.s.c.SolrCore [collection4]  CLOSING Solr

[...truncated too long message...]

-TestLazyCores.testLazyLoad-seed#[63DC1D1015F35FC3]) [    x:collection3] o.a.s.SolrTestCaseJ4 ###Ending testLazyLoad
   [junit4]   2> 1437420 INFO  (SUITE-TestLazyCores-seed#[63DC1D1015F35FC3]-worker) [    x:collection3] o.a.s.SolrTestCaseJ4 ###deleteCore
   [junit4]   2> 1437420 INFO  (SUITE-TestLazyCores-seed#[63DC1D1015F35FC3]-worker) [    x:collection3] o.a.s.c.CoreContainer Shutting down CoreContainer instance=66943441
   [junit4]   2> 1437420 INFO  (SUITE-TestLazyCores-seed#[63DC1D1015F35FC3]-worker) [    x:collection3] o.a.s.m.SolrMetricManager Closing metric reporters for registry=solr.node, tag=null
   [junit4]   2> 1437420 INFO  (SUITE-TestLazyCores-seed#[63DC1D1015F35FC3]-worker) [    x:collection3] o.a.s.m.SolrMetricManager Closing metric reporters for registry=solr.jvm, tag=null
   [junit4]   2> 1437420 INFO  (SUITE-TestLazyCores-seed#[63DC1D1015F35FC3]-worker) [    x:collection3] o.a.s.m.SolrMetricManager Closing metric reporters for registry=solr.jetty, tag=null
   [junit4]   2> NOTE: leaving temporary files on disk at: /home/jenkins/workspace/Lucene-Solr-7.2-Linux/solr/build/solr-core/test/J1/temp/solr.core.TestLazyCores_63DC1D1015F35FC3-001
   [junit4]   2> Dec 21, 2017 1:29:06 AM com.carrotsearch.randomizedtesting.ThreadLeakControl checkThreadLeaks
   [junit4]   2> WARNING: Will linger awaiting termination of 1 leaked thread(s).
   [junit4]   2> Dec 21, 2017 1:29:26 AM com.carrotsearch.randomizedtesting.ThreadLeakControl checkThreadLeaks
   [junit4]   2> SEVERE: 1 thread leaked from SUITE scope at org.apache.solr.core.TestLazyCores: 
   [junit4]   2>    1) Thread[id=12242, name=searcherExecutor-3875-thread-1, state=WAITING, group=TGRP-TestLazyCores]
   [junit4]   2>         at java.base@9.0.1/jdk.internal.misc.Unsafe.park(Native Method)
   [junit4]   2>         at java.base@9.0.1/java.util.concurrent.locks.LockSupport.park(LockSupport.java:194)
   [junit4]   2>         at java.base@9.0.1/java.util.concurrent.locks.AbstractQueuedSynchronizer$ConditionObject.await(AbstractQueuedSynchronizer.java:2062)
   [junit4]   2>         at java.base@9.0.1/java.util.concurrent.LinkedBlockingQueue.take(LinkedBlockingQueue.java:435)
   [junit4]   2>         at java.base@9.0.1/java.util.concurrent.ThreadPoolExecutor.getTask(ThreadPoolExecutor.java:1092)
   [junit4]   2>         at java.base@9.0.1/java.util.concurrent.ThreadPoolExecutor.runWorker(ThreadPoolExecutor.java:1152)
   [junit4]   2>         at java.base@9.0.1/java.util.concurrent.ThreadPoolExecutor$Worker.run(ThreadPoolExecutor.java:641)
   [junit4]   2>         at java.base@9.0.1/java.lang.Thread.run(Thread.java:844)
   [junit4]   2> Dec 21, 2017 1:29:26 AM com.carrotsearch.randomizedtesting.ThreadLeakControl tryToInterruptAll
   [junit4]   2> INFO: Starting to interrupt leaked threads:
   [junit4]   2>    1) Thread[id=12242, name=searcherExecutor-3875-thread-1, state=WAITING, group=TGRP-TestLazyCores]
   [junit4]   2> Dec 21, 2017 1:29:29 AM com.carrotsearch.randomizedtesting.ThreadLeakControl tryToInterruptAll
   [junit4]   2> SEVERE: There are still zombie threads that couldn't be terminated:
   [junit4]   2>    1) Thread[id=12242, name=searcherExecutor-3875-thread-1, state=WAITING, group=TGRP-TestLazyCores]
   [junit4]   2>         at java.base@9.0.1/jdk.internal.misc.Unsafe.park(Native Method)
   [junit4]   2>         at java.base@9.0.1/java.util.concurrent.locks.LockSupport.park(LockSupport.java:194)
   [junit4]   2>         at java.base@9.0.1/java.util.concurrent.locks.AbstractQueuedSynchronizer$ConditionObject.await(AbstractQueuedSynchronizer.java:2062)
   [junit4]   2>         at java.base@9.0.1/java.util.concurrent.LinkedBlockingQueue.take(LinkedBlockingQueue.java:435)
   [junit4]   2>         at java.base@9.0.1/java.util.concurrent.ThreadPoolExecutor.getTask(ThreadPoolExecutor.java:1092)
   [junit4]   2>         at java.base@9.0.1/java.util.concurrent.ThreadPoolExecutor.runWorker(ThreadPoolExecutor.java:1152)
   [junit4]   2>         at java.base@9.0.1/java.util.concurrent.ThreadPoolExecutor$Worker.run(ThreadPoolExecutor.java:641)
   [junit4]   2>         at java.base@9.0.1/java.lang.Thread.run(Thread.java:844)
   [junit4]   2> NOTE: test params are: codec=Asserting(Lucene70): {v_t=FSTOrd50, id=FSTOrd50, v_s=PostingsFormat(name=Asserting), v_f=TestBloomFilteredLucenePostings(BloomFilteringPostingsFormat(Lucene50(blocksize=128)))}, docValues:{}, maxPointsInLeafNode=44, maxMBSortInHeap=7.272468402598461, sim=RandomSimilarity(queryNorm=true): {}, locale=zh, timezone=Antarctica/DumontDUrville
   [junit4]   2> NOTE: Linux 4.10.0-40-generic amd64/Oracle Corporation 9.0.1 (64-bit)/cpus=8,threads=2,free=89065296,total=532152320
   [junit4]   2> NOTE: All tests run in this JVM: [TestLuceneMatchVersion, FacetPivotSmallTest, PingRequestHandlerTest, ZkFailoverTest, TestLegacyNumericRangeQueryBuilder, JSONWriterTest, TestReplicaProperties, HLLSerializationTest, TestDistribIDF, HdfsSyncSliceTest, SolrMetricsIntegrationTest, TestStressReorder, HdfsBasicDistributedZk2Test, DistributedIntervalFacetingTest, TestSimpleTrackingShardHandler, SolrRequestParserTest, TestManagedResourceStorage, TestBM25SimilarityFactory, DistributedVersionInfoTest, HttpSolrCallGetCoreTest, TestFastLRUCache, SuggestComponentTest, DeleteLastCustomShardedReplicaTest, ZkCLITest, CdcrReplicationHandlerTest, TestCursorMarkWithoutUniqueKey, QueryEqualityTest, TestRestoreCore, TestDocSet, TestSolrCloudWithKerberosAlt, TestStressUserVersions, TestDeleteCollectionOnDownNodes, BlockCacheTest, DistributedQueryComponentCustomSortTest, TestRTGBase, TestCopyFieldCollectionResource, HdfsRecoverLeaseTest, PrimUtilsTest, OpenCloseCoreStressTest, TestCollationField, DirectUpdateHandlerTest, TestPolicyCloud, TestBulkSchemaConcurrent, TestRangeQuery, SuggesterTSTTest, V2ApiIntegrationTest, TestSchemaManager, TestHdfsUpdateLog, TestPayloadCheckQParserPlugin, TestQuerySenderNoQuery, CloudExitableDirectoryReaderTest, TestSchemaSimilarityResource, NumericFieldsTest, JavabinLoaderTest, TestSolrConfigHandler, TestInfoStreamLogging, MoveReplicaHDFSFailoverTest, DOMUtilTest, TestHdfsBackupRestoreCore, TestJmxIntegration, AddReplicaTest, AssignTest, RankQueryTest, DebugComponentTest, BlockJoinFacetSimpleTest, TestAtomicUpdateErrorCases, DistributedFacetExistsSmallTest, TestCoreAdminApis, TestConfigSetsAPIExclusivity, TestClassicSimilarityFactory, ShowFileRequestHandlerTest, SolrCLIZkUtilsTest, CircularListTest, OverseerRolesTest, TestSurroundQueryParser, TestUniqueKeyFieldResource, PeerSyncReplicationTest, TestCloudRecovery, PreAnalyzedFieldManagedSchemaCloudTest, AutoScalingHandlerTest, TestDocumentBuilder, TestStressLucene, TestFieldTypeResource, ShardRoutingCustomTest, SynonymTokenizerTest, SpellingQueryConverterTest, ShardSplitTest, TestFileDictionaryLookup, TestXIncludeConfig, TestCollectionAPI, TestConfigSetProperties, ImplicitSnitchTest, TestSubQueryTransformerCrossCore, LukeRequestHandlerTest, OverriddenZkACLAndCredentialsProvidersTest, TestRandomCollapseQParserPlugin, ZkSolrClientTest, TestLazyCores]
   [junit4]   2> NOTE: reproduce with: ant test  -Dtestcase=TestLazyCores -Dtests.seed=63DC1D1015F35FC3 -Dtests.multiplier=3 -Dtests.slow=true -Dtests.locale=zh -Dtests.timezone=Antarctica/DumontDUrville -Dtests.asserts=true -Dtests.file.encoding=UTF-8
   [junit4] ERROR   0.00s J1 | TestLazyCores (suite) <<<
   [junit4]    > Throwable #1: com.carrotsearch.randomizedtesting.ThreadLeakError: 1 thread leaked from SUITE scope at org.apache.solr.core.TestLazyCores: 
   [junit4]    >    1) Thread[id=12242, name=searcherExecutor-3875-thread-1, state=WAITING, group=TGRP-TestLazyCores]
   [junit4]    >         at java.base@9.0.1/jdk.internal.misc.Unsafe.park(Native Method)
   [junit4]    >         at java.base@9.0.1/java.util.concurrent.locks.LockSupport.park(LockSupport.java:194)
   [junit4]    >         at java.base@9.0.1/java.util.concurrent.locks.AbstractQueuedSynchronizer$ConditionObject.await(AbstractQueuedSynchronizer.java:2062)
   [junit4]    >         at java.base@9.0.1/java.util.concurrent.LinkedBlockingQueue.take(LinkedBlockingQueue.java:435)
   [junit4]    >         at java.base@9.0.1/java.util.concurrent.ThreadPoolExecutor.getTask(ThreadPoolExecutor.java:1092)
   [junit4]    >         at java.base@9.0.1/java.util.concurrent.ThreadPoolExecutor.runWorker(ThreadPoolExecutor.java:1152)
   [junit4]    >         at java.base@9.0.1/java.util.concurrent.ThreadPoolExecutor$Worker.run(ThreadPoolExecutor.java:641)
   [junit4]    >         at java.base@9.0.1/java.lang.Thread.run(Thread.java:844)
   [junit4]    > 	at __randomizedtesting.SeedInfo.seed([63DC1D1015F35FC3]:0)Throwable #2: com.carrotsearch.randomizedtesting.ThreadLeakError: There are still zombie threads that couldn't be terminated:
   [junit4]    >    1) Thread[id=12242, name=searcherExecutor-3875-thread-1, state=WAITING, group=TGRP-TestLazyCores]
   [junit4]    >         at java.base@9.0.1/jdk.internal.misc.Unsafe.park(Native Method)
   [junit4]    >         at java.base@9.0.1/java.util.concurrent.locks.LockSupport.park(LockSupport.java:194)
   [junit4]    >         at java.base@9.0.1/java.util.concurrent.locks.AbstractQueuedSynchronizer$ConditionObject.await(AbstractQueuedSynchronizer.java:2062)
   [junit4]    >         at java.base@9.0.1/java.util.concurrent.LinkedBlockingQueue.take(LinkedBlockingQueue.java:435)
   [junit4]    >         at java.base@9.0.1/java.util.concurrent.ThreadPoolExecutor.getTask(ThreadPoolExecutor.java:1092)
   [junit4]    >         at java.base@9.0.1/java.util.concurrent.ThreadPoolExecutor.runWorker(ThreadPoolExecutor.java:1152)
   [junit4]    >         at java.base@9.0.1/java.util.concurrent.ThreadPoolExecutor$Worker.run(ThreadPoolExecutor.java:641)
   [junit4]    >         at java.base@9.0.1/java.lang.Thread.run(Thread.java:844)
   [junit4]    > 	at __randomizedtesting.SeedInfo.seed([63DC1D1015F35FC3]:0)
   [junit4] Completed [367/751 (1!)] on J1 in 33.87s, 9 tests, 3 errors <<< FAILURES!

[...truncated 41337 lines...]

Mime
View raw message