lucene-dev mailing list archives

Site index · List index
Message view « Date » · « Thread »
Top « Date » · « Thread »
From Policeman Jenkins Server <jenk...@thetaphi.de>
Subject [JENKINS] Lucene-Solr-7.x-MacOSX (64bit/jdk1.8.0) - Build # 348 - Unstable!
Date Tue, 19 Dec 2017 03:44:59 GMT
Build: https://jenkins.thetaphi.de/job/Lucene-Solr-7.x-MacOSX/348/
Java: 64bit/jdk1.8.0 -XX:-UseCompressedOops -XX:+UseParallelGC

10 tests failed.
FAILED:  org.apache.solr.cloud.CustomCollectionTest.testCustomCollectionsAPI

Error Message:
Could not find collection : implicitcoll

Stack Trace:
org.apache.solr.common.SolrException: Could not find collection : implicitcoll
	at __randomizedtesting.SeedInfo.seed([A3BFFE30E3B27591:C95E705BDE28C3E9]:0)
	at org.apache.solr.common.cloud.ClusterState.getCollection(ClusterState.java:118)
	at org.apache.solr.cloud.SolrCloudTestCase.getCollectionState(SolrCloudTestCase.java:247)
	at org.apache.solr.cloud.CustomCollectionTest.testCustomCollectionsAPI(CustomCollectionTest.java:68)
	at sun.reflect.NativeMethodAccessorImpl.invoke0(Native Method)
	at sun.reflect.NativeMethodAccessorImpl.invoke(NativeMethodAccessorImpl.java:62)
	at sun.reflect.DelegatingMethodAccessorImpl.invoke(DelegatingMethodAccessorImpl.java:43)
	at java.lang.reflect.Method.invoke(Method.java:498)
	at com.carrotsearch.randomizedtesting.RandomizedRunner.invoke(RandomizedRunner.java:1737)
	at com.carrotsearch.randomizedtesting.RandomizedRunner$8.evaluate(RandomizedRunner.java:934)
	at com.carrotsearch.randomizedtesting.RandomizedRunner$9.evaluate(RandomizedRunner.java:970)
	at com.carrotsearch.randomizedtesting.RandomizedRunner$10.evaluate(RandomizedRunner.java:984)
	at com.carrotsearch.randomizedtesting.rules.SystemPropertiesRestoreRule$1.evaluate(SystemPropertiesRestoreRule.java:57)
	at org.apache.lucene.util.TestRuleSetupTeardownChained$1.evaluate(TestRuleSetupTeardownChained.java:49)
	at org.apache.lucene.util.AbstractBeforeAfterRule$1.evaluate(AbstractBeforeAfterRule.java:45)
	at org.apache.lucene.util.TestRuleThreadAndTestName$1.evaluate(TestRuleThreadAndTestName.java:48)
	at org.apache.lucene.util.TestRuleIgnoreAfterMaxFailures$1.evaluate(TestRuleIgnoreAfterMaxFailures.java:64)
	at org.apache.lucene.util.TestRuleMarkFailure$1.evaluate(TestRuleMarkFailure.java:47)
	at com.carrotsearch.randomizedtesting.rules.StatementAdapter.evaluate(StatementAdapter.java:36)
	at com.carrotsearch.randomizedtesting.ThreadLeakControl$StatementRunner.run(ThreadLeakControl.java:368)
	at com.carrotsearch.randomizedtesting.ThreadLeakControl.forkTimeoutingTask(ThreadLeakControl.java:817)
	at com.carrotsearch.randomizedtesting.ThreadLeakControl$3.evaluate(ThreadLeakControl.java:468)
	at com.carrotsearch.randomizedtesting.RandomizedRunner.runSingleTest(RandomizedRunner.java:943)
	at com.carrotsearch.randomizedtesting.RandomizedRunner$5.evaluate(RandomizedRunner.java:829)
	at com.carrotsearch.randomizedtesting.RandomizedRunner$6.evaluate(RandomizedRunner.java:879)
	at com.carrotsearch.randomizedtesting.RandomizedRunner$7.evaluate(RandomizedRunner.java:890)
	at com.carrotsearch.randomizedtesting.rules.StatementAdapter.evaluate(StatementAdapter.java:36)
	at com.carrotsearch.randomizedtesting.rules.SystemPropertiesRestoreRule$1.evaluate(SystemPropertiesRestoreRule.java:57)
	at org.apache.lucene.util.AbstractBeforeAfterRule$1.evaluate(AbstractBeforeAfterRule.java:45)
	at com.carrotsearch.randomizedtesting.rules.StatementAdapter.evaluate(StatementAdapter.java:36)
	at org.apache.lucene.util.TestRuleStoreClassName$1.evaluate(TestRuleStoreClassName.java:41)
	at com.carrotsearch.randomizedtesting.rules.NoShadowingOrOverridesOnMethodsRule$1.evaluate(NoShadowingOrOverridesOnMethodsRule.java:40)
	at com.carrotsearch.randomizedtesting.rules.NoShadowingOrOverridesOnMethodsRule$1.evaluate(NoShadowingOrOverridesOnMethodsRule.java:40)
	at com.carrotsearch.randomizedtesting.rules.StatementAdapter.evaluate(StatementAdapter.java:36)
	at com.carrotsearch.randomizedtesting.rules.StatementAdapter.evaluate(StatementAdapter.java:36)
	at com.carrotsearch.randomizedtesting.rules.StatementAdapter.evaluate(StatementAdapter.java:36)
	at org.apache.lucene.util.TestRuleAssertionsRequired$1.evaluate(TestRuleAssertionsRequired.java:53)
	at org.apache.lucene.util.TestRuleMarkFailure$1.evaluate(TestRuleMarkFailure.java:47)
	at org.apache.lucene.util.TestRuleIgnoreAfterMaxFailures$1.evaluate(TestRuleIgnoreAfterMaxFailures.java:64)
	at org.apache.lucene.util.TestRuleIgnoreTestSuites$1.evaluate(TestRuleIgnoreTestSuites.java:54)
	at com.carrotsearch.randomizedtesting.rules.StatementAdapter.evaluate(StatementAdapter.java:36)
	at com.carrotsearch.randomizedtesting.ThreadLeakControl$StatementRunner.run(ThreadLeakControl.java:368)
	at java.lang.Thread.run(Thread.java:748)


FAILED:  org.apache.solr.cloud.CustomCollectionTest.testRouteFieldForImplicitRouter

Error Message:
Collection not found: withShardField

Stack Trace:
org.apache.solr.common.SolrException: Collection not found: withShardField
	at __randomizedtesting.SeedInfo.seed([A3BFFE30E3B27591:F6EF16A24F4BBA61]:0)
	at org.apache.solr.client.solrj.impl.CloudSolrClient.requestWithRetryOnStaleState(CloudSolrClient.java:851)
	at org.apache.solr.client.solrj.impl.CloudSolrClient.request(CloudSolrClient.java:817)
	at org.apache.solr.client.solrj.SolrRequest.process(SolrRequest.java:194)
	at org.apache.solr.client.solrj.request.UpdateRequest.commit(UpdateRequest.java:233)
	at org.apache.solr.cloud.CustomCollectionTest.testRouteFieldForImplicitRouter(CustomCollectionTest.java:141)
	at sun.reflect.NativeMethodAccessorImpl.invoke0(Native Method)
	at sun.reflect.NativeMethodAccessorImpl.invoke(NativeMethodAccessorImpl.java:62)
	at sun.reflect.DelegatingMethodAccessorImpl.invoke(DelegatingMethodAccessorImpl.java:43)
	at java.lang.reflect.Method.invoke(Method.java:498)
	at com.carrotsearch.randomizedtesting.RandomizedRunner.invoke(RandomizedRunner.java:1737)
	at com.carrotsearch.randomizedtesting.RandomizedRunner$8.evaluate(RandomizedRunner.java:934)
	at com.carrotsearch.randomizedtesting.RandomizedRunner$9.evaluate(RandomizedRunner.java:970)
	at com.carrotsearch.randomizedtesting.RandomizedRunner$10.evaluate(RandomizedRunner.java:984)
	at com.carrotsearch.randomizedtesting.rules.SystemPropertiesRestoreRule$1.evaluate(SystemPropertiesRestoreRule.java:57)
	at org.apache.lucene.util.TestRuleSetupTeardownChained$1.evaluate(TestRuleSetupTeardownChained.java:49)
	at org.apache.lucene.util.AbstractBeforeAfterRule$1.evaluate(AbstractBeforeAfterRule.java:45)
	at org.apache.lucene.util.TestRuleThreadAndTestName$1.evaluate(TestRuleThreadAndTestName.java:48)
	at org.apache.lucene.util.TestRuleIgnoreAfterMaxFailures$1.evaluate(TestRuleIgnoreAfterMaxFailures.java:64)
	at org.apache.lucene.util.TestRuleMarkFailure$1.evaluate(TestRuleMarkFailure.java:47)
	at com.carrotsearch.randomizedtesting.rules.StatementAdapter.evaluate(StatementAdapter.java:36)
	at com.carrotsearch.randomizedtesting.ThreadLeakControl$StatementRunner.run(ThreadLeakControl.java:368)
	at com.carrotsearch.randomizedtesting.ThreadLeakControl.forkTimeoutingTask(ThreadLeakControl.java:817)
	at com.carrotsearch.randomizedtesting.ThreadLeakControl$3.evaluate(ThreadLeakControl.java:468)
	at com.carrotsearch.randomizedtesting.RandomizedRunner.runSingleTest(RandomizedRunner.java:943)
	at com.carrotsearch.randomizedtesting.RandomizedRunner$5.evaluate(RandomizedRunner.java:829)
	at com.carrotsearch.randomizedtesting.RandomizedRunner$6.evaluate(RandomizedRunner.java:879)
	at com.carrotsearch.randomizedtesting.RandomizedRunner$7.evaluate(RandomizedRunner.java:890)
	at com.carrotsearch.randomizedtesting.rules.StatementAdapter.evaluate(StatementAdapter.java:36)
	at com.carrotsearch.randomizedtesting.rules.SystemPropertiesRestoreRule$1.evaluate(SystemPropertiesRestoreRule.java:57)
	at org.apache.lucene.util.AbstractBeforeAfterRule$1.evaluate(AbstractBeforeAfterRule.java:45)
	at com.carrotsearch.randomizedtesting.rules.StatementAdapter.evaluate(StatementAdapter.java:36)
	at org.apache.lucene.util.TestRuleStoreClassName$1.evaluate(TestRuleStoreClassName.java:41)
	at com.carrotsearch.randomizedtesting.rules.NoShadowingOrOverridesOnMethodsRule$1.evaluate(NoShadowingOrOverridesOnMethodsRule.java:40)
	at com.carrotsearch.randomizedtesting.rules.NoShadowingOrOverridesOnMethodsRule$1.evaluate(NoShadowingOrOverridesOnMethodsRule.java:40)
	at com.carrotsearch.randomizedtesting.rules.StatementAdapter.evaluate(StatementAdapter.java:36)
	at com.carrotsearch.randomizedtesting.rules.StatementAdapter.evaluate(StatementAdapter.java:36)
	at com.carrotsearch.randomizedtesting.rules.StatementAdapter.evaluate(StatementAdapter.java:36)
	at org.apache.lucene.util.TestRuleAssertionsRequired$1.evaluate(TestRuleAssertionsRequired.java:53)
	at org.apache.lucene.util.TestRuleMarkFailure$1.evaluate(TestRuleMarkFailure.java:47)
	at org.apache.lucene.util.TestRuleIgnoreAfterMaxFailures$1.evaluate(TestRuleIgnoreAfterMaxFailures.java:64)
	at org.apache.lucene.util.TestRuleIgnoreTestSuites$1.evaluate(TestRuleIgnoreTestSuites.java:54)
	at com.carrotsearch.randomizedtesting.rules.StatementAdapter.evaluate(StatementAdapter.java:36)
	at com.carrotsearch.randomizedtesting.ThreadLeakControl$StatementRunner.run(ThreadLeakControl.java:368)
	at java.lang.Thread.run(Thread.java:748)


FAILED:  org.apache.solr.cloud.CustomCollectionTest.testRouteFieldForHashRouter

Error Message:
Collection not found: routeFieldColl

Stack Trace:
org.apache.solr.common.SolrException: Collection not found: routeFieldColl
	at __randomizedtesting.SeedInfo.seed([A3BFFE30E3B27591:B8960ED7CD39ECB]:0)
	at org.apache.solr.client.solrj.impl.CloudSolrClient.requestWithRetryOnStaleState(CloudSolrClient.java:851)
	at org.apache.solr.client.solrj.impl.CloudSolrClient.request(CloudSolrClient.java:817)
	at org.apache.solr.client.solrj.SolrRequest.process(SolrRequest.java:194)
	at org.apache.solr.client.solrj.request.UpdateRequest.commit(UpdateRequest.java:233)
	at org.apache.solr.cloud.CustomCollectionTest.testRouteFieldForHashRouter(CustomCollectionTest.java:166)
	at sun.reflect.NativeMethodAccessorImpl.invoke0(Native Method)
	at sun.reflect.NativeMethodAccessorImpl.invoke(NativeMethodAccessorImpl.java:62)
	at sun.reflect.DelegatingMethodAccessorImpl.invoke(DelegatingMethodAccessorImpl.java:43)
	at java.lang.reflect.Method.invoke(Method.java:498)
	at com.carrotsearch.randomizedtesting.RandomizedRunner.invoke(RandomizedRunner.java:1737)
	at com.carrotsearch.randomizedtesting.RandomizedRunner$8.evaluate(RandomizedRunner.java:934)
	at com.carrotsearch.randomizedtesting.RandomizedRunner$9.evaluate(RandomizedRunner.java:970)
	at com.carrotsearch.randomizedtesting.RandomizedRunner$10.evaluate(RandomizedRunner.java:984)
	at com.carrotsearch.randomizedtesting.rules.SystemPropertiesRestoreRule$1.evaluate(SystemPropertiesRestoreRule.java:57)
	at org.apache.lucene.util.TestRuleSetupTeardownChained$1.evaluate(TestRuleSetupTeardownChained.java:49)
	at org.apache.lucene.util.AbstractBeforeAfterRule$1.evaluate(AbstractBeforeAfterRule.java:45)
	at org.apache.lucene.util.TestRuleThreadAndTestName$1.evaluate(TestRuleThreadAndTestName.java:48)
	at org.apache.lucene.util.TestRuleIgnoreAfterMaxFailures$1.evaluate(TestRuleIgnoreAfterMaxFailures.java:64)
	at org.apache.lucene.util.TestRuleMarkFailure$1.evaluate(TestRuleMarkFailure.java:47)
	at com.carrotsearch.randomizedtesting.rules.StatementAdapter.evaluate(StatementAdapter.java:36)
	at com.carrotsearch.randomizedtesting.ThreadLeakControl$StatementRunner.run(ThreadLeakControl.java:368)
	at com.carrotsearch.randomizedtesting.ThreadLeakControl.forkTimeoutingTask(ThreadLeakControl.java:817)
	at com.carrotsearch.randomizedtesting.ThreadLeakControl$3.evaluate(ThreadLeakControl.java:468)
	at com.carrotsearch.randomizedtesting.RandomizedRunner.runSingleTest(RandomizedRunner.java:943)
	at com.carrotsearch.randomizedtesting.RandomizedRunner$5.evaluate(RandomizedRunner.java:829)
	at com.carrotsearch.randomizedtesting.RandomizedRunner$6.evaluate(RandomizedRunner.java:879)
	at com.carrotsearch.randomizedtesting.RandomizedRunner$7.evaluate(RandomizedRunner.java:890)
	at com.carrotsearch.randomizedtesting.rules.StatementAdapter.evaluate(StatementAdapter.java:36)
	at com.carrotsearch.randomizedtesting.rules.SystemPropertiesRestoreRule$1.evaluate(SystemPropertiesRestoreRule.java:57)
	at org.apache.lucene.util.AbstractBeforeAfterRule$1.evaluate(AbstractBeforeAfterRule.java:45)
	at com.carrotsearch.randomizedtesting.rules.StatementAdapter.evaluate(StatementAdapter.java:36)
	at org.apache.lucene.util.TestRuleStoreClassName$1.evaluate(TestRuleStoreClassName.java:41)
	at com.carrotsearch.randomizedtesting.rules.NoShadowingOrOverridesOnMethodsRule$1.evaluate(NoShadowingOrOverridesOnMethodsRule.java:40)
	at com.carrotsearch.randomizedtesting.rules.NoShadowingOrOverridesOnMethodsRule$1.evaluate(NoShadowingOrOverridesOnMethodsRule.java:40)
	at com.carrotsearch.randomizedtesting.rules.StatementAdapter.evaluate(StatementAdapter.java:36)
	at com.carrotsearch.randomizedtesting.rules.StatementAdapter.evaluate(StatementAdapter.java:36)
	at com.carrotsearch.randomizedtesting.rules.StatementAdapter.evaluate(StatementAdapter.java:36)
	at org.apache.lucene.util.TestRuleAssertionsRequired$1.evaluate(TestRuleAssertionsRequired.java:53)
	at org.apache.lucene.util.TestRuleMarkFailure$1.evaluate(TestRuleMarkFailure.java:47)
	at org.apache.lucene.util.TestRuleIgnoreAfterMaxFailures$1.evaluate(TestRuleIgnoreAfterMaxFailures.java:64)
	at org.apache.lucene.util.TestRuleIgnoreTestSuites$1.evaluate(TestRuleIgnoreTestSuites.java:54)
	at com.carrotsearch.randomizedtesting.rules.StatementAdapter.evaluate(StatementAdapter.java:36)
	at com.carrotsearch.randomizedtesting.ThreadLeakControl$StatementRunner.run(ThreadLeakControl.java:368)
	at java.lang.Thread.run(Thread.java:748)


FAILED:  org.apache.solr.cloud.MultiThreadedOCPTest.test

Error Message:
Task 3001 did not complete, final state: FAILED expected same:<COMPLETED> was not:<FAILED>

Stack Trace:
java.lang.AssertionError: Task 3001 did not complete, final state: FAILED expected same:<COMPLETED> was not:<FAILED>
	at __randomizedtesting.SeedInfo.seed([A3BFFE30E3B27591:2BEBC1EA4D4E1869]:0)
	at org.junit.Assert.fail(Assert.java:93)
	at org.junit.Assert.failNotSame(Assert.java:641)
	at org.junit.Assert.assertSame(Assert.java:580)
	at org.apache.solr.cloud.MultiThreadedOCPTest.testDeduplicationOfSubmittedTasks(MultiThreadedOCPTest.java:227)
	at org.apache.solr.cloud.MultiThreadedOCPTest.test(MultiThreadedOCPTest.java:65)
	at sun.reflect.NativeMethodAccessorImpl.invoke0(Native Method)
	at sun.reflect.NativeMethodAccessorImpl.invoke(NativeMethodAccessorImpl.java:62)
	at sun.reflect.DelegatingMethodAccessorImpl.invoke(DelegatingMethodAccessorImpl.java:43)
	at java.lang.reflect.Method.invoke(Method.java:498)
	at com.carrotsearch.randomizedtesting.RandomizedRunner.invoke(RandomizedRunner.java:1737)
	at com.carrotsearch.randomizedtesting.RandomizedRunner$8.evaluate(RandomizedRunner.java:934)
	at com.carrotsearch.randomizedtesting.RandomizedRunner$9.evaluate(RandomizedRunner.java:970)
	at com.carrotsearch.randomizedtesting.RandomizedRunner$10.evaluate(RandomizedRunner.java:984)
	at org.apache.solr.BaseDistributedSearchTestCase$ShardsRepeatRule$ShardsFixedStatement.callStatement(BaseDistributedSearchTestCase.java:993)
	at org.apache.solr.BaseDistributedSearchTestCase$ShardsRepeatRule$ShardsStatement.evaluate(BaseDistributedSearchTestCase.java:968)
	at com.carrotsearch.randomizedtesting.rules.SystemPropertiesRestoreRule$1.evaluate(SystemPropertiesRestoreRule.java:57)
	at org.apache.lucene.util.TestRuleSetupTeardownChained$1.evaluate(TestRuleSetupTeardownChained.java:49)
	at org.apache.lucene.util.AbstractBeforeAfterRule$1.evaluate(AbstractBeforeAfterRule.java:45)
	at org.apache.lucene.util.TestRuleThreadAndTestName$1.evaluate(TestRuleThreadAndTestName.java:48)
	at org.apache.lucene.util.TestRuleIgnoreAfterMaxFailures$1.evaluate(TestRuleIgnoreAfterMaxFailures.java:64)
	at org.apache.lucene.util.TestRuleMarkFailure$1.evaluate(TestRuleMarkFailure.java:47)
	at com.carrotsearch.randomizedtesting.rules.StatementAdapter.evaluate(StatementAdapter.java:36)
	at com.carrotsearch.randomizedtesting.ThreadLeakControl$StatementRunner.run(ThreadLeakControl.java:368)
	at com.carrotsearch.randomizedtesting.ThreadLeakControl.forkTimeoutingTask(ThreadLeakControl.java:817)
	at com.carrotsearch.randomizedtesting.ThreadLeakControl$3.evaluate(ThreadLeakControl.java:468)
	at com.carrotsearch.randomizedtesting.RandomizedRunner.runSingleTest(RandomizedRunner.java:943)
	at com.carrotsearch.randomizedtesting.RandomizedRunner$5.evaluate(RandomizedRunner.java:829)
	at com.carrotsearch.randomizedtesting.RandomizedRunner$6.evaluate(RandomizedRunner.java:879)
	at com.carrotsearch.randomizedtesting.RandomizedRunner$7.evaluate(RandomizedRunner.java:890)
	at com.carrotsearch.randomizedtesting.rules.StatementAdapter.evaluate(StatementAdapter.java:36)
	at com.carrotsearch.randomizedtesting.rules.SystemPropertiesRestoreRule$1.evaluate(SystemPropertiesRestoreRule.java:57)
	at org.apache.lucene.util.AbstractBeforeAfterRule$1.evaluate(AbstractBeforeAfterRule.java:45)
	at com.carrotsearch.randomizedtesting.rules.StatementAdapter.evaluate(StatementAdapter.java:36)
	at org.apache.lucene.util.TestRuleStoreClassName$1.evaluate(TestRuleStoreClassName.java:41)
	at com.carrotsearch.randomizedtesting.rules.NoShadowingOrOverridesOnMethodsRule$1.evaluate(NoShadowingOrOverridesOnMethodsRule.java:40)
	at com.carrotsearch.randomizedtesting.rules.NoShadowingOrOverridesOnMethodsRule$1.evaluate(NoShadowingOrOverridesOnMethodsRule.java:40)
	at com.carrotsearch.randomizedtesting.rules.StatementAdapter.evaluate(StatementAdapter.java:36)
	at com.carrotsearch.randomizedtesting.rules.StatementAdapter.evaluate(StatementAdapter.java:36)
	at com.carrotsearch.randomizedtesting.rules.StatementAdapter.evaluate(StatementAdapter.java:36)
	at org.apache.lucene.util.TestRuleAssertionsRequired$1.evaluate(TestRuleAssertionsRequired.java:53)
	at org.apache.lucene.util.TestRuleMarkFailure$1.evaluate(TestRuleMarkFailure.java:47)
	at org.apache.lucene.util.TestRuleIgnoreAfterMaxFailures$1.evaluate(TestRuleIgnoreAfterMaxFailures.java:64)
	at org.apache.lucene.util.TestRuleIgnoreTestSuites$1.evaluate(TestRuleIgnoreTestSuites.java:54)
	at com.carrotsearch.randomizedtesting.rules.StatementAdapter.evaluate(StatementAdapter.java:36)
	at com.carrotsearch.randomizedtesting.ThreadLeakControl$StatementRunner.run(ThreadLeakControl.java:368)
	at java.lang.Thread.run(Thread.java:748)


FAILED:  org.apache.solr.cloud.RollingRestartTest.test

Error Message:
Failed to list contents of /Users/jenkins/workspace/Lucene-Solr-7.x-MacOSX/solr/core/src/test-files/solr

Stack Trace:
java.io.IOException: Failed to list contents of /Users/jenkins/workspace/Lucene-Solr-7.x-MacOSX/solr/core/src/test-files/solr
	at __randomizedtesting.SeedInfo.seed([A3BFFE30E3B27591:2BEBC1EA4D4E1869]:0)
	at org.apache.commons.io.FileUtils.doCopyDirectory(FileUtils.java:1426)
	at org.apache.commons.io.FileUtils.copyDirectory(FileUtils.java:1388)
	at org.apache.commons.io.FileUtils.copyDirectory(FileUtils.java:1268)
	at org.apache.commons.io.FileUtils.copyDirectory(FileUtils.java:1237)
	at org.apache.solr.BaseDistributedSearchTestCase.seedSolrHome(BaseDistributedSearchTestCase.java:1100)
	at org.apache.solr.BaseDistributedSearchTestCase.setupJettySolrHome(BaseDistributedSearchTestCase.java:1125)
	at org.apache.solr.cloud.AbstractFullDistribZkTestBase.createJettys(AbstractFullDistribZkTestBase.java:395)
	at org.apache.solr.cloud.AbstractFullDistribZkTestBase.createServers(AbstractFullDistribZkTestBase.java:334)
	at org.apache.solr.BaseDistributedSearchTestCase$ShardsRepeatRule$ShardsFixedStatement.callStatement(BaseDistributedSearchTestCase.java:991)
	at org.apache.solr.BaseDistributedSearchTestCase$ShardsRepeatRule$ShardsStatement.evaluate(BaseDistributedSearchTestCase.java:968)
	at com.carrotsearch.randomizedtesting.rules.SystemPropertiesRestoreRule$1.evaluate(SystemPropertiesRestoreRule.java:57)
	at org.apache.lucene.util.TestRuleSetupTeardownChained$1.evaluate(TestRuleSetupTeardownChained.java:49)
	at org.apache.lucene.util.AbstractBeforeAfterRule$1.evaluate(AbstractBeforeAfterRule.java:45)
	at org.apache.lucene.util.TestRuleThreadAndTestName$1.evaluate(TestRuleThreadAndTestName.java:48)
	at org.apache.lucene.util.TestRuleIgnoreAfterMaxFailures$1.evaluate(TestRuleIgnoreAfterMaxFailures.java:64)
	at org.apache.lucene.util.TestRuleMarkFailure$1.evaluate(TestRuleMarkFailure.java:47)
	at com.carrotsearch.randomizedtesting.rules.StatementAdapter.evaluate(StatementAdapter.java:36)
	at com.carrotsearch.randomizedtesting.ThreadLeakControl$StatementRunner.run(ThreadLeakControl.java:368)
	at com.carrotsearch.randomizedtesting.ThreadLeakControl.forkTimeoutingTask(ThreadLeakControl.java:817)
	at com.carrotsearch.randomizedtesting.ThreadLeakControl$3.evaluate(ThreadLeakControl.java:468)
	at com.carrotsearch.randomizedtesting.RandomizedRunner.runSingleTest(RandomizedRunner.java:943)
	at com.carrotsearch.randomizedtesting.RandomizedRunner$5.evaluate(RandomizedRunner.java:829)
	at com.carrotsearch.randomizedtesting.RandomizedRunner$6.evaluate(RandomizedRunner.java:879)
	at com.carrotsearch.randomizedtesting.RandomizedRunner$7.evaluate(RandomizedRunner.java:890)
	at com.carrotsearch.randomizedtesting.rules.StatementAdapter.evaluate(StatementAdapter.java:36)
	at com.carrotsearch.randomizedtesting.rules.SystemPropertiesRestoreRule$1.evaluate(SystemPropertiesRestoreRule.java:57)
	at org.apache.lucene.util.AbstractBeforeAfterRule$1.evaluate(AbstractBeforeAfterRule.java:45)
	at com.carrotsearch.randomizedtesting.rules.StatementAdapter.evaluate(StatementAdapter.java:36)
	at org.apache.lucene.util.TestRuleStoreClassName$1.evaluate(TestRuleStoreClassName.java:41)
	at com.carrotsearch.randomizedtesting.rules.NoShadowingOrOverridesOnMethodsRule$1.evaluate(NoShadowingOrOverridesOnMethodsRule.java:40)
	at com.carrotsearch.randomizedtesting.rules.NoShadowingOrOverridesOnMethodsRule$1.evaluate(NoShadowingOrOverridesOnMethodsRule.java:40)
	at com.carrotsearch.randomizedtesting.rules.StatementAdapter.evaluate(StatementAdapter.java:36)
	at com.carrotsearch.randomizedtesting.rules.StatementAdapter.evaluate(StatementAdapter.java:36)
	at com.carrotsearch.randomizedtesting.rules.StatementAdapter.evaluate(StatementAdapter.java:36)
	at org.apache.lucene.util.TestRuleAssertionsRequired$1.evaluate(TestRuleAssertionsRequired.java:53)
	at org.apache.lucene.util.TestRuleMarkFailure$1.evaluate(TestRuleMarkFailure.java:47)
	at org.apache.lucene.util.TestRuleIgnoreAfterMaxFailures$1.evaluate(TestRuleIgnoreAfterMaxFailures.java:64)
	at org.apache.lucene.util.TestRuleIgnoreTestSuites$1.evaluate(TestRuleIgnoreTestSuites.java:54)
	at com.carrotsearch.randomizedtesting.rules.StatementAdapter.evaluate(StatementAdapter.java:36)
	at com.carrotsearch.randomizedtesting.ThreadLeakControl$StatementRunner.run(ThreadLeakControl.java:368)
	at java.lang.Thread.run(Thread.java:748)


FAILED:  junit.framework.TestSuite.org.apache.solr.cloud.SolrCLIZkUtilsTest

Error Message:
java.io.IOException: Couldn't instantiate org.apache.zookeeper.ClientCnxnSocketNIO

Stack Trace:
org.apache.solr.common.SolrException: java.io.IOException: Couldn't instantiate org.apache.zookeeper.ClientCnxnSocketNIO
	at __randomizedtesting.SeedInfo.seed([A3BFFE30E3B27591]:0)
	at org.apache.solr.common.cloud.SolrZkClient.<init>(SolrZkClient.java:170)
	at org.apache.solr.common.cloud.SolrZkClient.<init>(SolrZkClient.java:119)
	at org.apache.solr.common.cloud.SolrZkClient.<init>(SolrZkClient.java:114)
	at org.apache.solr.common.cloud.SolrZkClient.<init>(SolrZkClient.java:101)
	at org.apache.solr.cloud.MiniSolrCloudCluster.waitForAllNodes(MiniSolrCloudCluster.java:268)
	at org.apache.solr.cloud.MiniSolrCloudCluster.<init>(MiniSolrCloudCluster.java:262)
	at org.apache.solr.cloud.SolrCloudTestCase$Builder.configure(SolrCloudTestCase.java:190)
	at org.apache.solr.cloud.SolrCLIZkUtilsTest.setupCluster(SolrCLIZkUtilsTest.java:50)
	at sun.reflect.NativeMethodAccessorImpl.invoke0(Native Method)
	at sun.reflect.NativeMethodAccessorImpl.invoke(NativeMethodAccessorImpl.java:62)
	at sun.reflect.DelegatingMethodAccessorImpl.invoke(DelegatingMethodAccessorImpl.java:43)
	at java.lang.reflect.Method.invoke(Method.java:498)
	at com.carrotsearch.randomizedtesting.RandomizedRunner.invoke(RandomizedRunner.java:1737)
	at com.carrotsearch.randomizedtesting.RandomizedRunner$6.evaluate(RandomizedRunner.java:874)
	at com.carrotsearch.randomizedtesting.RandomizedRunner$7.evaluate(RandomizedRunner.java:890)
	at com.carrotsearch.randomizedtesting.rules.StatementAdapter.evaluate(StatementAdapter.java:36)
	at com.carrotsearch.randomizedtesting.rules.SystemPropertiesRestoreRule$1.evaluate(SystemPropertiesRestoreRule.java:57)
	at org.apache.lucene.util.AbstractBeforeAfterRule$1.evaluate(AbstractBeforeAfterRule.java:45)
	at com.carrotsearch.randomizedtesting.rules.StatementAdapter.evaluate(StatementAdapter.java:36)
	at org.apache.lucene.util.TestRuleStoreClassName$1.evaluate(TestRuleStoreClassName.java:41)
	at com.carrotsearch.randomizedtesting.rules.NoShadowingOrOverridesOnMethodsRule$1.evaluate(NoShadowingOrOverridesOnMethodsRule.java:40)
	at com.carrotsearch.randomizedtesting.rules.NoShadowingOrOverridesOnMethodsRule$1.evaluate(NoShadowingOrOverridesOnMethodsRule.java:40)
	at com.carrotsearch.randomizedtesting.rules.StatementAdapter.evaluate(StatementAdapter.java:36)
	at com.carrotsearch.randomizedtesting.rules.StatementAdapter.evaluate(StatementAdapter.java:36)
	at com.carrotsearch.randomizedtesting.rules.StatementAdapter.evaluate(StatementAdapter.java:36)
	at org.apache.lucene.util.TestRuleAssertionsRequired$1.evaluate(TestRuleAssertionsRequired.java:53)
	at org.apache.lucene.util.TestRuleMarkFailure$1.evaluate(TestRuleMarkFailure.java:47)
	at org.apache.lucene.util.TestRuleIgnoreAfterMaxFailures$1.evaluate(TestRuleIgnoreAfterMaxFailures.java:64)
	at org.apache.lucene.util.TestRuleIgnoreTestSuites$1.evaluate(TestRuleIgnoreTestSuites.java:54)
	at com.carrotsearch.randomizedtesting.rules.StatementAdapter.evaluate(StatementAdapter.java:36)
	at com.carrotsearch.randomizedtesting.ThreadLeakControl$StatementRunner.run(ThreadLeakControl.java:368)
	at java.lang.Thread.run(Thread.java:748)
Caused by: java.io.IOException: Couldn't instantiate org.apache.zookeeper.ClientCnxnSocketNIO
	at org.apache.zookeeper.ZooKeeper.getClientCnxnSocket(ZooKeeper.java:1842)
	at org.apache.zookeeper.ZooKeeper.<init>(ZooKeeper.java:447)
	at org.apache.zookeeper.ZooKeeper.<init>(ZooKeeper.java:380)
	at org.apache.solr.common.cloud.SolrZooKeeper.<init>(SolrZooKeeper.java:43)
	at org.apache.solr.common.cloud.ZkClientConnectionStrategy.createSolrZooKeeper(ZkClientConnectionStrategy.java:105)
	at org.apache.solr.common.cloud.DefaultConnectionStrategy.connect(DefaultConnectionStrategy.java:37)
	at org.apache.solr.common.cloud.SolrZkClient.<init>(SolrZkClient.java:148)
	... 31 more
Caused by: java.io.IOException: Too many open files
	at sun.nio.ch.KQueueArrayWrapper.init(Native Method)
	at sun.nio.ch.KQueueArrayWrapper.<init>(KQueueArrayWrapper.java:98)
	at sun.nio.ch.KQueueSelectorImpl.<init>(KQueueSelectorImpl.java:88)
	at sun.nio.ch.KQueueSelectorProvider.openSelector(KQueueSelectorProvider.java:42)
	at java.nio.channels.Selector.open(Selector.java:227)
	at org.apache.zookeeper.ClientCnxnSocketNIO.<init>(ClientCnxnSocketNIO.java:43)
	at sun.reflect.GeneratedConstructorAccessor36.newInstance(Unknown Source)
	at sun.reflect.DelegatingConstructorAccessorImpl.newInstance(DelegatingConstructorAccessorImpl.java:45)
	at java.lang.reflect.Constructor.newInstance(Constructor.java:423)
	at java.lang.Class.newInstance(Class.java:442)
	at org.apache.zookeeper.ZooKeeper.getClientCnxnSocket(ZooKeeper.java:1839)
	... 37 more


FAILED:  junit.framework.TestSuite.org.apache.solr.cloud.SolrCLIZkUtilsTest

Error Message:


Stack Trace:
java.lang.NullPointerException
	at __randomizedtesting.SeedInfo.seed([A3BFFE30E3B27591]:0)
	at org.apache.solr.cloud.SolrCLIZkUtilsTest.closeConn(SolrCLIZkUtilsTest.java:58)
	at sun.reflect.NativeMethodAccessorImpl.invoke0(Native Method)
	at sun.reflect.NativeMethodAccessorImpl.invoke(NativeMethodAccessorImpl.java:62)
	at sun.reflect.DelegatingMethodAccessorImpl.invoke(DelegatingMethodAccessorImpl.java:43)
	at java.lang.reflect.Method.invoke(Method.java:498)
	at com.carrotsearch.randomizedtesting.RandomizedRunner.invoke(RandomizedRunner.java:1737)
	at com.carrotsearch.randomizedtesting.RandomizedRunner$7.evaluate(RandomizedRunner.java:897)
	at com.carrotsearch.randomizedtesting.rules.StatementAdapter.evaluate(StatementAdapter.java:36)
	at com.carrotsearch.randomizedtesting.rules.SystemPropertiesRestoreRule$1.evaluate(SystemPropertiesRestoreRule.java:57)
	at org.apache.lucene.util.AbstractBeforeAfterRule$1.evaluate(AbstractBeforeAfterRule.java:45)
	at com.carrotsearch.randomizedtesting.rules.StatementAdapter.evaluate(StatementAdapter.java:36)
	at org.apache.lucene.util.TestRuleStoreClassName$1.evaluate(TestRuleStoreClassName.java:41)
	at com.carrotsearch.randomizedtesting.rules.NoShadowingOrOverridesOnMethodsRule$1.evaluate(NoShadowingOrOverridesOnMethodsRule.java:40)
	at com.carrotsearch.randomizedtesting.rules.NoShadowingOrOverridesOnMethodsRule$1.evaluate(NoShadowingOrOverridesOnMethodsRule.java:40)
	at com.carrotsearch.randomizedtesting.rules.StatementAdapter.evaluate(StatementAdapter.java:36)
	at com.carrotsearch.randomizedtesting.rules.StatementAdapter.evaluate(StatementAdapter.java:36)
	at com.carrotsearch.randomizedtesting.rules.StatementAdapter.evaluate(StatementAdapter.java:36)
	at org.apache.lucene.util.TestRuleAssertionsRequired$1.evaluate(TestRuleAssertionsRequired.java:53)
	at org.apache.lucene.util.TestRuleMarkFailure$1.evaluate(TestRuleMarkFailure.java:47)
	at org.apache.lucene.util.TestRuleIgnoreAfterMaxFailures$1.evaluate(TestRuleIgnoreAfterMaxFailures.java:64)
	at org.apache.lucene.util.TestRuleIgnoreTestSuites$1.evaluate(TestRuleIgnoreTestSuites.java:54)
	at com.carrotsearch.randomizedtesting.rules.StatementAdapter.evaluate(StatementAdapter.java:36)
	at com.carrotsearch.randomizedtesting.ThreadLeakControl$StatementRunner.run(ThreadLeakControl.java:368)
	at java.lang.Thread.run(Thread.java:748)


FAILED:  junit.framework.TestSuite.org.apache.solr.cloud.SolrCLIZkUtilsTest

Error Message:
ObjectTracker found 2 object(s) that were not released!!! [InternalHttpClient, InternalHttpClient] org.apache.solr.common.util.ObjectReleaseTracker$ObjectTrackerException: org.apache.http.impl.client.InternalHttpClient  at org.apache.solr.common.util.ObjectReleaseTracker.track(ObjectReleaseTracker.java:42)  at org.apache.solr.client.solrj.impl.HttpClientUtil.createClient(HttpClientUtil.java:289)  at org.apache.solr.update.UpdateShardHandler.<init>(UpdateShardHandler.java:94)  at org.apache.solr.core.CoreContainer.load(CoreContainer.java:509)  at org.apache.solr.servlet.SolrDispatchFilter.createCoreContainer(SolrDispatchFilter.java:263)  at org.apache.solr.servlet.SolrDispatchFilter.init(SolrDispatchFilter.java:183)  at org.eclipse.jetty.servlet.FilterHolder.initialize(FilterHolder.java:139)  at org.eclipse.jetty.servlet.ServletHandler.initialize(ServletHandler.java:873)  at org.eclipse.jetty.servlet.ServletHandler.updateMappings(ServletHandler.java:1596)  at org.eclipse.jetty.servlet.ServletHandler.setFilterMappings(ServletHandler.java:1659)  at org.eclipse.jetty.servlet.ServletHandler.addFilterMapping(ServletHandler.java:1316)  at org.eclipse.jetty.servlet.ServletHandler.addFilterWithMapping(ServletHandler.java:1145)  at org.eclipse.jetty.servlet.ServletContextHandler.addFilter(ServletContextHandler.java:448)  at org.apache.solr.client.solrj.embedded.JettySolrRunner$1.lifeCycleStarted(JettySolrRunner.java:306)  at org.eclipse.jetty.util.component.AbstractLifeCycle.setStarted(AbstractLifeCycle.java:179)  at org.eclipse.jetty.util.component.AbstractLifeCycle.start(AbstractLifeCycle.java:69)  at org.apache.solr.client.solrj.embedded.JettySolrRunner.start(JettySolrRunner.java:394)  at org.apache.solr.client.solrj.embedded.JettySolrRunner.start(JettySolrRunner.java:367)  at org.apache.solr.cloud.MiniSolrCloudCluster.startJettySolrRunner(MiniSolrCloudCluster.java:384)  at org.apache.solr.cloud.MiniSolrCloudCluster.lambda$new$0(MiniSolrCloudCluster.java:247)  at java.util.concurrent.FutureTask.run(FutureTask.java:266)  at org.apache.solr.common.util.ExecutorUtil$MDCAwareThreadPoolExecutor.lambda$execute$0(ExecutorUtil.java:188)  at java.util.concurrent.ThreadPoolExecutor.runWorker(ThreadPoolExecutor.java:1149)  at java.util.concurrent.ThreadPoolExecutor$Worker.run(ThreadPoolExecutor.java:624)  at java.lang.Thread.run(Thread.java:748)  org.apache.solr.common.util.ObjectReleaseTracker$ObjectTrackerException: org.apache.http.impl.client.InternalHttpClient  at org.apache.solr.common.util.ObjectReleaseTracker.track(ObjectReleaseTracker.java:42)  at org.apache.solr.client.solrj.impl.HttpClientUtil.createClient(HttpClientUtil.java:289)  at org.apache.solr.handler.component.HttpShardHandlerFactory.init(HttpShardHandlerFactory.java:209)  at org.apache.solr.handler.component.ShardHandlerFactory.newInstance(ShardHandlerFactory.java:47)  at org.apache.solr.core.CoreContainer.load(CoreContainer.java:503)  at org.apache.solr.servlet.SolrDispatchFilter.createCoreContainer(SolrDispatchFilter.java:263)  at org.apache.solr.servlet.SolrDispatchFilter.init(SolrDispatchFilter.java:183)  at org.eclipse.jetty.servlet.FilterHolder.initialize(FilterHolder.java:139)  at org.eclipse.jetty.servlet.ServletHandler.initialize(ServletHandler.java:873)  at org.eclipse.jetty.servlet.ServletHandler.updateMappings(ServletHandler.java:1596)  at org.eclipse.jetty.servlet.ServletHandler.setFilterMappings(ServletHandler.java:1659)  at org.eclipse.jetty.servlet.ServletHandler.addFilterMapping(ServletHandler.java:1316)  at org.eclipse.jetty.servlet.ServletHandler.addFilterWithMapping(ServletHandler.java:1145)  at org.eclipse.jetty.servlet.ServletContextHandler.addFilter(ServletContextHandler.java:448)  at org.apache.solr.client.solrj.embedded.JettySolrRunner$1.lifeCycleStarted(JettySolrRunner.java:306)  at org.eclipse.jetty.util.component.AbstractLifeCycle.setStarted(AbstractLifeCycle.java:179)  at org.eclipse.jetty.util.component.AbstractLifeCycle.start(AbstractLifeCycle.java:69)  at org.apache.solr.client.solrj.embedded.JettySolrRunner.start(JettySolrRunner.java:394)  at org.apache.solr.client.solrj.embedded.JettySolrRunner.start(JettySolrRunner.java:367)  at org.apache.solr.cloud.MiniSolrCloudCluster.startJettySolrRunner(MiniSolrCloudCluster.java:384)  at org.apache.solr.cloud.MiniSolrCloudCluster.lambda$new$0(MiniSolrCloudCluster.java:247)  at java.util.concurrent.FutureTask.run(FutureTask.java:266)  at org.apache.solr.common.util.ExecutorUtil$MDCAwareThreadPoolExecutor.lambda$execute$0(ExecutorUtil.java:188)  at java.util.concurrent.ThreadPoolExecutor.runWorker(ThreadPoolExecutor.java:1149)  at java.util.concurrent.ThreadPoolExecutor$Worker.run(ThreadPoolExecutor.java:624)  at java.lang.Thread.run(Thread.java:748)  

Stack Trace:
java.lang.AssertionError: ObjectTracker found 2 object(s) that were not released!!! [InternalHttpClient, InternalHttpClient]
org.apache.solr.common.util.ObjectReleaseTracker$ObjectTrackerException: org.apache.http.impl.client.InternalHttpClient
	at org.apache.solr.common.util.ObjectReleaseTracker.track(ObjectReleaseTracker.java:42)
	at org.apache.solr.client.solrj.impl.HttpClientUtil.createClient(HttpClientUtil.java:289)
	at org.apache.solr.update.UpdateShardHandler.<init>(UpdateShardHandler.java:94)
	at org.apache.solr.core.CoreContainer.load(CoreContainer.java:509)
	at org.apache.solr.servlet.SolrDispatchFilter.createCoreContainer(SolrDispatchFilter.java:263)
	at org.apache.solr.servlet.SolrDispatchFilter.init(SolrDispatchFilter.java:183)
	at org.eclipse.jetty.servlet.FilterHolder.initialize(FilterHolder.java:139)
	at org.eclipse.jetty.servlet.ServletHandler.initialize(ServletHandler.java:873)
	at org.eclipse.jetty.servlet.ServletHandler.updateMappings(ServletHandler.java:1596)
	at org.eclipse.jetty.servlet.ServletHandler.setFilterMappings(ServletHandler.java:1659)
	at org.eclipse.jetty.servlet.ServletHandler.addFilterMapping(ServletHandler.java:1316)
	at org.eclipse.jetty.servlet.ServletHandler.addFilterWithMapping(ServletHandler.java:1145)
	at org.eclipse.jetty.servlet.ServletContextHandler.addFilter(ServletContextHandler.java:448)
	at org.apache.solr.client.solrj.embedded.JettySolrRunner$1.lifeCycleStarted(JettySolrRunner.java:306)
	at org.eclipse.jetty.util.component.AbstractLifeCycle.setStarted(AbstractLifeCycle.java:179)
	at org.eclipse.jetty.util.component.AbstractLifeCycle.start(AbstractLifeCycle.java:69)
	at org.apache.solr.client.solrj.embedded.JettySolrRunner.start(JettySolrRunner.java:394)
	at org.apache.solr.client.solrj.embedded.JettySolrRunner.start(JettySolrRunner.java:367)
	at org.apache.solr.cloud.MiniSolrCloudCluster.startJettySolrRunner(MiniSolrCloudCluster.java:384)
	at org.apache.solr.cloud.MiniSolrCloudCluster.lambda$new$0(MiniSolrCloudCluster.java:247)
	at java.util.concurrent.FutureTask.run(FutureTask.java:266)
	at org.apache.solr.common.util.ExecutorUtil$MDCAwareThreadPoolExecutor.lambda$execute$0(ExecutorUtil.java:188)
	at java.util.concurrent.ThreadPoolExecutor.runWorker(ThreadPoolExecutor.java:1149)
	at java.util.concurrent.ThreadPoolExecutor$Worker.run(ThreadPoolExecutor.java:624)
	at java.lang.Thread.run(Thread.java:748)

org.apache.solr.common.util.ObjectReleaseTracker$ObjectTrackerException: org.apache.http.impl.client.InternalHttpClient
	at org.apache.solr.common.util.ObjectReleaseTracker.track(ObjectReleaseTracker.java:42)
	at org.apache.solr.client.solrj.impl.HttpClientUtil.createClient(HttpClientUtil.java:289)
	at org.apache.solr.handler.component.HttpShardHandlerFactory.init(HttpShardHandlerFactory.java:209)
	at org.apache.solr.handler.component.ShardHandlerFactory.newInstance(ShardHandlerFactory.java:47)
	at org.apache.solr.core.CoreContainer.load(CoreContainer.java:503)
	at org.apache.solr.servlet.SolrDispatchFilter.createCoreContainer(SolrDispatchFilter.java:263)
	at org.apache.solr.servlet.SolrDispatchFilter.init(SolrDispatchFilter.java:183)
	at org.eclipse.jetty.servlet.FilterHolder.initialize(FilterHolder.java:139)
	at org.eclipse.jetty.servlet.ServletHandler.initialize(ServletHandler.java:873)
	at org.eclipse.jetty.servlet.ServletHandler.updateMappings(ServletHandler.java:1596)
	at org.eclipse.jetty.servlet.ServletHandler.setFilterMappings(ServletHandler.java:1659)
	at org.eclipse.jetty.servlet.ServletHandler.addFilterMapping(ServletHandler.java:1316)
	at org.eclipse.jetty.servlet.ServletHandler.addFilterWithMapping(ServletHandler.java:1145)
	at org.eclipse.jetty.servlet.ServletContextHandler.addFilter(ServletContextHandler.java:448)
	at org.apache.solr.client.solrj.embedded.JettySolrRunner$1.lifeCycleStarted(JettySolrRunner.java:306)
	at org.eclipse.jetty.util.component.AbstractLifeCycle.setStarted(AbstractLifeCycle.java:179)
	at org.eclipse.jetty.util.component.AbstractLifeCycle.start(AbstractLifeCycle.java:69)
	at org.apache.solr.client.solrj.embedded.JettySolrRunner.start(JettySolrRunner.java:394)
	at org.apache.solr.client.solrj.embedded.JettySolrRunner.start(JettySolrRunner.java:367)
	at org.apache.solr.cloud.MiniSolrCloudCluster.startJettySolrRunner(MiniSolrCloudCluster.java:384)
	at org.apache.solr.cloud.MiniSolrCloudCluster.lambda$new$0(MiniSolrCloudCluster.java:247)
	at java.util.concurrent.FutureTask.run(FutureTask.java:266)
	at org.apache.solr.common.util.ExecutorUtil$MDCAwareThreadPoolExecutor.lambda$execute$0(ExecutorUtil.java:188)
	at java.util.concurrent.ThreadPoolExecutor.runWorker(ThreadPoolExecutor.java:1149)
	at java.util.concurrent.ThreadPoolExecutor$Worker.run(ThreadPoolExecutor.java:624)
	at java.lang.Thread.run(Thread.java:748)


	at __randomizedtesting.SeedInfo.seed([A3BFFE30E3B27591]:0)
	at org.junit.Assert.fail(Assert.java:93)
	at org.junit.Assert.assertTrue(Assert.java:43)
	at org.junit.Assert.assertNull(Assert.java:551)
	at org.apache.solr.SolrTestCaseJ4.teardownTestCases(SolrTestCaseJ4.java:297)
	at sun.reflect.GeneratedMethodAccessor42.invoke(Unknown Source)
	at sun.reflect.DelegatingMethodAccessorImpl.invoke(DelegatingMethodAccessorImpl.java:43)
	at java.lang.reflect.Method.invoke(Method.java:498)
	at com.carrotsearch.randomizedtesting.RandomizedRunner.invoke(RandomizedRunner.java:1737)
	at com.carrotsearch.randomizedtesting.RandomizedRunner$7.evaluate(RandomizedRunner.java:897)
	at com.carrotsearch.randomizedtesting.rules.StatementAdapter.evaluate(StatementAdapter.java:36)
	at com.carrotsearch.randomizedtesting.rules.SystemPropertiesRestoreRule$1.evaluate(SystemPropertiesRestoreRule.java:57)
	at org.apache.lucene.util.AbstractBeforeAfterRule$1.evaluate(AbstractBeforeAfterRule.java:45)
	at com.carrotsearch.randomizedtesting.rules.StatementAdapter.evaluate(StatementAdapter.java:36)
	at org.apache.lucene.util.TestRuleStoreClassName$1.evaluate(TestRuleStoreClassName.java:41)
	at com.carrotsearch.randomizedtesting.rules.NoShadowingOrOverridesOnMethodsRule$1.evaluate(NoShadowingOrOverridesOnMethodsRule.java:40)
	at com.carrotsearch.randomizedtesting.rules.NoShadowingOrOverridesOnMethodsRule$1.evaluate(NoShadowingOrOverridesOnMethodsRule.java:40)
	at com.carrotsearch.randomizedtesting.rules.StatementAdapter.evaluate(StatementAdapter.java:36)
	at com.carrotsearch.randomizedtesting.rules.StatementAdapter.evaluate(StatementAdapter.java:36)
	at com.carrotsearch.randomizedtesting.rules.StatementAdapter.evaluate(StatementAdapter.java:36)
	at org.apache.lucene.util.TestRuleAssertionsRequired$1.evaluate(TestRuleAssertionsRequired.java:53)
	at org.apache.lucene.util.TestRuleMarkFailure$1.evaluate(TestRuleMarkFailure.java:47)
	at org.apache.lucene.util.TestRuleIgnoreAfterMaxFailures$1.evaluate(TestRuleIgnoreAfterMaxFailures.java:64)
	at org.apache.lucene.util.TestRuleIgnoreTestSuites$1.evaluate(TestRuleIgnoreTestSuites.java:54)
	at com.carrotsearch.randomizedtesting.rules.StatementAdapter.evaluate(StatementAdapter.java:36)
	at com.carrotsearch.randomizedtesting.ThreadLeakControl$StatementRunner.run(ThreadLeakControl.java:368)
	at java.lang.Thread.run(Thread.java:748)


FAILED:  junit.framework.TestSuite.org.apache.solr.cloud.SolrCLIZkUtilsTest

Error Message:
16 threads leaked from SUITE scope at org.apache.solr.cloud.SolrCLIZkUtilsTest:     1) Thread[id=21070, name=qtp3631478-21070, state=TIMED_WAITING, group=TGRP-SolrCLIZkUtilsTest]         at sun.misc.Unsafe.park(Native Method)         at java.util.concurrent.locks.LockSupport.parkNanos(LockSupport.java:215)         at java.util.concurrent.locks.AbstractQueuedSynchronizer$ConditionObject.awaitNanos(AbstractQueuedSynchronizer.java:2078)         at org.eclipse.jetty.util.BlockingArrayQueue.poll(BlockingArrayQueue.java:392)         at org.eclipse.jetty.util.thread.QueuedThreadPool.idleJobPoll(QueuedThreadPool.java:563)         at org.eclipse.jetty.util.thread.QueuedThreadPool.access$800(QueuedThreadPool.java:48)         at org.eclipse.jetty.util.thread.QueuedThreadPool$2.run(QueuedThreadPool.java:626)         at java.lang.Thread.run(Thread.java:748)    2) Thread[id=21073, name=org.eclipse.jetty.server.session.HashSessionManager@2269b481Timer, state=TIMED_WAITING, group=TGRP-SolrCLIZkUtilsTest]         at sun.misc.Unsafe.park(Native Method)         at java.util.concurrent.locks.LockSupport.parkNanos(LockSupport.java:215)         at java.util.concurrent.locks.AbstractQueuedSynchronizer$ConditionObject.awaitNanos(AbstractQueuedSynchronizer.java:2078)         at java.util.concurrent.ScheduledThreadPoolExecutor$DelayedWorkQueue.take(ScheduledThreadPoolExecutor.java:1093)         at java.util.concurrent.ScheduledThreadPoolExecutor$DelayedWorkQueue.take(ScheduledThreadPoolExecutor.java:809)         at java.util.concurrent.ThreadPoolExecutor.getTask(ThreadPoolExecutor.java:1074)         at java.util.concurrent.ThreadPoolExecutor.runWorker(ThreadPoolExecutor.java:1134)         at java.util.concurrent.ThreadPoolExecutor$Worker.run(ThreadPoolExecutor.java:624)         at java.lang.Thread.run(Thread.java:748)    3) Thread[id=21066, name=qtp3631478-21066-acceptor-0@4162625b-ServerConnector@7cbbb545{SSL,[ssl, http/1.1]}{127.0.0.1:63930}, state=RUNNABLE, group=TGRP-SolrCLIZkUtilsTest]         at sun.nio.ch.ServerSocketChannelImpl.accept0(Native Method)         at sun.nio.ch.ServerSocketChannelImpl.accept(ServerSocketChannelImpl.java:422)         at sun.nio.ch.ServerSocketChannelImpl.accept(ServerSocketChannelImpl.java:250)         at org.eclipse.jetty.server.ServerConnector.accept(ServerConnector.java:371)         at org.eclipse.jetty.server.AbstractConnector$Acceptor.run(AbstractConnector.java:601)         at org.eclipse.jetty.util.thread.QueuedThreadPool.runJob(QueuedThreadPool.java:671)         at org.eclipse.jetty.util.thread.QueuedThreadPool$2.run(QueuedThreadPool.java:589)         at java.lang.Thread.run(Thread.java:748)    4) Thread[id=21077, name=Connection evictor, state=TIMED_WAITING, group=TGRP-SolrCLIZkUtilsTest]         at java.lang.Thread.sleep(Native Method)         at org.apache.http.impl.client.IdleConnectionEvictor$1.run(IdleConnectionEvictor.java:66)         at java.lang.Thread.run(Thread.java:748)    5) Thread[id=21057, name=NIOServerCxn.Factory:0.0.0.0/0.0.0.0:0, state=RUNNABLE, group=TGRP-SolrCLIZkUtilsTest]         at sun.nio.ch.KQueueArrayWrapper.kevent0(Native Method)         at sun.nio.ch.KQueueArrayWrapper.poll(KQueueArrayWrapper.java:198)         at sun.nio.ch.KQueueSelectorImpl.doSelect(KQueueSelectorImpl.java:117)         at sun.nio.ch.SelectorImpl.lockAndDoSelect(SelectorImpl.java:86)         at sun.nio.ch.SelectorImpl.select(SelectorImpl.java:97)         at org.apache.zookeeper.server.NIOServerCnxnFactory.run(NIOServerCnxnFactory.java:173)         at java.lang.Thread.run(Thread.java:748)    6) Thread[id=21064, name=jetty-launcher-4805-thread-1, state=TIMED_WAITING, group=TGRP-SolrCLIZkUtilsTest]         at sun.misc.Unsafe.park(Native Method)         at java.util.concurrent.locks.LockSupport.parkNanos(LockSupport.java:215)         at java.util.concurrent.SynchronousQueue$TransferStack.awaitFulfill(SynchronousQueue.java:460)         at java.util.concurrent.SynchronousQueue$TransferStack.transfer(SynchronousQueue.java:362)         at java.util.concurrent.SynchronousQueue.poll(SynchronousQueue.java:941)         at java.util.concurrent.ThreadPoolExecutor.getTask(ThreadPoolExecutor.java:1073)         at java.util.concurrent.ThreadPoolExecutor.runWorker(ThreadPoolExecutor.java:1134)         at java.util.concurrent.ThreadPoolExecutor$Worker.run(ThreadPoolExecutor.java:624)         at java.lang.Thread.run(Thread.java:748)    7) Thread[id=21078, name=Connection evictor, state=TIMED_WAITING, group=TGRP-SolrCLIZkUtilsTest]         at java.lang.Thread.sleep(Native Method)         at org.apache.http.impl.client.IdleConnectionEvictor$1.run(IdleConnectionEvictor.java:66)         at java.lang.Thread.run(Thread.java:748)    8) Thread[id=21069, name=qtp3631478-21069, state=TIMED_WAITING, group=TGRP-SolrCLIZkUtilsTest]         at sun.misc.Unsafe.park(Native Method)         at java.util.concurrent.locks.LockSupport.parkNanos(LockSupport.java:215)         at java.util.concurrent.locks.AbstractQueuedSynchronizer$ConditionObject.awaitNanos(AbstractQueuedSynchronizer.java:2078)         at org.eclipse.jetty.util.BlockingArrayQueue.poll(BlockingArrayQueue.java:392)         at org.eclipse.jetty.util.thread.QueuedThreadPool.idleJobPoll(QueuedThreadPool.java:563)         at org.eclipse.jetty.util.thread.QueuedThreadPool.access$800(QueuedThreadPool.java:48)         at org.eclipse.jetty.util.thread.QueuedThreadPool$2.run(QueuedThreadPool.java:626)         at java.lang.Thread.run(Thread.java:748)    9) Thread[id=21056, name=Thread-3843, state=WAITING, group=TGRP-SolrCLIZkUtilsTest]         at java.lang.Object.wait(Native Method)         at java.lang.Thread.join(Thread.java:1252)         at java.lang.Thread.join(Thread.java:1326)         at org.apache.zookeeper.server.NIOServerCnxnFactory.join(NIOServerCnxnFactory.java:297)         at org.apache.solr.cloud.ZkTestServer$ZKServerMain.runFromConfig(ZkTestServer.java:310)         at org.apache.solr.cloud.ZkTestServer$2.run(ZkTestServer.java:491)   10) Thread[id=21068, name=qtp3631478-21068, state=TIMED_WAITING, group=TGRP-SolrCLIZkUtilsTest]         at sun.misc.Unsafe.park(Native Method)         at java.util.concurrent.locks.LockSupport.parkNanos(LockSupport.java:215)         at java.util.concurrent.locks.AbstractQueuedSynchronizer$ConditionObject.awaitNanos(AbstractQueuedSynchronizer.java:2078)         at org.eclipse.jetty.util.BlockingArrayQueue.poll(BlockingArrayQueue.java:392)         at org.eclipse.jetty.util.thread.QueuedThreadPool.idleJobPoll(QueuedThreadPool.java:563)         at org.eclipse.jetty.util.thread.QueuedThreadPool.access$800(QueuedThreadPool.java:48)         at org.eclipse.jetty.util.thread.QueuedThreadPool$2.run(QueuedThreadPool.java:626)         at java.lang.Thread.run(Thread.java:748)   11) Thread[id=21065, name=qtp3631478-21065, state=RUNNABLE, group=TGRP-SolrCLIZkUtilsTest]         at sun.nio.ch.KQueueArrayWrapper.kevent0(Native Method)         at sun.nio.ch.KQueueArrayWrapper.poll(KQueueArrayWrapper.java:198)         at sun.nio.ch.KQueueSelectorImpl.doSelect(KQueueSelectorImpl.java:117)         at sun.nio.ch.SelectorImpl.lockAndDoSelect(SelectorImpl.java:86)         at sun.nio.ch.SelectorImpl.select(SelectorImpl.java:97)         at sun.nio.ch.SelectorImpl.select(SelectorImpl.java:101)         at org.eclipse.jetty.io.ManagedSelector$SelectorProducer.select(ManagedSelector.java:243)         at org.eclipse.jetty.io.ManagedSelector$SelectorProducer.produce(ManagedSelector.java:191)         at org.eclipse.jetty.util.thread.strategy.ExecuteProduceConsume.executeProduceConsume(ExecuteProduceConsume.java:249)         at org.eclipse.jetty.util.thread.strategy.ExecuteProduceConsume.produceConsume(ExecuteProduceConsume.java:148)         at org.eclipse.jetty.util.thread.strategy.ExecuteProduceConsume.execute(ExecuteProduceConsume.java:100)         at org.eclipse.jetty.io.ManagedSelector.run(ManagedSelector.java:147)         at org.eclipse.jetty.util.thread.QueuedThreadPool.runJob(QueuedThreadPool.java:671)         at org.eclipse.jetty.util.thread.QueuedThreadPool$2.run(QueuedThreadPool.java:589)         at java.lang.Thread.run(Thread.java:748)   12) Thread[id=21058, name=SessionTracker, state=TIMED_WAITING, group=TGRP-SolrCLIZkUtilsTest]         at java.lang.Object.wait(Native Method)         at org.apache.zookeeper.server.SessionTrackerImpl.run(SessionTrackerImpl.java:146)   13) Thread[id=21067, name=qtp3631478-21067, state=TIMED_WAITING, group=TGRP-SolrCLIZkUtilsTest]         at sun.misc.Unsafe.park(Native Method)         at java.util.concurrent.locks.LockSupport.parkNanos(LockSupport.java:215)         at java.util.concurrent.locks.AbstractQueuedSynchronizer$ConditionObject.awaitNanos(AbstractQueuedSynchronizer.java:2078)         at org.eclipse.jetty.util.BlockingArrayQueue.poll(BlockingArrayQueue.java:392)         at org.eclipse.jetty.util.thread.QueuedThreadPool.idleJobPoll(QueuedThreadPool.java:563)         at org.eclipse.jetty.util.thread.QueuedThreadPool.access$800(QueuedThreadPool.java:48)         at org.eclipse.jetty.util.thread.QueuedThreadPool$2.run(QueuedThreadPool.java:626)         at java.lang.Thread.run(Thread.java:748)   14) Thread[id=21060, name=ProcessThread(sid:0 cport:63928):, state=WAITING, group=TGRP-SolrCLIZkUtilsTest]         at sun.misc.Unsafe.park(Native Method)         at java.util.concurrent.locks.LockSupport.park(LockSupport.java:175)         at java.util.concurrent.locks.AbstractQueuedSynchronizer$ConditionObject.await(AbstractQueuedSynchronizer.java:2039)         at java.util.concurrent.LinkedBlockingQueue.take(LinkedBlockingQueue.java:442)         at org.apache.zookeeper.server.PrepRequestProcessor.run(PrepRequestProcessor.java:122)   15) Thread[id=21071, name=qtp3631478-21071, state=TIMED_WAITING, group=TGRP-SolrCLIZkUtilsTest]         at sun.misc.Unsafe.park(Native Method)         at java.util.concurrent.locks.LockSupport.parkNanos(LockSupport.java:215)         at java.util.concurrent.locks.AbstractQueuedSynchronizer$ConditionObject.awaitNanos(AbstractQueuedSynchronizer.java:2078)         at org.eclipse.jetty.util.BlockingArrayQueue.poll(BlockingArrayQueue.java:392)         at org.eclipse.jetty.util.thread.QueuedThreadPool.idleJobPoll(QueuedThreadPool.java:563)         at org.eclipse.jetty.util.thread.QueuedThreadPool.access$800(QueuedThreadPool.java:48)         at org.eclipse.jetty.util.thread.QueuedThreadPool$2.run(QueuedThreadPool.java:626)         at java.lang.Thread.run(Thread.java:748)   16) Thread[id=21072, name=qtp3631478-21072, state=TIMED_WAITING, group=TGRP-SolrCLIZkUtilsTest]         at sun.misc.Unsafe.park(Native Method)         at java.util.concurrent.locks.LockSupport.parkNanos(LockSupport.java:215)         at java.util.concurrent.locks.AbstractQueuedSynchronizer$ConditionObject.awaitNanos(AbstractQueuedSynchronizer.java:2078)         at org.eclipse.jetty.util.BlockingArrayQueue.poll(BlockingArrayQueue.java:392)         at org.eclipse.jetty.util.thread.QueuedThreadPool.idleJobPoll(QueuedThreadPool.java:563)         at org.eclipse.jetty.util.thread.QueuedThreadPool.access$800(QueuedThreadPool.java:48)         at org.eclipse.jetty.util.thread.QueuedThreadPool$2.run(QueuedThreadPool.java:626)         at java.lang.Thread.run(Thread.java:748)

Stack Trace:
com.carrotsearch.randomizedtesting.ThreadLeakError: 16 threads leaked from SUITE scope at org.apache.solr.cloud.SolrCLIZkUtilsTest: 
   1) Thread[id=21070, name=qtp3631478-21070, state=TIMED_WAITING, group=TGRP-SolrCLIZkUtilsTest]
        at sun.misc.Unsafe.park(Native Method)
        at java.util.concurrent.locks.LockSupport.parkNanos(LockSupport.java:215)
        at java.util.concurrent.locks.AbstractQueuedSynchronizer$ConditionObject.awaitNanos(AbstractQueuedSynchronizer.java:2078)
        at org.eclipse.jetty.util.BlockingArrayQueue.poll(BlockingArrayQueue.java:392)
        at org.eclipse.jetty.util.thread.QueuedThreadPool.idleJobPoll(QueuedThreadPool.java:563)
        at org.eclipse.jetty.util.thread.QueuedThreadPool.access$800(QueuedThreadPool.java:48)
        at org.eclipse.jetty.util.thread.QueuedThreadPool$2.run(QueuedThreadPool.java:626)
        at java.lang.Thread.run(Thread.java:748)
   2) Thread[id=21073, name=org.eclipse.jetty.server.session.HashSessionManager@2269b481Timer, state=TIMED_WAITING, group=TGRP-SolrCLIZkUtilsTest]
        at sun.misc.Unsafe.park(Native Method)
        at java.util.concurrent.locks.LockSupport.parkNanos(LockSupport.java:215)
        at java.util.concurrent.locks.AbstractQueuedSynchronizer$ConditionObject.awaitNanos(AbstractQueuedSynchronizer.java:2078)
        at java.util.concurrent.ScheduledThreadPoolExecutor$DelayedWorkQueue.take(ScheduledThreadPoolExecutor.java:1093)
        at java.util.concurrent.ScheduledThreadPoolExecutor$DelayedWorkQueue.take(ScheduledThreadPoolExecutor.java:809)
        at java.util.concurrent.ThreadPoolExecutor.getTask(ThreadPoolExecutor.java:1074)
        at java.util.concurrent.ThreadPoolExecutor.runWorker(ThreadPoolExecutor.java:1134)
        at java.util.concurrent.ThreadPoolExecutor$Worker.run(ThreadPoolExecutor.java:624)
        at java.lang.Thread.run(Thread.java:748)
   3) Thread[id=21066, name=qtp3631478-21066-acceptor-0@4162625b-ServerConnector@7cbbb545{SSL,[ssl, http/1.1]}{127.0.0.1:63930}, state=RUNNABLE, group=TGRP-SolrCLIZkUtilsTest]
        at sun.nio.ch.ServerSocketChannelImpl.accept0(Native Method)
        at sun.nio.ch.ServerSocketChannelImpl.accept(ServerSocketChannelImpl.java:422)
        at sun.nio.ch.ServerSocketChannelImpl.accept(ServerSocketChannelImpl.java:250)
        at org.eclipse.jetty.server.ServerConnector.accept(ServerConnector.java:371)
        at org.eclipse.jetty.server.AbstractConnector$Acceptor.run(AbstractConnector.java:601)
        at org.eclipse.jetty.util.thread.QueuedThreadPool.runJob(QueuedThreadPool.java:671)
        at org.eclipse.jetty.util.thread.QueuedThreadPool$2.run(QueuedThreadPool.java:589)
        at java.lang.Thread.run(Thread.java:748)
   4) Thread[id=21077, name=Connection evictor, state=TIMED_WAITING, group=TGRP-SolrCLIZkUtilsTest]
        at java.lang.Thread.sleep(Native Method)
        at org.apache.http.impl.client.IdleConnectionEvictor$1.run(IdleConnectionEvictor.java:66)
        at java.lang.Thread.run(Thread.java:748)
   5) Thread[id=21057, name=NIOServerCxn.Factory:0.0.0.0/0.0.0.0:0, state=RUNNABLE, group=TGRP-SolrCLIZkUtilsTest]
        at sun.nio.ch.KQueueArrayWrapper.kevent0(Native Method)
        at sun.nio.ch.KQueueArrayWrapper.poll(KQueueArrayWrapper.java:198)
        at sun.nio.ch.KQueueSelectorImpl.doSelect(KQueueSelectorImpl.java:117)
        at sun.nio.ch.SelectorImpl.lockAndDoSelect(SelectorImpl.java:86)
        at sun.nio.ch.SelectorImpl.select(SelectorImpl.java:97)
        at org.apache.zookeeper.server.NIOServerCnxnFactory.run(NIOServerCnxnFactory.java:173)
        at java.lang.Thread.run(Thread.java:748)
   6) Thread[id=21064, name=jetty-launcher-4805-thread-1, state=TIMED_WAITING, group=TGRP-SolrCLIZkUtilsTest]
        at sun.misc.Unsafe.park(Native Method)
        at java.util.concurrent.locks.LockSupport.parkNanos(LockSupport.java:215)
        at java.util.concurrent.SynchronousQueue$TransferStack.awaitFulfill(SynchronousQueue.java:460)
        at java.util.concurrent.SynchronousQueue$TransferStack.transfer(SynchronousQueue.java:362)
        at java.util.concurrent.SynchronousQueue.poll(SynchronousQueue.java:941)
        at java.util.concurrent.ThreadPoolExecutor.getTask(ThreadPoolExecutor.java:1073)
        at java.util.concurrent.ThreadPoolExecutor.runWorker(ThreadPoolExecutor.java:1134)
        at java.util.concurrent.ThreadPoolExecutor$Worker.run(ThreadPoolExecutor.java:624)
        at java.lang.Thread.run(Thread.java:748)
   7) Thread[id=21078, name=Connection evictor, state=TIMED_WAITING, group=TGRP-SolrCLIZkUtilsTest]
        at java.lang.Thread.sleep(Native Method)
        at org.apache.http.impl.client.IdleConnectionEvictor$1.run(IdleConnectionEvictor.java:66)
        at java.lang.Thread.run(Thread.java:748)
   8) Thread[id=21069, name=qtp3631478-21069, state=TIMED_WAITING, group=TGRP-SolrCLIZkUtilsTest]
        at sun.misc.Unsafe.park(Native Method)
        at java.util.concurrent.locks.LockSupport.parkNanos(LockSupport.java:215)
        at java.util.concurrent.locks.AbstractQueuedSynchronizer$ConditionObject.awaitNanos(AbstractQueuedSynchronizer.java:2078)
        at org.eclipse.jetty.util.BlockingArrayQueue.poll(BlockingArrayQueue.java:392)
        at org.eclipse.jetty.util.thread.QueuedThreadPool.idleJobPoll(QueuedThreadPool.java:563)
        at org.eclipse.jetty.util.thread.QueuedThreadPool.access$800(QueuedThreadPool.java:48)
        at org.eclipse.jetty.util.thread.QueuedThreadPool$2.run(QueuedThreadPool.java:626)
        at java.lang.Thread.run(Thread.java:748)
   9) Thread[id=21056, name=Thread-3843, state=WAITING, group=TGRP-SolrCLIZkUtilsTest]
        at java.lang.Object.wait(Native Method)
        at java.lang.Thread.join(Thread.java:1252)
        at java.lang.Thread.join(Thread.java:1326)
        at org.apache.zookeeper.server.NIOServerCnxnFactory.join(NIOServerCnxnFactory.java:297)
        at org.apache.solr.cloud.ZkTestServer$ZKServerMain.runFromConfig(ZkTestServer.java:310)
        at org.apache.solr.cloud.ZkTestServer$2.run(ZkTestServer.java:491)
  10) Thread[id=21068, name=qtp3631478-21068, state=TIMED_WAITING, group=TGRP-SolrCLIZkUtilsTest]
        at sun.misc.Unsafe.park(Native Method)
        at java.util.concurrent.locks.LockSupport.parkNanos(LockSupport.java:215)
        at java.util.concurrent.locks.AbstractQueuedSynchronizer$ConditionObject.awaitNanos(AbstractQueuedSynchronizer.java:2078)
        at org.eclipse.jetty.util.BlockingArrayQueue.poll(BlockingArrayQueue.java:392)
        at org.eclipse.jetty.util.thread.QueuedThreadPool.idleJobPoll(QueuedThreadPool.java:563)
        at org.eclipse.jetty.util.thread.QueuedThreadPool.access$800(QueuedThreadPool.java:48)
        at org.eclipse.jetty.util.thread.QueuedThreadPool$2.run(QueuedThreadPool.java:626)
        at java.lang.Thread.run(Thread.java:748)
  11) Thread[id=21065, name=qtp3631478-21065, state=RUNNABLE, group=TGRP-SolrCLIZkUtilsTest]
        at sun.nio.ch.KQueueArrayWrapper.kevent0(Native Method)
        at sun.nio.ch.KQueueArrayWrapper.poll(KQueueArrayWrapper.java:198)
        at sun.nio.ch.KQueueSelectorImpl.doSelect(KQueueSelectorImpl.java:117)
        at sun.nio.ch.SelectorImpl.lockAndDoSelect(SelectorImpl.java:86)
        at sun.nio.ch.SelectorImpl.select(SelectorImpl.java:97)
        at sun.nio.ch.SelectorImpl.select(SelectorImpl.java:101)
        at org.eclipse.jetty.io.ManagedSelector$SelectorProducer.select(ManagedSelector.java:243)
        at org.eclipse.jetty.io.ManagedSelector$SelectorProducer.produce(ManagedSelector.java:191)
        at org.eclipse.jetty.util.thread.strategy.ExecuteProduceConsume.executeProduceConsume(ExecuteProduceConsume.java:249)
        at org.eclipse.jetty.util.thread.strategy.ExecuteProduceConsume.produceConsume(ExecuteProduceConsume.java:148)
        at org.eclipse.jetty.util.thread.strategy.ExecuteProduceConsume.execute(ExecuteProduceConsume.java:100)
        at org.eclipse.jetty.io.ManagedSelector.run(ManagedSelector.java:147)
        at org.eclipse.jetty.util.thread.QueuedThreadPool.runJob(QueuedThreadPool.java:671)
        at org.eclipse.jetty.util.thread.QueuedThreadPool$2.run(QueuedThreadPool.java:589)
        at java.lang.Thread.run(Thread.java:748)
  12) Thread[id=21058, name=SessionTracker, state=TIMED_WAITING, group=TGRP-SolrCLIZkUtilsTest]
        at java.lang.Object.wait(Native Method)
        at org.apache.zookeeper.server.SessionTrackerImpl.run(SessionTrackerImpl.java:146)
  13) Thread[id=21067, name=qtp3631478-21067, state=TIMED_WAITING, group=TGRP-SolrCLIZkUtilsTest]
        at sun.misc.Unsafe.park(Native Method)
        at java.util.concurrent.locks.LockSupport.parkNanos(LockSupport.java:215)
        at java.util.concurrent.locks.AbstractQueuedSynchronizer$ConditionObject.awaitNanos(AbstractQueuedSynchronizer.java:2078)
        at org.eclipse.jetty.util.BlockingArrayQueue.poll(BlockingArrayQueue.java:392)
        at org.eclipse.jetty.util.thread.QueuedThreadPool.idleJobPoll(QueuedThreadPool.java:563)
        at org.eclipse.jetty.util.thread.QueuedThreadPool.access$800(QueuedThreadPool.java:48)
        at org.eclipse.jetty.util.thread.QueuedThreadPool$2.run(QueuedThreadPool.java:626)
        at java.lang.Thread.run(Thread.java:748)
  14) Thread[id=21060, name=ProcessThread(sid:0 cport:63928):, state=WAITING, group=TGRP-SolrCLIZkUtilsTest]
        at sun.misc.Unsafe.park(Native Method)
        at java.util.concurrent.locks.LockSupport.park(LockSupport.java:175)
        at java.util.concurrent.locks.AbstractQueuedSynchronizer$ConditionObject.await(AbstractQueuedSynchronizer.java:2039)
        at java.util.concurrent.LinkedBlockingQueue.take(LinkedBlockingQueue.java:442)
        at org.apache.zookeeper.server.PrepRequestProcessor.run(PrepRequestProcessor.java:122)
  15) Thread[id=21071, name=qtp3631478-21071, state=TIMED_WAITING, group=TGRP-SolrCLIZkUtilsTest]
        at sun.misc.Unsafe.park(Native Method)
        at java.util.concurrent.locks.LockSupport.parkNanos(LockSupport.java:215)
        at java.util.concurrent.locks.AbstractQueuedSynchronizer$ConditionObject.awaitNanos(AbstractQueuedSynchronizer.java:2078)
        at org.eclipse.jetty.util.BlockingArrayQueue.poll(BlockingArrayQueue.java:392)
        at org.eclipse.jetty.util.thread.QueuedThreadPool.idleJobPoll(QueuedThreadPool.java:563)
        at org.eclipse.jetty.util.thread.QueuedThreadPool.access$800(QueuedThreadPool.java:48)
        at org.eclipse.jetty.util.thread.QueuedThreadPool$2.run(QueuedThreadPool.java:626)
        at java.lang.Thread.run(Thread.java:748)
  16) Thread[id=21072, name=qtp3631478-21072, state=TIMED_WAITING, group=TGRP-SolrCLIZkUtilsTest]
        at sun.misc.Unsafe.park(Native Method)
        at java.util.concurrent.locks.LockSupport.parkNanos(LockSupport.java:215)
        at java.util.concurrent.locks.AbstractQueuedSynchronizer$ConditionObject.awaitNanos(AbstractQueuedSynchronizer.java:2078)
        at org.eclipse.jetty.util.BlockingArrayQueue.poll(BlockingArrayQueue.java:392)
        at org.eclipse.jetty.util.thread.QueuedThreadPool.idleJobPoll(QueuedThreadPool.java:563)
        at org.eclipse.jetty.util.thread.QueuedThreadPool.access$800(QueuedThreadPool.java:48)
        at org.eclipse.jetty.util.thread.QueuedThreadPool$2.run(QueuedThreadPool.java:626)
        at java.lang.Thread.run(Thread.java:748)
	at __randomizedtesting.SeedInfo.seed([A3BFFE30E3B27591]:0)


FAILED:  junit.framework.TestSuite.org.apache.solr.cloud.SolrCLIZkUtilsTest

Error Message:
There are still zombie threads that couldn't be terminated:    1) Thread[id=21057, name=NIOServerCxn.Factory:0.0.0.0/0.0.0.0:0, state=RUNNABLE, group=TGRP-SolrCLIZkUtilsTest]         at sun.nio.ch.IOUtil.drain(Native Method)         at sun.nio.ch.KQueueSelectorImpl.updateSelectedKeys(KQueueSelectorImpl.java:181)         at sun.nio.ch.KQueueSelectorImpl.doSelect(KQueueSelectorImpl.java:122)         at sun.nio.ch.SelectorImpl.lockAndDoSelect(SelectorImpl.java:86)         at sun.nio.ch.SelectorImpl.select(SelectorImpl.java:97)         at org.apache.zookeeper.server.NIOServerCnxnFactory.run(NIOServerCnxnFactory.java:173)         at java.lang.Thread.run(Thread.java:748)    2) Thread[id=21064, name=jetty-launcher-4805-thread-1, state=TIMED_WAITING, group=TGRP-SolrCLIZkUtilsTest]         at sun.misc.Unsafe.park(Native Method)         at java.util.concurrent.locks.LockSupport.parkNanos(LockSupport.java:215)         at java.util.concurrent.SynchronousQueue$TransferStack.awaitFulfill(SynchronousQueue.java:460)         at java.util.concurrent.SynchronousQueue$TransferStack.transfer(SynchronousQueue.java:362)         at java.util.concurrent.SynchronousQueue.poll(SynchronousQueue.java:941)         at java.util.concurrent.ThreadPoolExecutor.getTask(ThreadPoolExecutor.java:1073)         at java.util.concurrent.ThreadPoolExecutor.runWorker(ThreadPoolExecutor.java:1134)         at java.util.concurrent.ThreadPoolExecutor$Worker.run(ThreadPoolExecutor.java:624)         at java.lang.Thread.run(Thread.java:748)    3) Thread[id=21065, name=qtp3631478-21065, state=RUNNABLE, group=TGRP-SolrCLIZkUtilsTest]         at sun.nio.ch.KQueueArrayWrapper.kevent0(Native Method)         at sun.nio.ch.KQueueArrayWrapper.poll(KQueueArrayWrapper.java:198)         at sun.nio.ch.KQueueSelectorImpl.doSelect(KQueueSelectorImpl.java:117)         at sun.nio.ch.SelectorImpl.lockAndDoSelect(SelectorImpl.java:86)         at sun.nio.ch.SelectorImpl.select(SelectorImpl.java:97)         at sun.nio.ch.SelectorImpl.select(SelectorImpl.java:101)         at org.eclipse.jetty.io.ManagedSelector$SelectorProducer.select(ManagedSelector.java:243)         at org.eclipse.jetty.io.ManagedSelector$SelectorProducer.produce(ManagedSelector.java:191)         at org.eclipse.jetty.util.thread.strategy.ExecuteProduceConsume.executeProduceConsume(ExecuteProduceConsume.java:249)         at org.eclipse.jetty.util.thread.strategy.ExecuteProduceConsume.produceConsume(ExecuteProduceConsume.java:148)         at org.eclipse.jetty.util.thread.strategy.ExecuteProduceConsume.execute(ExecuteProduceConsume.java:100)         at org.eclipse.jetty.io.ManagedSelector.run(ManagedSelector.java:147)         at org.eclipse.jetty.util.thread.QueuedThreadPool.runJob(QueuedThreadPool.java:671)         at org.eclipse.jetty.util.thread.QueuedThreadPool$2.run(QueuedThreadPool.java:589)         at java.lang.Thread.run(Thread.java:748)    4) Thread[id=21073, name=org.eclipse.jetty.server.session.HashSessionManager@2269b481Timer, state=TIMED_WAITING, group=TGRP-SolrCLIZkUtilsTest]         at sun.misc.Unsafe.park(Native Method)         at java.util.concurrent.locks.LockSupport.parkNanos(LockSupport.java:215)         at java.util.concurrent.locks.AbstractQueuedSynchronizer$ConditionObject.awaitNanos(AbstractQueuedSynchronizer.java:2078)         at java.util.concurrent.ScheduledThreadPoolExecutor$DelayedWorkQueue.take(ScheduledThreadPoolExecutor.java:1093)         at java.util.concurrent.ScheduledThreadPoolExecutor$DelayedWorkQueue.take(ScheduledThreadPoolExecutor.java:809)         at java.util.concurrent.ThreadPoolExecutor.getTask(ThreadPoolExecutor.java:1074)         at java.util.concurrent.ThreadPoolExecutor.runWorker(ThreadPoolExecutor.java:1134)         at java.util.concurrent.ThreadPoolExecutor$Worker.run(ThreadPoolExecutor.java:624)         at java.lang.Thread.run(Thread.java:748)

Stack Trace:
com.carrotsearch.randomizedtesting.ThreadLeakError: There are still zombie threads that couldn't be terminated:
   1) Thread[id=21057, name=NIOServerCxn.Factory:0.0.0.0/0.0.0.0:0, state=RUNNABLE, group=TGRP-SolrCLIZkUtilsTest]
        at sun.nio.ch.IOUtil.drain(Native Method)
        at sun.nio.ch.KQueueSelectorImpl.updateSelectedKeys(KQueueSelectorImpl.java:181)
        at sun.nio.ch.KQueueSelectorImpl.doSelect(KQueueSelectorImpl.java:122)
        at sun.nio.ch.SelectorImpl.lockAndDoSelect(SelectorImpl.java:86)
        at sun.nio.ch.SelectorImpl.select(SelectorImpl.java:97)
        at org.apache.zookeeper.server.NIOServerCnxnFactory.run(NIOServerCnxnFactory.java:173)
        at java.lang.Thread.run(Thread.java:748)
   2) Thread[id=21064, name=jetty-launcher-4805-thread-1, state=TIMED_WAITING, group=TGRP-SolrCLIZkUtilsTest]
        at sun.misc.Unsafe.park(Native Method)
        at java.util.concurrent.locks.LockSupport.parkNanos(LockSupport.java:215)
        at java.util.concurrent.SynchronousQueue$TransferStack.awaitFulfill(SynchronousQueue.java:460)
        at java.util.concurrent.SynchronousQueue$TransferStack.transfer(SynchronousQueue.java:362)
        at java.util.concurrent.SynchronousQueue.poll(SynchronousQueue.java:941)
        at java.util.concurrent.ThreadPoolExecutor.getTask(ThreadPoolExecutor.java:1073)
        at java.util.concurrent.ThreadPoolExecutor.runWorker(ThreadPoolExecutor.java:1134)
        at java.util.concurrent.ThreadPoolExecutor$Worker.run(ThreadPoolExecutor.java:624)
        at java.lang.Thread.run(Thread.java:748)
   3) Thread[id=21065, name=qtp3631478-21065, state=RUNNABLE, group=TGRP-SolrCLIZkUtilsTest]
        at sun.nio.ch.KQueueArrayWrapper.kevent0(Native Method)
        at sun.nio.ch.KQueueArrayWrapper.poll(KQueueArrayWrapper.java:198)
        at sun.nio.ch.KQueueSelectorImpl.doSelect(KQueueSelectorImpl.java:117)
        at sun.nio.ch.SelectorImpl.lockAndDoSelect(SelectorImpl.java:86)
        at sun.nio.ch.SelectorImpl.select(SelectorImpl.java:97)
        at sun.nio.ch.SelectorImpl.select(SelectorImpl.java:101)
        at org.eclipse.jetty.io.ManagedSelector$SelectorProducer.select(ManagedSelector.java:243)
        at org.eclipse.jetty.io.ManagedSelector$SelectorProducer.produce(ManagedSelector.java:191)
        at org.eclipse.jetty.util.thread.strategy.ExecuteProduceConsume.executeProduceConsume(ExecuteProduceConsume.java:249)
        at org.eclipse.jetty.util.thread.strategy.ExecuteProduceConsume.produceConsume(ExecuteProduceConsume.java:148)
        at org.eclipse.jetty.util.thread.strategy.ExecuteProduceConsume.execute(ExecuteProduceConsume.java:100)
        at org.eclipse.jetty.io.ManagedSelector.run(ManagedSelector.java:147)
        at org.eclipse.jetty.util.thread.QueuedThreadPool.runJob(QueuedThreadPool.java:671)
        at org.eclipse.jetty.util.thread.QueuedThreadPool$2.run(QueuedThreadPool.java:589)
        at java.lang.Thread.run(Thread.java:748)
   4) Thread[id=21073, name=org.eclipse.jetty.server.session.HashSessionManager@2269b481Timer, state=TIMED_WAITING, group=TGRP-SolrCLIZkUtilsTest]
        at sun.misc.Unsafe.park(Native Method)
        at java.util.concurrent.locks.LockSupport.parkNanos(LockSupport.java:215)
        at java.util.concurrent.locks.AbstractQueuedSynchronizer$ConditionObject.awaitNanos(AbstractQueuedSynchronizer.java:2078)
        at java.util.concurrent.ScheduledThreadPoolExecutor$DelayedWorkQueue.take(ScheduledThreadPoolExecutor.java:1093)
        at java.util.concurrent.ScheduledThreadPoolExecutor$DelayedWorkQueue.take(ScheduledThreadPoolExecutor.java:809)
        at java.util.concurrent.ThreadPoolExecutor.getTask(ThreadPoolExecutor.java:1074)
        at java.util.concurrent.ThreadPoolExecutor.runWorker(ThreadPoolExecutor.java:1134)
        at java.util.concurrent.ThreadPoolExecutor$Worker.run(ThreadPoolExecutor.java:624)
        at java.lang.Thread.run(Thread.java:748)
	at __randomizedtesting.SeedInfo.seed([A3BFFE30E3B27591]:0)




Build Log:
[...truncated 13312 lines...]
   [junit4] Suite: org.apache.solr.cloud.CustomCollectionTest
   [junit4]   2> Creating dataDir: /Users/jenkins/workspace/Lucene-Solr-7.x-MacOSX/solr/build/solr-core/test/J0/temp/solr.cloud.CustomCollectionTest_A3BFFE30E3B27591-001/init-core-data-001
   [junit4]   2> 2025459 INFO  (SUITE-CustomCollectionTest-seed#[A3BFFE30E3B27591]-worker) [    ] o.a.s.SolrTestCaseJ4 Using PointFields (NUMERIC_POINTS_SYSPROP=true) w/NUMERIC_DOCVALUES_SYSPROP=false
   [junit4]   2> 2025461 INFO  (SUITE-CustomCollectionTest-seed#[A3BFFE30E3B27591]-worker) [    ] o.a.s.SolrTestCaseJ4 Randomized ssl (true) and clientAuth (false) via: @org.apache.solr.util.RandomizeSSL(reason=, value=NaN, ssl=NaN, clientAuth=NaN) w/ MAC_OS_X supressed clientAuth
   [junit4]   2> 2025461 INFO  (SUITE-CustomCollectionTest-seed#[A3BFFE30E3B27591]-worker) [    ] o.a.s.SolrTestCaseJ4 SecureRandom sanity checks: test.solr.allowed.securerandom=null & java.security.egd=file:/dev/./urandom
   [junit4]   2> 2025462 INFO  (SUITE-CustomCollectionTest-seed#[A3BFFE30E3B27591]-worker) [    ] o.a.s.c.MiniSolrCloudCluster Starting cluster of 4 servers in /Users/jenkins/workspace/Lucene-Solr-7.x-MacOSX/solr/build/solr-core/test/J0/temp/solr.cloud.CustomCollectionTest_A3BFFE30E3B27591-001/tempDir-001
   [junit4]   2> 2025462 INFO  (SUITE-CustomCollectionTest-seed#[A3BFFE30E3B27591]-worker) [    ] o.a.s.c.ZkTestServer STARTING ZK TEST SERVER
   [junit4]   2> 2025463 INFO  (Thread-3812) [    ] o.a.s.c.ZkTestServer client port:0.0.0.0/0.0.0.0:0
   [junit4]   2> 2025463 INFO  (Thread-3812) [    ] o.a.s.c.ZkTestServer Starting server
   [junit4]   2> 2025470 ERROR (Thread-3812) [    ] o.a.z.s.ZooKeeperServer ZKShutdownHandler is not registered, so ZooKeeper server won't take any action on ERROR or SHUTDOWN server state changes
   [junit4]   2> 2025573 INFO  (SUITE-CustomCollectionTest-seed#[A3BFFE30E3B27591]-worker) [    ] o.a.s.c.ZkTestServer start zk server on port:63095
   [junit4]   2> 2025597 INFO  (zkConnectionManagerCallback-4373-thread-1) [    ] o.a.s.c.c.ConnectionManager zkClient has connected
   [junit4]   2> 2025612 INFO  (jetty-launcher-4370-thread-3) [    ] o.e.j.s.Server jetty-9.3.20.v20170531
   [junit4]   2> 2025613 INFO  (jetty-launcher-4370-thread-2) [    ] o.e.j.s.Server jetty-9.3.20.v20170531
   [junit4]   2> 2025613 INFO  (jetty-launcher-4370-thread-1) [    ] o.e.j.s.Server jetty-9.3.20.v20170531
   [junit4]   2> 2025614 INFO  (jetty-launcher-4370-thread-4) [    ] o.e.j.s.Server jetty-9.3.20.v20170531
   [junit4]   2> 2025616 INFO  (jetty-launcher-4370-thread-3) [    ] o.e.j.s.h.ContextHandler Started o.e.j.s.ServletContextHandler@19fff0f8{/solr,null,AVAILABLE}
   [junit4]   2> 2025617 INFO  (jetty-launcher-4370-thread-3) [    ] o.e.j.s.AbstractConnector Started ServerConnector@ac1594a{SSL,[ssl, http/1.1]}{127.0.0.1:63097}
   [junit4]   2> 2025618 INFO  (jetty-launcher-4370-thread-3) [    ] o.e.j.s.Server Started @2029210ms
   [junit4]   2> 2025618 INFO  (jetty-launcher-4370-thread-3) [    ] o.a.s.c.s.e.JettySolrRunner Jetty properties: {hostContext=/solr, hostPort=63097}
   [junit4]   2> 2025618 ERROR (jetty-launcher-4370-thread-3) [    ] o.a.s.u.StartupLoggingUtils Missing Java Option solr.log.dir. Logging may be missing or incomplete.
   [junit4]   2> 2025618 INFO  (jetty-launcher-4370-thread-3) [    ] o.a.s.s.SolrDispatchFilter  ___      _       Welcome to Apache Solr? version 7.3.0
   [junit4]   2> 2025619 INFO  (jetty-launcher-4370-thread-3) [    ] o.a.s.s.SolrDispatchFilter / __| ___| |_ _   Starting in cloud mode on port null
   [junit4]   2> 2025619 INFO  (jetty-launcher-4370-thread-3) [    ] o.a.s.s.SolrDispatchFilter \__ \/ _ \ | '_|  Install dir: null
   [junit4]   2> 2025619 INFO  (jetty-launcher-4370-thread-3) [    ] o.a.s.s.SolrDispatchFilter |___/\___/_|_|    Start time: 2017-12-19T03:11:29.387Z
   [junit4]   2> 2025622 INFO  (jetty-launcher-4370-thread-4) [    ] o.e.j.s.h.ContextHandler Started o.e.j.s.ServletContextHandler@a73f9d3{/solr,null,AVAILABLE}
   [junit4]   2> 2025623 INFO  (jetty-launcher-4370-thread-4) [    ] o.e.j.s.AbstractConnector Started ServerConnector@1d6a273d{SSL,[ssl, http/1.1]}{127.0.0.1:63098}
   [junit4]   2> 2025623 INFO  (jetty-launcher-4370-thread-4) [    ] o.e.j.s.Server Started @2029215ms
   [junit4]   2> 2025623 INFO  (jetty-launcher-4370-thread-4) [    ] o.a.s.c.s.e.JettySolrRunner Jetty properties: {hostContext=/solr, hostPort=63098}
   [junit4]   2> 2025623 ERROR (jetty-launcher-4370-thread-4) [    ] o.a.s.u.StartupLoggingUtils Missing Java Option solr.log.dir. Logging may be missing or incomplete.
   [junit4]   2> 2025624 INFO  (jetty-launcher-4370-thread-1) [    ] o.e.j.s.h.ContextHandler Started o.e.j.s.ServletContextHandler@28958427{/solr,null,AVAILABLE}
   [junit4]   2> 2025624 INFO  (jetty-launcher-4370-thread-4) [    ] o.a.s.s.SolrDispatchFilter  ___      _       Welcome to Apache Solr? version 7.3.0
   [junit4]   2> 2025624 INFO  (jetty-launcher-4370-thread-4) [    ] o.a.s.s.SolrDispatchFilter / __| ___| |_ _   Starting in cloud mode on port null
   [junit4]   2> 2025624 INFO  (jetty-launcher-4370-thread-4) [    ] o.a.s.s.SolrDispatchFilter \__ \/ _ \ | '_|  Install dir: null
   [junit4]   2> 2025624 INFO  (jetty-launcher-4370-thread-4) [    ] o.a.s.s.SolrDispatchFilter |___/\___/_|_|    Start time: 2017-12-19T03:11:29.392Z
   [junit4]   2> 2025624 INFO  (jetty-launcher-4370-thread-1) [    ] o.e.j.s.AbstractConnector Started ServerConnector@45ab6d9e{SSL,[ssl, http/1.1]}{127.0.0.1:63100}
   [junit4]   2> 2025624 INFO  (jetty-launcher-4370-thread-1) [    ] o.e.j.s.Server Started @2029216ms
   [junit4]   2> 2025624 INFO  (jetty-launcher-4370-thread-1) [    ] o.a.s.c.s.e.JettySolrRunner Jetty properties: {hostContext=/solr, hostPort=63100}
   [junit4]   2> 2025625 ERROR (jetty-launcher-4370-thread-1) [    ] o.a.s.u.StartupLoggingUtils Missing Java Option solr.log.dir. Logging may be missing or incomplete.
   [junit4]   2> 2025625 INFO  (jetty-launcher-4370-thread-1) [    ] o.a.s.s.SolrDispatchFilter  ___      _       Welcome to Apache Solr? version 7.3.0
   [junit4]   2> 2025625 INFO  (jetty-launcher-4370-thread-1) [    ] o.a.s.s.SolrDispatchFilter / __| ___| |_ _   Starting in cloud mode on port null
   [junit4]   2> 2025625 INFO  (jetty-launcher-4370-thread-1) [    ] o.a.s.s.SolrDispatchFilter \__ \/ _ \ | '_|  Install dir: null
   [junit4]   2> 2025625 INFO  (jetty-launcher-4370-thread-1) [    ] o.a.s.s.SolrDispatchFilter |___/\___/_|_|    Start time: 2017-12-19T03:11:29.393Z
   [junit4]   2> 2025629 INFO  (jetty-launcher-4370-thread-2) [    ] o.e.j.s.h.ContextHandler Started o.e.j.s.ServletContextHandler@6fc40979{/solr,null,AVAILABLE}
   [junit4]   2> 2025630 INFO  (jetty-launcher-4370-thread-2) [    ] o.e.j.s.AbstractConnector Started ServerConnector@612620b8{SSL,[ssl, http/1.1]}{127.0.0.1:63102}
   [junit4]   2> 2025630 INFO  (jetty-launcher-4370-thread-2) [    ] o.e.j.s.Server Started @2029222ms
   [junit4]   2> 2025630 INFO  (jetty-launcher-4370-thread-2) [    ] o.a.s.c.s.e.JettySolrRunner Jetty properties: {hostContext=/solr, hostPort=63102}
   [junit4]   2> 2025630 ERROR (jetty-launcher-4370-thread-2) [    ] o.a.s.u.StartupLoggingUtils Missing Java Option solr.log.dir. Logging may be missing or incomplete.
   [junit4]   2> 2025631 INFO  (jetty-launcher-4370-thread-2) [    ] o.a.s.s.SolrDispatchFilter  ___      _       Welcome to Apache Solr? version 7.3.0
   [junit4]   2> 2025631 INFO  (jetty-launcher-4370-thread-2) [    ] o.a.s.s.SolrDispatchFilter / __| ___| |_ _   Starting in cloud mode on port null
   [junit4]   2> 2025631 INFO  (jetty-launcher-4370-thread-2) [    ] o.a.s.s.SolrDispatchFilter \__ \/ _ \ | '_|  Install dir: null
   [junit4]   2> 2025631 INFO  (jetty-launcher-4370-thread-2) [    ] o.a.s.s.SolrDispatchFilter |___/\___/_|_|    Start time: 2017-12-19T03:11:29.399Z
   [junit4]   2> 2025635 INFO  (zkConnectionManagerCallback-4375-thread-1) [    ] o.a.s.c.c.ConnectionManager zkClient has connected
   [junit4]   2> 2025638 INFO  (jetty-launcher-4370-thread-3) [    ] o.a.s.s.SolrDispatchFilter solr.xml found in ZooKeeper. Loading...
   [junit4]   2> 2025639 INFO  (zkConnectionManagerCallback-4377-thread-1) [    ] o.a.s.c.c.ConnectionManager zkClient has connected
   [junit4]   2> 2025640 INFO  (zkConnectionManagerCallback-4379-thread-1) [    ] o.a.s.c.c.ConnectionManager zkClient has connected
   [junit4]   2> 2025647 INFO  (zkConnectionManagerCallback-4381-thread-1) [    ] o.a.s.c.c.ConnectionManager zkClient has connected
   [junit4]   2> 2025648 INFO  (jetty-launcher-4370-thread-4) [    ] o.a.s.s.SolrDispatchFilter solr.xml found in ZooKeeper. Loading...
   [junit4]   2> 2025649 INFO  (jetty-launcher-4370-thread-1) [    ] o.a.s.s.SolrDispatchFilter solr.xml found in ZooKeeper. Loading...
   [junit4]   2> 2025649 INFO  (jetty-launcher-4370-thread-2) [    ] o.a.s.s.SolrDispatchFilter solr.xml found in ZooKeeper. Loading...
   [junit4]   2> 2025659 INFO  (jetty-launcher-4370-thread-3) [    ] o.a.s.c.ZkContainer Zookeeper client=127.0.0.1:63095/solr
   [junit4]   2> 2025661 INFO  (jetty-launcher-4370-thread-1) [    ] o.a.s.c.ZkContainer Zookeeper client=127.0.0.1:63095/solr
   [junit4]   2> 2025662 INFO  (zkConnectionManagerCallback-4385-thread-1) [    ] o.a.s.c.c.ConnectionManager zkClient has connected
   [junit4]   2> 2025662 INFO  (jetty-launcher-4370-thread-4) [    ] o.a.s.c.ZkContainer Zookeeper client=127.0.0.1:63095/solr
   [junit4]   2> 2025665 INFO  (zkConnectionManagerCallback-4390-thread-1) [    ] o.a.s.c.c.ConnectionManager zkClient has connected
   [junit4]   2> 2025665 INFO  (zkConnectionManagerCallback-4393-thread-1) [    ] o.a.s.c.c.ConnectionManager zkClient has connected
   [junit4]   2> 2025668 INFO  (jetty-launcher-4370-thread-2) [    ] o.a.s.c.ZkContainer Zookeeper client=127.0.0.1:63095/solr
   [junit4]   2> 2025669 INFO  (zkConnectionManagerCallback-4395-thread-1-processing-n:127.0.0.1:63097_solr) [n:127.0.0.1:63097_solr    ] o.a.s.c.c.ConnectionManager zkClient has connected
   [junit4]   2> 2025671 INFO  (zkConnectionManagerCallback-4401-thread-1-processing-n:127.0.0.1:63100_solr) [n:127.0.0.1:63100_solr    ] o.a.s.c.c.ConnectionManager zkClient has connected
   [junit4]   2> 2025672 INFO  (zkConnectionManagerCallback-4400-thread-1) [    ] o.a.s.c.c.ConnectionManager zkClient has connected
   [junit4]   2> 2025672 INFO  (zkConnectionManagerCallback-4403-thread-1-processing-n:127.0.0.1:63098_solr) [n:127.0.0.1:63098_solr    ] o.a.s.c.c.ConnectionManager zkClient has connected
   [junit4]   2> 2025676 INFO  (zkConnectionManagerCallback-4405-thread-1-processing-n:127.0.0.1:63102_solr) [n:127.0.0.1:63102_solr    ] o.a.s.c.c.ConnectionManager zkClient has connected
   [junit4]   2> 2025915 INFO  (jetty-launcher-4370-thread-4) [n:127.0.0.1:63098_solr    ] o.a.s.c.Overseer Overseer (id=null) closing
   [junit4]   2> 2025915 INFO  (jetty-launcher-4370-thread-2) [n:127.0.0.1:63102_solr    ] o.a.s.c.Overseer Overseer (id=null) closing
   [junit4]   2> 2025916 INFO  (jetty-launcher-4370-thread-4) [n:127.0.0.1:63098_solr    ] o.a.s.c.OverseerElectionContext I am going to be the leader 127.0.0.1:63098_solr
   [junit4]   2> 2025917 INFO  (jetty-launcher-4370-thread-2) [n:127.0.0.1:63102_solr    ] o.a.s.c.ZkController Register node as live in ZooKeeper:/live_nodes/127.0.0.1:63102_solr
   [junit4]   2> 2025918 INFO  (jetty-launcher-4370-thread-4) [n:127.0.0.1:63098_solr    ] o.a.s.c.Overseer Overseer (id=99198768856104971-127.0.0.1:63098_solr-n_0000000000) starting
   [junit4]   2> 2025919 INFO  (zkCallback-4404-thread-1-processing-n:127.0.0.1:63102_solr) [n:127.0.0.1:63102_solr    ] o.a.s.c.c.ZkStateReader Updated live nodes from ZooKeeper... (0) -> (1)
   [junit4]   2> 2025920 INFO  (zkCallback-4402-thread-1-processing-n:127.0.0.1:63098_solr) [n:127.0.0.1:63098_solr    ] o.a.s.c.c.ZkStateReader Updated live nodes from ZooKeeper... (0) -> (1)
   [junit4]   2> 2025923 INFO  (zkCallback-4394-thread-1-processing-n:127.0.0.1:63097_solr) [n:127.0.0.1:63097_solr    ] o.a.s.c.c.ZkStateReader Updated live nodes from ZooKeeper... (0) -> (1)
   [junit4]   2> 2025925 INFO  (jetty-launcher-4370-thread-3) [n:127.0.0.1:63097_solr    ] o.a.s.c.Overseer Overseer (id=null) closing
   [junit4]   2> 2025935 INFO  (jetty-launcher-4370-thread-3) [n:127.0.0.1:63097_solr    ] o.a.s.c.ZkController Register node as live in ZooKeeper:/live_nodes/127.0.0.1:63097_solr
   [junit4]   2> 2025937 INFO  (zkCallback-4394-thread-1-processing-n:127.0.0.1:63097_solr) [n:127.0.0.1:63097_solr    ] o.a.s.c.c.ZkStateReader Updated live nodes from ZooKeeper... (1) -> (2)
   [junit4]   2> 2025937 INFO  (zkCallback-4404-thread-1-processing-n:127.0.0.1:63102_solr) [n:127.0.0.1:63102_solr    ] o.a.s.c.c.ZkStateReader Updated live nodes from ZooKeeper... (1) -> (2)
   [junit4]   2> 2025939 INFO  (zkCallback-4402-thread-1-processing-n:127.0.0.1:63098_solr) [n:127.0.0.1:63098_solr    ] o.a.s.c.c.ZkStateReader Updated live nodes from ZooKeeper... (1) -> (2)
   [junit4]   2> 2025948 INFO  (jetty-launcher-4370-thread-4) [n:127.0.0.1:63098_solr    ] o.a.s.c.ZkController Register node as live in ZooKeeper:/live_nodes/127.0.0.1:63098_solr
   [junit4]   2> 2025954 INFO  (zkCallback-4404-thread-1-processing-n:127.0.0.1:63102_solr) [n:127.0.0.1:63102_solr    ] o.a.s.c.c.ZkStateReader Updated live nodes from ZooKeeper... (2) -> (3)
   [junit4]   2> 2025965 INFO  (zkCallback-4402-thread-1-processing-n:127.0.0.1:63098_solr) [n:127.0.0.1:63098_solr    ] o.a.s.c.c.ZkStateReader Updated live nodes from ZooKeeper... (2) -> (3)
   [junit4]   2> 2025966 INFO  (zkCallback-4394-thread-1-processing-n:127.0.0.1:63097_solr) [n:127.0.0.1:63097_solr    ] o.a.s.c.c.ZkStateReader Updated live nodes from ZooKeeper... (2) -> (3)
   [junit4]   2> 2025984 INFO  (jetty-launcher-4370-thread-1) [n:127.0.0.1:63100_solr    ] o.a.s.c.c.ZkStateReader Updated live nodes from ZooKeeper... (0) -> (3)
   [junit4]   2> 2025987 INFO  (jetty-launcher-4370-thread-1) [n:127.0.0.1:63100_solr    ] o.a.s.c.Overseer Overseer (id=null) closing
   [junit4]   2> 2025991 INFO  (jetty-launcher-4370-thread-1) [n:127.0.0.1:63100_solr    ] o.a.s.c.ZkController Register node as live in ZooKeeper:/live_nodes/127.0.0.1:63100_solr
   [junit4]   2> 2025992 INFO  (zkCallback-4404-thread-1-processing-n:127.0.0.1:63102_solr) [n:127.0.0.1:63102_solr    ] o.a.s.c.c.ZkStateReader Updated live nodes from ZooKeeper... (3) -> (4)
   [junit4]   2> 2025992 INFO  (zkCallback-4399-thread-1-processing-n:127.0.0.1:63100_solr) [n:127.0.0.1:63100_solr    ] o.a.s.c.c.ZkStateReader Updated live nodes from ZooKeeper... (3) -> (4)
   [junit4]   2> 2025993 INFO  (zkCallback-4402-thread-1-processing-n:127.0.0.1:63098_solr) [n:127.0.0.1:63098_solr    ] o.a.s.c.c.ZkStateReader Updated live nodes from ZooKeeper... (3) -> (4)
   [junit4]   2> 2025993 INFO  (zkCallback-4394-thread-1-processing-n:127.0.0.1:63097_solr) [n:127.0.0.1:63097_solr    ] o.a.s.c.c.ZkStateReader Updated live nodes from ZooKeeper... (3) -> (4)
   [junit4]   2> 2026149 INFO  (jetty-launcher-4370-thread-2) [n:127.0.0.1:63102_solr    ] o.a.s.m.r.SolrJmxReporter JMX monitoring for 'solr_63102.solr.node' (registry 'solr.node') enabled at server: com.sun.jmx.mbeanserver.JmxMBeanServer@e957114
   [junit4]   2> 2026173 INFO  (jetty-launcher-4370-thread-3) [n:127.0.0.1:63097_solr    ] o.a.s.m.r.SolrJmxReporter JMX monitoring for 'solr_63097.solr.node' (registry 'solr.node') enabled at server: com.sun.jmx.mbeanserver.JmxMBeanServer@e957114
   [junit4]   2> 2026178 INFO  (jetty-launcher-4370-thread-4) [n:127.0.0.1:63098_solr    ] o.a.s.m.r.SolrJmxReporter JMX monitoring for 'solr_63098.solr.node' (registry 'solr.node') enabled at server: com.sun.jmx.mbeanserver.JmxMBeanServer@e957114
   [junit4]   2> 2026183 INFO  (jetty-launcher-4370-thread-2) [n:127.0.0.1:63102_solr    ] o.a.s.m.r.SolrJmxReporter JMX monitoring for 'solr_63102.solr.jvm' (registry 'solr.jvm') enabled at server: com.sun.jmx.mbeanserver.JmxMBeanServer@e957114
   [junit4]   2> 2026183 INFO  (jetty-launcher-4370-thread-2) [n:127.0.0.1:63102_solr    ] o.a.s.m.r.SolrJmxReporter JMX monitoring for 'solr_63102.solr.jetty' (registry 'solr.jetty') enabled at server: com.sun.jmx.mbeanserver.JmxMBeanServer@e957114
   [junit4]   2> 2026187 INFO  (jetty-launcher-4370-thread-2) [n:127.0.0.1:63102_solr    ] o.a.s.c.CorePropertiesLocator Found 0 core definitions underneath /Users/jenkins/workspace/Lucene-Solr-7.x-MacOSX/solr/build/solr-core/test/J0/temp/solr.cloud.CustomCollectionTest_A3BFFE30E3B27591-001/tempDir-001/node1/.
   [junit4]   2> 2026190 INFO  (jetty-launcher-4370-thread-3) [n:127.0.0.1:63097_solr    ] o.a.s.m.r.SolrJmxReporter JMX monitoring for 'solr_63097.solr.jvm' (registry 'solr.jvm') enabled at server: com.sun.jmx.mbeanserver.JmxMBeanServer@e957114
   [junit4]   2> 2026192 INFO  (jetty-launcher-4370-thread-3) [n:127.0.0.1:63097_solr    ] o.a.s.m.r.SolrJmxReporter JMX monitoring for 'solr_63097.solr.jetty' (registry 'solr.jetty') enabled at server: com.sun.jmx.mbeanserver.JmxMBeanServer@e957114
   [junit4]   2> 2026195 INFO  (jetty-launcher-4370-thread-3) [n:127.0.0.1:63097_solr    ] o.a.s.c.CorePropertiesLocat

[...truncated too long message...]

.ch.KQueueSelectorImpl.doSelect(KQueueSelectorImpl.java:117)
   [junit4]    >         at sun.nio.ch.SelectorImpl.lockAndDoSelect(SelectorImpl.java:86)
   [junit4]    >         at sun.nio.ch.SelectorImpl.select(SelectorImpl.java:97)
   [junit4]    >         at sun.nio.ch.SelectorImpl.select(SelectorImpl.java:101)
   [junit4]    >         at org.eclipse.jetty.io.ManagedSelector$SelectorProducer.select(ManagedSelector.java:243)
   [junit4]    >         at org.eclipse.jetty.io.ManagedSelector$SelectorProducer.produce(ManagedSelector.java:191)
   [junit4]    >         at org.eclipse.jetty.util.thread.strategy.ExecuteProduceConsume.executeProduceConsume(ExecuteProduceConsume.java:249)
   [junit4]    >         at org.eclipse.jetty.util.thread.strategy.ExecuteProduceConsume.produceConsume(ExecuteProduceConsume.java:148)
   [junit4]    >         at org.eclipse.jetty.util.thread.strategy.ExecuteProduceConsume.execute(ExecuteProduceConsume.java:100)
   [junit4]    >         at org.eclipse.jetty.io.ManagedSelector.run(ManagedSelector.java:147)
   [junit4]    >         at org.eclipse.jetty.util.thread.QueuedThreadPool.runJob(QueuedThreadPool.java:671)
   [junit4]    >         at org.eclipse.jetty.util.thread.QueuedThreadPool$2.run(QueuedThreadPool.java:589)
   [junit4]    >         at java.lang.Thread.run(Thread.java:748)
   [junit4]    >   12) Thread[id=21058, name=SessionTracker, state=TIMED_WAITING, group=TGRP-SolrCLIZkUtilsTest]
   [junit4]    >         at java.lang.Object.wait(Native Method)
   [junit4]    >         at org.apache.zookeeper.server.SessionTrackerImpl.run(SessionTrackerImpl.java:146)
   [junit4]    >   13) Thread[id=21067, name=qtp3631478-21067, state=TIMED_WAITING, group=TGRP-SolrCLIZkUtilsTest]
   [junit4]    >         at sun.misc.Unsafe.park(Native Method)
   [junit4]    >         at java.util.concurrent.locks.LockSupport.parkNanos(LockSupport.java:215)
   [junit4]    >         at java.util.concurrent.locks.AbstractQueuedSynchronizer$ConditionObject.awaitNanos(AbstractQueuedSynchronizer.java:2078)
   [junit4]    >         at org.eclipse.jetty.util.BlockingArrayQueue.poll(BlockingArrayQueue.java:392)
   [junit4]    >         at org.eclipse.jetty.util.thread.QueuedThreadPool.idleJobPoll(QueuedThreadPool.java:563)
   [junit4]    >         at org.eclipse.jetty.util.thread.QueuedThreadPool.access$800(QueuedThreadPool.java:48)
   [junit4]    >         at org.eclipse.jetty.util.thread.QueuedThreadPool$2.run(QueuedThreadPool.java:626)
   [junit4]    >         at java.lang.Thread.run(Thread.java:748)
   [junit4]    >   14) Thread[id=21060, name=ProcessThread(sid:0 cport:63928):, state=WAITING, group=TGRP-SolrCLIZkUtilsTest]
   [junit4]    >         at sun.misc.Unsafe.park(Native Method)
   [junit4]    >         at java.util.concurrent.locks.LockSupport.park(LockSupport.java:175)
   [junit4]    >         at java.util.concurrent.locks.AbstractQueuedSynchronizer$ConditionObject.await(AbstractQueuedSynchronizer.java:2039)
   [junit4]    >         at java.util.concurrent.LinkedBlockingQueue.take(LinkedBlockingQueue.java:442)
   [junit4]    >         at org.apache.zookeeper.server.PrepRequestProcessor.run(PrepRequestProcessor.java:122)
   [junit4]    >   15) Thread[id=21071, name=qtp3631478-21071, state=TIMED_WAITING, group=TGRP-SolrCLIZkUtilsTest]
   [junit4]    >         at sun.misc.Unsafe.park(Native Method)
   [junit4]    >         at java.util.concurrent.locks.LockSupport.parkNanos(LockSupport.java:215)
   [junit4]    >         at java.util.concurrent.locks.AbstractQueuedSynchronizer$ConditionObject.awaitNanos(AbstractQueuedSynchronizer.java:2078)
   [junit4]    >         at org.eclipse.jetty.util.BlockingArrayQueue.poll(BlockingArrayQueue.java:392)
   [junit4]    >         at org.eclipse.jetty.util.thread.QueuedThreadPool.idleJobPoll(QueuedThreadPool.java:563)
   [junit4]    >         at org.eclipse.jetty.util.thread.QueuedThreadPool.access$800(QueuedThreadPool.java:48)
   [junit4]    >         at org.eclipse.jetty.util.thread.QueuedThreadPool$2.run(QueuedThreadPool.java:626)
   [junit4]    >         at java.lang.Thread.run(Thread.java:748)
   [junit4]    >   16) Thread[id=21072, name=qtp3631478-21072, state=TIMED_WAITING, group=TGRP-SolrCLIZkUtilsTest]
   [junit4]    >         at sun.misc.Unsafe.park(Native Method)
   [junit4]    >         at java.util.concurrent.locks.LockSupport.parkNanos(LockSupport.java:215)
   [junit4]    >         at java.util.concurrent.locks.AbstractQueuedSynchronizer$ConditionObject.awaitNanos(AbstractQueuedSynchronizer.java:2078)
   [junit4]    >         at org.eclipse.jetty.util.BlockingArrayQueue.poll(BlockingArrayQueue.java:392)
   [junit4]    >         at org.eclipse.jetty.util.thread.QueuedThreadPool.idleJobPoll(QueuedThreadPool.java:563)
   [junit4]    >         at org.eclipse.jetty.util.thread.QueuedThreadPool.access$800(QueuedThreadPool.java:48)
   [junit4]    >         at org.eclipse.jetty.util.thread.QueuedThreadPool$2.run(QueuedThreadPool.java:626)
   [junit4]    >         at java.lang.Thread.run(Thread.java:748)
   [junit4]    > 	at __randomizedtesting.SeedInfo.seed([A3BFFE30E3B27591]:0)Throwable #5: com.carrotsearch.randomizedtesting.ThreadLeakError: There are still zombie threads that couldn't be terminated:
   [junit4]    >    1) Thread[id=21057, name=NIOServerCxn.Factory:0.0.0.0/0.0.0.0:0, state=RUNNABLE, group=TGRP-SolrCLIZkUtilsTest]
   [junit4]    >         at sun.nio.ch.IOUtil.drain(Native Method)
   [junit4]    >         at sun.nio.ch.KQueueSelectorImpl.updateSelectedKeys(KQueueSelectorImpl.java:181)
   [junit4]    >         at sun.nio.ch.KQueueSelectorImpl.doSelect(KQueueSelectorImpl.java:122)
   [junit4]    >         at sun.nio.ch.SelectorImpl.lockAndDoSelect(SelectorImpl.java:86)
   [junit4]    >         at sun.nio.ch.SelectorImpl.select(SelectorImpl.java:97)
   [junit4]    >         at org.apache.zookeeper.server.NIOServerCnxnFactory.run(NIOServerCnxnFactory.java:173)
   [junit4]    >         at java.lang.Thread.run(Thread.java:748)
   [junit4]    >    2) Thread[id=21064, name=jetty-launcher-4805-thread-1, state=TIMED_WAITING, group=TGRP-SolrCLIZkUtilsTest]
   [junit4]    >         at sun.misc.Unsafe.park(Native Method)
   [junit4]    >         at java.util.concurrent.locks.LockSupport.parkNanos(LockSupport.java:215)
   [junit4]    >         at java.util.concurrent.SynchronousQueue$TransferStack.awaitFulfill(SynchronousQueue.java:460)
   [junit4]    >         at java.util.concurrent.SynchronousQueue$TransferStack.transfer(SynchronousQueue.java:362)
   [junit4]    >         at java.util.concurrent.SynchronousQueue.poll(SynchronousQueue.java:941)
   [junit4]    >         at java.util.concurrent.ThreadPoolExecutor.getTask(ThreadPoolExecutor.java:1073)
   [junit4]    >         at java.util.concurrent.ThreadPoolExecutor.runWorker(ThreadPoolExecutor.java:1134)
   [junit4]    >         at java.util.concurrent.ThreadPoolExecutor$Worker.run(ThreadPoolExecutor.java:624)
   [junit4]    >         at java.lang.Thread.run(Thread.java:748)
   [junit4]    >    3) Thread[id=21065, name=qtp3631478-21065, state=RUNNABLE, group=TGRP-SolrCLIZkUtilsTest]
   [junit4]    >         at sun.nio.ch.KQueueArrayWrapper.kevent0(Native Method)
   [junit4]    >         at sun.nio.ch.KQueueArrayWrapper.poll(KQueueArrayWrapper.java:198)
   [junit4]    >         at sun.nio.ch.KQueueSelectorImpl.doSelect(KQueueSelectorImpl.java:117)
   [junit4]    >         at sun.nio.ch.SelectorImpl.lockAndDoSelect(SelectorImpl.java:86)
   [junit4]    >         at sun.nio.ch.SelectorImpl.select(SelectorImpl.java:97)
   [junit4]    >         at sun.nio.ch.SelectorImpl.select(SelectorImpl.java:101)
   [junit4]    >         at org.eclipse.jetty.io.ManagedSelector$SelectorProducer.select(ManagedSelector.java:243)
   [junit4]    >         at org.eclipse.jetty.io.ManagedSelector$SelectorProducer.produce(ManagedSelector.java:191)
   [junit4]    >         at org.eclipse.jetty.util.thread.strategy.ExecuteProduceConsume.executeProduceConsume(ExecuteProduceConsume.java:249)
   [junit4]    >         at org.eclipse.jetty.util.thread.strategy.ExecuteProduceConsume.produceConsume(ExecuteProduceConsume.java:148)
   [junit4]    >         at org.eclipse.jetty.util.thread.strategy.ExecuteProduceConsume.execute(ExecuteProduceConsume.java:100)
   [junit4]    >         at org.eclipse.jetty.io.ManagedSelector.run(ManagedSelector.java:147)
   [junit4]    >         at org.eclipse.jetty.util.thread.QueuedThreadPool.runJob(QueuedThreadPool.java:671)
   [junit4]    >         at org.eclipse.jetty.util.thread.QueuedThreadPool$2.run(QueuedThreadPool.java:589)
   [junit4]    >         at java.lang.Thread.run(Thread.java:748)
   [junit4]    >    4) Thread[id=21073, name=org.eclipse.jetty.server.session.HashSessionManager@2269b481Timer, state=TIMED_WAITING, group=TGRP-SolrCLIZkUtilsTest]
   [junit4]    >         at sun.misc.Unsafe.park(Native Method)
   [junit4]    >         at java.util.concurrent.locks.LockSupport.parkNanos(LockSupport.java:215)
   [junit4]    >         at java.util.concurrent.locks.AbstractQueuedSynchronizer$ConditionObject.awaitNanos(AbstractQueuedSynchronizer.java:2078)
   [junit4]    >         at java.util.concurrent.ScheduledThreadPoolExecutor$DelayedWorkQueue.take(ScheduledThreadPoolExecutor.java:1093)
   [junit4]    >         at java.util.concurrent.ScheduledThreadPoolExecutor$DelayedWorkQueue.take(ScheduledThreadPoolExecutor.java:809)
   [junit4]    >         at java.util.concurrent.ThreadPoolExecutor.getTask(ThreadPoolExecutor.java:1074)
   [junit4]    >         at java.util.concurrent.ThreadPoolExecutor.runWorker(ThreadPoolExecutor.java:1134)
   [junit4]    >         at java.util.concurrent.ThreadPoolExecutor$Worker.run(ThreadPoolExecutor.java:624)
   [junit4]    >         at java.lang.Thread.run(Thread.java:748)
   [junit4]    > 	at __randomizedtesting.SeedInfo.seed([A3BFFE30E3B27591]:0)
   [junit4] Completed [541/763 (4!)] on J1 in 44.68s, 0 tests, 1 failure, 4 errors <<< FAILURES!

[...truncated 48851 lines...]

Mime
View raw message