lucene-dev mailing list archives

Site index · List index
Message view « Date » · « Thread »
Top « Date » · « Thread »
From Policeman Jenkins Server <jenk...@thetaphi.de>
Subject [JENKINS] Lucene-Solr-7.2-Linux (64bit/jdk1.8.0_144) - Build # 101 - Still Unstable!
Date Fri, 22 Dec 2017 16:42:46 GMT
Build: https://jenkins.thetaphi.de/job/Lucene-Solr-7.2-Linux/101/
Java: 64bit/jdk1.8.0_144 -XX:-UseCompressedOops -XX:+UseConcMarkSweepGC

3 tests failed.
FAILED:  junit.framework.TestSuite.org.apache.solr.analytics.NoFacetTest

Error Message:
Error from server at http://127.0.0.1:32943/solr: create the collection time out:180s

Stack Trace:
org.apache.solr.client.solrj.impl.HttpSolrClient$RemoteSolrException: Error from server at http://127.0.0.1:32943/solr: create the collection time out:180s
	at __randomizedtesting.SeedInfo.seed([B21E101D42E707A5]:0)
	at org.apache.solr.client.solrj.impl.HttpSolrClient.executeMethod(HttpSolrClient.java:643)
	at org.apache.solr.client.solrj.impl.HttpSolrClient.request(HttpSolrClient.java:255)
	at org.apache.solr.client.solrj.impl.HttpSolrClient.request(HttpSolrClient.java:244)
	at org.apache.solr.client.solrj.impl.LBHttpSolrClient.doRequest(LBHttpSolrClient.java:483)
	at org.apache.solr.client.solrj.impl.LBHttpSolrClient.request(LBHttpSolrClient.java:413)
	at org.apache.solr.client.solrj.impl.CloudSolrClient.sendRequest(CloudSolrClient.java:1103)
	at org.apache.solr.client.solrj.impl.CloudSolrClient.requestWithRetryOnStaleState(CloudSolrClient.java:883)
	at org.apache.solr.client.solrj.impl.CloudSolrClient.request(CloudSolrClient.java:816)
	at org.apache.solr.client.solrj.SolrRequest.process(SolrRequest.java:194)
	at org.apache.solr.client.solrj.SolrRequest.process(SolrRequest.java:211)
	at org.apache.solr.analytics.SolrAnalyticsTestCase.setupCollection(SolrAnalyticsTestCase.java:62)
	at sun.reflect.NativeMethodAccessorImpl.invoke0(Native Method)
	at sun.reflect.NativeMethodAccessorImpl.invoke(NativeMethodAccessorImpl.java:62)
	at sun.reflect.DelegatingMethodAccessorImpl.invoke(DelegatingMethodAccessorImpl.java:43)
	at java.lang.reflect.Method.invoke(Method.java:498)
	at com.carrotsearch.randomizedtesting.RandomizedRunner.invoke(RandomizedRunner.java:1737)
	at com.carrotsearch.randomizedtesting.RandomizedRunner$6.evaluate(RandomizedRunner.java:874)
	at com.carrotsearch.randomizedtesting.RandomizedRunner$7.evaluate(RandomizedRunner.java:890)
	at com.carrotsearch.randomizedtesting.rules.StatementAdapter.evaluate(StatementAdapter.java:36)
	at com.carrotsearch.randomizedtesting.rules.SystemPropertiesRestoreRule$1.evaluate(SystemPropertiesRestoreRule.java:57)
	at org.apache.lucene.util.AbstractBeforeAfterRule$1.evaluate(AbstractBeforeAfterRule.java:45)
	at com.carrotsearch.randomizedtesting.rules.StatementAdapter.evaluate(StatementAdapter.java:36)
	at org.apache.lucene.util.TestRuleStoreClassName$1.evaluate(TestRuleStoreClassName.java:41)
	at com.carrotsearch.randomizedtesting.rules.NoShadowingOrOverridesOnMethodsRule$1.evaluate(NoShadowingOrOverridesOnMethodsRule.java:40)
	at com.carrotsearch.randomizedtesting.rules.NoShadowingOrOverridesOnMethodsRule$1.evaluate(NoShadowingOrOverridesOnMethodsRule.java:40)
	at com.carrotsearch.randomizedtesting.rules.StatementAdapter.evaluate(StatementAdapter.java:36)
	at com.carrotsearch.randomizedtesting.rules.StatementAdapter.evaluate(StatementAdapter.java:36)
	at com.carrotsearch.randomizedtesting.rules.StatementAdapter.evaluate(StatementAdapter.java:36)
	at org.apache.lucene.util.TestRuleAssertionsRequired$1.evaluate(TestRuleAssertionsRequired.java:53)
	at org.apache.lucene.util.TestRuleMarkFailure$1.evaluate(TestRuleMarkFailure.java:47)
	at org.apache.lucene.util.TestRuleIgnoreAfterMaxFailures$1.evaluate(TestRuleIgnoreAfterMaxFailures.java:64)
	at org.apache.lucene.util.TestRuleIgnoreTestSuites$1.evaluate(TestRuleIgnoreTestSuites.java:54)
	at com.carrotsearch.randomizedtesting.rules.StatementAdapter.evaluate(StatementAdapter.java:36)
	at com.carrotsearch.randomizedtesting.ThreadLeakControl$StatementRunner.run(ThreadLeakControl.java:368)
	at java.lang.Thread.run(Thread.java:748)


FAILED:  org.apache.solr.cloud.TestLeaderInitiatedRecoveryThread.testPublishDownState

Error Message:
Timeout occured while waiting response from server at: http://127.0.0.1:44171/ho_

Stack Trace:
org.apache.solr.client.solrj.SolrServerException: Timeout occured while waiting response from server at: http://127.0.0.1:44171/ho_
	at __randomizedtesting.SeedInfo.seed([6071DB34886778B0:3E0C79CA2C7A314D]:0)
	at org.apache.solr.client.solrj.impl.HttpSolrClient.executeMethod(HttpSolrClient.java:654)
	at org.apache.solr.client.solrj.impl.HttpSolrClient.request(HttpSolrClient.java:255)
	at org.apache.solr.client.solrj.impl.HttpSolrClient.request(HttpSolrClient.java:244)
	at org.apache.solr.client.solrj.impl.LBHttpSolrClient.doRequest(LBHttpSolrClient.java:483)
	at org.apache.solr.client.solrj.impl.LBHttpSolrClient.request(LBHttpSolrClient.java:413)
	at org.apache.solr.client.solrj.impl.CloudSolrClient.sendRequest(CloudSolrClient.java:1103)
	at org.apache.solr.client.solrj.impl.CloudSolrClient.requestWithRetryOnStaleState(CloudSolrClient.java:883)
	at org.apache.solr.client.solrj.impl.CloudSolrClient.request(CloudSolrClient.java:816)
	at org.apache.solr.client.solrj.SolrRequest.process(SolrRequest.java:194)
	at org.apache.solr.client.solrj.SolrRequest.process(SolrRequest.java:211)
	at org.apache.solr.cloud.AbstractFullDistribZkTestBase.createServers(AbstractFullDistribZkTestBase.java:314)
	at org.apache.solr.BaseDistributedSearchTestCase$ShardsRepeatRule$ShardsFixedStatement.callStatement(BaseDistributedSearchTestCase.java:991)
	at org.apache.solr.BaseDistributedSearchTestCase$ShardsRepeatRule$ShardsStatement.evaluate(BaseDistributedSearchTestCase.java:968)
	at com.carrotsearch.randomizedtesting.rules.SystemPropertiesRestoreRule$1.evaluate(SystemPropertiesRestoreRule.java:57)
	at org.apache.lucene.util.TestRuleSetupTeardownChained$1.evaluate(TestRuleSetupTeardownChained.java:49)
	at org.apache.lucene.util.AbstractBeforeAfterRule$1.evaluate(AbstractBeforeAfterRule.java:45)
	at org.apache.lucene.util.TestRuleThreadAndTestName$1.evaluate(TestRuleThreadAndTestName.java:48)
	at org.apache.lucene.util.TestRuleIgnoreAfterMaxFailures$1.evaluate(TestRuleIgnoreAfterMaxFailures.java:64)
	at org.apache.lucene.util.TestRuleMarkFailure$1.evaluate(TestRuleMarkFailure.java:47)
	at com.carrotsearch.randomizedtesting.rules.StatementAdapter.evaluate(StatementAdapter.java:36)
	at com.carrotsearch.randomizedtesting.ThreadLeakControl$StatementRunner.run(ThreadLeakControl.java:368)
	at com.carrotsearch.randomizedtesting.ThreadLeakControl.forkTimeoutingTask(ThreadLeakControl.java:817)
	at com.carrotsearch.randomizedtesting.ThreadLeakControl$3.evaluate(ThreadLeakControl.java:468)
	at com.carrotsearch.randomizedtesting.RandomizedRunner.runSingleTest(RandomizedRunner.java:943)
	at com.carrotsearch.randomizedtesting.RandomizedRunner$5.evaluate(RandomizedRunner.java:829)
	at com.carrotsearch.randomizedtesting.RandomizedRunner$6.evaluate(RandomizedRunner.java:879)
	at com.carrotsearch.randomizedtesting.RandomizedRunner$7.evaluate(RandomizedRunner.java:890)
	at com.carrotsearch.randomizedtesting.rules.StatementAdapter.evaluate(StatementAdapter.java:36)
	at com.carrotsearch.randomizedtesting.rules.SystemPropertiesRestoreRule$1.evaluate(SystemPropertiesRestoreRule.java:57)
	at org.apache.lucene.util.AbstractBeforeAfterRule$1.evaluate(AbstractBeforeAfterRule.java:45)
	at com.carrotsearch.randomizedtesting.rules.StatementAdapter.evaluate(StatementAdapter.java:36)
	at org.apache.lucene.util.TestRuleStoreClassName$1.evaluate(TestRuleStoreClassName.java:41)
	at com.carrotsearch.randomizedtesting.rules.NoShadowingOrOverridesOnMethodsRule$1.evaluate(NoShadowingOrOverridesOnMethodsRule.java:40)
	at com.carrotsearch.randomizedtesting.rules.NoShadowingOrOverridesOnMethodsRule$1.evaluate(NoShadowingOrOverridesOnMethodsRule.java:40)
	at com.carrotsearch.randomizedtesting.rules.StatementAdapter.evaluate(StatementAdapter.java:36)
	at com.carrotsearch.randomizedtesting.rules.StatementAdapter.evaluate(StatementAdapter.java:36)
	at com.carrotsearch.randomizedtesting.rules.StatementAdapter.evaluate(StatementAdapter.java:36)
	at org.apache.lucene.util.TestRuleAssertionsRequired$1.evaluate(TestRuleAssertionsRequired.java:53)
	at org.apache.lucene.util.TestRuleMarkFailure$1.evaluate(TestRuleMarkFailure.java:47)
	at org.apache.lucene.util.TestRuleIgnoreAfterMaxFailures$1.evaluate(TestRuleIgnoreAfterMaxFailures.java:64)
	at org.apache.lucene.util.TestRuleIgnoreTestSuites$1.evaluate(TestRuleIgnoreTestSuites.java:54)
	at com.carrotsearch.randomizedtesting.rules.StatementAdapter.evaluate(StatementAdapter.java:36)
	at com.carrotsearch.randomizedtesting.ThreadLeakControl$StatementRunner.run(ThreadLeakControl.java:368)
	at java.lang.Thread.run(Thread.java:748)
Caused by: java.net.SocketTimeoutException: Read timed out
	at java.net.SocketInputStream.socketRead0(Native Method)
	at java.net.SocketInputStream.socketRead(SocketInputStream.java:116)
	at java.net.SocketInputStream.read(SocketInputStream.java:171)
	at java.net.SocketInputStream.read(SocketInputStream.java:141)
	at org.apache.http.impl.io.SessionInputBufferImpl.streamRead(SessionInputBufferImpl.java:137)
	at org.apache.http.impl.io.SessionInputBufferImpl.fillBuffer(SessionInputBufferImpl.java:153)
	at org.apache.http.impl.io.SessionInputBufferImpl.readLine(SessionInputBufferImpl.java:282)
	at org.apache.http.impl.conn.DefaultHttpResponseParser.parseHead(DefaultHttpResponseParser.java:138)
	at org.apache.http.impl.conn.DefaultHttpResponseParser.parseHead(DefaultHttpResponseParser.java:56)
	at org.apache.http.impl.io.AbstractMessageParser.parse(AbstractMessageParser.java:259)
	at org.apache.http.impl.DefaultBHttpClientConnection.receiveResponseHeader(DefaultBHttpClientConnection.java:163)
	at org.apache.http.impl.conn.CPoolProxy.receiveResponseHeader(CPoolProxy.java:165)
	at org.apache.http.protocol.HttpRequestExecutor.doReceiveResponse(HttpRequestExecutor.java:273)
	at org.apache.http.protocol.HttpRequestExecutor.execute(HttpRequestExecutor.java:125)
	at org.apache.http.impl.execchain.MainClientExec.execute(MainClientExec.java:272)
	at org.apache.http.impl.execchain.ProtocolExec.execute(ProtocolExec.java:185)
	at org.apache.http.impl.execchain.RetryExec.execute(RetryExec.java:89)
	at org.apache.http.impl.execchain.RedirectExec.execute(RedirectExec.java:111)
	at org.apache.http.impl.client.InternalHttpClient.doExecute(InternalHttpClient.java:185)
	at org.apache.http.impl.client.CloseableHttpClient.execute(CloseableHttpClient.java:83)
	at org.apache.http.impl.client.CloseableHttpClient.execute(CloseableHttpClient.java:56)
	at org.apache.solr.client.solrj.impl.HttpSolrClient.executeMethod(HttpSolrClient.java:542)
	... 43 more


FAILED:  org.apache.solr.handler.TestReplicationHandler.doTestIndexAndConfigReplication

Error Message:
Index: 0, Size: 0

Stack Trace:
java.lang.IndexOutOfBoundsException: Index: 0, Size: 0
	at __randomizedtesting.SeedInfo.seed([6071DB34886778B0:74398061AB60C5AE]:0)
	at java.util.ArrayList.rangeCheck(ArrayList.java:653)
	at java.util.ArrayList.get(ArrayList.java:429)
	at org.apache.solr.handler.TestReplicationHandler.doTestIndexAndConfigReplication(TestReplicationHandler.java:561)
	at sun.reflect.NativeMethodAccessorImpl.invoke0(Native Method)
	at sun.reflect.NativeMethodAccessorImpl.invoke(NativeMethodAccessorImpl.java:62)
	at sun.reflect.DelegatingMethodAccessorImpl.invoke(DelegatingMethodAccessorImpl.java:43)
	at java.lang.reflect.Method.invoke(Method.java:498)
	at com.carrotsearch.randomizedtesting.RandomizedRunner.invoke(RandomizedRunner.java:1737)
	at com.carrotsearch.randomizedtesting.RandomizedRunner$8.evaluate(RandomizedRunner.java:934)
	at com.carrotsearch.randomizedtesting.RandomizedRunner$9.evaluate(RandomizedRunner.java:970)
	at com.carrotsearch.randomizedtesting.RandomizedRunner$10.evaluate(RandomizedRunner.java:984)
	at com.carrotsearch.randomizedtesting.rules.SystemPropertiesRestoreRule$1.evaluate(SystemPropertiesRestoreRule.java:57)
	at org.apache.lucene.util.TestRuleSetupTeardownChained$1.evaluate(TestRuleSetupTeardownChained.java:49)
	at org.apache.lucene.util.AbstractBeforeAfterRule$1.evaluate(AbstractBeforeAfterRule.java:45)
	at org.apache.lucene.util.TestRuleThreadAndTestName$1.evaluate(TestRuleThreadAndTestName.java:48)
	at org.apache.lucene.util.TestRuleIgnoreAfterMaxFailures$1.evaluate(TestRuleIgnoreAfterMaxFailures.java:64)
	at org.apache.lucene.util.TestRuleMarkFailure$1.evaluate(TestRuleMarkFailure.java:47)
	at com.carrotsearch.randomizedtesting.rules.StatementAdapter.evaluate(StatementAdapter.java:36)
	at com.carrotsearch.randomizedtesting.ThreadLeakControl$StatementRunner.run(ThreadLeakControl.java:368)
	at com.carrotsearch.randomizedtesting.ThreadLeakControl.forkTimeoutingTask(ThreadLeakControl.java:817)
	at com.carrotsearch.randomizedtesting.ThreadLeakControl$3.evaluate(ThreadLeakControl.java:468)
	at com.carrotsearch.randomizedtesting.RandomizedRunner.runSingleTest(RandomizedRunner.java:943)
	at com.carrotsearch.randomizedtesting.RandomizedRunner$5.evaluate(RandomizedRunner.java:829)
	at com.carrotsearch.randomizedtesting.RandomizedRunner$6.evaluate(RandomizedRunner.java:879)
	at com.carrotsearch.randomizedtesting.RandomizedRunner$7.evaluate(RandomizedRunner.java:890)
	at com.carrotsearch.randomizedtesting.rules.StatementAdapter.evaluate(StatementAdapter.java:36)
	at com.carrotsearch.randomizedtesting.rules.SystemPropertiesRestoreRule$1.evaluate(SystemPropertiesRestoreRule.java:57)
	at org.apache.lucene.util.AbstractBeforeAfterRule$1.evaluate(AbstractBeforeAfterRule.java:45)
	at com.carrotsearch.randomizedtesting.rules.StatementAdapter.evaluate(StatementAdapter.java:36)
	at org.apache.lucene.util.TestRuleStoreClassName$1.evaluate(TestRuleStoreClassName.java:41)
	at com.carrotsearch.randomizedtesting.rules.NoShadowingOrOverridesOnMethodsRule$1.evaluate(NoShadowingOrOverridesOnMethodsRule.java:40)
	at com.carrotsearch.randomizedtesting.rules.NoShadowingOrOverridesOnMethodsRule$1.evaluate(NoShadowingOrOverridesOnMethodsRule.java:40)
	at com.carrotsearch.randomizedtesting.rules.StatementAdapter.evaluate(StatementAdapter.java:36)
	at com.carrotsearch.randomizedtesting.rules.StatementAdapter.evaluate(StatementAdapter.java:36)
	at com.carrotsearch.randomizedtesting.rules.StatementAdapter.evaluate(StatementAdapter.java:36)
	at org.apache.lucene.util.TestRuleAssertionsRequired$1.evaluate(TestRuleAssertionsRequired.java:53)
	at org.apache.lucene.util.TestRuleMarkFailure$1.evaluate(TestRuleMarkFailure.java:47)
	at org.apache.lucene.util.TestRuleIgnoreAfterMaxFailures$1.evaluate(TestRuleIgnoreAfterMaxFailures.java:64)
	at org.apache.lucene.util.TestRuleIgnoreTestSuites$1.evaluate(TestRuleIgnoreTestSuites.java:54)
	at com.carrotsearch.randomizedtesting.rules.StatementAdapter.evaluate(StatementAdapter.java:36)
	at com.carrotsearch.randomizedtesting.ThreadLeakControl$StatementRunner.run(ThreadLeakControl.java:368)
	at java.lang.Thread.run(Thread.java:748)




Build Log:
[...truncated 12402 lines...]
   [junit4] Suite: org.apache.solr.cloud.TestLeaderInitiatedRecoveryThread
   [junit4]   2> Creating dataDir: /home/jenkins/workspace/Lucene-Solr-7.2-Linux/solr/build/solr-core/test/J2/temp/solr.cloud.TestLeaderInitiatedRecoveryThread_6071DB34886778B0-001/init-core-data-001
   [junit4]   2> 703786 INFO  (SUITE-TestLeaderInitiatedRecoveryThread-seed#[6071DB34886778B0]-worker) [    ] o.a.s.SolrTestCaseJ4 Using TrieFields (NUMERIC_POINTS_SYSPROP=false) w/NUMERIC_DOCVALUES_SYSPROP=true
   [junit4]   2> 703787 INFO  (SUITE-TestLeaderInitiatedRecoveryThread-seed#[6071DB34886778B0]-worker) [    ] o.a.s.SolrTestCaseJ4 Randomized ssl (false) and clientAuth (false) via: @org.apache.solr.SolrTestCaseJ4$SuppressSSL(bugUrl=None)
   [junit4]   2> 703787 INFO  (SUITE-TestLeaderInitiatedRecoveryThread-seed#[6071DB34886778B0]-worker) [    ] o.a.s.SolrTestCaseJ4 SecureRandom sanity checks: test.solr.allowed.securerandom=null & java.security.egd=file:/dev/./urandom
   [junit4]   2> 703787 INFO  (SUITE-TestLeaderInitiatedRecoveryThread-seed#[6071DB34886778B0]-worker) [    ] o.a.s.BaseDistributedSearchTestCase Setting hostContext system property: /ho_/
   [junit4]   2> 703788 INFO  (TEST-TestLeaderInitiatedRecoveryThread.testPublishDownState-seed#[6071DB34886778B0]) [    ] o.a.s.c.ZkTestServer STARTING ZK TEST SERVER
   [junit4]   2> 703788 INFO  (Thread-1010) [    ] o.a.s.c.ZkTestServer client port:0.0.0.0/0.0.0.0:0
   [junit4]   2> 703788 INFO  (Thread-1010) [    ] o.a.s.c.ZkTestServer Starting server
   [junit4]   2> 703789 ERROR (Thread-1010) [    ] o.a.z.s.ZooKeeperServer ZKShutdownHandler is not registered, so ZooKeeper server won't take any action on ERROR or SHUTDOWN server state changes
   [junit4]   2> 703888 INFO  (TEST-TestLeaderInitiatedRecoveryThread.testPublishDownState-seed#[6071DB34886778B0]) [    ] o.a.s.c.ZkTestServer start zk server on port:43709
   [junit4]   2> 703890 INFO  (zkConnectionManagerCallback-1059-thread-1) [    ] o.a.s.c.c.ConnectionManager zkClient has connected
   [junit4]   2> 703898 INFO  (zkConnectionManagerCallback-1061-thread-1) [    ] o.a.s.c.c.ConnectionManager zkClient has connected
   [junit4]   2> 703900 INFO  (TEST-TestLeaderInitiatedRecoveryThread.testPublishDownState-seed#[6071DB34886778B0]) [    ] o.a.s.c.AbstractZkTestCase put /home/jenkins/workspace/Lucene-Solr-7.2-Linux/solr/core/src/test-files/solr/collection1/conf/solrconfig-tlog.xml to /configs/conf1/solrconfig.xml
   [junit4]   2> 703900 INFO  (TEST-TestLeaderInitiatedRecoveryThread.testPublishDownState-seed#[6071DB34886778B0]) [    ] o.a.s.c.AbstractZkTestCase put /home/jenkins/workspace/Lucene-Solr-7.2-Linux/solr/core/src/test-files/solr/collection1/conf/schema.xml to /configs/conf1/schema.xml
   [junit4]   2> 703901 INFO  (TEST-TestLeaderInitiatedRecoveryThread.testPublishDownState-seed#[6071DB34886778B0]) [    ] o.a.s.c.AbstractZkTestCase put /home/jenkins/workspace/Lucene-Solr-7.2-Linux/solr/core/src/test-files/solr/collection1/conf/solrconfig.snippet.randomindexconfig.xml to /configs/conf1/solrconfig.snippet.randomindexconfig.xml
   [junit4]   2> 703901 INFO  (TEST-TestLeaderInitiatedRecoveryThread.testPublishDownState-seed#[6071DB34886778B0]) [    ] o.a.s.c.AbstractZkTestCase put /home/jenkins/workspace/Lucene-Solr-7.2-Linux/solr/core/src/test-files/solr/collection1/conf/stopwords.txt to /configs/conf1/stopwords.txt
   [junit4]   2> 703901 INFO  (TEST-TestLeaderInitiatedRecoveryThread.testPublishDownState-seed#[6071DB34886778B0]) [    ] o.a.s.c.AbstractZkTestCase put /home/jenkins/workspace/Lucene-Solr-7.2-Linux/solr/core/src/test-files/solr/collection1/conf/protwords.txt to /configs/conf1/protwords.txt
   [junit4]   2> 703902 INFO  (TEST-TestLeaderInitiatedRecoveryThread.testPublishDownState-seed#[6071DB34886778B0]) [    ] o.a.s.c.AbstractZkTestCase put /home/jenkins/workspace/Lucene-Solr-7.2-Linux/solr/core/src/test-files/solr/collection1/conf/currency.xml to /configs/conf1/currency.xml
   [junit4]   2> 703902 INFO  (TEST-TestLeaderInitiatedRecoveryThread.testPublishDownState-seed#[6071DB34886778B0]) [    ] o.a.s.c.AbstractZkTestCase put /home/jenkins/workspace/Lucene-Solr-7.2-Linux/solr/core/src/test-files/solr/collection1/conf/enumsConfig.xml to /configs/conf1/enumsConfig.xml
   [junit4]   2> 703903 INFO  (TEST-TestLeaderInitiatedRecoveryThread.testPublishDownState-seed#[6071DB34886778B0]) [    ] o.a.s.c.AbstractZkTestCase put /home/jenkins/workspace/Lucene-Solr-7.2-Linux/solr/core/src/test-files/solr/collection1/conf/open-exchange-rates.json to /configs/conf1/open-exchange-rates.json
   [junit4]   2> 703903 INFO  (TEST-TestLeaderInitiatedRecoveryThread.testPublishDownState-seed#[6071DB34886778B0]) [    ] o.a.s.c.AbstractZkTestCase put /home/jenkins/workspace/Lucene-Solr-7.2-Linux/solr/core/src/test-files/solr/collection1/conf/mapping-ISOLatin1Accent.txt to /configs/conf1/mapping-ISOLatin1Accent.txt
   [junit4]   2> 703903 INFO  (TEST-TestLeaderInitiatedRecoveryThread.testPublishDownState-seed#[6071DB34886778B0]) [    ] o.a.s.c.AbstractZkTestCase put /home/jenkins/workspace/Lucene-Solr-7.2-Linux/solr/core/src/test-files/solr/collection1/conf/old_synonyms.txt to /configs/conf1/old_synonyms.txt
   [junit4]   2> 703904 INFO  (TEST-TestLeaderInitiatedRecoveryThread.testPublishDownState-seed#[6071DB34886778B0]) [    ] o.a.s.c.AbstractZkTestCase put /home/jenkins/workspace/Lucene-Solr-7.2-Linux/solr/core/src/test-files/solr/collection1/conf/synonyms.txt to /configs/conf1/synonyms.txt
   [junit4]   2> 703905 INFO  (TEST-TestLeaderInitiatedRecoveryThread.testPublishDownState-seed#[6071DB34886778B0]) [    ] o.a.s.c.AbstractFullDistribZkTestBase Will use NRT replicas unless explicitly asked otherwise
   [junit4]   2> 703965 INFO  (TEST-TestLeaderInitiatedRecoveryThread.testPublishDownState-seed#[6071DB34886778B0]) [    ] o.e.j.s.Server jetty-9.3.20.v20170531
   [junit4]   2> 703974 INFO  (TEST-TestLeaderInitiatedRecoveryThread.testPublishDownState-seed#[6071DB34886778B0]) [    ] o.e.j.s.h.ContextHandler Started o.e.j.s.ServletContextHandler@7dbfd926{/ho_,null,AVAILABLE}
   [junit4]   2> 703976 INFO  (TEST-TestLeaderInitiatedRecoveryThread.testPublishDownState-seed#[6071DB34886778B0]) [    ] o.e.j.s.AbstractConnector Started ServerConnector@72e9cb85{HTTP/1.1,[http/1.1]}{127.0.0.1:44171}
   [junit4]   2> 703976 INFO  (TEST-TestLeaderInitiatedRecoveryThread.testPublishDownState-seed#[6071DB34886778B0]) [    ] o.e.j.s.Server Started @705310ms
   [junit4]   2> 703976 INFO  (TEST-TestLeaderInitiatedRecoveryThread.testPublishDownState-seed#[6071DB34886778B0]) [    ] o.a.s.c.s.e.JettySolrRunner Jetty properties: {solr.data.dir=/home/jenkins/workspace/Lucene-Solr-7.2-Linux/solr/build/solr-core/test/J2/temp/solr.cloud.TestLeaderInitiatedRecoveryThread_6071DB34886778B0-001/tempDir-001/control/data, hostContext=/ho_, hostPort=44171, coreRootDirectory=/home/jenkins/workspace/Lucene-Solr-7.2-Linux/solr/build/solr-core/test/J2/temp/solr.cloud.TestLeaderInitiatedRecoveryThread_6071DB34886778B0-001/control-001/cores}
   [junit4]   2> 703976 ERROR (TEST-TestLeaderInitiatedRecoveryThread.testPublishDownState-seed#[6071DB34886778B0]) [    ] o.a.s.u.StartupLoggingUtils Missing Java Option solr.log.dir. Logging may be missing or incomplete.
   [junit4]   2> 703976 INFO  (TEST-TestLeaderInitiatedRecoveryThread.testPublishDownState-seed#[6071DB34886778B0]) [    ] o.a.s.s.SolrDispatchFilter  ___      _       Welcome to Apache Solr™ version 7.2.1
   [junit4]   2> 703977 INFO  (TEST-TestLeaderInitiatedRecoveryThread.testPublishDownState-seed#[6071DB34886778B0]) [    ] o.a.s.s.SolrDispatchFilter / __| ___| |_ _   Starting in cloud mode on port null
   [junit4]   2> 703977 INFO  (TEST-TestLeaderInitiatedRecoveryThread.testPublishDownState-seed#[6071DB34886778B0]) [    ] o.a.s.s.SolrDispatchFilter \__ \/ _ \ | '_|  Install dir: null
   [junit4]   2> 703977 INFO  (TEST-TestLeaderInitiatedRecoveryThread.testPublishDownState-seed#[6071DB34886778B0]) [    ] o.a.s.s.SolrDispatchFilter |___/\___/_|_|    Start time: 2017-12-22T15:52:20.615Z
   [junit4]   2> 703986 INFO  (zkConnectionManagerCallback-1063-thread-1) [    ] o.a.s.c.c.ConnectionManager zkClient has connected
   [junit4]   2> 703988 INFO  (TEST-TestLeaderInitiatedRecoveryThread.testPublishDownState-seed#[6071DB34886778B0]) [    ] o.a.s.s.SolrDispatchFilter Loading solr.xml from SolrHome (not found in ZooKeeper)
   [junit4]   2> 703988 INFO  (TEST-TestLeaderInitiatedRecoveryThread.testPublishDownState-seed#[6071DB34886778B0]) [    ] o.a.s.c.SolrXmlConfig Loading container configuration from /home/jenkins/workspace/Lucene-Solr-7.2-Linux/solr/build/solr-core/test/J2/temp/solr.cloud.TestLeaderInitiatedRecoveryThread_6071DB34886778B0-001/control-001/solr.xml
   [junit4]   2> 703991 INFO  (TEST-TestLeaderInitiatedRecoveryThread.testPublishDownState-seed#[6071DB34886778B0]) [    ] o.a.s.c.SolrXmlConfig Configuration parameter autoReplicaFailoverWorkLoopDelay is ignored
   [junit4]   2> 703991 INFO  (TEST-TestLeaderInitiatedRecoveryThread.testPublishDownState-seed#[6071DB34886778B0]) [    ] o.a.s.c.SolrXmlConfig Configuration parameter autoReplicaFailoverBadNodeExpiration is ignored
   [junit4]   2> 703992 INFO  (TEST-TestLeaderInitiatedRecoveryThread.testPublishDownState-seed#[6071DB34886778B0]) [    ] o.a.s.c.SolrXmlConfig MBean server found: com.sun.jmx.mbeanserver.JmxMBeanServer@3d837746, but no JMX reporters were configured - adding default JMX reporter.
   [junit4]   2> 704002 INFO  (TEST-TestLeaderInitiatedRecoveryThread.testPublishDownState-seed#[6071DB34886778B0]) [    ] o.a.s.c.ZkContainer Zookeeper client=127.0.0.1:43709/solr
   [junit4]   2> 704010 INFO  (zkConnectionManagerCallback-1067-thread-1) [    ] o.a.s.c.c.ConnectionManager zkClient has connected
   [junit4]   2> 704018 INFO  (zkConnectionManagerCallback-1069-thread-1-processing-n:127.0.0.1:44171_ho_) [n:127.0.0.1:44171_ho_    ] o.a.s.c.c.ConnectionManager zkClient has connected
   [junit4]   2> 704067 INFO  (TEST-TestLeaderInitiatedRecoveryThread.testPublishDownState-seed#[6071DB34886778B0]) [n:127.0.0.1:44171_ho_    ] o.a.s.c.Overseer Overseer (id=null) closing
   [junit4]   2> 704067 INFO  (TEST-TestLeaderInitiatedRecoveryThread.testPublishDownState-seed#[6071DB34886778B0]) [n:127.0.0.1:44171_ho_    ] o.a.s.c.OverseerElectionContext I am going to be the leader 127.0.0.1:44171_ho_
   [junit4]   2> 704067 INFO  (TEST-TestLeaderInitiatedRecoveryThread.testPublishDownState-seed#[6071DB34886778B0]) [n:127.0.0.1:44171_ho_    ] o.a.s.c.Overseer Overseer (id=99218747583823876-127.0.0.1:44171_ho_-n_0000000000) starting
   [junit4]   2> 704083 INFO  (TEST-TestLeaderInitiatedRecoveryThread.testPublishDownState-seed#[6071DB34886778B0]) [n:127.0.0.1:44171_ho_    ] o.a.s.c.ZkController Register node as live in ZooKeeper:/live_nodes/127.0.0.1:44171_ho_
   [junit4]   2> 704087 INFO  (zkCallback-1068-thread-1-processing-n:127.0.0.1:44171_ho_) [n:127.0.0.1:44171_ho_    ] o.a.s.c.c.ZkStateReader Updated live nodes from ZooKeeper... (0) -> (1)
   [junit4]   2> 704124 INFO  (TEST-TestLeaderInitiatedRecoveryThread.testPublishDownState-seed#[6071DB34886778B0]) [n:127.0.0.1:44171_ho_    ] o.a.s.m.r.SolrJmxReporter JMX monitoring for 'solr.node' (registry 'solr.node') enabled at server: com.sun.jmx.mbeanserver.JmxMBeanServer@3d837746
   [junit4]   2> 704134 INFO  (TEST-TestLeaderInitiatedRecoveryThread.testPublishDownState-seed#[6071DB34886778B0]) [n:127.0.0.1:44171_ho_    ] o.a.s.m.r.SolrJmxReporter JMX monitoring for 'solr.jvm' (registry 'solr.jvm') enabled at server: com.sun.jmx.mbeanserver.JmxMBeanServer@3d837746
   [junit4]   2> 704134 INFO  (TEST-TestLeaderInitiatedRecoveryThread.testPublishDownState-seed#[6071DB34886778B0]) [n:127.0.0.1:44171_ho_    ] o.a.s.m.r.SolrJmxReporter JMX monitoring for 'solr.jetty' (registry 'solr.jetty') enabled at server: com.sun.jmx.mbeanserver.JmxMBeanServer@3d837746
   [junit4]   2> 704135 INFO  (TEST-TestLeaderInitiatedRecoveryThread.testPublishDownState-seed#[6071DB34886778B0]) [n:127.0.0.1:44171_ho_    ] o.a.s.c.CorePropertiesLocator Found 0 core definitions underneath /home/jenkins/workspace/Lucene-Solr-7.2-Linux/solr/build/solr-core/test/J2/temp/solr.cloud.TestLeaderInitiatedRecoveryThread_6071DB34886778B0-001/control-001/cores
   [junit4]   2> 704155 INFO  (zkConnectionManagerCallback-1075-thread-1) [    ] o.a.s.c.c.ConnectionManager zkClient has connected
   [junit4]   2> 704155 INFO  (TEST-TestLeaderInitiatedRecoveryThread.testPublishDownState-seed#[6071DB34886778B0]) [    ] o.a.s.c.c.ZkStateReader Updated live nodes from ZooKeeper... (0) -> (1)
   [junit4]   2> 704156 INFO  (TEST-TestLeaderInitiatedRecoveryThread.testPublishDownState-seed#[6071DB34886778B0]) [    ] o.a.s.c.s.i.ZkClientClusterStateProvider Cluster at 127.0.0.1:43709/solr ready
   [junit4]   2> 704162 INFO  (qtp561151975-4558) [n:127.0.0.1:44171_ho_    ] o.a.s.h.a.CollectionsHandler Invoked Collection Action :create with params replicationFactor=1&collection.configName=conf1&name=control_collection&nrtReplicas=1&action=CREATE&numShards=1&createNodeSet=127.0.0.1:44171_ho_&wt=javabin&version=2 and sendToOCPQueue=true
   [junit4]   2> 704163 INFO  (OverseerThreadFactory-1755-thread-1-processing-n:127.0.0.1:44171_ho_) [n:127.0.0.1:44171_ho_    ] o.a.s.c.CreateCollectionCmd Create collection control_collection
   [junit4]   2> 704266 INFO  (qtp561151975-4560) [n:127.0.0.1:44171_ho_    ] o.a.s.h.a.CoreAdminOperation core create command qt=/admin/cores&collection.configName=conf1&newCollection=true&name=control_collection_shard1_replica_n1&action=CREATE&numShards=1&collection=control_collection&shard=shard1&wt=javabin&version=2&replicaType=NRT
   [junit4]   2> 704266 INFO  (qtp561151975-4560) [n:127.0.0.1:44171_ho_    ] o.a.s.c.TransientSolrCoreCacheDefault Allocating transient cache for 4 transient cores
   [junit4]   2> 704369 INFO  (zkCallback-1068-thread-1-processing-n:127.0.0.1:44171_ho_) [n:127.0.0.1:44171_ho_    ] o.a.s.c.c.ZkStateReader A cluster state change: [WatchedEvent state:SyncConnected type:NodeDataChanged path:/collections/control_collection/state.json] for collection [control_collection] has occurred - updating... (live nodes size: [1])
   [junit4]   2> 705285 INFO  (qtp561151975-4560) [n:127.0.0.1:44171_ho_ c:control_collection s:shard1  x:control_collection_shard1_replica_n1] o.a.s.c.SolrConfig Using Lucene MatchVersion: 7.2.1
   [junit4]   2> 705298 INFO  (qtp561151975-4560) [n:127.0.0.1:44171_ho_ c:control_collection s:shard1  x:control_collection_shard1_replica_n1] o.a.s.s.IndexSchema [control_collection_shard1_replica_n1] Schema name=test
   [junit4]   2> 705346 INFO  (qtp561151975-4560) [n:127.0.0.1:44171_ho_ c:control_collection s:shard1  x:control_collection_shard1_replica_n1] o.a.s.s.IndexSchema Loaded schema test/1.0 with uniqueid field id
   [junit4]   2> 705353 INFO  (qtp561151975-4560) [n:127.0.0.1:44171_ho_ c:control_collection s:shard1  x:control_collection_shard1_replica_n1] o.a.s.c.CoreContainer Creating SolrCore 'control_collection_shard1_replica_n1' using configuration from collection control_collection, trusted=true
   [junit4]   2> 705353 INFO  (qtp561151975-4560) [n:127.0.0.1:44171_ho_ c:control_collection s:shard1  x:control_collection_shard1_replica_n1] o.a.s.m.r.SolrJmxReporter JMX monitoring for 'solr.core.control_collection.shard1.replica_n1' (registry 'solr.core.control_collection.shard1.replica_n1') enabled at server: com.sun.jmx.mbeanserver.JmxMBeanServer@3d837746
   [junit4]   2> 705354 INFO  (qtp561151975-4560) [n:127.0.0.1:44171_ho_ c:control_collection s:shard1  x:control_collection_shard1_replica_n1] o.a.s.c.SolrCore solr.RecoveryStrategy.Builder
   [junit4]   2> 705354 INFO  (qtp561151975-4560) [n:127.0.0.1:44171_ho_ c:control_collection s:shard1  x:control_collection_shard1_replica_n1] o.a.s.c.SolrCore [[control_collection_shard1_replica_n1] ] Opening new SolrCore at [/home/jenkins/workspace/Lucene-Solr-7.2-Linux/solr/build/solr-core/test/J2/temp/solr.cloud.TestLeaderInitiatedRecoveryThread_6071DB34886778B0-001/control-001/cores/control_collection_shard1_replica_n1], dataDir=[/home/jenkins/workspace/Lucene-Solr-7.2-Linux/solr/build/solr-core/test/J2/temp/solr.cloud.TestLeaderInitiatedRecoveryThread_6071DB34886778B0-001/control-001/cores/control_collection_shard1_replica_n1/data/]
   [junit4]   2> 705355 INFO  (qtp561151975-4560) [n:127.0.0.1:44171_ho_ c:control_collection s:shard1  x:control_collection_shard1_replica_n1] o.a.s.u.RandomMergePolicy RandomMergePolicy wrapping class org.apache.lucene.index.TieredMergePolicy: [TieredMergePolicy: maxMergeAtOnce=14, maxMergeAtOnceExplicit=20, maxMergedSegmentMB=89.1162109375, floorSegmentMB=1.787109375, forceMergeDeletesPctAllowed=29.57856589499914, segmentsPerTier=20.0, maxCFSSegmentSizeMB=8.796093022207999E12, noCFSRatio=0.0
   [junit4]   2> 705357 WARN  (qtp561151975-4560) [n:127.0.0.1:44171_ho_ c:control_collection s:shard1  x:control_collection_shard1_replica_n1] o.a.s.c.RequestHandlers INVALID paramSet a in requestHandler {type = requestHandler,name = /dump,class = DumpRequestHandler,attributes = {initParams=a, name=/dump, class=DumpRequestHandler},args = {defaults={a=A,b=B}}}
   [junit4]   2> 705378 INFO  (qtp561151975-4560) [n:127.0.0.1:44171_ho_ c:control_collection s:shard1  x:control_collection_shard1_replica_n1] o.a.s.u.UpdateHandler Using UpdateLog implementation: org.apache.solr.update.UpdateLog
   [junit4]   2> 705378 INFO  (qtp561151975-4560) [n:127.0.0.1:44171_ho_ c:control_collection s:shard1  x:control_collection_shard1_replica_n1] o.a.s.u.UpdateLog Initializing UpdateLog: dataDir= defaultSyncLevel=FLUSH numRecordsToKeep=100 maxNumLogsToKeep=10 numVersionBuckets=65536
   [junit4]   2> 705379 INFO  (qtp561151975-4560) [n:127.0.0.1:44171_ho_ c:control_collection s:shard1  x:control_collection_shard1_replica_n1] o.a.s.u.CommitTracker Hard AutoCommit: disabled
   [junit4]   2> 705379 INFO  (qtp561151975-4560) [n:127.0.0.1:44171_ho_ c:control_collection s:shard1  x:control_collection_shard1_replica_n1] o.a.s.u.CommitTracker Soft AutoCommit: disabled
   [junit4]   2> 705380 INFO  (qtp561151975-4560) [n:127.0.0.1:44171_ho_ c:control_collection s:shard1  x:control_collection_shard1_replica_n1] o.a.s.u.RandomMergePolicy RandomMergePolicy wrapping class org.apache.lucene.index.LogByteSizeMergePolicy: [LogByteSizeMergePolicy: minMergeSize=1677721, mergeFactor=26, maxMergeSize=2147483648, maxMergeSizeForForcedMerge=9223372036854775807, calibrateSizeByDeletes=true, maxMergeDocs=2147483647, maxCFSSegmentSizeMB=8.796093022207999E12, noCFSRatio=1.0]
   [junit4]   2> 705380 INFO  (qtp561151975-4560) [n:127.0.0.1:44171_ho_ c:control_collection s:shard1  x:control_collection_shard1_replica_n1] o.a.s.s.SolrIndexSearcher Opening [Searcher@590e467a[control_collection_shard1_replica_n1] main]
   [junit4]   2> 705381 INFO  (qtp561151975-4560) [n:127.0.0.1:44171_ho_ c:control_collection s:shard1  x:control_collection_shard1_replica_n1] o.a.s.r.ManagedResourceStorage Configured ZooKeeperStorageIO with znodeBase: /configs/conf1
   [junit4]   2> 705381 INFO  (qtp561151975-4560) [n:127.0.0.1:44171_ho_ c:control_collection s:shard1  x:control_collection_shard1_replica_n1] o.a.s.r.ManagedResourceStorage Loaded null at path _rest_managed.json using ZooKeeperStorageIO:path=/configs/conf1
   [junit4]   2> 705381 INFO  (qtp561151975-4560) [n:127.0.0.1:44171_ho_ c:control_collection s:shard1  x:control_collection_shard1_replica_n1] o.a.s.h.ReplicationHandler Commits will be reserved for 10000ms.
   [junit4]   2> 705382 INFO  (searcherExecutor-1758-thread-1-processing-n:127.0.0.1:44171_ho_ x:control_collection_shard1_replica_n1 s:shard1 c:control_collection) [n:127.0.0.1:44171_ho_ c:control_collection s:shard1  x:control_collection_shard1_replica_n1] o.a.s.c.SolrCore [control_collection_shard1_replica_n1] Registered new searcher Searcher@590e467a[control_collection_shard1_replica_n1] main{ExitableDirectoryReader(UninvertingDirectoryReader())}
   [junit4]   2> 705382 INFO  (qtp561151975-4560) [n:127.0.0.1:44171_ho_ c:control_collection s:shard1  x:control_collection_shard1_replica_n1] o.a.s.u.UpdateLog Could not find max version in index or recent updates, using new clock 1587499963011563520
   [junit4]   2> 705385 INFO  (qtp561151975-4560) [n:127.0.0.1:44171_ho_ c:control_collection s:shard1  x:control_collection_shard1_replica_n1] o.a.s.c.ShardLeaderElectionContext Enough replicas found to continue.
   [junit4]   2> 705385 INFO  (qtp561151975-4560) [n:127.0.0.1:44171_ho_ c:control_collection s:shard1  x:control_collection_shard1_replica_n1] o.a.s.c.ShardLeaderElectionContext I may be the new leader - try and sync
   [junit4]   2> 705385 INFO  (qtp561151975-4560) [n:127.0.0.1:44171_ho_ c:control_collection s:shard1  x:control_collection_shard1_replica_n1] o.a.s.c.SyncStrategy Sync replicas to http://127.0.0.1:44171/ho_/control_collection_shard1_replica_n1/
   [junit4]   2> 705385 INFO  (qtp561151975-4560) [n:127.0.0.1:44171_ho_ c:control_collection s:shard1  x:control_collection_shard1_replica_n1] o.a.s.c.SyncStrategy Sync Success - now sync replicas to me
   [junit4]   2> 705385 INFO  (qtp561151975-4560) [n:127.0.0.1:44171_ho_ c:control_collection s:shard1  x:control_collection_shard1_replica_n1] o.a.s.c.SyncStrategy http://127.0.0.1:44171/ho_/control_collection_shard1_replica_n1/ has no replicas
   [junit4]   2> 705385 INFO  (qtp561151975-4560) [n:127.0.0.1:44171_ho_ c:control_collection s:shard1  x:control_collection_shard1_replica_n1] o.a.s.c.ShardLeaderElectionContext Found all replicas participating in election, clear LIR
   [junit4]   2> 705386 INFO  (qtp561151975-4560) [n:127.0.0.1:44171_ho_ c:control_collection s:shard1  x:control_collection_shard1_replica_n1] o.a.s.c.ShardLeaderElectionContext I am the new leader: http://127.0.0.1:44171/ho_/control_collection_shard1_replica_n1/ shard1
   [junit4]   2> 764201 INFO  (TEST-TestLeaderInitiatedRecoveryThread.testPublishDownState-seed#[6071DB34886778B0]) [    ] o.a.s.c.ChaosMonkey monkey: stop jetty! 44171
   [junit4]   2> 764201 INFO  (TEST-TestLeaderInitiatedRecoveryThread.testPublishDownState-seed#[6071DB34886778B0]) [    ] o.a.s.c.CoreContainer Shutting down CoreContainer instance=1528787084
   [junit4]   2> 764201 INFO  (TEST-TestLeaderInitiatedRecoveryThread.testPublishDownState-seed#[6071DB34886778B0]) [    ] o.a.s.m.SolrMetricManager Closing metric reporters for registry=solr.node, tag=null
   [junit4]   2> 764201 INFO  (TEST-TestLeaderInitiatedRecoveryThread.testPublishDownState-seed#[6071DB34886778B0]) [    ] o.a.s.m.r.SolrJmxReporter Closing reporter [org.apache.solr.metrics.reporters.SolrJmxReporter@718bfe78: rootName = null, domain = solr.node, service url = null, agent id = null] for registry solr.node / com.codahale.metrics.MetricRegistry@5742d9d0
   [junit4]   2> 764207 INFO  (TEST-TestLeaderInitiatedRecoveryThread.testPublishDownState-seed#[6071DB34886778B0]) [    ] o.a.s.m.SolrMetricManager Closing metric reporters for registry=solr.jvm, tag=null
   [junit4]   2> 764207 INFO  (TEST-TestLeaderInitiatedRecoveryThread.testPublishDownState-seed#[6071DB34886778B0]) [    ] o.a.s.m.r.SolrJmxReporter Closing reporter [org.apache.solr.metrics.reporters.SolrJmxReporter@7d0ad658: rootName = null, domain = solr.jvm, service url = null, agent id = null] for registry solr.jvm / com.codahale.metrics.MetricRegistry@4b06f99
   [junit4]   2> 764211 INFO  (TEST-TestLeaderInitiatedRecoveryThread.testPublishDownState-seed#[6071DB34886778B0]) [    ] o.a.s.m.SolrMetricManager Closing metric reporters for registry=solr.jetty, tag=null
   [junit4]   2> 764211 INFO  (TEST-TestLeaderInitiatedRecoveryThread.testPublishDownState-seed#[6071DB34886778B0]) [    ] o.a.s.m.r.SolrJmxReporter Closing reporter [org.apache.solr.metrics.reporters.SolrJmxReporter@42b1860d: rootName = null, domain = solr.jetty, service url = null, agent id = null] for registry solr.jetty / com.codahale.metrics.MetricRegistry@474c2b33
   [junit4]   2> 764213 INFO  (TEST-TestLeaderInitiatedRecoveryThread.testPublishDownState-seed#[6071DB34886778B0]) [    ] o.a.s.c.ZkController Remove node as live in ZooKeeper:/live_nodes/127.0.0.1:44171_ho_
   [junit4]   2> 764214 INFO  (TEST-TestLeaderInitiatedRecoveryThread.testPublishDownState-seed#[6071DB34886778B0]) [    ] o.a.s.m.SolrMetricManager Closing metric reporters for registry=solr.cluster, tag=null
   [junit4]   2> 764216 INFO  (zkCallback-1068-thread-2-processing-n:127.0.0.1:44171_ho_) [n:127.0.0.1:44171_ho_    ] o.a.s.c.c.ZkStateReader Updated live nodes from ZooKeeper... (1) -> (0)
   [junit4]   2> 764216 INFO  (coreCloseExecutor-1763-thread-1) [n:127.0.0.1:44171_ho_ c:control_collection s:shard1 r:core_node2 x:control_collection_shard1_replica_n1] o.a.s.c.SolrCore [control_collection_shard1_replica_n1]  CLOSING SolrCore org.apache.solr.core.SolrCore@219ea11c
   [junit4]   2> 764216 INFO  (coreCloseExecutor-1763-thread-1) [n:127.0.0.1:44171_ho_ c:control_collection s:shard1 r:core_node2 x:control_collection_shard1_replica_n1] o.a.s.m.SolrMetricManager Closing metric reporters for registry=solr.core.control_collection.shard1.replica_n1, tag=564044060
   [junit4]   2> 764216 INFO  (coreCloseExecutor-1763-thread-1) [n:127.0.0.1:44171_ho_ c:control_collection s:shard1 r:core_node2 x:control_collection_shard1_replica_n1] o.a.s.m.r.SolrJmxReporter Closing reporter [org.apache.solr.metrics.reporters.SolrJmxReporter@4089fd04: rootName = null, domain = solr.core.control_collection.shard1.replica_n1, service url = null, agent id = null] for registry solr.core.control_collection.shard1.replica_n1 / com.codahale.metrics.MetricRegistry@63999d8a
   [junit4]   2> 764226 INFO  (coreCloseExecutor-1763-thread-1) [n:127.0.0.1:44171_ho_ c:control_collection s:shard1 r:core_node2 x:control_collection_shard1_replica_n1] o.a.s.m.SolrMetricManager Closing metric reporters for registry=solr.collection.control_collection.shard1.leader, tag=564044060
   [junit4]   2> 775101 INFO  (ScheduledTrigger-1753-thread-1) [n:127.0.0.1:44171_ho_    ] o.a.s.c.a.SystemLogListener Collection .system does not exist, disabling logging.
   [junit4]   2> 775102 INFO  (AutoscalingActionExecutor-1754-thread-1-processing-n:127.0.0.1:44171_ho_) [n:127.0.0.1:44171_ho_    ] o.a.s.c.a.ExecutePlanAction No operations to execute for event: {
   [junit4]   2>   "id":"1502a8c80255a200Te7j6v9cwy86vai2y5xyrk2h4d",
   [junit4]   2>   "source":".auto_add_replicas",
   [junit4]   2>   "eventTime":1513958001736000000,
   [junit4]   2>   "eventType":"NODELOST",
   [junit4]   2>   "properties":{
   [junit4]   2>     "eventTimes":[1513958001736000000],
   [junit4]   2>     "_enqueue_time_":1513958011738000000,
   [junit4]   2>     "nodeNames":["127.0.0.1:44171_ho_"]}}
   [junit4]   2> 884164 ERROR (qtp561151975-4558) [n:127.0.0.1:44171_ho_    ] o.a.s.h.RequestHandlerBase org.apache.solr.common.SolrException: create the collection time out:180s
   [junit4]   2> 	at org.apache.solr.handler.admin.CollectionsHandler.handleResponse(CollectionsHandler.java:314)
   [junit4]   2> 	at org.apache.solr.handler.admin.CollectionsHandler.invokeAction(CollectionsHandler.java:246)
   [junit4]   2> 	at org.apache.solr.handler.admin.CollectionsHandler.handleRequestBody(CollectionsHandler.java:224)
   [junit4]   2> 	at org.apache.solr.handler.RequestHandlerBase.handleRequest(RequestHandlerBase.java:177)
   [junit4]   2> 	at org.apache.solr.servlet.HttpSolrCall.handleAdmin(HttpSolrCall.java:735)
   [junit4]   2> 	at org.apache.solr.servlet.HttpSolrCall.handleAdminRequest(HttpSolrCall.java:716)
   [junit4]   2> 	at org.apache.solr.servlet.HttpSolrCall.call(HttpSolrCall.java:497)
   [junit4]   2> 	at org.apache.solr.servlet.SolrDispatchFilter.doFilter(SolrDispatchFilter.java:382)
   [junit4]   2> 	at org.apache.solr.servlet.SolrDispatchFilter.doFilter(SolrDispatchFilter.java:326)
   [junit4]   2> 	at org.eclipse.jetty.servlet.ServletHandler$CachedChain.doFilter(ServletHandler.java:1759)
   [junit4]   2> 	at org.apache.solr.client.solrj.embedded.JettySolrRunner$DebugFilter.doFilter(JettySolrRunner.java:139)
   [junit4]   2> 	at org.eclipse.jetty.servlet.ServletHandler$CachedChain.doFilter(ServletHandler.java:1759)
   [junit4]   2> 	at org.eclipse.jetty.servlet.ServletHandler.doHandle(ServletHandler.java:582)
   [junit4]   2> 	at org.eclipse.jetty.server.session.SessionHandler.doHandle(SessionHandler.java:224)
   [junit4]   2> 	at org.eclipse.jetty.server.handler.ContextHandler.doHandle(ContextHandler.java:1180)
   [junit4]   2> 	at org.eclipse.jetty.servlet.ServletHandler.doScope(ServletHandler.java:512)
   [junit4]   2> 	at org.eclipse.jetty.server.session.SessionHandler.doScope(SessionHandler.java:185)
   [junit4]   2> 	at org.eclipse.jetty.server.handler.ContextHandler.doScope(ContextHandler.java:1112)
   [junit4]   2> 	at org.eclipse.jetty.server.handler.ScopedHandler.handle(ScopedHandler.java:141)
   [junit4]   2> 	at org.eclipse.jetty.server.handler.gzip.GzipHandler.handle(GzipHandler.java:493)
   [junit4]   2> 	at org.eclipse.jetty.server.handler.HandlerWrapper.handle(HandlerWrapper.java:134)
   [junit4]   2> 	at org.eclipse.jetty.server.Server.handle(Server.java:534)
   [junit4]   2> 	at org.eclipse.jetty.server.HttpChannel.handle(HttpChannel.java:320)
   [junit4]   2> 	at org.eclipse.jetty.server.HttpConnection.onFillable(HttpConnection.java:251)
   [junit4]   2> 	at org.eclipse.jetty.io.AbstractConnection$ReadCallback.succeeded(AbstractConnection.java:283)
   [junit4]   2> 	at org.eclipse.jetty.io.FillInterest.fillable(FillInterest.java:108)
   [junit4]   2> 	at org.eclipse.jetty.io.SelectChannelEndPoint$2.run(SelectChannelEndPoint.java:93)
   [junit4]   2> 	at org.eclipse.jetty.util.thread.strategy.ExecuteProduceConsume.executeProduceConsume(ExecuteProduceConsume.java:303)
   [junit4]   2> 	at org.eclipse.jetty.util.thread.strategy.ExecuteProduceConsume.produceConsume(ExecuteProduceConsume.java:148)
   [junit4]   2> 	at org.eclipse.jetty.util.thread.strategy.ExecuteProduceConsume.run(ExecuteProduceConsume.java:136)
   [junit4]   2> 	at org.eclipse.jetty.util.thread.QueuedThreadPool.runJob(QueuedThreadPool.java:671)
   [junit4]   2> 	at org.eclipse.jetty.util.thread.QueuedThreadPool$2.run(QueuedThreadPool.java:589)
   [junit4]   2> 	at java.lang.Thread.run(Thread.java:748)
   [junit4]   2> 
   [junit4]   2> 884165 INFO  (qtp561151975-4558) [n:127.0.0.1:44171_ho_    ] o.a.s.s.HttpSolrCall [admin] webapp=null path=/admin/collections params={replicationFactor=1&collection.configName=conf1&name=control_collection&nrtReplicas=1&action=CREATE&numShards=1&createNodeSet=127.0.0.1:44171_ho_&wt=javabin&version=2} status=500 QTime=180002
   [junit4]   2> 884165 ERROR (qtp561151975-4558) [n:127.0.0.1:44171_ho_    ] o.a.s.s.HttpSolrCall null:org.apache.solr.common.SolrException: create the collection time out:180s
   [junit4]   2> 	at org.apache.solr.handler.admin.CollectionsHandler.handleResponse(CollectionsHandler.java:314)
   [junit4]   2> 	at org.apache.solr.handler.admin.CollectionsHandler.invokeAction(CollectionsHandler.java:246)
   [junit4]   2> 	at org.apache.solr.handler.admin.CollectionsHandler.handleRequestBody(CollectionsHandler.java:224)
   [junit4]   2> 	at org.apache.solr.handler.RequestHandlerBase.handleRequest(RequestHandlerBase.java:177)
   [junit4]   2> 	at org.apache.solr.servlet.HttpSolrCall.handleAdmin(HttpSolrCall.java:735)
   [junit4]   2> 	at org.apache.solr.servlet.HttpSolrCall.handleAdminRequest(HttpSolrCall.java:716)
   [junit4]   2> 	at org.apache.solr.servlet.HttpSolrCall.call(HttpSolrCall.java:497)
   [junit4]   2> 	at org.apache.solr.servlet.SolrDispatchFilter.doFilter(SolrDispatchFilter.java:382)
   [junit4]   2> 	at org.apache.solr.servlet.SolrDispatchFilter.doFilter(SolrDispatchFilter.java:326)
   [junit4]   2> 	at org.eclipse.jetty.servlet.ServletHandler$CachedChain.doFilter(ServletHandler.java:1759)
   [junit4]   2> 	at org.apache.solr.client.solrj.embedded.JettySolrRunner$DebugFilter.doFilter(JettySolrRunner.java:139)
   [junit4]   2> 	at org.eclipse.jetty.servlet.ServletHandler$CachedChain.doFilter(ServletHandler.java:1759)
   [junit4]   2> 	at org.eclipse.jetty.servlet.ServletHandler.doHandle(ServletHandler.java:582)
   [junit4]   2> 	at org.eclipse.jetty.server.session.SessionHandler.doHandle(SessionHandler.java:224)
   [junit4]   2> 	at org.eclipse.jetty.server.handler.ContextHandler.doHandle(ContextHandler.java:1180)
   [junit4]   2> 	at org.eclipse.jetty.servlet.ServletHandler.doScope(ServletHandler.java:512)
   [junit4]   2> 	at org.eclipse.jetty.server.session.SessionHandler.doScope(SessionHandler.java:185)
   [junit4]   2> 	at org.eclipse.jetty.server.handler.ContextHandler.doScope(ContextHandler.java:1112)
   [junit4]   2> 	at org.eclipse.jetty.server.handler.ScopedHandler.handle(ScopedHandler.java:141)
   [junit4]   2> 	at org.eclipse.jetty.server.handler.gzip.GzipHandler.handle(GzipHandler.java:493)
   [junit4]   2> 	at org.eclipse.jetty.server.handler.HandlerWrapper.handle(HandlerWrapper.java:134)
   [junit4]   2> 	at org.eclipse.jetty.server.Server.handle(Server.java:534)
   [junit4]   2> 	at org.eclipse.jetty.server.HttpChannel.handle(HttpChannel.java:320)
   [junit4]   2> 	at org.eclipse.jetty.server.HttpConnection.onFillable(HttpConnection.java:251)
   [junit4]   2> 	at org.eclipse.jetty.io.AbstractConnection$ReadCallback.succeeded(AbstractConnection.java:283)
   [junit4]   2> 	at org.eclipse.jetty.io.FillInterest.fillable(FillInterest.java:108)
   [junit4]   2> 	at org.eclipse.jetty.io.SelectChannelEndPoint$2.run(SelectChannelEndPoint.java:93)
   [junit4]   2> 	at org.eclipse.jetty.util.thread.strategy.ExecuteProduceConsume.executeProduceConsume(ExecuteProduceConsume.java:303)
   [junit4]   2> 	at org.eclipse.jetty.util.thread.strategy.ExecuteProduceConsume.produceConsume(ExecuteProduceConsume.java:148)
   [junit4]   2> 	at org.eclipse.jetty.util.thread.strategy.ExecuteProduceConsume.run(ExecuteProduceConsume.java:136)
   [junit4]   2> 	at org.eclipse.jetty.util.thread.QueuedThreadPool.runJob(QueuedThreadPool.java:671)
   [junit4]   2> 	at org.eclipse.jetty.util.thread.QueuedThreadPool$2.run(QueuedThreadPool.java:589)
   [junit4]   2> 	at java.lang.Thread.run(Thread.java:748)
   [junit4]   2> 
   [junit4]   2> 1304363 ERROR (OverseerThreadFactory-1755-thread-1-processing-n:127.0.0.1:44171_ho_) [n:127.0.0.1:44171_ho_    ] o.a.s.c.OverseerCollectionMessageHandler Error from shard: http://127.0.0.1:44171/ho_
   [junit4]   2> org.apache.solr.client.solrj.SolrServerException: Timeout occured while waiting response from server at: http://127.0.0.1:44171/ho_
   [junit4]   2> 	at org.apache.solr.client.solrj.impl.HttpSolrClient.executeMethod(HttpSolrClient.java:654)
   [junit4]   2> 	at org.apache.solr.client.solrj.impl.HttpSolrClient.request(HttpSolrClient.java:255)
   [junit4]   2> 	at org.apache.solr.client.solrj.impl.HttpSolrClient.request(HttpSolrClient.java:244)
   [junit4]   2> 	at org.apache.solr.client.solrj.SolrClient.request(SolrClient.java:1219)
   [junit4]   2> 	at org.apache.solr.handler.component.HttpShardHandler.lambda$submit$0(HttpShardHandler.java:172)
   [junit4]   2> 	at java.util.concurrent.FutureTask.run(FutureTask.java:266)
   [junit4]   2> 	at java.util.concurrent.Executors$RunnableAdapter.call(Executors.java:511)
   [junit4]   2> 	at java.util.concurrent.FutureTask.run(FutureTask.java:266)
   [junit4]   2> 	at com.codahale.metrics.InstrumentedExecutorService$InstrumentedRunnable.run(InstrumentedExecutorService.java:176)
   [junit4]   2> 	at org.apache.solr.common.util.ExecutorUtil$MDCAwareThreadPoolExecutor.lambda$execute$0(ExecutorUtil.java:188)
   [junit4]   2> 	at java.util.concurrent.ThreadPoolExecutor.runWorker(ThreadPoolExecutor.java:1149)
   [junit4]   2> 	at java.util.concurrent.ThreadPoolExecutor$Worker.run(ThreadPoolExecutor.java:624)
   [junit4]   2> 	at java.lang.Thread.run(Thread.java:748)
   [junit4]   2> Caused by: java.net.SocketTimeoutException: Read timed out
   [junit4]   2> 	at java.net.SocketInputStream.socketRead0(Native Method)
   [junit4]   2> 	at java.net.SocketInputStream.socketRead(SocketInputStream.java:116)
   [junit4]   2> 	at java.net.SocketInputStream.read(SocketInputStream.java:171)
   [junit4]   2> 	at java.net.SocketInputStream.read(SocketInputStream.java:141)
   [junit4]   2> 	at org.apache.http.impl.io.SessionInputBufferImpl.streamRead(SessionInputBufferImpl.java:137)
   [junit4]   2> 	at org.apache.http.impl.io.SessionInputBufferImpl.fillBuffer(SessionInputBufferImpl.java:153)
   [junit4]   2> 	at org.apache.http.impl.io.SessionInputBufferImpl.readLine(SessionInputBufferImpl.java:282)
   [junit4]   2> 	at org.apache.http.impl.conn.DefaultHttpResponseParser.parseHead(DefaultHttpResponseParser.java:138)
   [junit4]   2> 	at org.apache.http.impl.conn.DefaultHttpResponseParser.parseHead(DefaultHttpResponseParser.java:56)
   [junit4]   2> 	at org.apache.http.impl.io.AbstractMessageParser.parse(AbstractMessageParser.java:259)
   [junit4]   2> 	at org.apache.http.impl.DefaultBHttpClientConnection.receiveResponseHeader(DefaultBHttpClientConnection.java:163)
   [junit4]   2> 	at org.apache.http.impl.conn.CPoolProxy.receiveResponseHeader(CPoolProxy.java:165)
   [junit4]   2> 	at org.apache.http.protocol.HttpRequestExecutor.doReceiveResponse(HttpRequestExecutor.java:273)
   [junit4]   2> 	at org.apache.http.protocol.HttpRequestExecutor.execute(HttpRequestExecutor.java:125)
   [junit4]   2> 	at org.apache.solr.util.stats.InstrumentedHttpRequestExecutor.execute(InstrumentedHttpRequestExecutor.java:118)
   [junit4]   2> 	at org.apache.http.impl.execchain.MainClientExec.execute(MainClientExec.java:272)
   [junit4]   2> 	at org.apache.http.impl.execchain.ProtocolExec.execute(ProtocolExec.java:185)
   [junit4]   2> 	at org.apache.http.impl.execchain.RetryExec.execute(RetryExec.java:89)
   [junit4]   2> 	at org.apache.http.impl.execchain.RedirectExec.execute(RedirectExec.java:111)
   [junit4]   2> 	at org.apache.http.impl.client.InternalHttpClient.doExecute(InternalHttpClient.java:185)
   [junit4]   2> 	at org.apache.http.impl.client.CloseableHttpClient.execute(CloseableHttpClient.java:83)
   [junit4]   2> 	at org.apache.http.impl.client.CloseableHttpClient.execute(CloseableHttpClient.java:56)
   [junit4]   2> 	at org.apache.solr.client.solrj.impl.HttpSolrClient.executeMethod(HttpSolrClient.java:542)
   [junit4]   2> 	... 12 more
   [junit4]   2> 1304363 INFO  (TEST-TestLeaderInitiatedRecoveryThread.testPublishDownState-seed#[6071DB34886778B0]) [    ] o.a.s.c.Overseer Overseer (id=99218747583823876-127.0.0.1:44171_ho_-n_0000000000) closing
   [junit4]   2> 1304364 INFO  (OverseerStateUpdate-99218747583823876-127.0.0.1:44171_ho_-n_0000000000) [n:127.0.0.1:44171_ho_    ] o.a.s.c.Overseer Overseer Loop exiting : 127.0.0.1:44171_ho_
   [junit4]   2> 1304364 ERROR (OverseerThreadFactory-1755-thread-1-processing-n:127.0.0.1:44171_ho_) [n:127.0.0.1:44171_ho_    ] o.a.s.c.OverseerCollectionMessageHandler Cleaning up collection [control_collection].
   [junit4]   2> 1304364 INFO  (OverseerThreadFactory-1755-thread-1-processing-n:127.0.0.1:44171_ho_) [n:127.0.0.1:44171_ho_    ] o.a.s.c.OverseerCollectionMessageHandler Executing Collection Cmd : action=UNLOAD&deleteInstanceDir=true&deleteDataDir=true
   [junit4]   2> 1334397 INFO  (zkCallback-1068-thread-5-processing-n:127.0.0.1:44171_ho_) [n:127.0.0.1:44171_ho_    ] o.a.s.c.c.ZkStateReader A cluster state change: [WatchedEvent state:SyncConnected type:NodeDeleted path:/collections/control_collection/state.json] for collection [control_collection] has occurred - updating... (live nodes size: [0])
   [junit4]   2> 1334399 ERROR (OverseerThreadFactory-1755-thread-1-processing-n:127.0.0.1:44171_ho_) [n:127.0.0.1:44171_ho_    ] o.a.s.c.OverseerCollectionMessageHandler Collection: control_collection operation: create failed:org.apache.solr.common.SolrException: Could not fully remove collection: control_collection
   [junit4]   2> 	at org.apache.solr.cloud.DeleteCollectionCmd.call(DeleteCollectionCmd.java:109)
   [junit4]   2> 	at org.apache.solr.cloud.OverseerCollectionMessageHandler.cleanupCollection(OverseerCollectionMessageHandler.java:679)
   [junit4]   2> 	at org.apache.solr.cloud.CreateCollectionCmd.call(CreateCollectionCmd.java:302)
   [junit4]   2> 	at org.apache.solr.cloud.OverseerCollectionMessageHandler.processMessage(OverseerCollectionMessageHandler.java:233)
   [junit4]   2> 	at org.apache.solr.cloud.OverseerTaskProcessor$Runner.run(OverseerTaskProcessor.java:464)
   [junit4]   2> 	at org.apache.solr.common.util.ExecutorUtil$MDCAwareThreadPoolExecutor.lambda$execute$0(ExecutorUtil.java:188)
   [junit4]   2> 	at java.util.concurrent.ThreadPoolExecutor.runWorker(ThreadPoolExecutor.java:1149)
   [junit4]   2> 	at java.util.concurrent.ThreadPoolExecutor$Worker.run(ThreadPoolExecutor.java:624)
   [junit4]   2> 	at java.lang.Thread.run(Thread.java:748)
   [junit4]   2> 
   [junit4]   2> 1334400 INFO  (OverseerThreadFactory-1755-thread-1-processing-n:127.0.0.1:44171_ho_) [n:127.0.0.1:44171_ho_    ] o.a.s.c.OverseerTaskQueue Response ZK path: /overseer/collection-queue-work/qnr-0000000000 doesn't exist.  Requestor may have disconnected from ZooKeeper
   [junit4]   2> 1334400 WARN  (OverseerAutoScalingTriggerThread-99218747583823876-127.0.0.1:44171_ho_-n_0000000000) [n:127.0.0.1:44171_ho_    ] o.a.s.c.a.OverseerTriggerThread OverseerTriggerThread woken up but we are closed, exiting.
   [junit4]   2> 1334403 INFO  (TEST-TestLeaderInitiatedRecoveryThread.testPublishDownState-seed#[6071DB34886778B0]) [    ] o.e.j.s.AbstractConnector Stopped ServerConnector@72e9cb85{HTTP/1.1,[http/1.1]}{127.0.0.1:0}
   [junit4]   2> 1334403 INFO  (TEST-TestLeaderInitiatedRecoveryThread.testPublishDownState-seed#[6071DB34886778B0]) [    ] o.e.j.s.h.ContextHandler Stopped o.e.j.s.ServletContextHandler@7dbfd926{/ho_,null,UNAVAILABLE}
   [junit4]   2> 1334417 ERROR (qtp561151975-4560) [n:127.0.0.1:44171_ho_ c:control_collection s:shard1  x:control_collection_shard1_replica_n1] o.a.s.c.ZkController Error getting leader from zk
   [junit4]   2> org.apache.solr.common.SolrException: No registered leader was found after waiting for 1220000ms , collection: control_collection slice: shard1 saw state=null with live_nodes=[]
   [junit4]   2> 	at org.apache.solr.common.cloud.ZkStateReader.getLeaderRetry(ZkStateReader.java:772)
   [junit4]   2> 	at org.apache.solr.common.cloud.ZkStateReader.getLeaderUrl(ZkStateReader.java:737)
   [junit4]   2> 	at org.apache.solr.cloud.ZkController.getLeader(ZkController.java:1178)
   [junit4]   2> 	at org.apache.solr.cloud.ZkController.register(ZkController.java:1079)
   [junit4]   2> 	at org.apache.solr.cloud.ZkController.register(ZkController.java:1014)
   [junit4]   2> 	at org.apache.solr.core.ZkContainer.lambda$registerInZk$0(ZkContainer.java:181)
   [junit4]   2> 	at org.apache.solr.core.ZkContainer.registerInZk(ZkContainer.java:208)
   [junit4]   2> 	at org.apache.solr.core.CoreContainer.registerCore(CoreContainer.java:886)
   [junit4]   2> 	at org.apache.solr.core.CoreContainer.createFromDescriptor(CoreContainer.java:1047)
   [junit4]   2> 	at org.apache.solr.core.CoreContainer.create(CoreContainer.java:948)
   [junit4]   2> 	at org.apache.solr.handler.admin.CoreAdminOperation.lambda$static$0(CoreAdminOperation.java:91)
   [junit4]   2> 	at org.apache.solr.handler.admin.CoreAdminOperation.execute(CoreAdminOperation.java:384)
   [junit4]   2> 	at org.apache.solr.handler.admin.CoreAdminHandler$CallInfo.call(CoreAdminHandler.java:389)
   [junit4]   2> 	at org.apache.solr.handler.admin.CoreAdminHandler.handleRequestBody(CoreAdminHandler.java:174)
   [junit4]   2> 	at org.apache.solr.handler.RequestHandlerBase.handleRequest(RequestHandlerBase.java:177)
   [junit4]   2> 	at org.apache.solr.servlet.HttpSolrCall.handleAdmin(HttpSolrCall.java:735)
   [junit4]   2> 	at org.apache.solr.servlet.HttpSolrCall.handleAdminRequest(HttpSolrCall.java:716)
   [junit4]   2> 	at org.apache.solr.servlet.HttpSolrCall.call(HttpSolrCall.java:497)
   [junit4]   2> 	at org.apache.solr.servlet.SolrDispatchFilter.doFilter(SolrDispatchFilter.java:382)
   [junit4]   2> 	at org.apache.solr.servlet.SolrDispatchFilter.doFilter(SolrDispatchFilter.java:326)
   [junit4]   2> 	at org.eclipse.jetty.servlet.ServletHandler$CachedChain.doFilter(ServletHandler.java:1759)
   [junit4]   2> 	at org.apache.solr.client.solrj.embedded.JettySolrRunner$DebugFilter.doFilter(JettySolrRunner.java:139)
   [junit4]   2> 	at org.eclipse.jetty.servlet.ServletHandler$CachedChain.doFilter(ServletHandler.java:1759)
   [junit4]   2> 	at org.eclipse.jetty.servlet.ServletHandler.doHandle(ServletHandler.java:582)
   [junit4]   2> 	at org.eclipse.jetty.server.session.SessionHandler.doHandle(SessionHandler.java:224)
   [junit4]   2> 	at org.eclipse.jetty.server.handler.ContextHandler.doHandle(ContextHandler.java:1180)
   [junit4]   2> 	at org.eclipse.jetty.servlet.ServletHandler.doScope(ServletHandler.java:512)
   [junit4]   2> 	at org.eclipse.jetty.server.session.SessionHandler.doScope(SessionHandler.java:185)
   [junit4]   2> 	at org.eclipse.jetty.server.handler.ContextHandler.doScope(ContextHandler.java:1112)
   [junit4]   2> 	at org.eclipse.jetty.server.handler.ScopedHandler.handle(ScopedHandler.java:141)
   [junit4]   2> 	at org.eclipse.jetty.server.handler.gzip.GzipHandler.handle(GzipHandler.java:426)
   [junit4]   2> 	at org.eclipse.jetty.server.handler.HandlerWrapper.handle(HandlerWrapper.java:134)
   [junit4]   2> 	at org.eclipse.jetty.server.Server.handle(Server.java:534)
   [junit4]   2> 	at org.eclipse.jetty.server.HttpChannel.handle(HttpChannel.java:320)
   [junit4]   2> 	at org.eclipse.jetty.server.HttpConnection.onFillable(HttpConnection.java:251)
   [junit4]   2> 	at org.eclipse.jetty.io.AbstractConnection$ReadCallback.succeeded(AbstractConnection.java:283)
   [junit4]   2> 	at org.eclipse.jetty.io.FillInterest.fillable(FillInterest.java:108)
   [junit4]   2> 	at org.eclipse.jetty.io.SelectChannelEndPoint$2.run(SelectChannelEndPoint.java:93)
   [junit4]   2> 	at org.eclipse.jetty.util.thread.strategy.ExecuteProduceConsume.executeProduceConsume(ExecuteProduceConsume.java:303)
   [junit4]   2> 	at org.eclipse.jetty.util.thread.strategy.ExecuteProduceConsume.produceConsume(ExecuteProduceConsume.java:148)
   [junit4]   2> 	at org.eclipse.jetty.util.thread.strategy.ExecuteProduceConsume.run(ExecuteProduceConsume.java:136)
   [junit4]   2> 	at org.eclipse.jetty.util.thread.QueuedThreadPool.runJob(QueuedThreadPool.java:671)
   [junit4]   2> 	at org.eclipse.jetty.util.thread.QueuedThreadPool$2.run(QueuedThreadPool.java:589)
   [junit4]   2> 	at java.lang.Thread.run(Thread.java:748)
   [junit4]   2> 1334418 ERROR (qtp561151975-4560) [n:127.0.0.1:44171_ho_ c:control_collection s:shard1  x:control_collection_shard1_replica_n1] o.a.s.c.ZkContainer :org.apache.solr.common.SolrException: Error getting leader from zk for shard shard1
   [junit4]   2> 	at org.apache.solr.cloud.ZkController.getLeader(ZkController.java:1207)
   [junit4]   2> 	at org.apache.solr.cloud.ZkController.register(ZkController.java:1079)
   [junit4]   2> 	at org.apache.solr.cloud.ZkController.register(ZkController.java:1014)
   [junit4]   2> 	at org.apache.solr.core.ZkContainer.lambda$registerInZk$0(ZkContainer.java:181)
   [junit4]   2> 	at org.apache.solr.core.ZkContainer.registerInZk(ZkContainer.java:208)
   [junit4]   2> 	at org.apache.solr.core.CoreContainer.registerCore(CoreContainer.java:886)
   [junit4]   2> 	at org.apache.solr.core.CoreContainer.createFromDescriptor(CoreContainer.java:1047)
   [junit4]   2> 	at org.apache.solr.core.CoreContainer.create(CoreContainer.java:948)
   [junit4]   2> 	at org.apache.solr.handler.admin.CoreAdminOperation.lambda$static$0(CoreAdminOperation.java:91)
   [junit4]   2> 	at org.apache.solr.handler.admin.CoreAdminOperation.execute(CoreAdminOperation.java:384)
   [junit4]   2> 	at org.apache.solr.handler.admin.CoreAdminHandler$CallInfo.call(CoreAdminHandler.java:389)
   [junit4]   2> 	at org.apache.solr.handler.admin.CoreAdminHandler.handleRequestBody(CoreAdminHandler.java:174)
   [junit4]   2> 	at org.apache.solr.handler.RequestHandlerBase.handleRequest(RequestHandlerBase.java:177)
   [junit4]   2> 	at org.apache.solr.servlet.HttpSolrCall.handleAdmin(HttpSolrCall.java:735)
   [junit4]   2> 	at org.apache.solr.servlet.HttpSolrCall.handleAdminRequest(HttpSolrCall.java:716)
   [junit4]   2> 	at org.apache.solr.servlet.HttpSolrCall.call(HttpSolrCall.java:497)
   [junit4]   2> 	at org.apache.solr.servlet.SolrDispatchFilter.doFilter(SolrDispatchFilter.java:382)
   [junit4]   2> 	at org.apache.solr.servlet.SolrDispatchFilter.doFilter(SolrDispatchFilter.java:326)
   [junit4]   2> 	at org.eclipse.jetty.servlet.ServletHandler$CachedChain.doFilter(ServletHandler.java:1759)
   [junit4]   2> 	at org.apache.solr.client.solrj.embedded.JettySolrRunner$DebugFilter.doFilter(JettySolrRunner.java:139)
   [junit4]   2> 	at org.eclipse.jetty.servlet.ServletHandler$CachedChain.doFilter(ServletHandler.java:1759)
   [junit4]   2> 	at org.eclipse.jetty.servlet.ServletHandler.doHandle(ServletHandler.java:582)
   [junit4]   2> 	at org.eclipse.jetty.server.session.SessionHandler.doHandle(SessionHandler.java:224)
   [junit4]   2> 	at org.eclipse.jetty.server.handler.ContextHandler.doHandle(ContextHandler.java:1180)
   [junit4]   2> 	at org.eclipse.jetty.servlet.ServletHandler.doScope(ServletHandler.java:512)
   [junit4]   2> 	at org.eclipse.jetty.server.session.SessionHandler.doScope(SessionHandler.java:185)
   [junit4]   2> 	at org.eclipse.jetty.server.handler.ContextHandler.doScope(ContextHandler.java:1112)
   [junit4]   2> 	at org.eclipse.jetty.server.handler.ScopedHandler.handle(ScopedHandler.java:141)
   [junit4]   2> 	at org.eclipse.jetty.server.handler.gzip.GzipHandler.handle(GzipHandler.java:426)
   [junit4]   2> 	at org.eclipse.jetty.server.handler.HandlerWrapper.handle(HandlerWrapper.java:134)
   [junit4]   2> 	at org.eclipse.jetty.server.Server.handle(Server.java:534)
   [junit4]   2> 	at org.eclipse.jetty.server.HttpChannel.handle(HttpChannel.java:320)
   [junit4]   2> 	at org.eclipse.jetty.server.HttpConnection.onFillable(HttpConnection.java:251)
   [junit4]   2> 	at org.eclipse.jetty.io.AbstractConnection$ReadCallback.succeeded(AbstractConnection.java:283)
   [junit4]   2> 	at org.eclipse.jetty.io.FillInterest.fillable(FillInterest.java:108)
   [junit4]   2> 	at org.eclipse.jetty.io.SelectChannelEndPoint$2.run(SelectChannelEndPoint.java:93)
   [junit4]   2> 	at org.eclipse.jetty.util.thread.strategy.ExecuteProduceConsume.executeProduceConsume(ExecuteProduceConsume.java:303)
   [junit4]   2> 	at org.eclipse.jetty.util.thread.strategy.ExecuteProduceConsume.produceConsume(ExecuteProduceConsume.java:148)
   [junit4]   2> 	at org.eclipse.jetty.util.thread.strategy.ExecuteProduceConsume.run(ExecuteProduceConsume.java:136)
   [junit4]   2> 	at org.eclipse.jetty.util.thread.QueuedThreadPool.runJob(QueuedThreadPool.java:671)
   [junit4]   2> 	at org.eclipse.jetty.util.thread.QueuedThreadPool$2.run(QueuedThreadPool.java:589)
   [junit4]   2> 	at java.lang.Thread.run(Thread.java:748)
   [junit4]   2> Caused by: org.apache.solr.common.SolrException: No registered leader was found after waiting for 1220000ms , collection: control_collection slice: shard1 saw state=null with live_nodes=[]
   [junit4]   2> 	at org.apache.solr.common.cloud.ZkStateReader.getLeaderRetry(ZkStateReader.java:772)
   [junit4]   2> 	at org.apache.solr.common.cloud.ZkStateReader.getLeaderUrl(ZkStateReader.java:737)
   [junit4]   2> 	at org.apache.solr.cloud.ZkController.getLeader(ZkController.java:1178)
   [junit4]   2> 	... 41 more
   [junit4]   2> 
   [junit4]   2> 1334430 INFO  (qtp561151975-4560) [n:127.0.0.1:44171_ho_ c:control_collection s:shard1  x:control_collection_shard1_replica_n1] o.a.s.s.HttpSolrCall [admin] webapp=null path=/admin/cores params={qt=/admin/cores&collection.configName=conf1&newCollection=true&name=control_collection_shard1_replica_n1&action=CREATE&numShards=1&collection=control_collection&shard=shard1&wt=javabin&version=2&replicaType=NRT} status=0 QTime=630163
   [junit4]   2> 1334430 ERROR (TEST-TestLeaderInitiatedRecoveryThread.testPublishDownState-seed#[6071DB34886778B0]) [    ] o.a.z.s.ZooKeeperServer ZKShutdownHandler is not registered, so ZooKeeper server won't take any action on ERROR or SHUTDOWN server state changes
   [junit4]   2> 1334431 INFO  (TEST-TestLeaderInitiatedRecoveryThread.testPublishDownState-seed#[6071DB34886778B0]) [    ] o.a.s.c.ZkTestServer connecting to 127.0.0.1:43709 43709
   [junit4]   2> 1335308 INFO  (Thread-1010) [    ] o.a.s.c.ZkTestServer connecting to 127.0.0.1:43709 43709
   [junit4]   2> 1335309 WARN  (Thread-1010) [    ] o.a.s.c.ZkTestServer Watch limit violations: 
   [junit4]   2> Maximum concurrent create/delete watches above limit:
   [junit4]   2> 
   [junit4]   2> 	2	/solr/aliases.json
   [junit4]   2> 
   [junit4]   2> Maximum concurrent data watches above limit:
   [junit4]   2> 
   [junit4]   2> 	2	/solr/clusterstate.json
   [junit4]   2> 	2	/solr/clusterprops.json
   [junit4]   2> 
   [junit4]   2> Maximum concurrent children watches above limit:
   [junit4]   2> 
   [junit4]   2> 	2	/solr/live_nodes
   [junit4]   2> 	2	/solr/collections
   [junit4]   2> 
   [junit4]   2> NOTE: reproduce with: ant test  -Dtestcase=TestLeaderInitiatedRecoveryThread -Dtests.method=testPublishDownState -Dtests.seed=6071DB34886778B0 -Dtests.multiplier=3 -Dtests.slow=true -Dtests.locale=es-CO -Dtests.timezone=America/Kentucky/Louisville -Dtests.asserts=true -Dtests.file.encoding=UTF-8
   [junit4] ERROR    632s J2 | TestLeaderInitiatedRecoveryThread.testPublishDownState <<<
   [junit4]    > Throwable #1: org.apache.solr.client.solrj.SolrServerException: Timeout occured while waiting response from server at: http://127.0.0.1:44171/ho_
   [junit4]    > 	at __randomizedtesting.SeedInfo.seed([6071DB34886778B0:3E0C79CA2C7A314D]:0)
   [junit4]    > 	at org.apache.solr.client.solrj.impl.HttpSolrClient.executeMethod(HttpSolrClient.java:654)
   [junit4]    > 	at org.apache.solr.client.solrj.impl.HttpSolrClient.request(HttpSolrClient.java:255)
   [junit4]    > 	at org.apache.solr.client.solrj.impl.HttpSolrClient.request(HttpSolrClient.java:244)
   [junit4]    > 	at org.apache.solr.client.solrj.impl.LBHttpSolrClient.doRequest(LBHttpSolrClient.java:483)
   [junit4]    > 	at org.apache.solr.client.solrj.impl.LBHttpSolrClient.request(LBHttpSolrClient.java:413)
   [junit4]    > 	at org.apache.solr.client.solrj.impl.CloudSolrClient.sendRequest(CloudSolrClient.java:1103)
   [junit4]    > 	at org.apache.solr.client.solrj.impl.CloudSolrClient.requestWithRetryOnStaleState(CloudSolrClient.java:883)
   [junit4]    > 	at org.apache.solr.client.solrj.impl.CloudSolrClient.request(CloudSolrClient.java:816)
   [junit4]    > 	at org.apache.solr.client.solrj.SolrRequest.process(SolrRequest.java:194)
   [junit4]    > 	at org.apache.solr.client.solrj.SolrRequest.process(SolrRequest.java:211)
   [junit4]    > 	at org.apache.solr.cloud.AbstractFullDistribZkTestBase.createServers(AbstractFullDistribZkTestBase.java:314)
   [junit4]    > 	at org.apache.solr.BaseDistributedSearchTestCase$ShardsRepeatRule$ShardsFixedStatement.callStatement(BaseDistributedSearchTestCase.java:991)
   [junit4]    > 	at org.apache.solr.BaseDistributedSearchTestCase$ShardsRepeatRule$ShardsStatement.evaluate(BaseDistributedSearchTestCase.java:968)
   [junit4]    > 	at java.lang.Thread.run(Thread.java:748)
   [junit4]    > Caused by: java.net.SocketTimeoutException: Read timed out
   [junit4]    > 	at java.net.SocketInputStream.socketRead0(Native Method)
   [junit4]    > 	at java.net.SocketInputStream.socketRead(SocketInputStream.java:116)
   [junit4]    > 	at java.net.SocketInputStream.read(SocketInputStream.java:171)
   [junit4]    > 	at java.net.SocketInputStream.read(SocketInputStream.java:141)
   [junit4]    > 	at org.apache.http.impl.io.SessionInputBufferImpl.streamRead(SessionInputBufferImpl.java:137)
   [junit4]    > 	at org.apache.http.impl.io.SessionInputBufferImpl.fillBuffer(SessionInputBufferImpl.java:153)
   [junit4]    > 	at org.apache.http.impl.io.SessionInputBufferImpl.readLine(SessionInputBufferImpl.java:282)
   [junit4]    > 	at org.apache.http.impl.conn.DefaultHttpResponseParser.parseHead(DefaultHttpResponseParser.java:138)
   [junit4]    > 	at org.apache.http.impl.conn.DefaultHttpResponseParser.parseHead(DefaultHttpResponseParser.java:56)
   [junit4]    > 	at org.apache.http.impl.io.AbstractMessageParser.parse(AbstractMessageParser.java:259)
   [junit4]    > 	at org.apache.http.impl.DefaultBHttpClientConnection.receiveResponseHeader(DefaultBHttpClientConnection.java:163)
   [junit4]    > 	at org.apache.http.impl.conn.CPoolProxy.receiveResponseHeader(CPoolProxy.java:165)
   [junit4]    > 	at org.apache.http.protocol.HttpRequestExecutor.doReceiveResponse(HttpRequestExecutor.java:273)
   [junit4]    > 	at org.apache.http.protocol.HttpRequestExecutor.execute(HttpRequestExecutor.java:125)
   [junit4]    > 	at org.apache.http.impl.execchain.MainClientExec.execute(MainClientExec.java:272)
   [junit4]    > 	at org.apache.http.impl.execchain.ProtocolExec.execute(ProtocolExec.java:185)
   [junit4]    > 	at org.apache.http.impl.execchain.RetryExec.execute(RetryExec.java:89)
   [junit4]    > 	at org.apache.http.impl.execchain.RedirectExec.execute(RedirectExec.java:111)
   [junit4]    > 	at org.apache.http.impl.client.InternalHttpClient.doExecute(InternalHttpClient.java:185)
   [junit4]    > 	at org.apache.http.impl.client.CloseableHttpClient.execute(CloseableHttpClient.java:83)
   [junit4]    > 	at org.apache.http.impl.client.CloseableHttpClient.execute(CloseableHttpClient.java:56)
   [junit4]    > 	at org.apache.solr.client.solrj.impl.HttpSolrClient.executeMethod(HttpSolrClient.java:542)
   [junit4]    > 	... 43 more
   [junit4]   2> NOTE: leaving temporary files on disk at: /home/jenkins/workspace/Lucene-Solr-7.2-Linux/solr/build/solr-core/test/J2/temp/solr.cloud.TestLeaderInitiatedRecoveryThread_6071DB34886778B0-001
   [junit4]   2> Dec 22, 2017 4:02:51 PM com.carrotsearch.randomizedtesting.ThreadLeakControl checkThreadLeaks
   [junit4]   2> WARNING: Will linger awaiting termination of 1 leaked thread(s).
   [junit4]   2> NOTE: test params are: codec=Asserting(Lucene70): {}, docValues:{}, maxPointsInLeafNode=16, maxMBSortInHeap=7.340583598349874, sim=RandomSimilarity(queryNorm=true): {}, locale=es-CO, timezone=America/Kentucky/Louisville
   [junit4]   2> NOTE: Linux 4.10.0-40-generic amd64/Oracle Corporation 1.8.0_144 (64-bit)/cpus=8,threads=1,free=185383312,total=518979584
   [junit4]   2> NOTE: All tests run in this JVM: [TestQueryTypes, TestEmbeddedSolrServerConstructors, TestReloadDeadlock, V2StandaloneTest, DeleteNodeTest, DistanceUnitsTest, TestCharFilters, HdfsBasicDistributedZkTest, AlternateDirectoryTest, TestJsonFacetRefinement, TestSolrCoreProperties, RuleEngineTest, TestManagedSchemaThreadSafety, CoreSorterTest, XsltUpdateRequestHandlerTest, BlockJoinFacetDistribTest, TestReload, DefaultValueUpdateProcessorTest, TestHashPartitioner, ConfigSetsAPITest, TestRealTimeGet, MetricsHandlerTest, TestSubQueryTransformerDistrib, SimplePostToolTest, TestLegacyTerms, TestValueSourceCache, TestCloudDeleteByQuery, TestDocBasedVersionConstraints, TestMacroExpander, TestFuzzyAnalyzedSuggestions, TestSearchPerf, TriggerIntegrationTest, AutoAddReplicasIntegrationTest, HdfsLockFactoryTest, ChaosMonkeyNothingIsSafeTest, JvmMetricsTest, LoggingHandlerTest, StatsComponentTest, TestQuerySenderListener, AddBlockUpdateTest, SmileWriterTest, IgnoreCommitOptimizeUpdateProcessorFactoryTest, SolrTestCaseJ4Test, TestSegmentSorting, DocValuesNotIndexedTest, TestConfigOverlay, FieldMutatingUpdateProcessorTest, BasicDistributedZk2Test, LeaderInitiatedRecoveryOnCommitTest, RequestLoggingTest, DirectSolrSpellCheckerTest, TestLFUCache, TestFreeTextSuggestions, TestInPlaceUpdatesDistrib, BadCopyFieldTest, TestLeaderInitiatedRecoveryThread]
   [junit4] Completed [257/751 (1!)] on J2 in 631.79s, 1 test, 1 error <<< FAILURES!

[...truncated 179 lines...]
   [junit4] Suite: org.apache.solr.handler.TestReplicationHandler
   [junit4]   2> Creating dataDir: /home/jenkins/workspace/Lucene-Solr-7.2-Linux/solr/build/solr-core/test/J0/temp/solr.handler.TestReplicationHandler_6071DB34886778B0-001/init-core-data-001
   [junit4]   2> 1493838 WARN  (SUITE-TestReplicationHandler-seed#[6071DB34886778B0]-worker) [    ] o.a.s.SolrTestCaseJ4 startTrackingSearchers: numOpens=88 numCloses=88
   [junit4]   2> 1493838 INFO  (SUITE-TestReplicationHandler-seed#[6071DB34886778B0]-worker) [    ] o.a.s.SolrTestCaseJ4 Using PointFields (NUMERIC_POINTS_SYSPROP=true) w/NUMERIC_DOCVALUES_SYSPROP=true
   [junit4]   2> 1493839 INFO  (SUITE-TestReplicationHandler-seed#[6071DB34886778B0]-worker) [    ] o.a.s.SolrTestCaseJ4 Randomized ssl (false) and clientAuth (false) via: @org.apache.solr.SolrTestCaseJ4$SuppressSSL(bugUrl=None)
   [junit4]   2> 1493839 INFO  (SUITE-TestReplicationHandler-seed#[6071DB34886778B0]-worker) [    ] o.a.s.SolrTestCaseJ4 SecureRandom sanity checks: test.solr.allowed.securerandom=null & java.security.egd=file:/dev/./urandom
   [junit4]   2> 1493840 INFO  (TEST-TestReplicationHandler.testRateLimitedReplication-seed#[6071DB34886778B0]) [    ] o.a.s.SolrTestCaseJ4 ###Starting testRateLimitedReplication
   [junit4]   2> 1493840 INFO  (TEST-TestReplicationHandler.testRateLimitedReplication-seed#[6071DB34886778B0]) [    ] o.a.s.SolrTestCaseJ4 Writing core.properties file to /home/jenkins/workspace/Lucene-Solr-7.2-Linux/solr/build/solr-core/test/J0/temp/solr.handler.TestReplicationHandler_6071DB34886778B0-001/solr-instance-001/collection1
   [junit4]   2> 1493842 INFO  (TEST-TestReplicationHandler.testRateLimitedReplication-seed#[6071DB34886778B0]) [    ] o.e.j.s.Server jetty-9.3.20.v20170531
   [junit4]   2> 1493843 INFO  (TEST-TestReplicationHandler.testRateLimitedReplication-seed#[6071DB34886778B0]) [    ] o.e.j.s.h.ContextHandler Started o.e.j.s.ServletContextHandler@20c084ce{/solr,null,AVAILABLE}
   [junit4]   2> 1493844 INFO  (TEST-TestReplicationHandler.testRateLimitedReplication-seed#[6071DB34886778B0]) [    ] o.e.j.s.AbstractConnector Started ServerConnector@275e6e1c{HTTP/1.1,[http/1.1]}{127.0.0.1:44305}
   [junit4]   2> 1493844 INFO  (TEST-TestReplicationHandler.testRateLimitedReplication-seed#[6071DB34886778B0]) [    ] o.e.j.s.Server Started @1495202ms
   [junit4]   2> 1493844 INFO  (TEST-TestReplicationHandler.testRateLimitedReplication-seed#[6071DB34886778B0]) [    ] o.a.s.c.s.e.JettySolrRunner Jetty properties: {solr.data.dir=/home/jenkins/workspace/Lucene-Solr-7.2-Linux/solr/build/solr-core/test/J0/temp/solr.handler.TestReplicationHandler_6071DB34886778B0-001/solr-instance-001/collection1/data, hostContext=/solr, hostPort=44305}
   [junit4]   2> 1493844 ERROR (TEST-TestReplicationHandler.testRateLimitedReplication-seed#[6071DB34886778B0]) [    ] o.a.s.u.StartupLoggingUtils Missing Java Option solr.log.dir. Logging may be missing or incomplete.
   [junit4]   2> 1493844 INFO  (TEST-TestReplicationHandler.testRateLimitedReplication-seed#[6071DB34886778B0]) [    ] o.a.s.s.SolrDispatchFilter  ___      _       Welcome to Apache Solr™ version 7.2.1
   [junit4]   2> 1493844 INFO  (TEST-TestReplicationHandler.testRateLimitedReplication-seed#[6071DB34886778B0]) [    ] o.a.s.s.SolrDispatchFilter / __| ___| |_ _   Starting in standalone mode on port null
   [junit4]   2> 1493844 INFO  (TEST-TestReplicationHandler.testRateLimitedReplication-seed#[6071DB34886778B0]) [    ] o.a.s.s.SolrDispatchFilter \__ \/ _ \ | '_|  Install dir: null
   [junit4]   2> 1493844 INFO  (TEST-TestReplicationHandler.testRateLimitedReplication-seed#[6071DB34886778B0]) [    ] o.a.s.s.SolrDispatchFilter |___/\___/_|_|    Start time: 2017-12-22T16:05:30.513Z
   [junit4]   2> 1493845 INFO  (TEST-TestReplicationHandler.testRateLimitedReplication-seed#[6071DB34886778B0]) [    ] o.a.s.c.SolrXmlConfig Loading container configuration from /home/jenkins/workspace/Lucene-Solr-7.2-Linux/solr/build/solr-core/test/J0/temp/solr.handler.TestReplicationHandler_6071DB34886778B0-001/solr-instance-001/solr.xml
   [junit4]   2> 1493847 INFO  (TEST-TestReplicationHandler.testRateLimitedReplication-seed#[6071DB34886778B0]) [    ] o.a.s.c.SolrXmlConfig Configuration parameter autoReplicaFailoverWorkLoopDelay is ignored
   [junit4]   2> 1493847 INFO  (TEST-TestReplicationHandler.testRateLimitedReplication-seed#[6071DB34886778B0]) [    ] o.a.s.c.SolrXmlConfig Configuration parameter autoReplicaFailoverBadNodeExpiration is ignored
   [junit4]   2> 1493848 INFO  (TEST-TestReplicationHandler.testRateLimitedReplication-seed#[6071DB34886778B0]) [    ] o.a.s.c.SolrXmlConfig MBean server found: com.sun.jmx.mbeanserver.JmxMBeanServer@e93b789, but no JMX reporters were configured - adding default JMX reporter.
   [junit4]   2> 1493869 INFO  (TEST-TestReplicationHandler.testRateLimitedReplication-seed#[6071DB34886778B0]) [    ] o.a.s.m.r.SolrJmxReporter JMX monitoring for 'solr.node' (registry 'solr.node') enabled at server: com.sun.jmx.mbeanserver.JmxMBeanServer@e93b789
   [junit4]   2> 1493874 INFO  (TEST-TestReplicationHandler.testRateLimitedReplication-seed#[6071DB34886778B0]) [    ] o.a.s.m.r.SolrJmxReporter JMX monitoring for 'solr.jvm' (registry 'solr.jvm') enabled at server: com.sun.jmx.mbeanserver.JmxMBeanServer@e93b789
   [junit4]   2> 1493874 INFO  (TEST-TestReplicationHandler.testRateLimitedReplication-seed#[6071DB34886778B0]) [    ] o.a.s.m.r.SolrJmxReporter JMX monitoring for 'solr.jetty' (registry 'solr.jetty') enabled at server: com.sun.jmx.mbeanserver.JmxMBeanServer@e93b789
   [junit4]   2> 1493876 INFO  (TEST-TestReplicationHandler.testRateLimitedReplication-seed#[6071DB34886778B0]) [    ] o.a.s.c.CorePropertiesLocator Found 1 core definitions underneath /home/jenkins/workspace/Lucene-Solr-7.2-Linux/solr/build/solr-core/test/J0/temp/solr.handler.TestReplicationHandler_6071DB34886778B0-001/solr-instance-001/.
   [junit4]   2> 1493876 INFO  (TEST-TestReplicationHandler.testRateLimitedReplication-seed#[6071DB34886778B0]) [    ] o.a.s.c.CorePropertiesLocator Cores are: [collection1]
   [junit4]   2> 1493876 INFO  (coreLoadExecutor-5456-thread-1) [    ] o.a.s.c.TransientSolrCoreCacheDefault Allocating transient cache for 4 transient cores
   [junit4]   2> 1493882 INFO  (coreLoadExecutor-5456-thread-1) [    x:collection1] o.a.s.c.SolrConfig Using Lucene MatchVersion: 7.2.1
   [junit4]   2> 1493890 INFO  (coreLoadExecutor-5456-thread-1) [    x:collection1] o.a.s.s.IndexSchema [collection1] Schema name=test
   [junit4]   2> 1493891 INFO  (coreLoadExecutor-5456-thread-1) [    x:collection1] o.a.s.s.IndexSchema Loaded schema test/1.2 with uniqueid field id
   [junit4]   2> 1493891 INFO  (coreLoadExecutor-5456-thread-1) [    x:collection1] o.a.s.c.CoreContainer Creating SolrCore 'collection1' using configuration from instancedir /home/jenkins/workspace/Lucene-Solr-7.2-Linux/solr/build/solr-core/test/J0/temp/solr.handler.TestReplicationHandler_6071DB34886778B0-001/solr-instance-001/./collection1, trusted=true
   [junit4]   2> 1493892 INFO  (coreLoadExecutor-5456-thread-1) [    x:collection1] o.a.s.m.r.SolrJmxReporter JMX monitoring for 'solr.core.collection1' (registry 'solr.core.collection1') enabled at server: com.sun.jmx.mbeanserver.JmxMBeanServer@e93b789
   [junit4]   2> 1493892 INFO  (coreLoadExecutor-5456-thread-1) [    x:collection1] o.a.s.c.SolrCore solr.RecoveryStrategy.Builder
   [junit4]   2> 1493892 INFO  (coreLoadExecutor-5456-thread-1) [    x:collection1] o.a.s.c.SolrCore [[collection1] ] Opening new SolrCore at [/home/jenkins/workspace/Lucene-Solr-7.2-Linux/solr/build/solr-core/test/J0/temp/solr.handler.TestReplicationHandler_6071DB34886778B0-001/solr-instance-001/collection1], dataDir=[/home/jenkins/workspace/Lucene-Solr-7.2-Linux/solr/build/solr-core/test/J0/temp/solr.handler.TestReplicationHandler_6071DB34886778B0-001/solr-instance-001/./collection1/data/]
   [junit4]   2> 1493893 INFO  (coreLoadExecutor-5456-thread-1) [    x:collection1] o.a.s.u.RandomMergePolicy RandomMergePolicy wrapping class org.apache.lucene.index.LogDocMergePolicy: [LogDocMergePolicy: minMergeSize=1000, mergeFactor=34, maxMergeSize=9223372036854775807, maxMergeSizeForForcedMerge=9223372036854775807, calibrateSizeByDeletes=false, maxMergeDocs=2147483647, maxCFSSegmentSizeMB=8.796093022207999E12, noCFSRatio=0.0]
   [junit4]   2> 1493911 INFO  (coreLoadExecutor-5456-thread-1) [    x:collection1] o.a.s.u.CommitTracker Hard AutoCommit: disabled
   [junit4]   2> 1493911 INFO  (coreLoadExecutor-5456-thread-1) [    x:collection1] o.a.s.u.CommitTracker Soft AutoCommit: disabled
   [junit4]   2> 1493912 INFO  (coreLoadExecutor-5456-thread-1) [    x:collection1] o.a.s.u.RandomMergePolicy RandomMergePolicy wrapping class org.apache.lucene.index.LogByteSizeMergePolicy: [LogByteSizeMergePolicy: minMergeSize=1677721, mergeFactor=41, maxMergeSize=2147483648, maxMergeSizeForForcedMerge=9223372036854775807, calibrateSizeByDeletes=true, maxMergeDocs=2147483647, maxCFSSegmentSizeMB=8.796093022207999E12, noCFSRatio=1.0]
   [junit4]   2> 1493912 INFO  (coreLoadExecutor-5456-thread-1) [    x:collection1] o.a.s.s.SolrIndexSearcher Opening [Searcher@9a4284f[collection1] main]
   [junit4]   2> 1493912 INFO  (coreLoadExecutor-5456-thread-1) [    x:collection1] o.a.s.r.ManagedResourceStorage File-based storage initialized to use dir: /home/jenkins/workspace/Lucene-Solr-7.2-Linux/solr/build/solr-core/test/J0/temp/solr.handler.TestReplicationHandler_6071DB34886778B0-001/solr-instance-001/collection1/conf
   [junit4]   2> 1493913 INFO  (coreLoadExecutor-5456-thread-1) [    x:collection1] o.a.s.h.ReplicationHandler Replication enabled for following config files: schema.xml,xslt/dummy.xsl
   [junit4]   2> 1493913 INFO  (coreLoadExecutor-5456-thread-1) [    x:collection1] o.a.s.h.ReplicationHandler Commits will be reserved for 10000ms.
   [junit4]   2> 1493913 INFO  (searcherExecutor-5457-thread-1-processing-x:collection1) [    x:collection1] o.a.s.c.SolrCore [collection1] Registered new searcher Searcher@9a4284f[collection1] main{ExitableDirectoryReader(UninvertingDirectoryReader())}
   [junit4]   2> 1493914 INFO  (TEST-TestReplicationHandler.testRateLimitedReplication-seed#[6071DB34886778B0]) [    ] o.a.s.SolrTestCaseJ4 Writing core.properties file to /home/jenkins/workspace/Lucene-Solr-7.2-Linux/solr/build/solr-core/test/J0/temp/solr.handler.TestReplicationHandler_6071DB34886778B0-001/solr-instance-002/collection1
   [junit4]   2> 1493915 INFO  (TEST-TestReplicationHandler.testRateLimitedReplication-seed#[6071DB34886778B0]) [    ] o.e.j.s.Server jetty-9.3.20.v20170531
   [junit4]   2> 1493916 INFO  (TEST-TestReplicationHandler.testRateLimitedReplication-seed#[6071DB34886778B0]) [    ] o.e.j.s.h.ContextHandler Started o.e.j.s.ServletContextHandler@1c8ae07f{/solr,null,AVAILABLE}
   [junit4]   2> 1493916 INFO  (TEST-TestReplicationHandler.testRateLimitedReplication-seed#[6071DB34886778B0]) [    ] o.e.j.s.AbstractConnector Started ServerConnector@4032c4ca{HTTP/1.1,[http/1.1]}{127.0.0.1:37153}
   [junit4]   2> 1493916 INFO  (TEST-TestReplicationHandler.testRateLimitedReplication-seed#[6071DB34886778B0]) [    ] o.e.j.s.Server Started @1495275ms
   [junit4]   2> 1493916 INFO  (TEST-TestReplicationHandler.testRateLimitedReplication-seed#[6071DB34886778B0]) [    ] o.a.s.c.s.e.JettySolrRunner Jetty properties: {solr.data.dir=/home/jenkins/workspace/Lucene-Solr-7.2-Linux/solr/build/solr-core/test/J0/temp/solr.handler.TestReplicationHandler_6071DB34886778B0-001/solr-instance-002/collection1/data, hostContext=/solr, hostPort=37153}
   [junit4]   2> 1493917 ERROR (TEST-TestReplicationHandler.testRateLimitedReplication-seed#[6071DB34886778B0]) [    ] o.a.s.u.StartupLoggingUtils Missing Java Option solr.log.dir. Logging may be missing or incomplete.
   [junit4]   2> 1493917 INFO  (TEST-TestReplicationHandler.testRateLimitedReplication-seed#[6071DB34886778B0]) [    ] o.a.s.s.SolrDispatchFilter  ___      _       Welcome to Apache Solr™ version 7.2.1
   [junit4]   2> 1493917 INFO  (TEST-TestReplicationHandler.testRateLimitedReplication-seed#[6071DB34886778B0]) [    ] o.a.s.s.SolrDispatchFilter / __| ___| |_ _   Starting in standalone mode on port null
   [junit4]   2> 1493917 INFO  (TEST-TestReplicationHandler.testRateLimitedReplication-seed#[6071DB34886778B0]) [    ] o.a.s.s.SolrDispatchFilter \__ \/ _ \ | '_|  Install dir: null
   [junit4]   2> 1493917 INFO  (TEST-TestReplicationHandler.testRateLimitedReplication-seed#[6071DB34886778B0]) [    ] o.a.s.s.SolrDispatchFilter |___/\___/_|_|    Start time: 2017-12-22T16:05:30.586Z
   [junit4]   2> 1493917 INFO  (TEST-TestReplicationHandler.testRateLimitedReplication-seed#[6071DB34886778B0]) [    ] o.a.s.c.SolrXmlConfig Loading container configuration from /home/jenkins/workspace/Lucene-Solr-7.2-Linux/solr/build/solr-core/test/J0/temp/solr.handler.TestReplicationHandler_6071DB34886778B0-001/solr-instance-002/solr.xml
   [junit4]   2> 1493919 INFO  (TEST-TestReplicationHandler.testRateLimitedReplication-seed#[6071DB34886778B0]) [    ] o.a.s.c.SolrXmlConfig Configuration parameter autoReplicaFailoverWorkLoopDelay is ignored
   [junit4]   2> 1493919 INFO  (TEST-TestReplicationHandler.testRateLimitedReplication-seed#[6071DB34886778B0]) [    ] o.a.s.c.SolrXmlConfig Configuration parameter autoReplicaFailoverBadNodeExpiration is ignored
   [junit4]   2> 1493920 INFO  (TEST-TestReplicationHandler.testRateLimitedReplication-seed#[6071DB34886778B0]) [    ] o.a.s.c.SolrXmlConfig MBean server found: com.sun.jmx.mbeanserver.JmxMBeanServer@e93b789, but no JMX reporters were configured - adding default JMX reporter.
   [junit4]   2> 1493940 INFO  (TEST-TestReplicationHandler.testRateLimitedReplication-seed#[6071DB34886778B0]) [    ] o.a.s.m.r.SolrJmxReporter JMX monitoring for 'solr.node' (registry 'solr.node') enabled at server: com.sun.jmx.mbeanserver.JmxMBeanServer@e93b789
   [junit4]   2> 1493946 INFO  (TEST-TestReplicationHandler.testRateLimitedReplication-seed#[6071DB34886778B0]) [    ] o.a.s.m.r.SolrJmxReporter JMX monitoring for 'solr.jvm' (registry 'solr.jvm') enabled at server: com.sun.jmx.mbeanserver.JmxMBeanServer@e93b789
   [junit4]   2> 1493946 INFO  (TEST-TestReplicationHandler.testRateLimitedReplication-seed#[6071DB34886778B0]) [    ] o.a.s.m.r.SolrJmxReporter JMX monitoring for 'solr.jetty' (registry 'solr.jetty') enabled at server: com.sun.jmx.mbeanserver.JmxMBeanServer@e93b789
   [junit4]   2> 1493948 INFO  (TEST-TestReplicationHandler.testRateLimitedReplication-seed#[6071DB34886778B0]) [    ] o.a.s.c.CorePropertiesLocator Found 1 core definitions underneath /home/jenkins/workspace/Lucene-Solr-7.2-Linux/solr/build/solr-core/test/J0/temp/solr.handler.TestReplicationHandler_6071DB34886778B0-001/solr-instance-002/.
   [junit4]   2> 1493948 INFO  (TEST-TestReplicationHandler.testRateLimitedReplication-seed#[6071DB34886778B0]) [    ] o.a.s.c.CorePropertiesLocator Cores are: [collection1]
   [junit4]   2> 1493948 INFO  (coreLoadExec

[...truncated too long message...]

ReplicationHandler.doTestReplicateAfterStartup-seed#[6071DB34886778B0]) [    ] o.e.j.s.h.ContextHandler Stopped o.e.j.s.ServletContextHandler@44269971{/solr,null,UNAVAILABLE}
   [junit4]   2> 1567578 INFO  (TEST-TestReplicationHandler.doTestReplicateAfterStartup-seed#[6071DB34886778B0]) [    ] o.e.j.s.AbstractConnector Stopped ServerConnector@51348864{HTTP/1.1,[http/1.1]}{127.0.0.1:0}
   [junit4]   2> 1567578 INFO  (TEST-TestReplicationHandler.doTestReplicateAfterStartup-seed#[6071DB34886778B0]) [    ] o.a.s.c.CoreContainer Shutting down CoreContainer instance=1251020278
   [junit4]   2> 1567578 INFO  (TEST-TestReplicationHandler.doTestReplicateAfterStartup-seed#[6071DB34886778B0]) [    ] o.a.s.m.SolrMetricManager Closing metric reporters for registry=solr.node, tag=null
   [junit4]   2> 1567579 INFO  (TEST-TestReplicationHandler.doTestReplicateAfterStartup-seed#[6071DB34886778B0]) [    ] o.a.s.m.r.SolrJmxReporter Closing reporter [org.apache.solr.metrics.reporters.SolrJmxReporter@40789fa8: rootName = null, domain = solr.node, service url = null, agent id = null] for registry solr.node / com.codahale.metrics.MetricRegistry@282166bf
   [junit4]   2> 1567587 INFO  (TEST-TestReplicationHandler.doTestReplicateAfterStartup-seed#[6071DB34886778B0]) [    ] o.a.s.m.SolrMetricManager Closing metric reporters for registry=solr.jvm, tag=null
   [junit4]   2> 1567587 INFO  (TEST-TestReplicationHandler.doTestReplicateAfterStartup-seed#[6071DB34886778B0]) [    ] o.a.s.m.r.SolrJmxReporter Closing reporter [org.apache.solr.metrics.reporters.SolrJmxReporter@3cabaed4: rootName = null, domain = solr.jvm, service url = null, agent id = null] for registry solr.jvm / com.codahale.metrics.MetricRegistry@1a3cbd06
   [junit4]   2> 1567592 INFO  (TEST-TestReplicationHandler.doTestReplicateAfterStartup-seed#[6071DB34886778B0]) [    ] o.a.s.m.SolrMetricManager Closing metric reporters for registry=solr.jetty, tag=null
   [junit4]   2> 1567592 INFO  (TEST-TestReplicationHandler.doTestReplicateAfterStartup-seed#[6071DB34886778B0]) [    ] o.a.s.m.r.SolrJmxReporter Closing reporter [org.apache.solr.metrics.reporters.SolrJmxReporter@5602ae5d: rootName = null, domain = solr.jetty, service url = null, agent id = null] for registry solr.jetty / com.codahale.metrics.MetricRegistry@234def24
   [junit4]   2> 1567592 INFO  (coreCloseExecutor-6139-thread-1) [    x:collection1] o.a.s.c.SolrCore [collection1]  CLOSING SolrCore org.apache.solr.core.SolrCore@2ac14337
   [junit4]   2> 1567592 INFO  (coreCloseExecutor-6139-thread-1) [    x:collection1] o.a.s.m.SolrMetricManager Closing metric reporters for registry=solr.core.collection1, tag=717308727
   [junit4]   2> 1567592 INFO  (coreCloseExecutor-6139-thread-1) [    x:collection1] o.a.s.m.r.SolrJmxReporter Closing reporter [org.apache.solr.metrics.reporters.SolrJmxReporter@129cd0d7: rootName = null, domain = solr.core.collection1, service url = null, agent id = null] for registry solr.core.collection1 / com.codahale.metrics.MetricRegistry@60ce0685
   [junit4]   2> 1567599 INFO  (TEST-TestReplicationHandler.doTestReplicateAfterStartup-seed#[6071DB34886778B0]) [    ] o.e.j.s.h.ContextHandler Stopped o.e.j.s.ServletContextHandler@3626b563{/solr,null,UNAVAILABLE}
   [junit4]   2> NOTE: leaving temporary files on disk at: /home/jenkins/workspace/Lucene-Solr-7.2-Linux/solr/build/solr-core/test/J0/temp/solr.handler.TestReplicationHandler_6071DB34886778B0-001
   [junit4]   2> NOTE: test params are: codec=Asserting(Lucene70): {name=PostingsFormat(name=LuceneVarGapFixedInterval), id=PostingsFormat(name=LuceneVarGapFixedInterval), newname=PostingsFormat(name=LuceneVarGapFixedInterval)}, docValues:{}, maxPointsInLeafNode=666, maxMBSortInHeap=7.7468896661823, sim=RandomSimilarity(queryNorm=true): {}, locale=es-BO, timezone=Europe/Monaco
   [junit4]   2> NOTE: Linux 4.10.0-40-generic amd64/Oracle Corporation 1.8.0_144 (64-bit)/cpus=8,threads=1,free=136699496,total=518979584
   [junit4]   2> NOTE: All tests run in this JVM: [TestSortByMinMaxFunction, TestFastOutputStream, RulesTest, TestClusterProperties, TestRebalanceLeaders, MetricsConfigTest, ZkControllerTest, AssignBackwardCompatibilityTest, TestSolr4Spatial2, BufferStoreTest, TestSort, ForceLeaderTest, ExternalFileFieldSortTest, NumberUtilsTest, HdfsNNFailoverTest, TestManagedResource, TestIntervalFaceting, QueryParsingTest, TestPullReplicaErrorHandling, TestNRTOpen, TestBadConfig, TestReqParamsAPI, TestUtils, TestCloudPseudoReturnFields, TestSerializedLuceneMatchVersion, TestStressVersions, NoCacheHeaderTest, CollectionStateFormat2Test, BasicDistributedZkTest, TestIndexingPerformance, VMParamsZkACLAndCredentialsProvidersTest, RemoteQueryErrorTest, TestInPlaceUpdatesStandalone, TestHighFrequencyDictionaryFactory, TestPointFields, BlockJoinFacetRandomTest, FileUtilsTest, TestRandomDVFaceting, TestBulkSchemaAPI, SolrInfoBeanTest, TermVectorComponentTest, TestJsonFacets, TestStandardQParsers, TestNumericTokenStream, CachingDirectoryFactoryTest, TestGeoJSONResponseWriter, TestComponentsName, TestDocTermOrds, TolerantUpdateProcessorTest, LeaderElectionIntegrationTest, CdcrReplicationDistributedZkTest, TestConfig, ConnectionManagerTest, ManagedSchemaRoundRobinCloudTest, TestConfigSetsAPI, TestRecovery, TestImplicitCoreProperties, ParsingFieldUpdateProcessorsTest, SimpleCollectionCreateDeleteTest, TestBlendedInfixSuggestions, SpellCheckCollatorTest, SimpleFacetsTest, TestConfigSetImmutable, MergeStrategyTest, TestFieldCacheSort, TestMacros, DocumentBuilderTest, TemplateUpdateProcessorTest, TestMergePolicyConfig, DateFieldTest, TestEmbeddedSolrServerSchemaAPI, TestIBSimilarityFactory, TestUtilizeNode, TestLeaderElectionWithEmptyReplica, SpatialRPTFieldTypeTest, TestBinaryResponseWriter, MinimalSchemaTest, TestUseDocValuesAsStored, AnalyticsQueryTest, TestSolrIndexConfig, TestExceedMaxTermLength, TestMultiValuedNumericRangeQuery, SystemLogListenerTest, DirectoryFactoryTest, TestLuceneIndexBackCompat, DistributedExpandComponentTest, TestDistributedSearch, BasicAuthStandaloneTest, TestNonDefinedSimilarityFactory, TestSolrJ, TestReversedWildcardFilterFactory, BasicZkTest, ResourceLoaderTest, TestReRankQParserPlugin, SearchHandlerTest, TestZkAclsWithHadoopAuth, BaseCdcrDistributedZkTest, TestFieldTypeCollectionResource, TestAddFieldRealTimeGet, SuggestComponentContextFilterQueryTest, StressHdfsTest, RAMDirectoryFactoryTest, AutoAddReplicasPlanActionTest, TestFieldCacheWithThreads, TestCrossCoreJoin, TestShortCircuitedRequests, TermsComponentTest, UpdateRequestProcessorFactoryTest, StatsReloadRaceTest, ExecutePlanActionTest, TestSQLHandlerNonCloud, TestSolrCloudWithDelegationTokens, MoveReplicaTest, SliceStateTest, TestMissingGroups, TestComplexPhraseQParserPlugin, TestPostingsSolrHighlighter, TestSolrDeletionPolicy1, TestNumericTerms64, CloneFieldUpdateProcessorFactoryTest, HdfsTlogReplayBufferedWhileIndexingTest, TestCSVLoader, DocValuesTest, DateMathParserTest, IndexSchemaRuntimeFieldTest, UnloadDistributedZkTest, SyncSliceTest, OverseerTest, ShardRoutingTest, TestReplicationHandler]
   [junit4] Completed [317/751 (2!)] on J0 in 73.77s, 16 tests, 1 error, 1 skipped <<< FAILURES!

[...truncated 4554 lines...]
   [junit4] Suite: org.apache.solr.analytics.NoFacetTest
   [junit4]   2> Creating dataDir: /home/jenkins/workspace/Lucene-Solr-7.2-Linux/solr/build/contrib/solr-analytics/test/J2/temp/solr.analytics.NoFacetTest_B21E101D42E707A5-001/init-core-data-001
   [junit4]   2> NOTE: test params are: codec=Asserting(Lucene70), sim=RandomSimilarity(queryNorm=false): {}, locale=en-PH, timezone=Asia/Katmandu
   [junit4]   2> NOTE: Linux 4.10.0-40-generic amd64/Oracle Corporation 1.8.0_144 (64-bit)/cpus=8,threads=1,free=423041680,total=518979584
   [junit4]   2> NOTE: All tests run in this JVM: [CastingAnalyticsValueTest, LegacyFunctionTest, ConstantValueTest, LTEFunctionTest, CastingIntValueStreamTest, LegacyFacetSortingTest, CastingDoubleValueTest, MultFunctionTest, CastingDateValueStreamTest, PowerFunctionTest, ConcatFunctionTest, RoundFunctionTest, CastingLongValueTest, ExpressionFactoryTest, NoFacetTest]
   [junit4]   2> NOTE: reproduce with: ant test  -Dtestcase=NoFacetTest -Dtests.seed=B21E101D42E707A5 -Dtests.multiplier=3 -Dtests.slow=true -Dtests.locale=en-PH -Dtests.timezone=Asia/Katmandu -Dtests.asserts=true -Dtests.file.encoding=US-ASCII
   [junit4] ERROR   0.00s J2 | NoFacetTest (suite) <<<
   [junit4]    > Throwable #1: org.apache.solr.client.solrj.impl.HttpSolrClient$RemoteSolrException: Error from server at http://127.0.0.1:32943/solr: create the collection time out:180s
   [junit4]    > 	at __randomizedtesting.SeedInfo.seed([B21E101D42E707A5]:0)
   [junit4]    > 	at org.apache.solr.client.solrj.impl.HttpSolrClient.executeMethod(HttpSolrClient.java:643)
   [junit4]    > 	at org.apache.solr.client.solrj.impl.HttpSolrClient.request(HttpSolrClient.java:255)
   [junit4]    > 	at org.apache.solr.client.solrj.impl.HttpSolrClient.request(HttpSolrClient.java:244)
   [junit4]    > 	at org.apache.solr.client.solrj.impl.LBHttpSolrClient.doRequest(LBHttpSolrClient.java:483)
   [junit4]    > 	at org.apache.solr.client.solrj.impl.LBHttpSolrClient.request(LBHttpSolrClient.java:413)
   [junit4]    > 	at org.apache.solr.client.solrj.impl.CloudSolrClient.sendRequest(CloudSolrClient.java:1103)
   [junit4]    > 	at org.apache.solr.client.solrj.impl.CloudSolrClient.requestWithRetryOnStaleState(CloudSolrClient.java:883)
   [junit4]    > 	at org.apache.solr.client.solrj.impl.CloudSolrClient.request(CloudSolrClient.java:816)
   [junit4]    > 	at org.apache.solr.client.solrj.SolrRequest.process(SolrRequest.java:194)
   [junit4]    > 	at org.apache.solr.client.solrj.SolrRequest.process(SolrRequest.java:211)
   [junit4]    > 	at org.apache.solr.analytics.SolrAnalyticsTestCase.setupCollection(SolrAnalyticsTestCase.java:62)
   [junit4]    > 	at java.lang.Thread.run(Thread.java:748)
   [junit4] Completed [78/78 (1!)] on J2 in 215.97s, 0 tests, 1 error <<< FAILURES!

[...truncated 44279 lines...]

Mime
View raw message