lucene-dev mailing list archives

Site index · List index
Message view « Date » · « Thread »
Top « Date » · « Thread »
From Policeman Jenkins Server <jenk...@thetaphi.de>
Subject [JENKINS] Lucene-Solr-7.x-Solaris (64bit/jdk1.8.0) - Build # 344 - Unstable!
Date Wed, 20 Dec 2017 06:46:13 GMT
Build: https://jenkins.thetaphi.de/job/Lucene-Solr-7.x-Solaris/344/
Java: 64bit/jdk1.8.0 -XX:-UseCompressedOops -XX:+UseConcMarkSweepGC

1 tests failed.
FAILED:  org.apache.solr.cloud.CollectionsAPIDistributedZkTest.testCollectionsAPI

Error Message:
Error from server at http://127.0.0.1:61096/solr/awhollynewcollection_0_shard2_replica_n2: ClusterState says we are the leader (http://127.0.0.1:61096/solr/awhollynewcollection_0_shard2_replica_n2), but locally we don't think so. Request came from null

Stack Trace:
org.apache.solr.client.solrj.impl.CloudSolrClient$RouteException: Error from server at http://127.0.0.1:61096/solr/awhollynewcollection_0_shard2_replica_n2: ClusterState says we are the leader (http://127.0.0.1:61096/solr/awhollynewcollection_0_shard2_replica_n2), but locally we don't think so. Request came from null
	at __randomizedtesting.SeedInfo.seed([212C3DF6229AD48D:6959494224A9FB18]:0)
	at org.apache.solr.client.solrj.impl.CloudSolrClient.directUpdate(CloudSolrClient.java:550)
	at org.apache.solr.client.solrj.impl.CloudSolrClient.sendRequest(CloudSolrClient.java:1013)
	at org.apache.solr.client.solrj.impl.CloudSolrClient.requestWithRetryOnStaleState(CloudSolrClient.java:884)
	at org.apache.solr.client.solrj.impl.CloudSolrClient.requestWithRetryOnStaleState(CloudSolrClient.java:946)
	at org.apache.solr.client.solrj.impl.CloudSolrClient.requestWithRetryOnStaleState(CloudSolrClient.java:946)
	at org.apache.solr.client.solrj.impl.CloudSolrClient.requestWithRetryOnStaleState(CloudSolrClient.java:946)
	at org.apache.solr.client.solrj.impl.CloudSolrClient.requestWithRetryOnStaleState(CloudSolrClient.java:946)
	at org.apache.solr.client.solrj.impl.CloudSolrClient.requestWithRetryOnStaleState(CloudSolrClient.java:946)
	at org.apache.solr.client.solrj.impl.CloudSolrClient.request(CloudSolrClient.java:817)
	at org.apache.solr.client.solrj.SolrRequest.process(SolrRequest.java:194)
	at org.apache.solr.client.solrj.request.UpdateRequest.commit(UpdateRequest.java:233)
	at org.apache.solr.cloud.CollectionsAPIDistributedZkTest.testCollectionsAPI(CollectionsAPIDistributedZkTest.java:460)
	at sun.reflect.NativeMethodAccessorImpl.invoke0(Native Method)
	at sun.reflect.NativeMethodAccessorImpl.invoke(NativeMethodAccessorImpl.java:62)
	at sun.reflect.DelegatingMethodAccessorImpl.invoke(DelegatingMethodAccessorImpl.java:43)
	at java.lang.reflect.Method.invoke(Method.java:498)
	at com.carrotsearch.randomizedtesting.RandomizedRunner.invoke(RandomizedRunner.java:1737)
	at com.carrotsearch.randomizedtesting.RandomizedRunner$8.evaluate(RandomizedRunner.java:934)
	at com.carrotsearch.randomizedtesting.RandomizedRunner$9.evaluate(RandomizedRunner.java:970)
	at com.carrotsearch.randomizedtesting.RandomizedRunner$10.evaluate(RandomizedRunner.java:984)
	at com.carrotsearch.randomizedtesting.rules.SystemPropertiesRestoreRule$1.evaluate(SystemPropertiesRestoreRule.java:57)
	at org.apache.lucene.util.TestRuleSetupTeardownChained$1.evaluate(TestRuleSetupTeardownChained.java:49)
	at org.apache.lucene.util.AbstractBeforeAfterRule$1.evaluate(AbstractBeforeAfterRule.java:45)
	at org.apache.lucene.util.TestRuleThreadAndTestName$1.evaluate(TestRuleThreadAndTestName.java:48)
	at org.apache.lucene.util.TestRuleIgnoreAfterMaxFailures$1.evaluate(TestRuleIgnoreAfterMaxFailures.java:64)
	at org.apache.lucene.util.TestRuleMarkFailure$1.evaluate(TestRuleMarkFailure.java:47)
	at com.carrotsearch.randomizedtesting.rules.StatementAdapter.evaluate(StatementAdapter.java:36)
	at com.carrotsearch.randomizedtesting.ThreadLeakControl$StatementRunner.run(ThreadLeakControl.java:368)
	at com.carrotsearch.randomizedtesting.ThreadLeakControl.forkTimeoutingTask(ThreadLeakControl.java:817)
	at com.carrotsearch.randomizedtesting.ThreadLeakControl$3.evaluate(ThreadLeakControl.java:468)
	at com.carrotsearch.randomizedtesting.RandomizedRunner.runSingleTest(RandomizedRunner.java:943)
	at com.carrotsearch.randomizedtesting.RandomizedRunner$5.evaluate(RandomizedRunner.java:829)
	at com.carrotsearch.randomizedtesting.RandomizedRunner$6.evaluate(RandomizedRunner.java:879)
	at com.carrotsearch.randomizedtesting.RandomizedRunner$7.evaluate(RandomizedRunner.java:890)
	at com.carrotsearch.randomizedtesting.rules.StatementAdapter.evaluate(StatementAdapter.java:36)
	at com.carrotsearch.randomizedtesting.rules.SystemPropertiesRestoreRule$1.evaluate(SystemPropertiesRestoreRule.java:57)
	at org.apache.lucene.util.AbstractBeforeAfterRule$1.evaluate(AbstractBeforeAfterRule.java:45)
	at com.carrotsearch.randomizedtesting.rules.StatementAdapter.evaluate(StatementAdapter.java:36)
	at org.apache.lucene.util.TestRuleStoreClassName$1.evaluate(TestRuleStoreClassName.java:41)
	at com.carrotsearch.randomizedtesting.rules.NoShadowingOrOverridesOnMethodsRule$1.evaluate(NoShadowingOrOverridesOnMethodsRule.java:40)
	at com.carrotsearch.randomizedtesting.rules.NoShadowingOrOverridesOnMethodsRule$1.evaluate(NoShadowingOrOverridesOnMethodsRule.java:40)
	at com.carrotsearch.randomizedtesting.rules.StatementAdapter.evaluate(StatementAdapter.java:36)
	at com.carrotsearch.randomizedtesting.rules.StatementAdapter.evaluate(StatementAdapter.java:36)
	at com.carrotsearch.randomizedtesting.rules.StatementAdapter.evaluate(StatementAdapter.java:36)
	at org.apache.lucene.util.TestRuleAssertionsRequired$1.evaluate(TestRuleAssertionsRequired.java:53)
	at org.apache.lucene.util.TestRuleMarkFailure$1.evaluate(TestRuleMarkFailure.java:47)
	at org.apache.lucene.util.TestRuleIgnoreAfterMaxFailures$1.evaluate(TestRuleIgnoreAfterMaxFailures.java:64)
	at org.apache.lucene.util.TestRuleIgnoreTestSuites$1.evaluate(TestRuleIgnoreTestSuites.java:54)
	at com.carrotsearch.randomizedtesting.rules.StatementAdapter.evaluate(StatementAdapter.java:36)
	at com.carrotsearch.randomizedtesting.ThreadLeakControl$StatementRunner.run(ThreadLeakControl.java:368)
	at java.lang.Thread.run(Thread.java:748)
Caused by: org.apache.solr.client.solrj.impl.HttpSolrClient$RemoteSolrException: Error from server at http://127.0.0.1:61096/solr/awhollynewcollection_0_shard2_replica_n2: ClusterState says we are the leader (http://127.0.0.1:61096/solr/awhollynewcollection_0_shard2_replica_n2), but locally we don't think so. Request came from null
	at org.apache.solr.client.solrj.impl.HttpSolrClient.executeMethod(HttpSolrClient.java:643)
	at org.apache.solr.client.solrj.impl.HttpSolrClient.request(HttpSolrClient.java:255)
	at org.apache.solr.client.solrj.impl.HttpSolrClient.request(HttpSolrClient.java:244)
	at org.apache.solr.client.solrj.impl.LBHttpSolrClient.doRequest(LBHttpSolrClient.java:483)
	at org.apache.solr.client.solrj.impl.LBHttpSolrClient.request(LBHttpSolrClient.java:413)
	at org.apache.solr.client.solrj.impl.CloudSolrClient.lambda$directUpdate$0(CloudSolrClient.java:527)
	at java.util.concurrent.FutureTask.run(FutureTask.java:266)
	at org.apache.solr.common.util.ExecutorUtil$MDCAwareThreadPoolExecutor.lambda$execute$0(ExecutorUtil.java:188)
	at java.util.concurrent.ThreadPoolExecutor.runWorker(ThreadPoolExecutor.java:1149)
	at java.util.concurrent.ThreadPoolExecutor$Worker.run(ThreadPoolExecutor.java:624)
	... 1 more




Build Log:
[...truncated 13009 lines...]
   [junit4] Suite: org.apache.solr.cloud.CollectionsAPIDistributedZkTest
   [junit4]   2> Creating dataDir: /export/home/jenkins/workspace/Lucene-Solr-7.x-Solaris/solr/build/solr-core/test/J1/temp/solr.cloud.CollectionsAPIDistributedZkTest_212C3DF6229AD48D-001/init-core-data-001
   [junit4]   2> 2745100 WARN  (SUITE-CollectionsAPIDistributedZkTest-seed#[212C3DF6229AD48D]-worker) [    ] o.a.s.SolrTestCaseJ4 startTrackingSearchers: numOpens=54 numCloses=54
   [junit4]   2> 2745100 INFO  (SUITE-CollectionsAPIDistributedZkTest-seed#[212C3DF6229AD48D]-worker) [    ] o.a.s.SolrTestCaseJ4 Using PointFields (NUMERIC_POINTS_SYSPROP=true) w/NUMERIC_DOCVALUES_SYSPROP=false
   [junit4]   2> 2745102 INFO  (SUITE-CollectionsAPIDistributedZkTest-seed#[212C3DF6229AD48D]-worker) [    ] o.a.s.SolrTestCaseJ4 Randomized ssl (false) and clientAuth (false) via: @org.apache.solr.util.RandomizeSSL(reason=, value=NaN, ssl=NaN, clientAuth=NaN)
   [junit4]   2> 2745102 INFO  (SUITE-CollectionsAPIDistributedZkTest-seed#[212C3DF6229AD48D]-worker) [    ] o.a.s.SolrTestCaseJ4 SecureRandom sanity checks: test.solr.allowed.securerandom=null & java.security.egd=file:/dev/./urandom
   [junit4]   2> 2745103 INFO  (SUITE-CollectionsAPIDistributedZkTest-seed#[212C3DF6229AD48D]-worker) [    ] o.a.s.c.MiniSolrCloudCluster Starting cluster of 4 servers in /export/home/jenkins/workspace/Lucene-Solr-7.x-Solaris/solr/build/solr-core/test/J1/temp/solr.cloud.CollectionsAPIDistributedZkTest_212C3DF6229AD48D-001/tempDir-001
   [junit4]   2> 2745103 INFO  (SUITE-CollectionsAPIDistributedZkTest-seed#[212C3DF6229AD48D]-worker) [    ] o.a.s.c.ZkTestServer STARTING ZK TEST SERVER
   [junit4]   2> 2745103 INFO  (Thread-7421) [    ] o.a.s.c.ZkTestServer client port:0.0.0.0/0.0.0.0:0
   [junit4]   2> 2745103 INFO  (Thread-7421) [    ] o.a.s.c.ZkTestServer Starting server
   [junit4]   2> 2745104 ERROR (Thread-7421) [    ] o.a.z.s.ZooKeeperServer ZKShutdownHandler is not registered, so ZooKeeper server won't take any action on ERROR or SHUTDOWN server state changes
   [junit4]   2> 2745203 INFO  (SUITE-CollectionsAPIDistributedZkTest-seed#[212C3DF6229AD48D]-worker) [    ] o.a.s.c.ZkTestServer start zk server on port:56031
   [junit4]   2> 2745209 INFO  (zkConnectionManagerCallback-6224-thread-1) [    ] o.a.s.c.c.ConnectionManager zkClient has connected
   [junit4]   2> 2745220 INFO  (jetty-launcher-6221-thread-1) [    ] o.e.j.s.Server jetty-9.3.20.v20170531
   [junit4]   2> 2745220 INFO  (jetty-launcher-6221-thread-2) [    ] o.e.j.s.Server jetty-9.3.20.v20170531
   [junit4]   2> 2745221 INFO  (jetty-launcher-6221-thread-3) [    ] o.e.j.s.Server jetty-9.3.20.v20170531
   [junit4]   2> 2745221 INFO  (jetty-launcher-6221-thread-1) [    ] o.e.j.s.h.ContextHandler Started o.e.j.s.ServletContextHandler@593b7590{/solr,null,AVAILABLE}
   [junit4]   2> 2745220 INFO  (jetty-launcher-6221-thread-4) [    ] o.e.j.s.Server jetty-9.3.20.v20170531
   [junit4]   2> 2745223 INFO  (jetty-launcher-6221-thread-1) [    ] o.e.j.s.AbstractConnector Started ServerConnector@6c9998e8{HTTP/1.1,[http/1.1]}{127.0.0.1:44935}
   [junit4]   2> 2745223 INFO  (jetty-launcher-6221-thread-1) [    ] o.e.j.s.Server Started @2748999ms
   [junit4]   2> 2745223 INFO  (jetty-launcher-6221-thread-1) [    ] o.a.s.c.s.e.JettySolrRunner Jetty properties: {hostContext=/solr, hostPort=44935}
   [junit4]   2> 2745224 ERROR (jetty-launcher-6221-thread-1) [    ] o.a.s.u.StartupLoggingUtils Missing Java Option solr.log.dir. Logging may be missing or incomplete.
   [junit4]   2> 2745224 INFO  (jetty-launcher-6221-thread-1) [    ] o.a.s.s.SolrDispatchFilter  ___      _       Welcome to Apache Solr? version 7.3.0
   [junit4]   2> 2745224 INFO  (jetty-launcher-6221-thread-1) [    ] o.a.s.s.SolrDispatchFilter / __| ___| |_ _   Starting in cloud mode on port null
   [junit4]   2> 2745224 INFO  (jetty-launcher-6221-thread-1) [    ] o.a.s.s.SolrDispatchFilter \__ \/ _ \ | '_|  Install dir: null
   [junit4]   2> 2745224 INFO  (jetty-launcher-6221-thread-1) [    ] o.a.s.s.SolrDispatchFilter |___/\___/_|_|    Start time: 2017-12-20T05:55:56.105Z
   [junit4]   2> 2745224 INFO  (jetty-launcher-6221-thread-3) [    ] o.e.j.s.h.ContextHandler Started o.e.j.s.ServletContextHandler@a466c09{/solr,null,AVAILABLE}
   [junit4]   2> 2745228 INFO  (jetty-launcher-6221-thread-3) [    ] o.e.j.s.AbstractConnector Started ServerConnector@2382e46b{HTTP/1.1,[http/1.1]}{127.0.0.1:39265}
   [junit4]   2> 2745228 INFO  (jetty-launcher-6221-thread-3) [    ] o.e.j.s.Server Started @2749004ms
   [junit4]   2> 2745228 INFO  (jetty-launcher-6221-thread-3) [    ] o.a.s.c.s.e.JettySolrRunner Jetty properties: {hostContext=/solr, hostPort=39265}
   [junit4]   2> 2745229 ERROR (jetty-launcher-6221-thread-3) [    ] o.a.s.u.StartupLoggingUtils Missing Java Option solr.log.dir. Logging may be missing or incomplete.
   [junit4]   2> 2745232 INFO  (jetty-launcher-6221-thread-2) [    ] o.e.j.s.h.ContextHandler Started o.e.j.s.ServletContextHandler@66475752{/solr,null,AVAILABLE}
   [junit4]   2> 2745232 INFO  (jetty-launcher-6221-thread-4) [    ] o.e.j.s.h.ContextHandler Started o.e.j.s.ServletContextHandler@64604838{/solr,null,AVAILABLE}
   [junit4]   2> 2745232 INFO  (jetty-launcher-6221-thread-2) [    ] o.e.j.s.AbstractConnector Started ServerConnector@5412ef20{HTTP/1.1,[http/1.1]}{127.0.0.1:48630}
   [junit4]   2> 2745232 INFO  (jetty-launcher-6221-thread-4) [    ] o.e.j.s.AbstractConnector Started ServerConnector@584df3cd{HTTP/1.1,[http/1.1]}{127.0.0.1:61096}
   [junit4]   2> 2745233 INFO  (jetty-launcher-6221-thread-2) [    ] o.e.j.s.Server Started @2749008ms
   [junit4]   2> 2745233 INFO  (jetty-launcher-6221-thread-4) [    ] o.e.j.s.Server Started @2749008ms
   [junit4]   2> 2745233 INFO  (jetty-launcher-6221-thread-2) [    ] o.a.s.c.s.e.JettySolrRunner Jetty properties: {hostContext=/solr, hostPort=48630}
   [junit4]   2> 2745233 INFO  (jetty-launcher-6221-thread-4) [    ] o.a.s.c.s.e.JettySolrRunner Jetty properties: {hostContext=/solr, hostPort=61096}
   [junit4]   2> 2745233 ERROR (jetty-launcher-6221-thread-4) [    ] o.a.s.u.StartupLoggingUtils Missing Java Option solr.log.dir. Logging may be missing or incomplete.
   [junit4]   2> 2745233 INFO  (jetty-launcher-6221-thread-4) [    ] o.a.s.s.SolrDispatchFilter  ___      _       Welcome to Apache Solr? version 7.3.0
   [junit4]   2> 2745233 INFO  (jetty-launcher-6221-thread-4) [    ] o.a.s.s.SolrDispatchFilter / __| ___| |_ _   Starting in cloud mode on port null
   [junit4]   2> 2745233 INFO  (jetty-launcher-6221-thread-4) [    ] o.a.s.s.SolrDispatchFilter \__ \/ _ \ | '_|  Install dir: null
   [junit4]   2> 2745233 INFO  (jetty-launcher-6221-thread-4) [    ] o.a.s.s.SolrDispatchFilter |___/\___/_|_|    Start time: 2017-12-20T05:55:56.114Z
   [junit4]   2> 2745233 ERROR (jetty-launcher-6221-thread-2) [    ] o.a.s.u.StartupLoggingUtils Missing Java Option solr.log.dir. Logging may be missing or incomplete.
   [junit4]   2> 2745233 INFO  (jetty-launcher-6221-thread-2) [    ] o.a.s.s.SolrDispatchFilter  ___      _       Welcome to Apache Solr? version 7.3.0
   [junit4]   2> 2745234 INFO  (jetty-launcher-6221-thread-2) [    ] o.a.s.s.SolrDispatchFilter / __| ___| |_ _   Starting in cloud mode on port null
   [junit4]   2> 2745234 INFO  (jetty-launcher-6221-thread-2) [    ] o.a.s.s.SolrDispatchFilter \__ \/ _ \ | '_|  Install dir: null
   [junit4]   2> 2745234 INFO  (jetty-launcher-6221-thread-2) [    ] o.a.s.s.SolrDispatchFilter |___/\___/_|_|    Start time: 2017-12-20T05:55:56.115Z
   [junit4]   2> 2745234 INFO  (jetty-launcher-6221-thread-3) [    ] o.a.s.s.SolrDispatchFilter  ___      _       Welcome to Apache Solr? version 7.3.0
   [junit4]   2> 2745234 INFO  (jetty-launcher-6221-thread-3) [    ] o.a.s.s.SolrDispatchFilter / __| ___| |_ _   Starting in cloud mode on port null
   [junit4]   2> 2745234 INFO  (zkConnectionManagerCallback-6226-thread-1) [    ] o.a.s.c.c.ConnectionManager zkClient has connected
   [junit4]   2> 2745234 INFO  (jetty-launcher-6221-thread-3) [    ] o.a.s.s.SolrDispatchFilter \__ \/ _ \ | '_|  Install dir: null
   [junit4]   2> 2745234 INFO  (jetty-launcher-6221-thread-3) [    ] o.a.s.s.SolrDispatchFilter |___/\___/_|_|    Start time: 2017-12-20T05:55:56.115Z
   [junit4]   2> 2745236 INFO  (jetty-launcher-6221-thread-1) [    ] o.a.s.s.SolrDispatchFilter solr.xml found in ZooKeeper. Loading...
   [junit4]   2> 2745236 INFO  (zkConnectionManagerCallback-6228-thread-1) [    ] o.a.s.c.c.ConnectionManager zkClient has connected
   [junit4]   2> 2745236 INFO  (zkConnectionManagerCallback-6230-thread-1) [    ] o.a.s.c.c.ConnectionManager zkClient has connected
   [junit4]   2> 2745236 INFO  (zkConnectionManagerCallback-6232-thread-1) [    ] o.a.s.c.c.ConnectionManager zkClient has connected
   [junit4]   2> 2745237 INFO  (jetty-launcher-6221-thread-4) [    ] o.a.s.s.SolrDispatchFilter solr.xml found in ZooKeeper. Loading...
   [junit4]   2> 2745240 INFO  (jetty-launcher-6221-thread-2) [    ] o.a.s.s.SolrDispatchFilter solr.xml found in ZooKeeper. Loading...
   [junit4]   2> 2745241 INFO  (jetty-launcher-6221-thread-3) [    ] o.a.s.s.SolrDispatchFilter solr.xml found in ZooKeeper. Loading...
   [junit4]   2> 2745244 INFO  (jetty-launcher-6221-thread-4) [    ] o.a.s.c.SolrXmlConfig Configuration parameter autoReplicaFailoverWorkLoopDelay is ignored
   [junit4]   2> 2745244 INFO  (jetty-launcher-6221-thread-4) [    ] o.a.s.c.SolrXmlConfig Configuration parameter autoReplicaFailoverBadNodeExpiration is ignored
   [junit4]   2> 2745244 INFO  (jetty-launcher-6221-thread-1) [    ] o.a.s.c.SolrXmlConfig Configuration parameter autoReplicaFailoverWorkLoopDelay is ignored
   [junit4]   2> 2745244 INFO  (jetty-launcher-6221-thread-1) [    ] o.a.s.c.SolrXmlConfig Configuration parameter autoReplicaFailoverBadNodeExpiration is ignored
   [junit4]   2> 2745244 INFO  (jetty-launcher-6221-thread-2) [    ] o.a.s.c.SolrXmlConfig Configuration parameter autoReplicaFailoverWorkLoopDelay is ignored
   [junit4]   2> 2745244 INFO  (jetty-launcher-6221-thread-2) [    ] o.a.s.c.SolrXmlConfig Configuration parameter autoReplicaFailoverBadNodeExpiration is ignored
   [junit4]   2> 2745249 INFO  (jetty-launcher-6221-thread-4) [    ] o.a.s.c.ZkContainer Zookeeper client=127.0.0.1:56031/solr
   [junit4]   2> 2745249 INFO  (jetty-launcher-6221-thread-1) [    ] o.a.s.c.ZkContainer Zookeeper client=127.0.0.1:56031/solr
   [junit4]   2> 2745249 INFO  (jetty-launcher-6221-thread-3) [    ] o.a.s.c.SolrXmlConfig Configuration parameter autoReplicaFailoverWorkLoopDelay is ignored
   [junit4]   2> 2745250 INFO  (jetty-launcher-6221-thread-3) [    ] o.a.s.c.SolrXmlConfig Configuration parameter autoReplicaFailoverBadNodeExpiration is ignored
   [junit4]   2> 2745251 INFO  (zkConnectionManagerCallback-6237-thread-1) [    ] o.a.s.c.c.ConnectionManager zkClient has connected
   [junit4]   2> 2745252 INFO  (zkConnectionManagerCallback-6240-thread-1) [    ] o.a.s.c.c.ConnectionManager zkClient has connected
   [junit4]   2> 2745253 INFO  (jetty-launcher-6221-thread-2) [    ] o.a.s.c.ZkContainer Zookeeper client=127.0.0.1:56031/solr
   [junit4]   2> 2745255 INFO  (zkConnectionManagerCallback-6244-thread-1-processing-n:127.0.0.1:61096_solr) [n:127.0.0.1:61096_solr    ] o.a.s.c.c.ConnectionManager zkClient has connected
   [junit4]   2> 2745256 INFO  (jetty-launcher-6221-thread-3) [    ] o.a.s.c.ZkContainer Zookeeper client=127.0.0.1:56031/solr
   [junit4]   2> 2745261 INFO  (zkConnectionManagerCallback-6246-thread-1) [    ] o.a.s.c.c.ConnectionManager zkClient has connected
   [junit4]   2> 2745262 INFO  (zkConnectionManagerCallback-6249-thread-1-processing-n:127.0.0.1:44935_solr) [n:127.0.0.1:44935_solr    ] o.a.s.c.c.ConnectionManager zkClient has connected
   [junit4]   2> 2745263 INFO  (zkConnectionManagerCallback-6252-thread-1) [    ] o.a.s.c.c.ConnectionManager zkClient has connected
   [junit4]   2> 2745264 INFO  (zkConnectionManagerCallback-6254-thread-1-processing-n:127.0.0.1:48630_solr) [n:127.0.0.1:48630_solr    ] o.a.s.c.c.ConnectionManager zkClient has connected
   [junit4]   2> 2745265 WARN  (NIOServerCxn.Factory:0.0.0.0/0.0.0.0:0) [    ] o.a.z.s.NIOServerCnxn caught end of stream exception
   [junit4]   2> EndOfStreamException: Unable to read additional data from client sessionid 0x160727e1dd1000a, likely client has closed socket
   [junit4]   2> 	at org.apache.zookeeper.server.NIOServerCnxn.doIO(NIOServerCnxn.java:239)
   [junit4]   2> 	at org.apache.zookeeper.server.NIOServerCnxnFactory.run(NIOServerCnxnFactory.java:203)
   [junit4]   2> 	at java.lang.Thread.run(Thread.java:748)
   [junit4]   2> 2745266 INFO  (zkConnectionManagerCallback-6256-thread-1-processing-n:127.0.0.1:39265_solr) [n:127.0.0.1:39265_solr    ] o.a.s.c.c.ConnectionManager zkClient has connected
   [junit4]   2> 2745445 INFO  (jetty-launcher-6221-thread-3) [n:127.0.0.1:39265_solr    ] o.a.s.c.Overseer Overseer (id=null) closing
   [junit4]   2> 2745446 INFO  (jetty-launcher-6221-thread-3) [n:127.0.0.1:39265_solr    ] o.a.s.c.OverseerElectionContext I am going to be the leader 127.0.0.1:39265_solr
   [junit4]   2> 2745447 INFO  (jetty-launcher-6221-thread-3) [n:127.0.0.1:39265_solr    ] o.a.s.c.Overseer Overseer (id=99205077793832972-127.0.0.1:39265_solr-n_0000000000) starting
   [junit4]   2> 2745458 INFO  (jetty-launcher-6221-thread-3) [n:127.0.0.1:39265_solr    ] o.a.s.c.ZkController Register node as live in ZooKeeper:/live_nodes/127.0.0.1:39265_solr
   [junit4]   2> 2745461 INFO  (jetty-launcher-6221-thread-2) [n:127.0.0.1:48630_solr    ] o.a.s.c.Overseer Overseer (id=null) closing
   [junit4]   2> 2745471 INFO  (zkCallback-6253-thread-1-processing-n:127.0.0.1:48630_solr) [n:127.0.0.1:48630_solr    ] o.a.s.c.c.ZkStateReader Updated live nodes from ZooKeeper... (0) -> (1)
   [junit4]   2> 2745472 INFO  (OverseerStateUpdate-99205077793832972-127.0.0.1:39265_solr-n_0000000000) [n:127.0.0.1:39265_solr    ] o.a.s.c.c.ZkStateReader Updated live nodes from ZooKeeper... (0) -> (1)
   [junit4]   2> 2745480 INFO  (jetty-launcher-6221-thread-2) [n:127.0.0.1:48630_solr    ] o.a.s.c.ZkController Register node as live in ZooKeeper:/live_nodes/127.0.0.1:48630_solr
   [junit4]   2> 2745481 INFO  (zkCallback-6255-thread-1-processing-n:127.0.0.1:39265_solr) [n:127.0.0.1:39265_solr    ] o.a.s.c.c.ZkStateReader Updated live nodes from ZooKeeper... (1) -> (2)
   [junit4]   2> 2745481 INFO  (zkCallback-6253-thread-1-processing-n:127.0.0.1:48630_solr) [n:127.0.0.1:48630_solr    ] o.a.s.c.c.ZkStateReader Updated live nodes from ZooKeeper... (1) -> (2)
   [junit4]   2> 2745501 INFO  (jetty-launcher-6221-thread-1) [n:127.0.0.1:44935_solr    ] o.a.s.c.c.ZkStateReader Updated live nodes from ZooKeeper... (0) -> (2)
   [junit4]   2> 2745503 INFO  (jetty-launcher-6221-thread-1) [n:127.0.0.1:44935_solr    ] o.a.s.c.Overseer Overseer (id=null) closing
   [junit4]   2> 2745505 INFO  (jetty-launcher-6221-thread-1) [n:127.0.0.1:44935_solr    ] o.a.s.c.ZkController Register node as live in ZooKeeper:/live_nodes/127.0.0.1:44935_solr
   [junit4]   2> 2745522 INFO  (zkCallback-6253-thread-1-processing-n:127.0.0.1:48630_solr) [n:127.0.0.1:48630_solr    ] o.a.s.c.c.ZkStateReader Updated live nodes from ZooKeeper... (2) -> (3)
   [junit4]   2> 2745523 INFO  (zkCallback-6255-thread-2-processing-n:127.0.0.1:39265_solr) [n:127.0.0.1:39265_solr    ] o.a.s.c.c.ZkStateReader Updated live nodes from ZooKeeper... (2) -> (3)
   [junit4]   2> 2745525 INFO  (zkCallback-6248-thread-1-processing-n:127.0.0.1:44935_solr) [n:127.0.0.1:44935_solr    ] o.a.s.c.c.ZkStateReader Updated live nodes from ZooKeeper... (2) -> (3)
   [junit4]   2> 2745552 INFO  (jetty-launcher-6221-thread-4) [n:127.0.0.1:61096_solr    ] o.a.s.c.c.ZkStateReader Updated live nodes from ZooKeeper... (0) -> (3)
   [junit4]   2> 2745553 INFO  (jetty-launcher-6221-thread-3) [n:127.0.0.1:39265_solr    ] o.a.s.m.r.SolrJmxReporter JMX monitoring for 'solr.node' (registry 'solr.node') enabled at server: com.sun.jmx.mbeanserver.JmxMBeanServer@1f1303ef
   [junit4]   2> 2745554 INFO  (jetty-launcher-6221-thread-4) [n:127.0.0.1:61096_solr    ] o.a.s.c.Overseer Overseer (id=null) closing
   [junit4]   2> 2745556 INFO  (jetty-launcher-6221-thread-4) [n:127.0.0.1:61096_solr    ] o.a.s.c.ZkController Register node as live in ZooKeeper:/live_nodes/127.0.0.1:61096_solr
   [junit4]   2> 2745558 INFO  (jetty-launcher-6221-thread-3) [n:127.0.0.1:39265_solr    ] o.a.s.m.r.SolrJmxReporter JMX monitoring for 'solr.jvm' (registry 'solr.jvm') enabled at server: com.sun.jmx.mbeanserver.JmxMBeanServer@1f1303ef
   [junit4]   2> 2745559 INFO  (jetty-launcher-6221-thread-3) [n:127.0.0.1:39265_solr    ] o.a.s.m.r.SolrJmxReporter JMX monitoring for 'solr.jetty' (registry 'solr.jetty') enabled at server: com.sun.jmx.mbeanserver.JmxMBeanServer@1f1303ef
   [junit4]   2> 2745559 INFO  (jetty-launcher-6221-thread-3) [n:127.0.0.1:39265_solr    ] o.a.s.c.CorePropertiesLocator Found 0 core definitions underneath /export/home/jenkins/workspace/Lucene-Solr-7.x-Solaris/solr/build/solr-core/test/J1/temp/solr.cloud.CollectionsAPIDistributedZkTest_212C3DF6229AD48D-001/tempDir-001/node4
   [junit4]   2> 2745576 INFO  (zkCallback-6253-thread-1-processing-n:127.0.0.1:48630_solr) [n:127.0.0.1:48630_solr    ] o.a.s.c.c.ZkStateReader Updated live nodes from ZooKeeper... (3) -> (4)
   [junit4]   2> 2745585 INFO  (zkCallback-6255-thread-2-processing-n:127.0.0.1:39265_solr) [n:127.0.0.1:39265_solr    ] o.a.s.c.c.ZkStateReader Updated live nodes from ZooKeeper... (3) -> (4)
   [junit4]   2> 2745609 INFO  (zkCallback-6243-thread-1-processing-n:127.0.0.1:61096_solr) [n:127.0.0.1:61096_solr    ] o.a.s.c.c.ZkStateReader Updated live nodes from ZooKeeper... (3) -> (4)
   [junit4]   2> 2745624 INFO  (zkCallback-6248-thread-1-processing-n:127.0.0.1:44935_solr) [n:127.0.0.1:44935_solr    ] o.a.s.c.c.ZkStateReader Updated live nodes from ZooKeeper... (3) -> (4)
   [junit4]   2> 2745631 INFO  (jetty-launcher-6221-thread-1) [n:127.0.0.1:44935_solr    ] o.a.s.m.r.SolrJmxReporter JMX monitoring for 'solr.node' (registry 'solr.node') enabled at server: com.sun.jmx.mbeanserver.JmxMBeanServer@1f1303ef
   [junit4]   2> 2745648 INFO  (jetty-launcher-6221-thread-1) [n:127.0.0.1:44935_solr    ] o.a.s.m.r.SolrJmxReporter JMX monitoring for 'solr.jvm' (registry 'solr.jvm') enabled at server: com.sun.jmx.mbeanserver.JmxMBeanServer@1f1303ef
   [junit4]   2> 2745651 INFO  (jetty-launcher-6221-thread-1) [n:127.0.0.1:44935_solr    ] o.a.s.m.r.SolrJmxReporter JMX monitoring for 'solr.jetty' (registry 'solr.jetty') enabled at server: com.sun.jmx.mbeanserver.JmxMBeanServer@1f1303ef
   [junit4]   2> 2745664 INFO  (jetty-launcher-6221-thread-1) [n:127.0.0.1:44935_solr    ] o.a.s.c.CorePropertiesLocator Found 0 core definitions underneath /export/home/jenkins/workspace/Lucene-Solr-7.x-Solaris/solr/build/solr-core/test/J1/temp/solr.cloud.CollectionsAPIDistributedZkTest_212C3DF6229AD48D-001/tempDir-001/node1
   [junit4]   2> 2745689 INFO  (jetty-launcher-6221-thread-4) [n:127.0.0.1:61096_solr    ] o.a.s.m.r.SolrJmxReporter JMX monitoring for 'solr.node' (registry 'solr.node') enabled at server: com.sun.jmx.mbeanserver.JmxMBeanServer@1f1303ef
   [junit4]   2> 2745724 INFO  (jetty-launcher-6221-thread-2) [n:127.0.0.1:48630_solr    ] o.a.s.m.r.SolrJmxReporter JMX monitoring for 'solr.node' (registry 'solr.node') enabled at server: com.sun.jmx.mbeanserver.JmxMBeanServer@1f1303ef
   [junit4]   2> 2745753 INFO  (jetty-launcher-6221-thread-2) [n:127.0.0.1:48630_solr    ] o.a.s.m.r.SolrJmxReporter JMX monitoring for 'solr.jvm' (registry 'solr.jvm') enabled at server: com.sun.jmx.mbeanserver.JmxMBeanServer@1f1303ef
   [junit4]   2> 2745753 INFO  (jetty-launcher-6221-thread-2) [n:127.0.0.1:48630_solr    ] o.a.s.m.r.SolrJmxReporter JMX monitoring for 'solr.jetty' (registry 'solr.jetty') enabled at server: com.sun.jmx.mbeanserver.JmxMBeanServer@1f1303ef
   [junit4]   2> 2745754 INFO  (jetty-launcher-6221-thread-2) [n:127.0.0.1:48630_solr    ] o.a.s.c.CorePropertiesLocator Found 0 core definitions underneath /export/home/jenkins/workspace/Lucene-Solr-7.x-Solaris/solr/build/solr-core/test/J1/temp/solr.cloud.CollectionsAPIDistributedZkTest_212C3DF6229AD48D-001/tempDir-001/node2
   [junit4]   2> 2745760 INFO  (jetty-launcher-6221-thread-4) [n:127.0.0.1:61096_solr    ] o.a.s.m.r.SolrJmxReporter JMX monitoring for 'solr.jvm' (registry 'solr.jvm') enabled at server: com.sun.jmx.mbeanserver.JmxMBeanServer@1f1303ef
   [junit4]   2> 2745760 INFO  (jetty-launcher-6221-thread-4) [n:127.0.0.1:61096_solr    ] o.a.s.m.r.SolrJmxReporter JMX monitoring for 'solr.jetty' (registry 'solr.jetty') enabled at server: com.sun.jmx.mbeanserver.JmxMBeanServer@1f1303ef
   [junit4]   2> 2745761 INFO  (jetty-launcher-6221-thread-4) [n:127.0.0.1:61096_solr    ] o.a.s.c.CorePropertiesLocator Found 0 core definitions underneath /export/home/jenkins/workspace/Lucene-Solr-7.x-Solaris/solr/build/solr-core/test/J1/temp/solr.cloud.CollectionsAPIDistributedZkTest_212C3DF6229AD48D-001/tempDir-001/node3
   [junit4]   2> 2745816 INFO  (zkConnectionManagerCallback-6266-thread-1) [    ] o.a.s.c.c.ConnectionManager zkClient has connected
   [junit4]   2> 2745818 WARN  (NIOServerCxn.Factory:0.0.0.0/0.0.0.0:0) [    ] o.a.z.s.NIOServerCnxn caught end of stream exception
   [junit4]   2> EndOfStreamException: Unable to read additional data from client sessionid 0x160727e1dd1000d, likely client has closed socket
   [junit4]   2> 	at org.apache.zookeeper.server.NIOServerCnxn.doIO(NIOServerCnxn.java:239)
   [junit4]   2> 	at org.apache.zookeeper.server.NIOServerCnxnFactory.run(NIOServerCnxnFactory.java:203)
   [junit4]   2> 	at java.lang.Thread.run(Thread.java:748)
   [junit4]   2> 2745820 INFO  (zkConnectionManagerCallback-6270-thread-1) [    ] o.a.s.c.c.ConnectionManager zkClient has connected
   [junit4]   2> 2745822 INFO  (SUITE-CollectionsAPIDistributedZkTest-seed#[212C3DF6229AD48D]-worker) [    ] o.a.s.c.c.ZkStateReader Updated live nodes from ZooKeeper... (0) -> (4)
   [junit4]   2> 2745823 INFO  (SUITE-CollectionsAPIDistributedZkTest-seed#[212C3DF6229AD48D]-worker) [    ] o.a.s.c.s.i.ZkClientClusterStateProvider Cluster at 127.0.0.1:56031/solr ready
   [junit4]   2> 2746079 INFO  (TEST-CollectionsAPIDistributedZkTest.deleteCollectionRemovesStaleZkCollectionsNode-seed#[212C3DF6229AD48D]) [    ] o.a.s.SolrTestCaseJ4 ###Starting deleteCollectionRemovesStaleZkCollectionsNode
   [junit4]   2> 2746081 INFO  (TEST-CollectionsAPIDistributedZkTest.deleteCollectionRemovesStaleZkCollectionsNode-seed#[212C3DF6229AD48D]) [    ] o.a.s.c.c.ZkStateReader Updated live nodes from ZooKeeper... (0) -> (4)
   [junit4]   2> 2746090 INFO  (qtp1503933720-29160) [n:127.0.0.1:44935_solr    ] o.a.s.h.a.CollectionsHandler Invoked Collection Action :delete with params name=out_of_sync_collection&action=DELETE&wt=javabin&version=2 and sendToOCPQueue=true
   [junit4]   2> 2746098 INFO  (qtp1503933720-29160) [n:127.0.0.1:44935_solr    ] o.a.s.s.HttpSolrCall [admin] webapp=null path=/admin/collections params={name=out_of_sync_collection&action=DELETE&wt=javabin&version=2} status=0 QTime=8
   [junit4]   2> 2746100 INFO  (qtp1503933720-29161) [n:127.0.0.1:44935_solr    ] o.a.s.h.a.CollectionsHandler Invoked Collection Action :list with params action=LIST&wt=javabin&version=2 and sendToOCPQueue=true
   [junit4]   2> 2746100 INFO  (qtp1503933720-29161) [n:127.0.0.1:44935_solr    ] o.a.s.s.HttpSolrCall [admin] webapp=null path=/admin/collections params={action=LIST&wt=javabin&version=2} status=0 QTime=0
   [junit4]   2> 2746101 INFO  (TEST-CollectionsAPIDistributedZkTest.deleteCollectionRemovesStaleZkCollectionsNode-seed#[212C3DF6229AD48D]) [    ] o.a.s.SolrTestCaseJ4 ###Ending deleteCollectionRemovesStaleZkCollectionsNode
   [junit4]   2> 2746304 INFO  (TEST-CollectionsAPIDistributedZkTest.testCollectionsAPI-seed#[212C3DF6229AD48D]) [    ] o.a.s.SolrTestCaseJ4 ###Starting testCollectionsAPI
   [junit4]   2> 2746306 INFO  (TEST-CollectionsAPIDistributedZkTest.testCollectionsAPI-seed#[212C3DF6229AD48D]) [    ] o.a.s.c.c.ZkStateReader Updated live nodes from ZooKeeper... (0) -> (4)
   [junit4]   2> 2746308 INFO  (qtp1503933720-29162) [n:127.0.0.1:44935_solr    ] o.a.s.h.a.CollectionsHandler Invoked Collection Action :create with params async=6d98a29b-c71e-4441-ac60-1a2c724bac84&replicationFactor=1&collection.configName=conf2&maxShardsPerNode=1&name=awhollynewcollection_0&nrtReplicas=1&action=CREATE&numShards=2&wt=javabin&version=2 and sendToOCPQueue=true
   [junit4]   2> 2746313 INFO  (qtp1503933720-29162) [n:127.0.0.1:44935_solr    ] o.a.s.s.HttpSolrCall [admin] webapp=null path=/admin/collections params={async=6d98a29b-c71e-4441-ac60-1a2c724bac84&replicationFactor=1&collection.configName=conf2&maxShardsPerNode=1&name=awhollynewcollection_0&nrtReplicas=1&action=CREATE&numShards=2&wt=javabin&version=2} status=0 QTime=5
   [junit4]   2> 2746315 INFO  (OverseerThreadFactory-8706-thread-2-processing-n:127.0.0.1:39265_solr) [n:127.0.0.1:39265_solr    ] o.a.s.c.CreateCollectionCmd Create collection awhollynewcollection_0
   [junit4]   2> 2746316 INFO  (OverseerCollectionConfigSetProcessor-99205077793832972-127.0.0.1:39265_solr-n_0000000000) [n:127.0.0.1:39265_solr    ] o.a.s.c.OverseerTaskQueue Response ZK path: /overseer/collection-queue-work/qnr-0000000000 doesn't exist.  Requestor may have disconnected from ZooKeeper
   [junit4]   2> 2746324 INFO  (zkCallback-6269-thread-2) [    ] o.a.s.c.c.ZkStateReader A cluster state change: [WatchedEvent state:SyncConnected type:NodeCreated path:/collections/awhollynewcollection_0/state.json] for collection [awhollynewcollection_0] has occurred - updating... (live nodes size: [4])
   [junit4]   2> 2746428 INFO  (OverseerStateUpdate-99205077793832972-127.0.0.1:39265_solr-n_0000000000) [n:127.0.0.1:39265_solr    ] o.a.s.c.o.SliceMutator createReplica() {
   [junit4]   2>   "operation":"ADDREPLICA",
   [junit4]   2>   "collection":"awhollynewcollection_0",
   [junit4]   2>   "shard":"shard1",
   [junit4]   2>   "core":"awhollynewcollection_0_shard1_replica_n1",
   [junit4]   2>   "state":"down",
   [junit4]   2>   "base_url":"http://127.0.0.1:39265/solr",
   [junit4]   2>   "type":"NRT",
   [junit4]   2>   "waitForFinalState":"false"} 
   [junit4]   2> 2746432 INFO  (OverseerStateUpdate-99205077793832972-127.0.0.1:39265_solr-n_0000000000) [n:127.0.0.1:39265_solr    ] o.a.s.c.o.SliceMutator createReplica() {
   [junit4]   2>   "operation":"ADDREPLICA",
   [junit4]   2>   "collection":"awhollynewcollection_0",
   [junit4]   2>   "shard":"shard2",
   [junit4]   2>   "core":"awhollynewcollection_0_shard2_replica_n2",
   [junit4]   2>   "state":"down",
   [junit4]   2>   "base_url":"http://127.0.0.1:61096/solr",
   [junit4]   2>   "type":"NRT",
   [junit4]   2>   "waitForFinalState":"false"} 
   [junit4]   2> 2746538 INFO  (zkCallback-6269-thread-2) [    ] o.a.s.c.c.ZkStateReader A cluster state change: [WatchedEvent state:SyncConnected type:NodeDataChanged path:/collections/awhollynewcollection_0/state.json] for collection [awhollynewcollection_0] has occurred - updating... (live nodes size: [4])
   [junit4]   2> 2746646 INFO  (qtp281033939-29168) [n:127.0.0.1:39265_solr    ] o.a.s.s.HttpSolrCall [admin] webapp=null path=/admin/cores params={qt=/admin/cores&collection.configName=conf2&newCollection=true&collection=awhollynewcollection_0&version=2&replicaType=NRT&async=6d98a29b-c71e-4441-ac60-1a2c724bac841492421082470677&coreNodeName=core_node3&name=awhollynewcollection_0_shard1_replica_n1&action=CREATE&numShards=2&shard=shard1&wt=javabin} status=0 QTime=0
   [junit4]   2> 2746646 INFO  (qtp1344811086-29185) [n:127.0.0.1:61096_solr    ] o.a.s.s.HttpSolrCall [admin] webapp=null path=/admin/cores params={qt=/admin/cores&collection.configName=conf2&newCollection=true&collection=awhollynewcollection_0&version=2&replicaType=NRT&async=6d98a29b-c71e-4441-ac60-1a2c724bac841492421085843643&coreNodeName=core_node4&name=awhollynewcollection_0_shard2_replica_n2&action=CREATE&numShards=2&shard=shard2&wt=javabin} status=0 QTime=0
   [junit4]   2> 2746646 INFO  (parallelCoreAdminExecutor-8707-thread-1-processing-n:127.0.0.1:39265_solr 6d98a29b-c71e-4441-ac60-1a2c724bac841492421082470677 CREATE) [n:127.0.0.1:39265_solr    ] o.a.s.h.a.CoreAdminOperation core create command qt=/admin/cores&collection.configName=conf2&newCollection=true&collection=awhollynewcollection_0&version=2&replicaType=NRT&async=6d98a29b-c71e-4441-ac60-1a2c724bac841492421082470677&coreNodeName=core_node3&name=awhollynewcollection_0_shard1_replica_n1&action=CREATE&numShards=2&shard=shard1&wt=javabin
   [junit4]   2> 2746646 INFO  (parallelCoreAdminExecutor-8711-thread-1-processing-n:127.0.0.1:61096_solr 6d98a29b-c71e-4441-ac60-1a2c724bac841492421085843643 CREATE) [n:127.0.0.1:61096_solr    ] o.a.s.h.a.CoreAdminOperation core create command qt=/admin/cores&collection.configName=conf2&newCollection=true&collection=awhollynewcollection_0&version=2&replicaType=NRT&async=6d98a29b-c71e-4441-ac60-1a2c724bac841492421085843643&coreNodeName=core_node4&name=awhollynewcollection_0_shard2_replica_n2&action=CREATE&numShards=2&shard=shard2&wt=javabin
   [junit4]   2> 2746646 INFO  (parallelCoreAdminExecutor-8707-thread-1-processing-n:127.0.0.1:39265_solr 6d98a29b-c71e-4441-ac60-1a2c724bac841492421082470677 CREATE) [n:127.0.0.1:39265_solr    ] o.a.s.c.TransientSolrCoreCacheDefault Allocating transient cache for 2147483647 transient cores
   [junit4]   2> 2746646 INFO  (parallelCoreAdminExecutor-8711-thread-1-processing-n:127.0.0.1:61096_solr 6d98a29b-c71e-4441-ac60-1a2c724bac841492421085843643 CREATE) [n:127.0.0.1:61096_solr    ] o.a.s.c.TransientSolrCoreCacheDefault Allocating transient cache for 2147483647 transient cores
   [junit4]   2> 2746647 INFO  (qtp281033939-29169) [n:127.0.0.1:39265_solr    ] o.a.s.h.a.CoreAdminOperation Checking request status for : 6d98a29b-c71e-4441-ac60-1a2c724bac841492421082470677
   [junit4]   2> 2746647 INFO  (qtp281033939-29169) [n:127.0.0.1:39265_solr    ] o.a.s.s.HttpSolrCall [admin] webapp=null path=/admin/cores params={qt=/admin/cores&requestid=6d98a29b-c71e-4441-ac60-1a2c724bac841492421082470677&action=REQUESTSTATUS&wt=javabin&version=2} status=0 QTime=0
   [junit4]   2> 2746752 INFO  (zkCallback-6255-thread-2-processing-n:127.0.0.1:39265_solr) [n:127.0.0.1:39265_solr    ] o.a.s.c.c.ZkStateReader A cluster state change: [WatchedEvent state:SyncConnected type:NodeDataChanged path:/collections/awhollynewcollection_0/state.json] for collection [awhollynewcollection_0] has occurred - updating... (live nodes size: [4])
   [junit4]   2> 2746752 INFO  (zkCallback-6255-thread-1-processing-n:127.0.0.1:39265_solr) [n:127.0.0.1:39265_solr    ] o.a.s.c.c.ZkStateReader A cluster state change: [WatchedEvent state:SyncConnected type:NodeDataChanged path:/collections/awhollynewcollection_0/state.json] for collection [awhollynewcollection_0] has occurred - updating... (live nodes size: [4])
   [junit4]   2> 2746752 INFO  (zkCallback-6243-thread-1-processing-n:127.0.0.1:61096_solr) [n:127.0.0.1:61096_solr    ] o.a.s.c.c.ZkStateReader A cluster state change: [WatchedEvent state:SyncConnected type:NodeDataChanged path:/collections/awhollynewcollection_0/state.json] for collection [awhollynewcollection_0] has occurred - updating... (live nodes size: [4])
   [junit4]   2> 2746753 INFO  (zkCallback-6269-thread-2) [    ] o.a.s.c.c.ZkStateReader A cluster state change: [WatchedEvent state:SyncConnected type:NodeDataChanged path:/collections/awhollynewcollection_0/state.json] for collection [awhollynewcollection_0] has occurred - updating... (live nodes size: [4])
   [junit4]   2> 2746753 INFO  (zkCallback-6243-thread-2-processing-n:127.0.0.1:61096_solr) [n:127.0.0.1:61096_solr    ] o.a.s.c.c.ZkStateReader A cluster state change: [WatchedEvent state:SyncConnected type:NodeDataChanged path:/collections/awhollynewcollection_0/state.json] for collection [awhollynewcollection_0] has occurred - updating... (live nodes size: [4])
   [junit4]   2> 2747649 INFO  (qtp281033939-29170) [n:127.0.0.1:39265_solr    ] o.a.s.h.a.CoreAdminOperation Checking request status for : 6d98a29b-c71e-4441-ac60-1a2c724bac841492421082470677
   [junit4]   2> 2747649 INFO  (qtp281033939-29170) [n:127.0.0.1:39265_solr    ] o.a.s.s.HttpSolrCall [admin] webapp=null path=/admin/cores params={qt=/admin/cores&requestid=6d98a29b-c71e-4441-ac60-1a2c724bac841492421082470677&action=REQUESTSTATUS&wt=javabin&version=2} status=0 QTime=0
   [junit4]   2> 2747661 INFO  (parallelCoreAdminExecutor-8711-thread-1-processing-n:127.0.0.1:61096_solr 6d98a29b-c71e-4441-ac60-1a2c724bac841492421085843643 CREATE) [n:127.0.0.1:61096_solr c:awhollynewcollection_0 s:shard2 r:core_node4 x:awhollynewcollection_0_shard2_replica_n2] o.a.s.c.SolrConfig Using Lucene MatchVersion: 7.3.0
   [junit4]   2> 2747661 INFO  (parallelCoreAdminExecutor-8707-thread-1-processing-n:127.0.0.1:39265_solr 6d98a29b-c71e-4441-ac60-1a2c724bac841492421082470677 CREATE) [n:127.0.0.1:39265_solr c:awhollynewcollection_0 s:shard1 r:core_node3 x:awhollynewcollection_0_shard1_replica_n1] o.a.s.c.SolrConfig Using Lucene MatchVersion: 7.3.0
   [junit4]   2> 2747668 INFO  (parallelCoreAdminExecutor-8711-thread-1-processing-n:127.0.0.1:61096_solr 6d98a29b-c71e-4441-ac60-1a2c724bac841492421085843643 CREATE) [n:127.0.0.1:61096_solr c:awhollynewcollection_0 s:shard2 r:core_node4 x:awhollynewcollection_0_shard2_replica_n2] o.a.s.s.IndexSchema [awhollynewcollection_0_shard2_replica_n2] Schema name=minimal
   [junit4]   2> 2747669 INFO  (parallelCoreAdminExecutor-8707-thread-1-processing-n:127.0.0.1:39265_solr 6d98a29b-c71e-4441-ac60-1a2c724bac841492421082470677 CREATE) [n:127.0.0.1:39265_solr c:awhollynewcollection_0 s:shard1 r:core_node3 x:awhollynewcollection_0_shard1_replica_n1] o.a.s.s.IndexSchema [awhollynewcollection_0_shard1_replica_n1] Schema name=minimal
   [junit4]   2> 2747671 INFO  (parallelCoreAdminExecutor-8711-thread-1-processing-n:127.0.0.1:61096_solr 6d98a29b-c71e-4441-ac60-1a2c724bac841492421085843643 CREATE) [n:127.0.0.1:61096_solr c:awhollynewcollection_0 s:shard2 r:core_node4 x:awhollynewcollection_0_shard2_replica_n2] o.a.s.s.IndexSchema Loaded schema minimal/1.1 with uniqueid field id
   [junit4]   2> 2747671 INFO  (parallelCoreAdminExecutor-8711-thread-1-processing-n:127.0.0.1:61096_solr 6d98a29b-c71e-4441-ac60-1a2c724bac841492421085843643 CREATE) [n:127.0.0.1:61096_solr c:awhollynewcollection_0 s:shard2 r:core_node4 x:awhollynewcollection_0_shard2_replica_n2] o.a.s.c.CoreContainer Creating SolrCore 'awhollynewcollection_0_shard2_replica_n2' using configuration from collection awhollynewcollection_0, trusted=true
   [junit4]   2> 2747671 INFO  (parallelCoreAdminExecutor-8707-thread-1-processing-n:127.0.0.1:39265_solr 6d98a29b-c71e-4441-ac60-1a2c724bac841492421082470677 CREATE) [n:127.0.0.1:39265_solr c:awhollynewcollection_0 s:shard1 r:core_node3 x:awhollynewcollection_0_shard1_replica_n1] o.a.s.s.IndexSchema Loaded schema minimal/1.1 with uniqueid field id
   [junit4]   2> 2747671 INFO  (parallelCoreAdminExecutor-8707-thread-1-processing-n:127.0.0.1:39265_solr 6d98a29b-c71e-4441-ac60-1a2c724bac841492421082470677 CREATE) [n:127.0.0.1:39265_solr c:awhollynewcollection_0 s:shard1 r:core_node3 x:awhollynewcollection_0_shard1_replica_n1] o.a.s.c.CoreContainer Creating SolrCore 'awhollynewcollection_0_shard1_replica_n1' using configuration from collection awhollynewcollection_0, trusted=true
   [junit4]   2> 2747671 INFO  (parallelCoreAdminExecutor-8711-thread-1-processing-n:127.0.0.1:61096_solr 6d98a29b-c71e-4441-ac60-1a2c724bac841492421085843643 CREATE) [n:127.0.0.1:61096_solr c:awhollynewcollection_0 s:shard2 r:core_node4 x:awhollynewcollection_0_shard2_replica_n2] o.a.s.m.r.SolrJmxReporter JMX monitoring for 'solr.core.awhollynewcollection_0.shard2.replica_n2' (registry 'solr.core.awhollynewcollection_0.shard2.replica_n2') enabled at server: com.sun.jmx.mbeanserver.JmxMBeanServer@1f1303ef
   [junit4]   2> 2747671 INFO  (parallelCoreAdminExecutor-8707-thread-1-processing-n:127.0.0.1:39265_solr 6d98a29b-c71e-4441-ac60-1a2c724bac841492421082470677 CREATE) [n:127.0.0.1:39265_solr c:awhollynewcollection_0 s:shard1 r:core_node3 x:awhollynewcollection_0_shard1_replica_n1] o.a.s.m.r.SolrJmxReporter JMX monitoring for 'solr.core.awhollynewcollection_0.shard1.replica_n1' (registry 'solr.core.awhollynewcollection_0.shard1.replica_n1') enabled at server: com.sun.jmx.mbeanserver.JmxMBeanServer@1f1303ef
   [junit4]   2> 2747671 INFO  (parallelCoreAdminExecutor-8711-thread-1-processing-n:127.0.0.1:61096_solr 6d98a29b-c71e-4441-ac60-1a2c724bac841492421085843643 CREATE) [n:127.0.0.1:61096_solr c:awhollynewcollection_0 s:shard2 r:core_node4 x:awhollynewcollection_0_shard2_replica_n2] o.a.s.c.SolrCore solr.RecoveryStrategy.Builder
   [junit4]   2> 2747671 INFO  (parallelCoreAdminExecutor-8707-thread-1-processing-n:127.0.0.1:39265_solr 6d98a29b-c71e-4441-ac60-1a2c724bac841492421082470677 CREATE) [n:127.0.0.1:39265_solr c:awhollynewcollection_0 s:shard1 r:core_node3 x:awhollynewcollection_0_shard1_replica_n1] o.a.s.c.SolrCore solr.RecoveryStrategy.Builder
   [junit4]   2> 2747671 INFO  (parallelCoreAdminExecutor-8711-thread-1-processing-n:127.0.0.1:61096_solr 6d98a29b-c71e-4441-ac60-1a2c724bac841492421085843643 CREATE) [n:127.0.0.1:61096_solr c:awhollynewcollection_0 s:shard2 r:core_node4 x:awhollynewcollection_0_shard2_replica_n2] o.a.s.c.SolrCore [[awhollynewcollection_0_shard2_replica_n2] ] Opening new SolrCore at [/export/home/jenkins/workspace/Lucene-Solr-7.x-Solaris/solr/build/solr-core/test/J1/temp/solr.cloud.CollectionsAPIDistributedZkTest_212C3DF6229AD48D-001/tempDir-001/node3/awhollynewcollection_0_shard2_replica_n2], dataDir=[/export/home/jenkins/workspace/Lucene-Solr-7.x-Solaris/solr/build/solr-core/test/J1/temp/solr.cloud.CollectionsAPIDistributedZkTest_212C3DF6229AD48D-001/tempDir-001/node3/awhollynewcollection_0_shard2_replica_n2/data/]
   [junit4]   2> 2747671 INFO  (parallelCoreAdminExecutor-8707-thread-1-processing-n:127.0.0.1:39265_solr 6d98a29b-c71e-4441-ac60-1a2c724bac841492421082470677 CREATE) [n:127.0.0.1:39265_solr c:awhollynewcollection_0 s:shard1 r:core_node3 x:awhollynewcollection_0_shard1_replica_n1] o.a.s.c.SolrCore [[awhollynewcollection_0_shard1_replica_n1] ] Opening new SolrCore at [/export/home/jenkins/workspace/Lucene-Solr-7.x-Solaris/solr/build/solr-core/test/J1/temp/solr.cloud.CollectionsAPIDistributedZkTest_212C3DF6229AD48D-001/tempDir-001/node4/awhollynewcollection_0_shard1_replica_n1], dataDir=[/export/home/jenkins/workspace/Lucene-Solr-7.x-Solaris/solr/build/solr-core/test/J1/temp/solr.cloud.CollectionsAPIDistributedZkTest_212C3DF6229AD48D-001/tempDir-001/node4/awhollynewcollection_0_shard1_replica_n1/data/]
   [junit4]   2> 2747732 INFO  (parallelCoreAdminExecutor-8707-thread-1-processing-n:127.0.0.1:39265_solr 6d98a29b-c71e-4441-ac60-1a2c724bac841492421082470677 CREATE) [n:127.0.0.1:39265_solr c:awhollynewcollection_0 s:shard1 r:core_node3 x:awhollynewcollection_0_shard1_replica_n1] o.a.s.u.UpdateHandler Using UpdateLog implementation: org.apache.solr.update.UpdateLog
   [junit4]   2> 2747733 INFO  (parallelCoreAdminExecutor-8707-thread-1-processing-n:127.0.0.1:39265_solr 6d98a29b-c71e-4441-ac60-1a2c724bac841492421082470677 CREATE) [n:127.0.0.1:39265_solr c:awhollynewcollection_0 s:shard1 r:core_node3 x:awhollynewcollection_0_shard1_replica_n1] o.a.s.u.UpdateLog Initializing UpdateLog: dataDir=null defaultSyncLevel=FLUSH numRecordsToKeep=100 maxNumLogsToKeep=10 numVersionBuckets=65536
   [junit4]   2> 2747733 INFO  (parallelCoreAdminExecutor-8711-thread-1-processing-n:127.0.0.1:61096_solr 6d98a29b-c71e-4441-ac60-1a2c724bac841492421085843643 CREATE) [n:127.0.0.1:61096_solr c:awhollynewcollection_0 s:shard2 r:core_node4 x:awhollynewcollection_0_shard2_replica_n2] o.a.s.u.UpdateHandler Using UpdateLog implementation: org.apache.solr.update.UpdateLog
   [junit4]   2> 2747733 INFO  (parallelCoreAdminExecutor-8711-thread-1-processing-n:127.0.0.1:61096_solr 6d98a29b-c71e-4441-ac60-1a2c724bac841492421085843643 CREATE) [n:127.0.0.1:61096_solr c:awhollynewcollection_0 s:shard2 r:core_node4 x:awhollynewcollection_0_shard2_replica_n2] o.a.s.u.UpdateLog Initializing UpdateLog: dataDir=null defaultSyncLevel=FLUSH numRecordsToKeep=100 maxNumLogsToKeep=10 numVersionBuckets=65536
   [junit4]   2> 2747734 INFO  (parallelCoreAdminExecutor-8707-thread-1-processing-n:127.0.0.1:39265_solr 6d98a29b-c71e-4441-ac60-1a2c724bac841492421082470677 CREATE) [n:127.0.0.1:39265_solr c:awhollynewcollection_0 s:shard1 r:core_node3 x:awhollynewcollection_0_shard1_replica_n1] o.a.s.u.CommitTracker Hard AutoCommit: disabled
   [junit4]   2> 2747734 INFO  (parallelCoreAdminExecutor-8707-thread-1-processing-n:127.0.0.1:39265_solr 6d98a29b-c71e-4441-ac60-1a2c724bac841492421082470677 CREATE) [n:127.0.0.1:39265_solr c:awhollynewcollection_0 s:shard1 r:core_node3 x:awhollynewcollection_0_shard1_replica_n1] o.a.s.u.CommitTracker Soft AutoCommit: disabled
   [junit4]   2> 2747734 INFO  (parallelCoreAdminExecutor-8711-thread-1-processing-n:127.0.0.1:61096_solr 6d98a29b-c71e-4441-ac60-1a2c724bac841492421085843643 CREATE) [n:127.0.0.1:61096_solr c:awhollynewcollection_0 s:shard2 r:core_node4 x:awhollynewcollection_0_shard2_replica_n2] o.a.s.u.CommitTracker Hard AutoCommit: disabled
   [junit4]   2> 2747734 INFO  (parallelCoreAdminExecutor-8711-thread-1-processing-n:127.0.0.1:61096_solr 6d98a29b-c71e-4441-ac60-1a2c724bac841492421085843643 CREATE) [n:127.0.0.1:61096_solr c:awhollynewcollection_0 s:shard2 r:core_node4 x:awhollynewcollection_0_shard2_replica_n2] o.a.s.u.CommitTracker Soft AutoCommit: disabled
   [junit4]   2> 2747735 INFO  (parallelCoreAdminExecutor-8707-thread-1-processing-n:127.0.0.1:39265_solr 6d98a29b-c71e-4441-ac60-1a2c724bac841492421082470677 CREATE) [n:127.0.0.1:39265_solr c:awhollynewcollection_0 s:shard1 r:core_node3 x:awhollynewcollection_0_shard1_replica_n1] o.a.s.s.SolrIndexSearcher Opening [Searcher@33a1d003[awhollynewcollection_0_shard1_replica_n1] main]
   [junit4]   2> 2747735 INFO  (parallelCoreAdminExecutor-8711-thread-1-processing-n:127.0.0.1:61096_solr 6d98a29b-c71e-4441-ac60-1a2c724bac841492421085843643 CREATE) [n:127.0.0.1:61096_solr c:awhollynewcollection_0 s:shard2 r:core_node4 x:awhollynewcollection_0_shard2_replica_n2] o.a.s.s.SolrIndexSearcher Opening [Searcher@db26b34[awhollynewcollection_0_shard2_replica_n2] main]
   [junit4]   2> 2747737 INFO  (parallelCoreAdminExecutor-8711-thread-1-processing-n:127.0.0.1:61096_solr 6d98a29b-c71e-4441-ac60-1a2c724bac841492421085843643 CREATE) [n:127.0.0.1:61096_solr c:awhollynewcollection_0 s:shard2 r:core_node4 x:awhollynewcollection_0_shard2_replica_n2] o.a.s.r.ManagedResourceStorage Configured ZooKeeperStorageIO with znodeBase: /configs/conf2
   [junit4]   2> 2747737 INFO  (parallelCoreAdminExecutor-8707-thread-1-processing-n:127.0.0.1:39265_solr 6d98a29b-c71e-4441-ac60-1a2c724bac841492421082470677 CREATE) [n:127.0.0.1:39265_solr c:awhollynewcollection_0 s:shard1 r:core_node3 x:awhollynewcollection_0_shard1_replica_n1] o.a.s.r.ManagedResourceStorage Configured ZooKeeperStorageIO with znodeBase: /configs/conf2
   [junit4]   2> 2747737 INFO  (parallelCoreAdminExecutor-8711-thread-1-processing-n:127.0.0.1:61096_solr 6d98a29b-c71e-4441-ac60-1a2c724bac841492421085843643 CREATE) [n:127.0.0.1:61096_solr c:awhollynewcollection_0 s:shard2 r:core_node4 x:awhollynewcollection_0_shard2_replica_n2] o.a.s.r.ManagedResourceStorage Loaded null at path _rest_managed.json using ZooKeeperStorageIO:path=/configs/conf2
   [junit4]   2> 2747737 INFO  (parallelCoreAdminExecutor-8707-thread-1-processing-n:127.0.0.1:39265_solr 6d98a29b-c71e-4441-ac60-1a2c724bac841492421082470677 CREATE) [n:127.0.0.1:39265_solr c:awhollynewcollection_0 s:shard1 r:core_node3 x:awhollynewcollection_0_shard1_replica_n1] o.a.s.r.ManagedResourceStorage Loaded null at path _rest_managed.json using ZooKeeperStorageIO:path=/configs/conf2
   [junit4]   2> 2747738 INFO  (parallelCoreAdminExecutor-8711-thread-1-processing-n:127.0.0.1:61096_solr 6d98a29b-c71e-4441-ac60-1a2c724bac841492421085843643 CREATE) [n:127.0.0.1:61096_solr c:awhollynewcollection_0 s:shard2 r:core_node4 x:awhollynewcollection_0_shard2_replica_n2] o.a.s.h.ReplicationHandler Commits will be reserved for 10000ms.
   [junit4]   2> 2747738 INFO  (parallelCoreAdminExecutor-8707-thread-1-processing-n:127.0.0.1:39265_solr 6d98a29b-c71e-4441-ac60-1a2c724bac841492421082470677 CREATE) [n:127.0.0.1:39265_solr c:awhollynewcollection_0 s:shard1 r:core_node3 x:awhollynewcollection_0_shard1_replica_n1] o.a.s.h.ReplicationHandler Commits will be reserved for 10000ms.
   [junit4]   2> 2747738 INFO  (parallelCoreAdminExecutor-8711-thread-1-processing-n:127.0.0.1:61096_solr 6d98a29b-c71e-4441-ac60-1a2c724bac841492421085843643 CREATE) [n:127.0.0.1:61096_solr c:awhollynewcollection_0 s:shard2 r:core_node4 x:awhollynewcollection_0_shard2_replica_n2] o.a.s.u.UpdateLog Could not find max version in index or recent updates, using new clock 1587281247463276544
   [junit4]   2> 2747739 INFO  (searcherExecutor-8715-thread-1-processing-x:awhollynewcollection_0_shard2_replica_n2 r:core_node4 6d98a29b-c71e-4441-ac60-1a2c724bac841492421085843643 CREATE n:127.0.0.1:61096_solr s:shard2 c:awhollynewcollection_0) [n:127.0.0.1:61096_solr c:awhollynewcollection_0 s:shard2 r:core_node4 x:awhollynewcollection_0_shard2_replica_n2] o.a.s.c.SolrCore [awhollynewcollection_0_shard2_replica_n2] Registered new searcher Searcher@db26b34[awhollynewcollection_0_shard2_replica_n2] main{ExitableDirectoryReader(UninvertingDirectoryReader())}
   [junit4]   2> 2747739 INFO  (searcherExecutor-8716-thread-1-processing-x:awhollynewcollection_0_shard1_replica_n1 r:core_node3 6d98a29b-c71e-4441-ac60-1a2c724bac841492421082470677 CREATE n:127.0.0.1:39265_solr s:shard1 c:awhollynewcollection_0) [n:127.0.0.1:39265_solr c:awhollynewcollection_0 s:shard1 r:core_node3 x:awhollynewcollection_0_shard1_replica_n1] o.a.s.c.SolrCore [awhollynewcollection_0_shard1_replica_n1] Registered new searcher Searcher@33a1d003[awhollynewcollection_0_shard1_replica_n1] main{ExitableDirectoryReader(UninvertingDirectoryReader())}
   [junit4]   2> 2747738 INFO  (parallelCoreAdminExecutor-8707-thread-1-processing-n:127.0.0.1:39265_solr 6d98a29b-c71e-4441-ac60-1a2c724bac841492421082470677 CREATE) [n:127.0.0.1:39265_solr c:awhollynewcollection_0 s:shard1 r:core_node3 x:awhollynewcollection_0_shard1_replica_n1] o.a.s.u.UpdateLog Could not find max version in index or recent updates, using new clock 1587281247463276544
   [junit4]   2> 2747747 INFO  (parallelCoreAdminExecutor-8711-thread-1-processing-n:127.0.0.1:61096_solr 6d98a29b-c71e-4441-ac60-1a2c724bac841492421085843643 CREATE) [n:127.0.0.1:61096_solr c:awhollynewcollection_0 s:shard2 r:core_node4 x:awhollynewcollection_0_shard2_replica_n2] o.a.s.c.ShardLeaderElectionContext Enough replicas found to continue.
   [junit4]   2> 2747747 INFO  (parallelCoreAdminExecutor-8711-thread-1-processing-n:127.0.0.1:61096_solr 6d98a29b-c71e-4441-ac60-1a2c724bac841492421085843643 CREATE) [n:127.0.0.1:61096_solr c:awhollynewcollection_0 s:shard2 r:core_node4 x:awhollynewcollection_0_shard2_replica_n2] o.a.s.c.ShardLeaderElectionContext I may be the new leader - try and sync
   [junit4]   2> 2747747 INFO  (parallelCoreAdminExecutor-8711-thread-1-processing-n:127.0.0.1:61096_solr 6d98a29b-c71e-4441-ac60-1a2c724bac841492421085843643 CREATE) [n:127.0.0.1:61096_solr c:awhollynewcollection_0 s:shard2 r:core_node4 x:awhollynewcollection_0_shard2_replica_n2] o.a.s.c.SyncStrategy Sync replicas to http://127.0.0.1:61096/solr/awhollynewcollection_0_shard2_replica_n2/
   [junit4]   2> 2747747 INFO  (parallelCoreAdminExecutor-8711-thread-1-processing-n:127.0.0.1:61096_solr 6d98a29b-c71e-4441-ac60-1a2c724bac841492421085843643 CREATE) [n:127.0.0.1:61096_solr c:awhollynewcollection_0 s:shard2 r:core_node4 x:awhollynewcollection_0_shard2_replica_n2] o.a.s.c.SyncStrategy Sync Success - now sync replicas to me
   [junit4]   2> 2747747 INFO  (parallelCoreAdminExecutor-8711-thread-1-processing-n:127.0.0.1:61096_solr 6d98a29b-c71e-4441-ac60-1a2c724bac841492421085843643 CREATE) [n:127.0.0.1:61096_solr c:awhollynewcollection_0 s:shard2 r:core_node4 x:awhollynewcollection_0_shard2_replica_n2] o.a.s.c.SyncStrategy http://127.0.0.1:61096/solr/awhollynewcollection_0_shard2_replica_n2/ has no replicas
   [junit4]   2> 2747747 INFO  (parallelCoreAdminExecutor-8711-thread-1-processing-n:127.0.0.1:61096_solr 6d98a29b-c71e-4441-ac60-1a2c724bac841492421085843643 CREATE) [n:127.0.0.1:61096_solr c:awhollynewcollection_0 s:shard2 r:core_node4 x:awhollynewcollection_0_shard2_replica_n2] o.a.s.c.ShardLeaderElectionContext Found all replicas participating in election, clear LIR
   [junit4]   2> 2747748 INFO  (parallelCoreAdminExecutor-8707-thread-1-processing-n:127.0.0.1:39265_solr 6d98a29b-c71e-4441-ac60-1a2c724bac841492421082470677 CREATE) [n:127.0.0.1:39265_solr c:awhollynewcollection_0 s:shard1 r:core_node3 x:awhollynewcollection_0_shard1_replica_n1] o.a.s.c.ShardLeaderElectionContext Enough replicas found to continue.
   [junit4]   2> 2747748 INFO  (parallelCoreAdminExecutor-8707-thread-1-processing-n:127.0.0.1:39265_solr 6d98a29b-c71e-4441-ac60-1a2c724bac841492421082470677 CREATE) [n:127.0.0.1:39265_solr c:awhollynewcollection_0 s:shard1 r:core_node3 x:awhollynewcollection_0_shard1_replica_n1] o.a.s.c.ShardLeaderElectionContext I may be the new leader - try and sync
   [junit4]   2> 2747748 INFO  (parallelCoreAdminExecutor-8707-thread-1-processing-n:127.0.0.1:39265_solr 6d98a29b-c71e-4441-ac60-1a2c724bac841492421082470677 CREATE) [n:127.0.0.1:39265_solr c:awhollynewcollection_0 s:shard1 r:core_node3 x:awhollynewcollection_0_shard1_replica_n1] o.a.s.c.SyncStrategy Sync replicas to http://127.0.0.1:39265/solr/awhollynewcollection_0_shard1_replica_n1/
   [junit4]   2> 2747748 INFO  (parallelCoreAdminExecutor-8707-thread-1-processing-n:127.0.0.1:39265_solr 6d98a29b-c71e-4441-ac60-1a2c724bac841492421082470677 CREATE) [n:127.0.0.1:39265_solr c:awhollynewcollection_0 s:shard1 r:core_node3 x:awhollynewcollection_0_shard1_replica_n1] o.a.s.c.SyncStrategy Sync Success - now sync replicas to me
   [junit4]   2> 2747748 INFO  (parallelCoreAdminExecutor-8707-thread-1-processing-n:127.0.0.1:39265_solr 6d98a29b-c71e-4441-ac60-1a2c724bac841492421082470677 CREATE) [n:127.0.0.1:39265_solr c:awhollynewcollection_0 s:shard1 r:core_node3 x:awhollynewcollection_0_shard1_replica_n1] o.a.s.c.SyncStrategy http://127.0.0.1:39265/solr/awhollynewcollection_0_shard1_replica_n1/ has no replicas
   [junit4]   2> 2747748 INFO  (parallelCoreAdminExecutor-8707-thread-1-processing-n:127.0.0.1:39265_solr 6d98a29b-c71e-4441-ac60-1a2c724bac841492421082470677 CREATE) [n:127.0.0.1:39265_solr c:awhollynewcollection_0 s:shard1 r:core_node3 x:awhollynewcollection_0_shard1_replica_n1] o.a.s.c.ShardLeaderElectionContext Found all replicas participating in election, clear LIR
   [junit4]   2> 2747754 INFO  (parallelCoreAdminExecutor-8711-thread-1-processing-n:127.0.0.1:61096_solr 6d98a29b-c71e-4441-ac60-1a2c724bac841492421085843643 CREATE) [n:127.0.0.1:61096_solr c:awhollynewcollection_0 s:shard2 r:core_node4 x:awhollynewcollection_0_shard2_replica_n2] o.a.s.c.ShardLeaderElectionContext I am the new leader: http://127.0.0.1:61096/solr/awhollynewcollection_0_shard2_replica_n2/ shard2
   [junit4]   2> 2747754 INFO  (parallelCoreAdminExecutor-8707-thread-1-processing-n:127.0.0.1:39265_solr 6d98a29b-c71e-4441-ac60-1a2c724bac841492421082470677 CREATE) [n:127.0.0.1:39265_solr c:awhollynewcollection_0 s:shard1 r:core_node3 x:awhollynewcollection_0_shard1_replica_n1] o.a.s.c.ShardLeaderElectionContext I am the new leader: http://127.0.0.1:39265/solr/awhollynewcollection_0_shard1_replica_n1/ shard1
   [junit4]   2> 2747860 INFO  (zkCallback-6269-thread-2) [    ] o.a.s.c.c.ZkStateReader A cluster state change: [WatchedEvent state:SyncConnected type:NodeDataChanged path:/collections/awhollynewcollection_0/state.json] for collection [awhollynewcollection_0] has occurred - updating... (live nodes size: [4])
   [junit4]   2> 2747860 INFO  (zkCallback-6255-thread-3-processing-n:127.0.0.1:39265_solr) [n:127.0.0.1:39265_solr    ] o.a.s.c.c.ZkStateReader A cluster state change: [WatchedEvent state:SyncConnected type:NodeDataChanged path:/collections/awhollynewcollection_0/state.json] for collection [awhollynewcollection_0] has occurred - updating... (live nodes size: [4])
   [junit4]   2> 2747860 INFO  (zkCallback-6243-thread-1-processing-n:127.0.0.1:61096_solr) [n:127.0.0.1:61096_solr    ] o.a.s.c.c.ZkStateReader A cluster state change: [WatchedEvent state:SyncConnected type:NodeDataChanged path:/collections/awhollynewcollection_0/state.json] for collection [awhollynewcollection_0] has occurred - updating... (live nodes size: [4])
   [junit4]   2> 2747860 INFO  (zkCallback-6243-thread-2-processing-n:127.0.0.1:61096_solr) [n:127.0.0.1:61096_solr    ] o.a.s.c.c.ZkStateReader A cluster state change: [WatchedEvent state:SyncConnected type:NodeDataChanged path:/collections/awhollynewcollection_0/state.json] for collection [awhollynewcollection_0] has occurred - updating... (live nodes size: [4])
   [junit4]   2> 2747860 INFO  (zkCallback-6255-thread-1-processing-n:127.0.0.1:39265_solr) [n:127.0.0.1:39265_solr    ] o.a.s.c.c.ZkStateReader A cluster state change: [WatchedEvent state:SyncConnected type:NodeDataChanged path:/collections/awhollynewcollection_0/state.json] for collection [awhollynewcollection_0] has occurred - updating... (live nodes size: [4])
   [junit4]   2> 2747910 INFO  (parallelCoreAdminExecutor-8711-thread-1-processing-n:127.0.0.1:61096_solr 6d98a29b-c71e-4441-ac60-1a2c724bac841492421085843643 CREATE) [n:127.0.0.1:61096_solr c:awhollynewcollection_0 s:shard2 r:core_node4 x:awhollynewcollection_0_shard2_replica_n2] o.a.s.c.ZkController I am the leader, no recovery necessary
   [junit4]   2> 2747910 INFO  (parallelCoreAdminExecutor-8707-thread-1-processing-n:127.0.0.1:39265_solr 6d98a29b-c71e-4441-ac60-1a2c724bac841492421082470677 CREATE) [n:127.0.0.1:39265_solr c:awhollynewcollection_0 s:shard1 r:core_node3 x:awhollynewcollection_0_shard1_replica_n1] o.a.s.c.ZkController I am the leader, no recovery necessary
   [junit4]   2> 2748014 INFO  (zkCallback-6269-thread-2) [    ] o.a.s.c.c.ZkStateReader A cluster state change: [WatchedEvent state:SyncConnected type:NodeDataChanged path:/collections/awhollynewcollection_0/state.json] for collection [awhollynewcollection_0] has occurred - updating... (live nodes size: [4])
   [junit4]   2> 2748014 INFO  (zkCallback-6243-thread-1-processing-n:127.0.0.1:61096_solr) [n:127.0.0.1:61096_solr    ] o.a.s.c.c.ZkStateReader A cluster state change: [WatchedEvent state:SyncConnected type:NodeDataChanged path:/collections/awhollynewcollection_0/state.json] for collection [awhollynewcollection_0] has occurred - updating... (live nodes size: [4])
   [junit4]   2> 2748014 INFO  (zkCallback-6255-thread-1-processing-n:127.0.0.1:39265_solr) [n:127.0.0.1:39265_solr    ] o.a.s.c.c.ZkStateReader A cluster state change: [WatchedEvent state:SyncConnected type:NodeDataChanged path:/collections/awhollynewcollection_0/state.json] for collection [awhollynewcollection_0] has occurred - updating... (live nodes size: [4])
   [junit4]   2> 2748014 INFO  (zkCallback-6255-thread-3-processing-n:127.0.0.1:39265_solr) [n:127.0.0.1:39265_solr    ] o.a.s.c.c.ZkStateReader A cluster state change: [WatchedEvent state:SyncConnected type:NodeDataChanged path:/collections/awhollynewcollection_0/state.json] for collection [awhollynewcollection_0] has occurred - updating... (live nodes size: [4])
   [junit4]   2> 2748014 INFO  (zkCallback-6243-thread-2-processing-n:127.0.0.1:61096_solr) [n:127.0.0.1:61096_solr    ] o.a.s.c.c.ZkStateReader A cluster state change: [WatchedEvent state:SyncConnected type:NodeDataChanged path:/collections/awhollynewcollection_0/state.json] for collection [awhollynewcollection_0] has occurred - updating... (live nodes size: [4])
   [junit4]   2> 2748015 INFO  (TEST-CollectionsAPIDistributedZkTest.testCollectionsAPI-seed#[212C3DF6229AD48D]) [    ] o.a.s.c.ChaosMonkey monkey: stop jetty! 61096
   [junit4]   2> 2748015 INFO  (TEST-CollectionsAPIDistributedZkTest.testCollectionsAPI-seed#[212C3DF6229AD48D]) [    ] o.a.s.c.CoreContainer Shutting down CoreContainer instance=1036262201
   [junit4]   2> 2748016 INFO  (TEST-CollectionsAPIDistributedZkTest.testCollectionsAPI-seed#[212C3DF6229AD48D]) [    ] o.a.s.m.SolrMetricManager Closing metric reporters for registry=solr.node, tag=null
   [junit4]   2> 2748016 INFO  (TEST-CollectionsAPIDistributedZkTest.testCollectionsAPI-seed#[212C3DF6229AD48D]) [    ] o.a.s.m.r.SolrJmxReporter Closing reporter [org.apache.solr.metrics.reporters.SolrJmxReporter@122332bf: rootName = null, domain = solr.node, service url = null, agent id = null] for registry solr.node / com.codahale.metrics.MetricRegistry@667b7794
   [junit4]   2> 2748018 INFO  (TEST-CollectionsAPIDistributedZkTest.testCollectionsAPI-seed#[212C3DF6229AD48D]) [    ] o.a.s.m.SolrMetricManager Closing metric reporters for registry=solr.jvm, tag=null
   [junit4]   2> 2748018 INFO  (TEST-CollectionsAPIDistributedZkTest.testCollectionsAPI-seed#[212C3DF6229AD48D]) [    ] o.a.s.m.r.SolrJmxReporter Closing reporter [org.apache.solr.metrics.reporters.SolrJmxReporter@44cbb0c3: rootName = null, domain = solr.jvm, service url = null, agent id = null] for registry solr.jvm / com.codahale.metrics.MetricRegistry@1df2411a
   [junit4]   2> 2748019 INFO  (TEST-CollectionsAPIDistributedZkTest.testCollectionsAPI-seed#[212C3DF6229AD48D]) [    ] o.a.s.m.SolrMetricManager Closing metric reporters for registry=solr.jetty, tag=null
   [junit4]   2> 2748019 INFO  (TEST-CollectionsAPIDistributedZkTest.testCollectionsAPI-seed#[212C3DF6229AD48D]) [    ] o.a.s.m.r.SolrJmxReporter Closing reporter [org.apache.solr.metrics.reporters.SolrJmxReporter@32662c61: rootName = null, domain = solr.jetty, service url = null, agent id = null] for registry solr.jetty / com.codahale.metrics.MetricRegistry@22b76b52
   [junit4]   2> 2748021 INFO  (TEST-CollectionsAPIDistributedZkTest.testCollectionsAPI-seed#[212C3DF6229AD48D]) [    ] o.a.s.c.ZkController Remove node as live in ZooKeeper:/live_nodes/127.0.0.1:61096_solr
   [junit4]   2> 2748023 INFO  (TEST-CollectionsAPIDistributedZkTest.testCollectionsAPI-seed#[212C3DF6229AD48D]) [    ] o.a.s.m.SolrMetricManager Closing metric reporters for registry=solr.cluster, tag=null
   [junit4]   2> 2748023 INFO  (zkCallback-6269-thread-2) [    ] o.a.s.c.c.ZkStateReader Updated live nodes from ZooKeeper... (4) -> (3)
   [junit4]   2> 2748023 INFO  (zkCallback-6269-thread-1) [    ] o.a.s.c.c.ZkStateReader Updated live nodes from ZooKeeper... (4) -> (3)
   [junit4]   2> 2748023 INFO  (zkCallback-6253-thread-1-processing-n:127.0.0.1:48630_solr) [n:127.0.0.1:48630_solr    ] o.a.s.c.c.ZkStateReader Updated live nodes from ZooKeeper... (4) -> (3)
   [junit4]   2> 2748023 INFO  (zkCallback-6269-thread-3) [    ] o.a.s.c.c.ZkStateReader Updated live nodes from ZooKeeper... (4) -> (3)
   [junit4]   2> 2748024 INFO  (coreCloseExecutor-8725-thread-1) [n:127.0.0.1:61096_solr c:awhollynewcollection_0 s:shard2 r:core_node4 x:awhollynewcollection_0_shard2_replica_n2] o.a.s.c.SolrCore [awhollynewcollection_0_shard2_replica_n2]  CLOSING SolrCore org.apache.solr.core.SolrCore@60d439c9
   [junit4]   2> 2748024 INFO  (coreCloseExecutor-8725-thread-1) [n:127.0.0.1:61096_solr c:awhollynewcollection_0 s:shard2 r:core_node4 x:awhollynewcollection_0_shard2_replica_n2] o.a.s.m.SolrMetricManager Closing metric reporters for registry=solr.core.awhollynewcollection_0.shard2.replica_n2, tag=1624521161
   [junit4]   2> 2748024 INFO  (zkCallback-6255-thread-1-processing-n:127.0.0.1:39265_solr) [n:127.0.0.1:39265_solr    ] o.a.s.c.c.ZkStateReader Updated live nodes from ZooKeeper... (4) -> (3)
   [junit4]   2> 2748024 INFO  (coreCloseExecutor-8725-thread-1) [n:127.0.0.1:61096_solr c:awhollynewcollection_0 s:shard2 r:core_node4 x:awhollynewcollection_0_shard2_replica_n2] o.a.s.m.r.SolrJmxReporter Closing reporter [org.apache.solr.metrics.reporters.SolrJmxReporter@395ffb1c: rootName = null, domain = solr.core.awhollynewcollection_0.shard2.replica_n2, service url = null, agent id = null] for registry solr.core.awhollynewcollection_0.shard2.replica_n2 / com.codahale.metrics.MetricRegistry@7124f92a
   [junit4]   2> 2748024 INFO  (zkCallback-6248-thread-1-processing-n:127.0.0.1:44935_solr) [n:127.0.0.1:44935_solr    ] o.a.s.c.c.ZkStateReader Updated live nodes from ZooKeeper... (4) -> (3)
   [junit4]   2> 2748024 INFO  (zkCallback-6243-thread-2-processing-n:127.0.0.1:61096_solr) [n:127.0.0.1:61096_solr    ] o.a.s.c.c.ZkStateReader Updated live nodes from ZooKeeper... (4) -> (3)
   [junit4]   2> 2748031 INFO  (coreCloseExecutor-8725-thread-1) [n:127.0.0.1:61096_solr c:awhollynewcollection_0 s:shard2 r:core_node4 x:awhollynewcollection_0_shard2_replica_n2] o.a.s.m.SolrMetricManager Closing metric reporters for registry=solr.collection.awhollynewcollection_0.shard2.leader, tag=1624521161
   [junit4]   2> 2748033 WARN  (NIOServerCxn.Factory:0.0.0.0/0.0.0.0:0) [    ] o.a.z.s.NIOServerCnxn caught end of stream exception
   [junit4]   2> EndOfStreamException: Unable to read additional data from client sessionid 0x160727e1dd10008, likely client has closed socket
   [junit4]   2> 	at org.apache.zookeeper.server.NIOServerCnxn.doIO(NIOServerCnxn.java:239)
   [junit4]   2> 	at org.apache.zookeeper.server.NIOServerCnxnFactory.run(NIOServerCnxnFactory.java:203)
   [junit4]   2> 	at java.lang.Thread.run(Thread.java:748)
   [junit4]   2> 2748035 INFO  (TEST-CollectionsAPIDistributedZkTest.testCollectionsAPI-seed#[212C3DF6229AD48D]) [    ] o.e.j.s.AbstractConnector Stopped ServerConnector@584df3cd{HTTP/1.1,[http/1.1]}{127.0.0.1:0}
   [junit4]   2> 2748038 INFO  (TEST-CollectionsAPIDistributedZkTest.testCollectionsAPI-seed#[212C3DF6229AD48D]) [    ] o.e.j.s.h.ContextHandler Stopped o.e.j.s.ServletContextHandler@64604838{/solr,null,UNAVAILABLE}
   [junit4]   2> 2748039 INFO  (TEST-CollectionsAPIDistributedZkTest.testCollectionsAPI-seed#[212C3DF6229AD48D]) [    ] o.a.s.c.MiniSolrCloudCluster ============ Restarting jetty
   [junit4]   2> 2748039 INFO  (TEST-CollectionsAPIDistributedZkTest.testCollectionsAPI-seed#[212C3DF6229AD48D]) [    ] o.a.s.c.ChaosMonkey monkey: starting jetty! 61096
   [junit4]   2> 2748040 INFO  (TEST-CollectionsAPIDistributedZkTest.testCollectionsAPI-seed#[212C3DF6229AD48D]) [    ] o.e.j.s.Server jetty-9.3.20.v20170531
   [junit4]   2> 2748040 INFO  (TEST-CollectionsAPIDistributedZkTest.testCollectionsAPI-seed#[212C3DF6229AD48D]) [    ] o.e.j.s.h.ContextHandler Started o.e.j.s.ServletContextHandler@13a52c97{/solr,null,AVAILABLE}
   [junit4]   2> 2748041 INFO  (TEST-CollectionsAPIDistributedZkTest.testCollectionsAPI-seed#[212C3DF6229AD48D]) [    ] o.e.j.s.AbstractConnector Started ServerConnector@5318c61b{HTTP/1.1,[http/1.1]}{127.0.0.1:61096}
   [junit4]   2> 2748041 INFO  (TEST-CollectionsAPIDistributedZkTest.testCollectionsAPI-seed#[212C3DF6229AD48D]) [    ] o.e.j.s.Server Started @2751817ms
   [junit4]   2> 2748041 INFO  (TEST-CollectionsAPIDistributedZkTest.testCollectionsAPI-seed#[212C3DF6229AD48D]) [    ] o.a.s.c.s.e.JettySolrRunner Jetty properties: {hostContext=/solr, hostPort=61096}
   [junit4]   2> 2748043 ERROR (TEST-CollectionsAPIDistributedZkTest.testCollectionsAPI-seed#[212C3DF6229AD48D]) [    ] o.a.s.u.StartupLoggingUtils Missing Java Option solr.log.dir. Logging may be missing or incomplete.
   [junit4]   2> 2748043 INFO  (TEST-CollectionsAPIDistributedZkTest.testCollectionsAPI-seed#[212C3DF6229AD48D]) [    ] o.a.s.s.SolrDispatchFilter  ___      _       Welcome to Apache Solr? version 7.3.0
   [junit4]   2> 2748043 INFO  (TEST-CollectionsAPIDistributedZkTest.testCollectionsAPI-seed#[212C3DF6229AD48D]) [    ] o.a.s.s.SolrDispatchFilter / __| ___| |_ _   Starting in cloud mode on port null
   [junit4]   2> 2748044 INFO  (TEST-CollectionsAPIDistributedZkTest.testCollectionsAPI-seed#[212C3DF6229AD48D]) [    ] o.a.s.s.SolrDispatchFilter \__ \/ _ \ | '_|  Install dir: null
   [junit4]   2> 2748044 INFO  (TEST-CollectionsAPIDistributedZkTest.testCollectionsAPI-seed#[212C3DF6229AD48D]) [    ] o.a.s.s.SolrDispatchFilter |___/\___/_|_|    Start time: 2017-12-20T05:55:58.925Z
   [junit4]   2> 2748045 INFO  (zkConnectionManagerCallback-6274-thread-1) [    ] o.a.s.c.c.ConnectionManager zkClient has connected
   [junit4]   2> 2748046 INFO  (TEST-CollectionsAPIDistributedZkTest.testCollectionsAPI-seed#[212C3DF6229AD48D]) [    ] o.a.s.s.SolrDispatchFilter solr.xml found in ZooKeeper. Loading...
   [junit4]   2> 2748050 INFO  (TEST-CollectionsAPIDistributedZkTest.testCollectionsAPI-seed#[212C3DF6229AD48D]) [    ] o.a.s.c.SolrXmlConfig Configuration parameter autoReplicaFailoverWorkLoopDelay is ignored
   [junit4]   2> 2748050 INFO  (TEST-CollectionsAPIDistributedZkTest.testCollectionsAPI-seed#[212C3DF6229AD48D]) [    ] o.a.s.c.SolrXmlConfig Configuration parameter autoReplicaFailoverBadNodeExpiration is ignored
   [junit4]   2> 2748054 INFO  (TEST-CollectionsAPIDistributedZkTest.testCollectionsAPI-seed#[212C3DF6229AD48D]) [    ] o.a.s.c.ZkContainer Zookeeper client=127.0.0.1:56031/solr
   [junit4]   2> 2748056 INFO  (zkConnectionManagerCallback-6278-thread-1) [    ] o.a.s.c.c.ConnectionManager zkClient has connected
   [junit4]   2> 2748059 INFO  (zkConnectionManagerCallback-6280-thread-1-processing-n:127.0.0.1:61096_solr) [n:127.0.0.1:61096_solr    ] o.a.s.c.c.ConnectionManager zkClient has connected
   [junit4]   2> 2748073 INFO  (TEST-CollectionsAPIDistributedZkTest.testCollectionsAPI-seed#[212C3DF6229AD48D]) [n:127.0.0.1:61096_solr    ] o.a.s.c.c.ZkStateReader Updated live nodes from ZooKeeper... (0) -> (3)
   [junit4]   2> 2748077 INFO  (TEST-CollectionsAPIDistributedZkTest.testCollectionsAPI-seed#[212C3DF6229AD48D]) [n:127.0.0.1:61096_solr    ] o.a.s.c.Overseer Overseer (id=null) closing
   [junit4]   2> 2748080 INFO  (TEST-CollectionsAPIDistributedZkTest.testCollectionsAPI-seed#[212C3DF6229AD48D]) [n:127.0.0.1:61096_solr    ] o.a.s.c.ZkController Register node as live in ZooKeeper:/live_nodes/127.0.0.1:61096_solr
   [junit4]   2> 2748082 INFO  (zkCallback-6248-thread-1-processing-n:127.0.0.1:44935_solr) [n:127.0.0.1:44935_solr    ] o.a.s.c.c.ZkStateReader Updated live nodes from ZooKeeper... (3) -> (4)
   [junit4]   2> 2748083 INFO  (zkCallback-6269-thread-3) [    ] o.a.s.c.c.ZkStateReader Updated live nodes from ZooKeeper... (3) -> (4)
   [junit4]   2> 2748083 INFO  (zkCallback-6269-thread-2) [    ] o.a.s.c.c.ZkStateReader Updated live nodes from ZooKeeper... (3) -> (4)
   [junit4]   2> 2748083 INFO  (zkCallback-6269-thread-1) [    ] o.a.s.c.c.ZkStateReader Updated live nodes from ZooKeeper... (3) -> (4)
   [junit4]   2> 2748083 INFO  (zkCallback-6255-thread-1-processing-n:127.0.0.1:39265_solr) [n:127.0.0.1:39265_solr    ] o.a.s.c.c.ZkStateReader Updated live nodes from ZooKeeper... (3) -> (4)
   [junit4]   2> 2748083 INFO  (zkCallback-6253-thread-1-processing-n:127.0.0.1:48630_solr) [n:127.0.0.1:48630_solr    ] o.a.s.c.c.ZkStateReader Updated live nodes from ZooKeeper... (3) -> (4)
   [junit4]   2> 2748085 INFO  (zkCallback-6279-thread-1-processing-n:127.0.0.1:61096_solr) [n:127.0.0.1:61096_solr    ] o.a.s.c.c.ZkStateReader Updated live nodes from ZooKeeper... (3) -> (4)
   [junit4]   2> 2748182 INFO  (zkCallback-6255-thread-1-processing-n:127.0.0.1:39265_solr) [n:127.0.0.1:39265_solr    ] o.a.s.c.c.ZkStateReader A cluster state change: [WatchedEvent state:SyncConnected type:NodeDataChanged path:/collections/awhollynewcollection_0/state.json] for collection [awhollynewcollection_0] has occurred - updating... (live nodes size: [4])
   [junit4]   2> 2748182 INFO  (zkCallback-6255-thread-3-processing-n:127.0.0.1:39265_solr) [n:127.0.0.1:39265_solr    ] o.a.s.c.c.ZkStateReader A cluster state change: [WatchedEvent state:SyncConnected type:NodeDataChanged path:/collections/awhollynewcollection_0/state.json] for collection [awhollynewcollection_0] has occurred - updating... (live nodes size: [4])
   [junit4]   2> 2748356 INFO  (TEST-CollectionsAPIDistributedZkTest.testCollectionsAPI-seed#[212C3DF6229AD48D]) [n:127.0.0.1:61096_solr    ] o.a.s.m.r.SolrJmxReporter JMX monitoring for 'solr.node' (registry 'solr.node') enabled at server: com.sun.jmx.mbeanserver.JmxMBeanServer@1f1303ef
   [junit4]   2> 2748360 INFO  (TEST-CollectionsAPIDistributedZkTest.testCollectionsAPI-seed#[212C3DF6229AD48D]) [n:127.0.0.1:61096_solr    ] o.a.s.m.r.SolrJmxReporter JMX monitoring for 'solr.jvm' (registry 'solr.jvm') enabled at server: com.sun.jmx.mbeanserver.JmxMBeanServer@1f1303ef
   [junit4]   2> 2748365 INFO  (TEST-CollectionsAPIDistributedZkTest.testCollectionsAPI-seed#[212C3DF6229AD48D]) [n:127.0.0.1:61096_solr    ] o.a.s.m.r.SolrJmxReporter JMX monitoring for 'solr.jetty' (registry 'solr.jetty') enabled at server: com.sun.jmx.mbeanserver.JmxMBeanServer@1f1303ef
   [junit4]   2> 2748367 INFO  (TEST-CollectionsAPIDistributedZkTest.testCollectionsAPI-seed#[212C3DF6229AD48D]) [n:127.0.0.1:61096_solr    ] o.a.s.c.CorePropertiesLocator Found 1 core definitions underneath /export/home/jenkins/workspace/Lucene-Solr-7.x-Solaris/solr/build/solr-core/test/J1/temp/solr.cloud.CollectionsAPIDistributedZkTest_212C3DF6229AD48D-001/tempDir-001/node3
   [junit4]   2> 2748367 INFO  (TEST-CollectionsAPIDistributedZkTest.testCollectionsAPI-seed#[212C3DF6229AD48D]) [n:127.0.0.1:61096_solr    ] o.a.s.c.CorePropertiesLocator Cores are: [awhollynewcollection_0_shard2_replica_n2]
   [junit4]   2> 2748368 INFO  (coreLoadExecutor-8732-thread-1-processing-n:127.0.0.1:61096_solr) [n:127.0.0.1:61096_solr    ] o.a.s.c.TransientSolrCoreCacheDefault Allocating transient cache for 2147483647 transient cores
   [junit4]   2> 2748379 INFO  (coreLoadExecutor-8732-thread-1-processing-n:127.0.0.1:61096_solr) [n:127.0.0.1:61096_solr    ] o.a.s.c.SolrConfig Using Lucene MatchVersion: 7.3.0
   [junit4]   2> 2748386 INFO  (coreLoadExecutor-8732-thread-1-processing-n:127.0.0.1:61096_solr) [n:127.0.0.1:61096_solr    ] o.a.s.s.IndexSchema [awhollynewcollection_0_shard2_replica_n2] Schema name=minimal
   [junit4]   2> 2748389 INFO  (coreLoadExecutor-8732-thread-1-processing-n:127.0.0.1:61096_solr) [n:127.0.0.1:61096_solr    ] o.a.s.s.IndexSchema Loaded schema minimal/1.1 with uniqueid field id
   [junit4]   2> 2748415 INFO  (coreLoadExecutor-8732-thread-1-processing-n:127.0.0.1:61096_solr) [n:127.0.0.1:61096_solr c:awhollynewcollection_0 s:shard2 r:core_node4 x:awhollynewcollection_0_shard2_replica_n2] o.a.s.c.SolrConfig Using Lucene MatchVersion: 7.3.0
   [junit4]   2> 2748421 INFO  (coreLoadExecutor-8732-thread-1-processing-n:127.0.0.1:61096_solr) [n:127.0.0.1:61096_solr c:awhollynewcollection_0 s:shard2 r:core_node4 x:awhollynewcollection_0_shard2_replica_n2] o.a.s.s.IndexSchema [awhollynewcollection_0_shard2_replica_n2] Schema name=minimal
   [junit4]   2> 2748421 INFO  (coreLoadExecutor-8732-thread-1-processing-n:127.0.0.1:61096_solr) [n:127.0.0.1:61096_solr c:awhollynewcollection_0 s:shard2 r:core_node4 x:awhollynewcollection_0_shard2_replica_n2] o.a.s.s.IndexSchema Loaded schema minimal/1.1 with uniqueid field id
   [junit4]   2> 2748421 INFO  (coreLoadExecutor-8732-thread-1-processing-n:127.0.0.1:61096_solr) [n:127.0.0.1:61096_solr c:awhollynewcollection_0 s:shard2 r:core_node4 x:awhollynewcollection_0_shard2_replica_n2] o.a.s.c.CoreContainer Creating SolrCore 'awhollynewcollection_0_shard2_replica_n2' using configuration from collection awhollynewcollection_0, trusted=true
   [junit4]   2> 2748421 INFO  (coreLoadExecutor-8732-thread-1-processing-n:127.0.0.1:61096_solr) [n:127.0.0.1:61096_solr c:awhollynewcollection_0 s:shard2 r:core_node4 x:awhollynewcollection_0_shard2_replica_n2] o.a.s.m.r.SolrJmxReporter JMX monitoring for 'solr.core.awhollynewcollection_0.shard2.replica_n2' (registry 'solr.core.awhollynewcollection_0.shard2.replica_n2') enabled at server: com.sun.jmx.mbeanserver.JmxMBeanServer@1f1303ef
   [junit4]   2> 2748421 INFO  (coreLoadExecutor-8732-thread-1-processing-n:127.0.0.1:61096_solr) [n:127.0.0.1:61096_solr c:awhollynewcollection_0 s:shard2 r:core_node4 x:awhollynewcollection_0_shard2_replica_n2] o.a.s.c.SolrCore solr.RecoveryStrategy.Builder
   [junit4]   2> 2748421 INFO  (coreLoadExecutor-8732-thread-1-processing-n:127.0.0.1:61096_solr) [n:127.0.0.1:61096_solr c:awhollynewcollection_0 s:shard2 r:core_node4 x:awhollynewcollection_0_shard2_replica_n2] o.a.s.c.SolrCore [[awhollynewcollection_0_shard2_replica_n2] ] Opening new SolrCore at [/export/home/jenkins/workspace/Lucene-Solr-7.x-Solaris/solr/build/solr-core/test/J1/temp/solr.cloud.CollectionsAPIDistributedZkTest_212C3DF6229AD48D-001/tempDir-001/node3/awhollynewcollection_0_shard2_replica_n2], dataDir=[/export/home/jenkins/workspace/Lucene-Solr-7.x-Solaris/solr/build/solr-core/test/J1/temp/solr.cloud.CollectionsAPIDistributedZkTest_212C3DF6229AD48D-001/tempDir-001/node3/awhollynewcollection_0_shard2_replica_n2/data/]
   [junit4]   2> 2748461 INFO  (coreLoadExecutor-8732-thread-1-processing-n:127.0.0.1:61096_solr) [n:127.0.0.1:61096_solr c:awhollynewcollection_0 s:shard2 r:core_node4 x:awhollynewcollection_0_shard2_replica_n2] o.a.s.u.UpdateHandler Using UpdateLog implementation: org.apache.solr.update.UpdateLog
   [junit4]   2> 2748461 INFO  (coreLoadExecutor-8732-thread-1-processing-n:127.0.0.1:61096_solr) [n:127.0.0.1:61096_solr c:awhollynewcollection_0 s:shard2 r:core_node4 x:awhollynewcollection_0_shard2_replica_n2] o.a.s.u.UpdateLog Initializing UpdateLog: dataDir=null defaultSyncLevel=FLUSH numRecordsToKeep=100 maxNumLogsToKeep=10 numVersionBuckets=65536
   [junit4]   2> 2748462 INFO  (coreLoadExecutor-8732-thread-1-processing-n:127.0.0.1:61096_solr) [n:127.0.0.1:61096_solr c:awhollynewcollection_0 s:shard2 r:core_node4 x:awhollynewcollection_0_shard2_replica_n2] o.a.s.u.CommitTracker Hard AutoCommit: disabled
   [junit4]   2> 2748462 INFO  (coreLoadExecutor-8732-thread-1-processing-n:127.0.0.1:61096_solr) [n:127.0.0.1:61096_solr c:awhollynewcollection_0 s:shard2 r:core_node4 x:awhollynewcollection_0_shard2_replica_n2] o.a.s.u.CommitTracker Soft AutoCommit: disabled
   [junit4]   2> 2748462 INFO  (coreLoadExecutor-8732-thread-1-processing-n:127.0.0.1:61096_solr) [n:127.0.0.1:61096_solr c:awhollynewcollection_0 s:shard2 r:core_node4 x:awhollynewcollection_0_shard2_replica_n2] o.a.s.s.SolrIndexSearcher Opening [Searcher@739957d4[awhollynewcollection_0_shard2_replica_n2] main]
   [junit4]   2> 2748464 INFO  (coreLoadExecutor-8732-thread-1-processing-n:127.0.0.1:61096_solr) [n:127.0.0.1:61096_solr c:awhollynewcollection_0 s:shard2 r:core_node4 x:awhollynewcollection_0_shard2_replica_n2] o.a.s.r.ManagedResourceStorage Configured ZooKeeperStorageIO with znodeBase: /configs/conf2
   [junit4]   2> 2748464 INFO  (coreLoadExecutor-8732-thread-1-processing-n:127.0.0.1:61096_solr) [n:127.0.0.1:61096_solr c:awhollynewcollection_0 s:shard2 r:core_node4 x:awhollynewcollection_0_shard2_replica_n2] o.a.s.r.ManagedResourceStorage Loaded null at path _rest_managed.json using ZooKeeperStorageIO:path=/configs/conf2
   [junit4]   2> 2748465 INFO  (coreLoadExecutor-8732-thread-1-processing-n:127.0.0.1:61096_solr) [n:127.0.0.1:61096_solr c:awhollynewcollection_0 s:shard2 r:core_node4 x:awhollynewcollection_0_shard2_replica_n2] o.a.s.h.ReplicationHandler Commits will be reserved for 10000ms.
   [junit4]   2> 2748465 INFO  (coreLoadExecutor-8732-thread-1-processing-n:127.0.0.1:61096_solr) [n:127.0.0.1:61096_solr c:awhollynewcollection_0 s:shard2 r:core_node4 x:awhollynewcollection_0_shard2_replica_n2] o.a.s.u.UpdateLog Could not find max version in index or recent updates, using new clock 1587281248225591296
   [junit4]   2> 2748466 INFO  (searcherExecutor-8733-thread-1-processing-n:127.0.0.1:61096_solr x:awhollynewcollection_0_shard2_replica_n2 s:shard2 c:awhollynewcollection_0 r:core_node4) [n:127.0.0.1:61096_solr c:awhollynewcollection_0 s:shard2 r:core_node4 x:awhollynewcollection_0_shard2_replica_n2] o.a.s.c.SolrCore [awhollynewcollection_0_shard2_replica_n2] Registered new searcher Searcher@739957d4[awhollynewcollection_0_shard2_replica_n2] main{ExitableDirectoryReader(UninvertingDirectoryReader())}
   [junit4]   2> 2748467 ERROR (TEST-CollectionsAPIDistributedZkTest.testCollectionsAPI-seed#[212C3DF6229AD48D]) [    ] o.a.z.s.ZooKeeperServer ZKShutdownHandler is not registered, so ZooKeeper server won't take any action on ERROR or SHUTDOWN server state changes
   [junit4]   2> 2748468 WARN  (NIOServerCxn.Factory:0.0.0.0/0.0.0.0:0) [    ] o.a.z.s.NIOServerCnxn Exception causing close of session 0x160727e1dd10011 due to java.io.IOException: ZooKeeperServer not running
   [junit4]   2> 2748468 INFO  (TEST-CollectionsAPIDistributedZkTest.testCollectionsAPI-seed#[212C3DF6229AD48D]) [    ] o.a.s.c.ZkTestServer connecting to 127.0.0.1:56031 56031
   [junit4]   2> 2748570 WARN  (zkConnectionManagerCallback-6280-thread-1-processing-n:127.0.0.1:61096_solr) [n:127.0.0.1:61096_solr    ] o.a.s.c.c.ConnectionManager Watcher org.apache.solr.common.cloud.ConnectionManager@507b0bbd name: ZooKeeperConnection Watcher:127.0.0.1:56031/solr got event WatchedEvent state:Disconnected type:None path:null path: null type: None
   [junit4]   2> 2748570 WARN  (zkConnectionManagerCallback-6280-thread-1-processing-n:127.0.0.1:61096_solr) [n:127.0.0.1:61096_solr    ] o.a.s.c.c.ConnectionManager zkClient has disconnected
   [junit4]   2> 2748651 INFO  (qtp281033939-29171) [n:127.0.0.1:39265_solr    ] o.a.s.h.a.CoreAdminOperation Checking request status for : 6d98a29b-c71e-4441-ac60-1a2c724bac841492421082470677
   [junit4]   2> 2748651 INFO  (qtp281033939-29171) [n:127.0.0.1:39265_solr    ] o.a.s.s.HttpSolrCall [admin] webapp=null path=/admin/cores params={qt=/admin/cores&requestid=6d98a29b-c71e-4441-ac60-1a2c724bac841492421082470677&action=REQUESTSTATUS&wt=javabin&version=2} status=0 QTime=0
   [junit4]   2> 2748652 ERROR (OverseerThreadFactory-8706-thread-2-processing-n:127.0.0.1:39265_solr) [n:127.0.0.1:39265_solr    ] o.a.s.c.OverseerCollectionMessageHandler Error from shard: http://127.0.0.1:61096/solr
   [junit4]   2> org.apache.solr.client.solrj.SolrServerException: IOException occured when talking to server at: http://127.0.0.1:61096/solr
   [junit4]   2> 	at org.apache.solr.client.solrj.impl.HttpSolrClient.executeMethod(HttpSolrClient.java:657)
   [junit4]   2> 	at org.apache.solr.client.solrj.impl.HttpSolrClient.request(HttpSolrClient.java:255)
   [junit4]   2> 	at org.apache.solr.client.solrj.impl.HttpSolrClient.request(HttpSolrClient.java:244)
   [junit4]   2> 	at org.apache.solr.client.solrj.SolrClient.request(SolrClient.java:1219)
   [junit4]   2> 	at org.apache.solr.handler.component.HttpShardHandler.lambda$submit$0(HttpShardHandler.java:172)
   [junit4]   2> 	at java.util.concurrent.FutureTask.run(FutureTask.java:266)
   [junit4]   2> 	at java.util.concurrent.Executors$RunnableAdapter.call(Executors.java:511)
   [junit4]   2> 	at java.util.concurrent.FutureTask.run(FutureTask.java:266)
   [junit4]   2> 	at com.codahale.metrics.InstrumentedExecutorService$InstrumentedRunnable.run(InstrumentedExecutorService.java:176)
   [junit4]   2> 	at org.apache.solr.common.util.ExecutorUtil$MDCAwareThreadPoolExecutor.lambda$execute$0(ExecutorUtil.java:188)
   [junit4]   2> 	at java.util.concurrent.ThreadPoolExecutor.runWorker(ThreadPoolExecutor.java:1149)
   [junit4]   2> 	at java.util.concurrent.ThreadPoolExecutor$Worker.run(ThreadPoolExecutor.java:624)
   [junit4]   2> 	at java.lang.Thread.run(Thread.java:748)
   [junit4]   2> Caused by: java.net.SocketException: Connection reset
   [junit4]   2> 	at java.net.SocketInputStream.read(SocketInputStream.java:210)
   [junit4]   2> 	at java.net.SocketInputStream.read(SocketInputStream.java:141)
   [junit4]   2> 	at org.apache.http.impl.io.SessionInputBufferImpl.streamRead(SessionInputBufferImpl.java:137)
   [junit4]   2> 	at org.apache.http.impl.io.SessionInputBufferImpl.fillBuffer(SessionInputBufferImpl.java:153)
   [junit4]   2> 	at org.apache.http.impl.io.SessionInputBufferImpl.readLine(SessionInputBufferImpl.java:282)
   [junit4]   2> 	at org.apache.http.impl.conn.DefaultHttpResponseParser.parseHead(DefaultHttpResponseParser.java:138)
   [junit4]   2> 	at org.apache.http.impl.conn.DefaultHttpResponseParser.parseHead(DefaultHttpResponseParser.java:56)
   [junit4]   2> 	at org.apache.http.impl.io.AbstractMessageParser.parse(AbstractMessageParser.java:259)
   [junit4]   2> 	at org.apache.http.impl.DefaultBHttpClientConnection.receiveResponseHeader(DefaultBHttpClientConnection.java:163)
   [junit4]   2> 	at org.apache.http.impl.conn.CPoolProxy.receiveResponseHeader(CPoolProxy.java:165)
   [junit4]   2> 	at org.apache.http.protocol.HttpRequestExecutor.doReceiveResponse(HttpRequestExecutor.java:273)
   [junit4]   2> 	at org.apache.http.protocol.HttpRequestExecutor.execute(HttpRequestExecutor.java:125)
   [junit4]   2> 	at org.apache.solr.util.stats.InstrumentedHttpRequestExecutor.execute(InstrumentedHttpRequestExecutor.java:118)
   [junit4]   2> 	at org.apache.http.impl.execchain.MainClientExec.execute(MainClientExec.java:272)
   [junit4]   2> 	at org.apache.http.impl.execchain.ProtocolExec.execute(ProtocolExec.java:185)
   [junit4]   2> 	at org.apache.http.impl.execchain.RetryExec.execute(RetryExec.java:89)
   [junit4]   2> 	at org.apache.http.impl.execchain.RedirectExec.execute(RedirectExec.java:111)
   [junit4]   2> 	at org.apache.http.impl.client.InternalHttpClient.doExecute(InternalHttpClient.java:185)
   [junit4]   2> 	at org.apache.http.impl.client.CloseableHttpClient.execute(CloseableHttpClient.java:83)
   [junit4]   2> 	at org.apache.http.impl.client.CloseableHttpClient.execute(CloseableHttpClient.java:56)
   [junit4]   2> 	at org.apache.solr.client.solrj.impl.HttpSolrClient.executeMethod(HttpSolrClient.java:542)
   [junit4]   2> 	... 12 more
   [junit4]   2> 2758626 WARN  (NIOServerCxn.Factory:0.0.0.0/0.0.0.0:0) [    ] o.a.z.s.NIOServerCnxnFactory Ignoring unexpected runtime exception
   [junit4]   2> java.nio.channels.CancelledKeyException
   [junit4]   2> 	at sun.nio.ch.SelectionKeyImpl.ensureValid(SelectionKeyImpl.java:73)
   [junit4]   2> 	at sun.nio.ch.SelectionKeyImpl.readyOps(SelectionKeyImpl.java:87)
   [junit4]   2> 	at org.apache.zookeeper.server.NIOServerCnxnFactory.run(NIOServerCnxnFactory.java:182)
   [junit4]   2> 	at java.lang.Thread.run(Thread.java:748)
   [junit4]   2> 2758626 WARN  (TEST-CollectionsAPIDistributedZkTest.testCollectionsAPI-seed#[212C3DF6229AD48D]-SendThread(127.0.0.1:56031)) [n:127.0.0.1:61096_solr    ] o.a.z.ClientCnxn Session 0x160727e1d

[...truncated too long message...]

eption.create(KeeperException.java:127)
   [junit4]   2> 	at org.apache.zookeeper.KeeperException.create(KeeperException.java:51)
   [junit4]   2> 	at org.apache.zookeeper.ZooKeeper.create(ZooKeeper.java:783)
   [junit4]   2> 	at org.apache.solr.common.cloud.SolrZkClient.lambda$create$7(SolrZkClient.java:364)
   [junit4]   2> 	at org.apache.solr.common.cloud.ZkCmdExecutor.retryOperation(ZkCmdExecutor.java:60)
   [junit4]   2> 	at org.apache.solr.common.cloud.SolrZkClient.create(SolrZkClient.java:364)
   [junit4]   2> 	at org.apache.solr.cloud.ZkController.lambda$registerLiveNodesListener$2(ZkController.java:879)
   [junit4]   2> 	at org.apache.solr.common.cloud.ZkStateReader.lambda$refreshLiveNodes$1(ZkStateReader.java:704)
   [junit4]   2> 	at java.util.concurrent.ConcurrentHashMap$KeySetView.forEach(ConcurrentHashMap.java:4649)
   [junit4]   2> 	at org.apache.solr.common.cloud.ZkStateReader.refreshLiveNodes(ZkStateReader.java:703)
   [junit4]   2> 	at org.apache.solr.common.cloud.ZkStateReader.access$900(ZkStateReader.java:72)
   [junit4]   2> 	at org.apache.solr.common.cloud.ZkStateReader$LiveNodeWatcher.refreshAndWatch(ZkStateReader.java:1090)
   [junit4]   2> 	at org.apache.solr.common.cloud.ZkStateReader$LiveNodeWatcher.process(ZkStateReader.java:1085)
   [junit4]   2> 	at org.apache.solr.common.cloud.SolrZkClient$1.lambda$process$1(SolrZkClient.java:268)
   [junit4]   2> 	at java.util.concurrent.Executors$RunnableAdapter.call(Executors.java:511)
   [junit4]   2> 	at java.util.concurrent.FutureTask.run(FutureTask.java:266)
   [junit4]   2> 	at org.apache.solr.common.util.ExecutorUtil$MDCAwareThreadPoolExecutor.lambda$execute$0(ExecutorUtil.java:188)
   [junit4]   2> 	at java.util.concurrent.ThreadPoolExecutor.runWorker(ThreadPoolExecutor.java:1149)
   [junit4]   2> 	at java.util.concurrent.ThreadPoolExecutor$Worker.run(ThreadPoolExecutor.java:624)
   [junit4]   2> 	at java.lang.Thread.run(Thread.java:748)
   [junit4]   2> 2843752 INFO  (jetty-closer-6222-thread-3) [    ] o.e.j.s.h.ContextHandler Stopped o.e.j.s.ServletContextHandler@66475752{/solr,null,UNAVAILABLE}
   [junit4]   2> 2843782 INFO  (jetty-closer-6222-thread-2) [    ] o.e.j.s.h.ContextHandler Stopped o.e.j.s.ServletContextHandler@593b7590{/solr,null,UNAVAILABLE}
   [junit4]   2> 2843785 ERROR (SUITE-CollectionsAPIDistributedZkTest-seed#[212C3DF6229AD48D]-worker) [    ] o.a.z.s.ZooKeeperServer ZKShutdownHandler is not registered, so ZooKeeper server won't take any action on ERROR or SHUTDOWN server state changes
   [junit4]   2> 2843786 INFO  (SUITE-CollectionsAPIDistributedZkTest-seed#[212C3DF6229AD48D]-worker) [    ] o.a.s.c.ZkTestServer connecting to 127.0.0.1:56031 56031
   [junit4]   2> 2843801 INFO  (Thread-7468) [    ] o.a.s.c.ZkTestServer connecting to 127.0.0.1:56031 56031
   [junit4]   2> 2843805 WARN  (Thread-7468) [    ] o.a.s.c.ZkTestServer Watch limit violations: 
   [junit4]   2> Maximum concurrent create/delete watches above limit:
   [junit4]   2> 
   [junit4]   2> 	22	/solr/configs/conf
   [junit4]   2> 	17	/solr/aliases.json
   [junit4]   2> 	17	/solr/clusterprops.json
   [junit4]   2> 
   [junit4]   2> Maximum concurrent data watches above limit:
   [junit4]   2> 
   [junit4]   2> 	52	/solr/collections/addReplicaColl/state.json
   [junit4]   2> 	26	/solr/collections/reloaded_collection/state.json
   [junit4]   2> 	24	/solr/collections/nodes_used_collection/state.json
   [junit4]   2> 	17	/solr/clusterstate.json
   [junit4]   2> 	15	/solr/collections/acollectionafterbaddelete/state.json
   [junit4]   2> 	13	/solr/collections/halfdeletedcollection/state.json
   [junit4]   2> 	10	/solr/collections/onlyinzk/state.json
   [junit4]   2> 	5	/solr/collections/withconfigset2/state.json
   [junit4]   2> 	5	/solr/collections/created_and_deleted/state.json
   [junit4]   2> 	4	/solr/collections/halfcollectionblocker/state.json
   [junit4]   2> 	4	/solr/collections/halfcollection/state.json
   [junit4]   2> 	4	/solr/collections/halfcollectionblocker2/state.json
   [junit4]   2> 	2	/solr/collections/addReplicaColl/leader_elect/shard1/election/99205077793832972-core_node4-n_0000000000
   [junit4]   2> 
   [junit4]   2> Maximum concurrent children watches above limit:
   [junit4]   2> 
   [junit4]   2> 	364	/solr/collections
   [junit4]   2> 	17	/solr/live_nodes
   [junit4]   2> 
   [junit4]   2> NOTE: leaving temporary files on disk at: /export/home/jenkins/workspace/Lucene-Solr-7.x-Solaris/solr/build/solr-core/test/J1/temp/solr.cloud.CollectionsAPIDistributedZkTest_212C3DF6229AD48D-001
   [junit4]   2> Dec 20, 2017 5:57:34 AM com.carrotsearch.randomizedtesting.ThreadLeakControl checkThreadLeaks
   [junit4]   2> WARNING: Will linger awaiting termination of 1 leaked thread(s).
   [junit4]   2> NOTE: test params are: codec=Asserting(Lucene70): {id=PostingsFormat(name=MockRandom)}, docValues:{}, maxPointsInLeafNode=1285, maxMBSortInHeap=5.401298273783112, sim=RandomSimilarity(queryNorm=false): {}, locale=is, timezone=NST
   [junit4]   2> NOTE: SunOS 5.11 amd64/Oracle Corporation 1.8.0_152 (64-bit)/cpus=3,threads=1,free=181018104,total=518979584
   [junit4]   2> NOTE: All tests run in this JVM: [HdfsAutoAddReplicasIntegrationTest, TestSerializedLuceneMatchVersion, ConfigureRecoveryStrategyTest, SynonymTokenizerTest, TestFieldCacheReopen, TestManagedSynonymGraphFilterFactory, TestObjectReleaseTracker, NodeAddedTriggerTest, HdfsThreadLeakTest, UUIDUpdateProcessorFallbackTest, CoreMergeIndexesAdminHandlerTest, TestStressCloudBlindAtomicUpdates, TestNumericRangeQuery32, TestHashPartitioner, SolrShardReporterTest, TestCloudInspectUtil, TestCloudNestedDocsSort, TestGenericDistributedQueue, PreAnalyzedUpdateProcessorTest, SimpleFacetsTest, TestPushWriter, TestUnifiedSolrHighlighter, OpenCloseCoreStressTest, TestFoldingMultitermQuery, TestPayloadCheckQParserPlugin, TestExtendedDismaxParser, PingRequestHandlerTest, TestSimpleTrackingShardHandler, ManagedSchemaRoundRobinCloudTest, DeleteStatusTest, TestSolrConfigHandlerCloud, ConcurrentDeleteAndCreateCollectionTest, SSLMigrationTest, TestRequestForwarding, TestSolrCloudWithHadoopAuthPlugin, TestConfig, TestLeaderInitiatedRecoveryThread, TestZkChroot, TestNoOpRegenerator, TestCloudRecovery, ComputePlanActionTest, SolrMetricReporterTest, OverseerCollectionConfigSetProcessorTest, TestQueryTypes, TestOnReconnectListenerSupport, PluginInfoTest, FileUtilsTest, TestFieldCacheSortRandom, TestDocumentBuilder, TestConfigSets, SoftAutoCommitTest, OpenExchangeRatesOrgProviderTest, CollectionsAPIAsyncDistributedZkTest, CurrencyFieldTypeTest, DocumentAnalysisRequestHandlerTest, BigEndianAscendingWordDeserializerTest, DistributedFacetPivotWhiteBoxTest, RestartWhileUpdatingTest, TestCloudSchemaless, AssignTest, TestAnalyzeInfixSuggestions, TestWordDelimiterFilterFactory, TestConfigReload, TestSolrCloudWithKerberosAlt, TestRTGBase, EchoParamsTest, TestEmbeddedSolrServerConstructors, BooleanFieldTest, HdfsCollectionsAPIDistributedZkTest, TestBinaryResponseWriter, TestNumericTokenStream, TestHdfsBackupRestoreCore, TestRandomFaceting, SolrIndexMetricsTest, TestSolrJ, UtilsToolTest, TestSearcherReuse, BlockJoinFacetDistribTest, NumberUtilsTest, TestValueSourceCache, TestExportWriter, TestLegacyNumericRangeQueryBuilder, TestNumericTerms32, TestSSLRandomization, CustomCollectionTest, TestPointFields, TestHashQParserPlugin, QueryEqualityTest, FieldMutatingUpdateProcessorTest, LeaderFailoverAfterPartitionTest, OverseerRolesTest, SuggestComponentTest, TestCustomStream, TestPivotHelperCode, TestUseDocValuesAsStored2, AnalysisAfterCoreReloadTest, TestSmileRequest, TestSubQueryTransformerDistrib, TestSchemaSimilarityResource, MBeansHandlerTest, RecoveryAfterSoftCommitTest, TestRecoveryHdfs, SystemInfoHandlerTest, ZkNodePropsTest, BitVectorTest, FullSolrCloudDistribCmdsTest, TestLockTree, DocValuesMultiTest, MoveReplicaHDFSTest, TestInPlaceUpdatesDistrib, SimplePostToolTest, TestMinMaxOnMultiValuedField, CdcrRequestHandlerTest, TestQueryWrapperFilter, DistributedFacetPivotLargeTest, MetricsHandlerTest, BadComponentTest, DistributedExpandComponentTest, TestLuceneIndexBackCompat, TestCoreAdminApis, TestSolrDeletionPolicy1, TestBulkSchemaConcurrent, TestAddFieldRealTimeGet, TestDynamicFieldCollectionResource, SampleTest, BasicFunctionalityTest, SolrGangliaReporterTest, TestIntervalFaceting, TestSortByMinMaxFunction, TestSolrCLIRunExample, TestLuceneMatchVersion, HdfsRestartWhileUpdatingTest, TestJettySolrRunner, PreAnalyzedFieldTest, OutOfBoxZkACLAndCredentialsProvidersTest, CopyFieldTest, TestBM25SimilarityFactory, TestStressReorder, TestMissingGroups, TestReqParamsAPI, MetricUtilsTest, TestCollectionsAPIViaSolrCloudCluster, TestSubQueryTransformer, LeaderElectionIntegrationTest, TestTriggerIntegration, SolrSlf4jReporterTest, DataDrivenBlockJoinTest, TestDistribStateManager, DistributedMLTComponentTest, TestPerFieldSimilarity, DocValuesTest, BlockJoinFacetSimpleTest, TestScoreJoinQPNoScore, TestExpandComponent, BasicDistributedZk2Test, AtomicUpdatesTest, CoreAdminCreateDiscoverTest, ActionThrottleTest, TestDocTermOrds, TestGroupingSearch, TestStressLucene, DistributedQueryComponentOptimizationTest, DistributedIntervalFacetingTest, UninvertDocValuesMergePolicyTest, TestFieldTypeCollectionResource, SolrIndexSplitterTest, TestLMJelinekMercerSimilarityFactory, AliasIntegrationTest, TestManagedResourceStorage, ShardSplitTest, TestCoreContainer, TestConfigSetImmutable, TestExceedMaxTermLength, TestTrie, TestPolicyCloud, TestStressLiveNodes, TermsComponentTest, TestSystemIdResolver, SolrCoreTest, TestSchemalessBufferedUpdates, CdcrReplicationDistributedZkTest, TestUtilizeNode, TestPartialUpdateDeduplication, TestLeaderElectionWithEmptyReplica, LegacyCloudClusterPropTest, TermVectorComponentDistributedTest, DebugComponentTest, TestCustomSort, ChaosMonkeySafeLeaderTest, UnloadDistributedZkTest, CollectionsAPIDistributedZkTest]
   [junit4] Completed [385/763 (1!)] on J1 in 99.27s, 19 tests, 1 error <<< FAILURES!

[...truncated 49326 lines...]

Mime
View raw message