lucene-dev mailing list archives

Site index · List index
Message view « Date » · « Thread »
Top « Date » · « Thread »
From Policeman Jenkins Server <jenk...@thetaphi.de>
Subject [JENKINS] Lucene-Solr-master-Linux (32bit/jdk1.8.0_144) - Build # 21158 - Still Unstable!
Date Thu, 28 Dec 2017 05:08:17 GMT
Build: https://jenkins.thetaphi.de/job/Lucene-Solr-master-Linux/21158/
Java: 32bit/jdk1.8.0_144 -client -XX:+UseConcMarkSweepGC

2 tests failed.
FAILED:  org.apache.solr.cloud.TestCollectionAPI.test

Error Message:
Property 'preferredleader' with value null not set correctly for collection/replica pair: testcollection/core_node7 property map is {core=testcollection_shard2_replica_n3, base_url=https://127.0.0.1:40747, node_name=127.0.0.1:40747_, state=active, type=NRT, leader=true}.

Stack Trace:
java.lang.AssertionError: Property 'preferredleader' with value null not set correctly for collection/replica pair: testcollection/core_node7 property map is {core=testcollection_shard2_replica_n3, base_url=https://127.0.0.1:40747, node_name=127.0.0.1:40747_, state=active, type=NRT, leader=true}.
	at __randomizedtesting.SeedInfo.seed([8257B112E10D42BA:A038EC84FF12F42]:0)
	at org.junit.Assert.fail(Assert.java:93)
	at org.apache.solr.cloud.ReplicaPropertiesBase.verifyPropertyVal(ReplicaPropertiesBase.java:95)
	at org.apache.solr.cloud.TestCollectionAPI.replicaPropTest(TestCollectionAPI.java:428)
	at org.apache.solr.cloud.TestCollectionAPI.test(TestCollectionAPI.java:92)
	at sun.reflect.NativeMethodAccessorImpl.invoke0(Native Method)
	at sun.reflect.NativeMethodAccessorImpl.invoke(NativeMethodAccessorImpl.java:62)
	at sun.reflect.DelegatingMethodAccessorImpl.invoke(DelegatingMethodAccessorImpl.java:43)
	at java.lang.reflect.Method.invoke(Method.java:498)
	at com.carrotsearch.randomizedtesting.RandomizedRunner.invoke(RandomizedRunner.java:1737)
	at com.carrotsearch.randomizedtesting.RandomizedRunner$8.evaluate(RandomizedRunner.java:934)
	at com.carrotsearch.randomizedtesting.RandomizedRunner$9.evaluate(RandomizedRunner.java:970)
	at com.carrotsearch.randomizedtesting.RandomizedRunner$10.evaluate(RandomizedRunner.java:984)
	at org.apache.solr.BaseDistributedSearchTestCase$ShardsRepeatRule$ShardsFixedStatement.callStatement(BaseDistributedSearchTestCase.java:993)
	at org.apache.solr.BaseDistributedSearchTestCase$ShardsRepeatRule$ShardsStatement.evaluate(BaseDistributedSearchTestCase.java:968)
	at com.carrotsearch.randomizedtesting.rules.SystemPropertiesRestoreRule$1.evaluate(SystemPropertiesRestoreRule.java:57)
	at org.apache.lucene.util.TestRuleSetupTeardownChained$1.evaluate(TestRuleSetupTeardownChained.java:49)
	at org.apache.lucene.util.AbstractBeforeAfterRule$1.evaluate(AbstractBeforeAfterRule.java:45)
	at org.apache.lucene.util.TestRuleThreadAndTestName$1.evaluate(TestRuleThreadAndTestName.java:48)
	at org.apache.lucene.util.TestRuleIgnoreAfterMaxFailures$1.evaluate(TestRuleIgnoreAfterMaxFailures.java:64)
	at org.apache.lucene.util.TestRuleMarkFailure$1.evaluate(TestRuleMarkFailure.java:47)
	at com.carrotsearch.randomizedtesting.rules.StatementAdapter.evaluate(StatementAdapter.java:36)
	at com.carrotsearch.randomizedtesting.ThreadLeakControl$StatementRunner.run(ThreadLeakControl.java:368)
	at com.carrotsearch.randomizedtesting.ThreadLeakControl.forkTimeoutingTask(ThreadLeakControl.java:817)
	at com.carrotsearch.randomizedtesting.ThreadLeakControl$3.evaluate(ThreadLeakControl.java:468)
	at com.carrotsearch.randomizedtesting.RandomizedRunner.runSingleTest(RandomizedRunner.java:943)
	at com.carrotsearch.randomizedtesting.RandomizedRunner$5.evaluate(RandomizedRunner.java:829)
	at com.carrotsearch.randomizedtesting.RandomizedRunner$6.evaluate(RandomizedRunner.java:879)
	at com.carrotsearch.randomizedtesting.RandomizedRunner$7.evaluate(RandomizedRunner.java:890)
	at com.carrotsearch.randomizedtesting.rules.StatementAdapter.evaluate(StatementAdapter.java:36)
	at com.carrotsearch.randomizedtesting.rules.SystemPropertiesRestoreRule$1.evaluate(SystemPropertiesRestoreRule.java:57)
	at org.apache.lucene.util.AbstractBeforeAfterRule$1.evaluate(AbstractBeforeAfterRule.java:45)
	at com.carrotsearch.randomizedtesting.rules.StatementAdapter.evaluate(StatementAdapter.java:36)
	at org.apache.lucene.util.TestRuleStoreClassName$1.evaluate(TestRuleStoreClassName.java:41)
	at com.carrotsearch.randomizedtesting.rules.NoShadowingOrOverridesOnMethodsRule$1.evaluate(NoShadowingOrOverridesOnMethodsRule.java:40)
	at com.carrotsearch.randomizedtesting.rules.NoShadowingOrOverridesOnMethodsRule$1.evaluate(NoShadowingOrOverridesOnMethodsRule.java:40)
	at com.carrotsearch.randomizedtesting.rules.StatementAdapter.evaluate(StatementAdapter.java:36)
	at com.carrotsearch.randomizedtesting.rules.StatementAdapter.evaluate(StatementAdapter.java:36)
	at com.carrotsearch.randomizedtesting.rules.StatementAdapter.evaluate(StatementAdapter.java:36)
	at org.apache.lucene.util.TestRuleAssertionsRequired$1.evaluate(TestRuleAssertionsRequired.java:53)
	at org.apache.lucene.util.TestRuleMarkFailure$1.evaluate(TestRuleMarkFailure.java:47)
	at org.apache.lucene.util.TestRuleIgnoreAfterMaxFailures$1.evaluate(TestRuleIgnoreAfterMaxFailures.java:64)
	at org.apache.lucene.util.TestRuleIgnoreTestSuites$1.evaluate(TestRuleIgnoreTestSuites.java:54)
	at com.carrotsearch.randomizedtesting.rules.StatementAdapter.evaluate(StatementAdapter.java:36)
	at com.carrotsearch.randomizedtesting.ThreadLeakControl$StatementRunner.run(ThreadLeakControl.java:368)
	at java.lang.Thread.run(Thread.java:748)


FAILED:  org.apache.solr.cloud.autoscaling.TriggerIntegrationTest.testEventQueue

Error Message:
action wasn't interrupted

Stack Trace:
java.lang.AssertionError: action wasn't interrupted
	at __randomizedtesting.SeedInfo.seed([8257B112E10D42BA:4BE2F3BCE86A844F]:0)
	at org.junit.Assert.fail(Assert.java:93)
	at org.junit.Assert.assertTrue(Assert.java:43)
	at org.apache.solr.cloud.autoscaling.TriggerIntegrationTest.testEventQueue(TriggerIntegrationTest.java:711)
	at sun.reflect.NativeMethodAccessorImpl.invoke0(Native Method)
	at sun.reflect.NativeMethodAccessorImpl.invoke(NativeMethodAccessorImpl.java:62)
	at sun.reflect.DelegatingMethodAccessorImpl.invoke(DelegatingMethodAccessorImpl.java:43)
	at java.lang.reflect.Method.invoke(Method.java:498)
	at com.carrotsearch.randomizedtesting.RandomizedRunner.invoke(RandomizedRunner.java:1737)
	at com.carrotsearch.randomizedtesting.RandomizedRunner$8.evaluate(RandomizedRunner.java:934)
	at com.carrotsearch.randomizedtesting.RandomizedRunner$9.evaluate(RandomizedRunner.java:970)
	at com.carrotsearch.randomizedtesting.RandomizedRunner$10.evaluate(RandomizedRunner.java:984)
	at com.carrotsearch.randomizedtesting.rules.SystemPropertiesRestoreRule$1.evaluate(SystemPropertiesRestoreRule.java:57)
	at org.apache.lucene.util.TestRuleSetupTeardownChained$1.evaluate(TestRuleSetupTeardownChained.java:49)
	at org.apache.lucene.util.AbstractBeforeAfterRule$1.evaluate(AbstractBeforeAfterRule.java:45)
	at org.apache.lucene.util.TestRuleThreadAndTestName$1.evaluate(TestRuleThreadAndTestName.java:48)
	at org.apache.lucene.util.TestRuleIgnoreAfterMaxFailures$1.evaluate(TestRuleIgnoreAfterMaxFailures.java:64)
	at org.apache.lucene.util.TestRuleMarkFailure$1.evaluate(TestRuleMarkFailure.java:47)
	at com.carrotsearch.randomizedtesting.rules.StatementAdapter.evaluate(StatementAdapter.java:36)
	at com.carrotsearch.randomizedtesting.ThreadLeakControl$StatementRunner.run(ThreadLeakControl.java:368)
	at com.carrotsearch.randomizedtesting.ThreadLeakControl.forkTimeoutingTask(ThreadLeakControl.java:817)
	at com.carrotsearch.randomizedtesting.ThreadLeakControl$3.evaluate(ThreadLeakControl.java:468)
	at com.carrotsearch.randomizedtesting.RandomizedRunner.runSingleTest(RandomizedRunner.java:943)
	at com.carrotsearch.randomizedtesting.RandomizedRunner$5.evaluate(RandomizedRunner.java:829)
	at com.carrotsearch.randomizedtesting.RandomizedRunner$6.evaluate(RandomizedRunner.java:879)
	at com.carrotsearch.randomizedtesting.RandomizedRunner$7.evaluate(RandomizedRunner.java:890)
	at com.carrotsearch.randomizedtesting.rules.StatementAdapter.evaluate(StatementAdapter.java:36)
	at com.carrotsearch.randomizedtesting.rules.SystemPropertiesRestoreRule$1.evaluate(SystemPropertiesRestoreRule.java:57)
	at org.apache.lucene.util.AbstractBeforeAfterRule$1.evaluate(AbstractBeforeAfterRule.java:45)
	at com.carrotsearch.randomizedtesting.rules.StatementAdapter.evaluate(StatementAdapter.java:36)
	at org.apache.lucene.util.TestRuleStoreClassName$1.evaluate(TestRuleStoreClassName.java:41)
	at com.carrotsearch.randomizedtesting.rules.NoShadowingOrOverridesOnMethodsRule$1.evaluate(NoShadowingOrOverridesOnMethodsRule.java:40)
	at com.carrotsearch.randomizedtesting.rules.NoShadowingOrOverridesOnMethodsRule$1.evaluate(NoShadowingOrOverridesOnMethodsRule.java:40)
	at com.carrotsearch.randomizedtesting.rules.StatementAdapter.evaluate(StatementAdapter.java:36)
	at com.carrotsearch.randomizedtesting.rules.StatementAdapter.evaluate(StatementAdapter.java:36)
	at com.carrotsearch.randomizedtesting.rules.StatementAdapter.evaluate(StatementAdapter.java:36)
	at org.apache.lucene.util.TestRuleAssertionsRequired$1.evaluate(TestRuleAssertionsRequired.java:53)
	at org.apache.lucene.util.TestRuleMarkFailure$1.evaluate(TestRuleMarkFailure.java:47)
	at org.apache.lucene.util.TestRuleIgnoreAfterMaxFailures$1.evaluate(TestRuleIgnoreAfterMaxFailures.java:64)
	at org.apache.lucene.util.TestRuleIgnoreTestSuites$1.evaluate(TestRuleIgnoreTestSuites.java:54)
	at com.carrotsearch.randomizedtesting.rules.StatementAdapter.evaluate(StatementAdapter.java:36)
	at com.carrotsearch.randomizedtesting.ThreadLeakControl$StatementRunner.run(ThreadLeakControl.java:368)
	at java.lang.Thread.run(Thread.java:748)




Build Log:
[...truncated 12273 lines...]
   [junit4] Suite: org.apache.solr.cloud.autoscaling.TriggerIntegrationTest
   [junit4]   2> 657931 INFO  (SUITE-TriggerIntegrationTest-seed#[8257B112E10D42BA]-worker) [    ] o.a.s.SolrTestCaseJ4 SecureRandom sanity checks: test.solr.allowed.securerandom=null & java.security.egd=file:/dev/./urandom
   [junit4]   2> Creating dataDir: /home/jenkins/workspace/Lucene-Solr-master-Linux/solr/build/solr-core/test/J1/temp/solr.cloud.autoscaling.TriggerIntegrationTest_8257B112E10D42BA-001/init-core-data-001
   [junit4]   2> 657932 INFO  (SUITE-TriggerIntegrationTest-seed#[8257B112E10D42BA]-worker) [    ] o.a.s.SolrTestCaseJ4 Using PointFields (NUMERIC_POINTS_SYSPROP=true) w/NUMERIC_DOCVALUES_SYSPROP=true
   [junit4]   2> 657933 INFO  (SUITE-TriggerIntegrationTest-seed#[8257B112E10D42BA]-worker) [    ] o.a.s.SolrTestCaseJ4 Randomized ssl (true) and clientAuth (false) via: @org.apache.solr.util.RandomizeSSL(reason=, ssl=NaN, value=NaN, clientAuth=NaN)
   [junit4]   2> 657934 INFO  (SUITE-TriggerIntegrationTest-seed#[8257B112E10D42BA]-worker) [    ] o.a.s.c.MiniSolrCloudCluster Starting cluster of 2 servers in /home/jenkins/workspace/Lucene-Solr-master-Linux/solr/build/solr-core/test/J1/temp/solr.cloud.autoscaling.TriggerIntegrationTest_8257B112E10D42BA-001/tempDir-001
   [junit4]   2> 657934 INFO  (SUITE-TriggerIntegrationTest-seed#[8257B112E10D42BA]-worker) [    ] o.a.s.c.ZkTestServer STARTING ZK TEST SERVER
   [junit4]   2> 657934 INFO  (Thread-1210) [    ] o.a.s.c.ZkTestServer client port:0.0.0.0/0.0.0.0:0
   [junit4]   2> 657934 INFO  (Thread-1210) [    ] o.a.s.c.ZkTestServer Starting server
   [junit4]   2> 657935 ERROR (Thread-1210) [    ] o.a.z.s.ZooKeeperServer ZKShutdownHandler is not registered, so ZooKeeper server won't take any action on ERROR or SHUTDOWN server state changes
   [junit4]   2> 658034 INFO  (SUITE-TriggerIntegrationTest-seed#[8257B112E10D42BA]-worker) [    ] o.a.s.c.ZkTestServer start zk server on port:35093
   [junit4]   2> 658036 INFO  (zkConnectionManagerCallback-1578-thread-1) [    ] o.a.s.c.c.ConnectionManager zkClient has connected
   [junit4]   2> 658049 INFO  (jetty-launcher-1575-thread-1) [    ] o.e.j.s.Server jetty-9.3.20.v20170531
   [junit4]   2> 658050 INFO  (jetty-launcher-1575-thread-2) [    ] o.e.j.s.Server jetty-9.3.20.v20170531
   [junit4]   2> 658067 INFO  (jetty-launcher-1575-thread-2) [    ] o.e.j.s.h.ContextHandler Started o.e.j.s.ServletContextHandler@49ebd2{/solr,null,AVAILABLE}
   [junit4]   2> 658067 INFO  (jetty-launcher-1575-thread-1) [    ] o.e.j.s.h.ContextHandler Started o.e.j.s.ServletContextHandler@1ea6a02{/solr,null,AVAILABLE}
   [junit4]   2> 658079 INFO  (jetty-launcher-1575-thread-1) [    ] o.e.j.s.AbstractConnector Started ServerConnector@afe07f{SSL,[ssl, http/1.1]}{127.0.0.1:40483}
   [junit4]   2> 658079 INFO  (jetty-launcher-1575-thread-1) [    ] o.e.j.s.Server Started @659097ms
   [junit4]   2> 658079 INFO  (jetty-launcher-1575-thread-1) [    ] o.a.s.c.s.e.JettySolrRunner Jetty properties: {hostContext=/solr, hostPort=40483}
   [junit4]   2> 658079 ERROR (jetty-launcher-1575-thread-1) [    ] o.a.s.u.StartupLoggingUtils Missing Java Option solr.log.dir. Logging may be missing or incomplete.
   [junit4]   2> 658079 INFO  (jetty-launcher-1575-thread-1) [    ] o.a.s.s.SolrDispatchFilter  ___      _       Welcome to Apache Solr™ version 8.0.0
   [junit4]   2> 658079 INFO  (jetty-launcher-1575-thread-1) [    ] o.a.s.s.SolrDispatchFilter / __| ___| |_ _   Starting in cloud mode on port null
   [junit4]   2> 658079 INFO  (jetty-launcher-1575-thread-1) [    ] o.a.s.s.SolrDispatchFilter \__ \/ _ \ | '_|  Install dir: null
   [junit4]   2> 658079 INFO  (jetty-launcher-1575-thread-1) [    ] o.a.s.s.SolrDispatchFilter |___/\___/_|_|    Start time: 2017-12-28T04:11:16.296Z
   [junit4]   2> 658080 INFO  (jetty-launcher-1575-thread-2) [    ] o.e.j.s.AbstractConnector Started ServerConnector@1a8d00a{SSL,[ssl, http/1.1]}{127.0.0.1:33193}
   [junit4]   2> 658080 INFO  (jetty-launcher-1575-thread-2) [    ] o.e.j.s.Server Started @659098ms
   [junit4]   2> 658080 INFO  (jetty-launcher-1575-thread-2) [    ] o.a.s.c.s.e.JettySolrRunner Jetty properties: {hostContext=/solr, hostPort=33193}
   [junit4]   2> 658080 ERROR (jetty-launcher-1575-thread-2) [    ] o.a.s.u.StartupLoggingUtils Missing Java Option solr.log.dir. Logging may be missing or incomplete.
   [junit4]   2> 658080 INFO  (jetty-launcher-1575-thread-2) [    ] o.a.s.s.SolrDispatchFilter  ___      _       Welcome to Apache Solr™ version 8.0.0
   [junit4]   2> 658080 INFO  (jetty-launcher-1575-thread-2) [    ] o.a.s.s.SolrDispatchFilter / __| ___| |_ _   Starting in cloud mode on port null
   [junit4]   2> 658080 INFO  (jetty-launcher-1575-thread-2) [    ] o.a.s.s.SolrDispatchFilter \__ \/ _ \ | '_|  Install dir: null
   [junit4]   2> 658081 INFO  (jetty-launcher-1575-thread-2) [    ] o.a.s.s.SolrDispatchFilter |___/\___/_|_|    Start time: 2017-12-28T04:11:16.298Z
   [junit4]   2> 658087 INFO  (zkConnectionManagerCallback-1580-thread-1) [    ] o.a.s.c.c.ConnectionManager zkClient has connected
   [junit4]   2> 658087 INFO  (zkConnectionManagerCallback-1582-thread-1) [    ] o.a.s.c.c.ConnectionManager zkClient has connected
   [junit4]   2> 658088 INFO  (jetty-launcher-1575-thread-1) [    ] o.a.s.s.SolrDispatchFilter solr.xml found in ZooKeeper. Loading...
   [junit4]   2> 658090 INFO  (jetty-launcher-1575-thread-2) [    ] o.a.s.s.SolrDispatchFilter solr.xml found in ZooKeeper. Loading...
   [junit4]   2> 658111 INFO  (jetty-launcher-1575-thread-1) [    ] o.a.s.c.ZkContainer Zookeeper client=127.0.0.1:35093/solr
   [junit4]   2> 658111 INFO  (jetty-launcher-1575-thread-2) [    ] o.a.s.c.ZkContainer Zookeeper client=127.0.0.1:35093/solr
   [junit4]   2> 658115 INFO  (zkConnectionManagerCallback-1588-thread-1) [    ] o.a.s.c.c.ConnectionManager zkClient has connected
   [junit4]   2> 658115 INFO  (zkConnectionManagerCallback-1590-thread-1) [    ] o.a.s.c.c.ConnectionManager zkClient has connected
   [junit4]   2> 658116 WARN  (NIOServerCxn.Factory:0.0.0.0/0.0.0.0:0) [    ] o.a.z.s.NIOServerCnxn caught end of stream exception
   [junit4]   2> EndOfStreamException: Unable to read additional data from client sessionid 0x1609b512b380003, likely client has closed socket
   [junit4]   2> 	at org.apache.zookeeper.server.NIOServerCnxn.doIO(NIOServerCnxn.java:239)
   [junit4]   2> 	at org.apache.zookeeper.server.NIOServerCnxnFactory.run(NIOServerCnxnFactory.java:203)
   [junit4]   2> 	at java.lang.Thread.run(Thread.java:748)
   [junit4]   2> 658119 INFO  (zkConnectionManagerCallback-1594-thread-1-processing-n:127.0.0.1:33193_solr) [n:127.0.0.1:33193_solr    ] o.a.s.c.c.ConnectionManager zkClient has connected
   [junit4]   2> 658119 INFO  (zkConnectionManagerCallback-1593-thread-1-processing-n:127.0.0.1:40483_solr) [n:127.0.0.1:40483_solr    ] o.a.s.c.c.ConnectionManager zkClient has connected
   [junit4]   2> 658199 INFO  (jetty-launcher-1575-thread-2) [n:127.0.0.1:33193_solr    ] o.a.s.c.Overseer Overseer (id=null) closing
   [junit4]   2> 658199 INFO  (jetty-launcher-1575-thread-2) [n:127.0.0.1:33193_solr    ] o.a.s.c.OverseerElectionContext I am going to be the leader 127.0.0.1:33193_solr
   [junit4]   2> 658200 INFO  (jetty-launcher-1575-thread-2) [n:127.0.0.1:33193_solr    ] o.a.s.c.Overseer Overseer (id=99249964721897477-127.0.0.1:33193_solr-n_0000000000) starting
   [junit4]   2> 658208 INFO  (jetty-launcher-1575-thread-1) [n:127.0.0.1:40483_solr    ] o.a.s.c.Overseer Overseer (id=null) closing
   [junit4]   2> 658209 INFO  (jetty-launcher-1575-thread-1) [n:127.0.0.1:40483_solr    ] o.a.s.c.ZkController Register node as live in ZooKeeper:/live_nodes/127.0.0.1:40483_solr
   [junit4]   2> 658219 INFO  (zkCallback-1591-thread-1-processing-n:127.0.0.1:40483_solr) [n:127.0.0.1:40483_solr    ] o.a.s.c.c.ZkStateReader Updated live nodes from ZooKeeper... (0) -> (1)
   [junit4]   2> 658223 DEBUG (OverseerAutoScalingTriggerThread-99249964721897477-127.0.0.1:33193_solr-n_0000000000) [n:127.0.0.1:33193_solr    ] o.a.s.c.a.OverseerTriggerThread Adding .autoAddReplicas trigger
   [junit4]   2> 658227 INFO  (zkCallback-1592-thread-1-processing-n:127.0.0.1:33193_solr) [n:127.0.0.1:33193_solr    ] o.a.s.c.c.ZkStateReader Updated live nodes from ZooKeeper... (0) -> (1)
   [junit4]   2> 658229 INFO  (jetty-launcher-1575-thread-2) [n:127.0.0.1:33193_solr    ] o.a.s.c.ZkController Register node as live in ZooKeeper:/live_nodes/127.0.0.1:33193_solr
   [junit4]   2> 658230 DEBUG (OverseerAutoScalingTriggerThread-99249964721897477-127.0.0.1:33193_solr-n_0000000000) [n:127.0.0.1:33193_solr    ] o.a.s.c.a.OverseerTriggerThread Refreshing /autoscaling.json with znode version 1
   [junit4]   2> 658230 INFO  (zkCallback-1591-thread-1-processing-n:127.0.0.1:40483_solr) [n:127.0.0.1:40483_solr    ] o.a.s.c.c.ZkStateReader Updated live nodes from ZooKeeper... (1) -> (2)
   [junit4]   2> 658237 DEBUG (OverseerAutoScalingTriggerThread-99249964721897477-127.0.0.1:33193_solr-n_0000000000) [n:127.0.0.1:33193_solr    ] o.a.s.c.a.NodeLostTrigger Initial livenodes: [127.0.0.1:40483_solr]
   [junit4]   2> 658238 DEBUG (OverseerAutoScalingTriggerThread-99249964721897477-127.0.0.1:33193_solr-n_0000000000) [n:127.0.0.1:33193_solr    ] o.a.s.c.a.OverseerTriggerThread Current znodeVersion 1, lastZnodeVersion -1
   [junit4]   2> 658238 DEBUG (OverseerAutoScalingTriggerThread-99249964721897477-127.0.0.1:33193_solr-n_0000000000) [n:127.0.0.1:33193_solr    ] o.a.s.c.a.OverseerTriggerThread Processed trigger updates upto znodeVersion 1
   [junit4]   2> 658241 INFO  (zkCallback-1592-thread-1-processing-n:127.0.0.1:33193_solr) [n:127.0.0.1:33193_solr    ] o.a.s.c.c.ZkStateReader Updated live nodes from ZooKeeper... (1) -> (2)
   [junit4]   2> 658241 DEBUG (OverseerAutoScalingTriggerThread-99249964721897477-127.0.0.1:33193_solr-n_0000000000) [n:127.0.0.1:33193_solr    ] o.a.s.c.a.OverseerTriggerThread -- clean old nodeAdded markers
   [junit4]   2> 658242 DEBUG (OverseerAutoScalingTriggerThread-99249964721897477-127.0.0.1:33193_solr-n_0000000000) [n:127.0.0.1:33193_solr    ] o.a.s.c.a.OverseerTriggerThread Current znodeVersion 1, lastZnodeVersion 1
   [junit4]   2> 658242 DEBUG (ScheduledTrigger-2148-thread-1) [n:127.0.0.1:33193_solr    ] o.a.s.c.a.NodeLostTrigger Running NodeLostTrigger: .auto_add_replicas with currently live nodes: 2
   [junit4]   2> 658518 INFO  (jetty-launcher-1575-thread-1) [n:127.0.0.1:40483_solr    ] o.a.s.m.r.SolrJmxReporter JMX monitoring for 'solr_40483.solr.node' (registry 'solr.node') enabled at server: com.sun.jmx.mbeanserver.JmxMBeanServer@1ada017
   [junit4]   2> 658529 INFO  (jetty-launcher-1575-thread-1) [n:127.0.0.1:40483_solr    ] o.a.s.m.r.SolrJmxReporter JMX monitoring for 'solr_40483.solr.jvm' (registry 'solr.jvm') enabled at server: com.sun.jmx.mbeanserver.JmxMBeanServer@1ada017
   [junit4]   2> 658529 INFO  (jetty-launcher-1575-thread-1) [n:127.0.0.1:40483_solr    ] o.a.s.m.r.SolrJmxReporter JMX monitoring for 'solr_40483.solr.jetty' (registry 'solr.jetty') enabled at server: com.sun.jmx.mbeanserver.JmxMBeanServer@1ada017
   [junit4]   2> 658530 INFO  (jetty-launcher-1575-thread-1) [n:127.0.0.1:40483_solr    ] o.a.s.c.CorePropertiesLocator Found 0 core definitions underneath /home/jenkins/workspace/Lucene-Solr-master-Linux/solr/build/solr-core/test/J1/temp/solr.cloud.autoscaling.TriggerIntegrationTest_8257B112E10D42BA-001/tempDir-001/node1/.
   [junit4]   2> 658545 INFO  (jetty-launcher-1575-thread-2) [n:127.0.0.1:33193_solr    ] o.a.s.m.r.SolrJmxReporter JMX monitoring for 'solr_33193.solr.node' (registry 'solr.node') enabled at server: com.sun.jmx.mbeanserver.JmxMBeanServer@1ada017
   [junit4]   2> 658563 INFO  (jetty-launcher-1575-thread-2) [n:127.0.0.1:33193_solr    ] o.a.s.m.r.SolrJmxReporter JMX monitoring for 'solr_33193.solr.jvm' (registry 'solr.jvm') enabled at server: com.sun.jmx.mbeanserver.JmxMBeanServer@1ada017
   [junit4]   2> 658563 INFO  (jetty-launcher-1575-thread-2) [n:127.0.0.1:33193_solr    ] o.a.s.m.r.SolrJmxReporter JMX monitoring for 'solr_33193.solr.jetty' (registry 'solr.jetty') enabled at server: com.sun.jmx.mbeanserver.JmxMBeanServer@1ada017
   [junit4]   2> 658565 INFO  (jetty-launcher-1575-thread-2) [n:127.0.0.1:33193_solr    ] o.a.s.c.CorePropertiesLocator Found 0 core definitions underneath /home/jenkins/workspace/Lucene-Solr-master-Linux/solr/build/solr-core/test/J1/temp/solr.cloud.autoscaling.TriggerIntegrationTest_8257B112E10D42BA-001/tempDir-001/node2/.
   [junit4]   2> 658592 INFO  (zkConnectionManagerCallback-1600-thread-1) [    ] o.a.s.c.c.ConnectionManager zkClient has connected
   [junit4]   2> 658596 INFO  (zkConnectionManagerCallback-1604-thread-1) [    ] o.a.s.c.c.ConnectionManager zkClient has connected
   [junit4]   2> 658597 INFO  (SUITE-TriggerIntegrationTest-seed#[8257B112E10D42BA]-worker) [    ] o.a.s.c.c.ZkStateReader Updated live nodes from ZooKeeper... (0) -> (2)
   [junit4]   2> 658598 INFO  (SUITE-TriggerIntegrationTest-seed#[8257B112E10D42BA]-worker) [    ] o.a.s.c.s.i.ZkClientClusterStateProvider Cluster at 127.0.0.1:35093/solr ready
   [junit4]   2> 658612 INFO  (TEST-TriggerIntegrationTest.testEventQueue-seed#[8257B112E10D42BA]) [    ] o.a.s.SolrTestCaseJ4 ###Starting testEventQueue
   [junit4]   2> 658613 INFO  (TEST-TriggerIntegrationTest.testEventQueue-seed#[8257B112E10D42BA]) [    ] o.a.s.c.a.TriggerIntegrationTest /autoscaling.json reset, new znode version 2
   [junit4]   2> 658613 DEBUG (zkCallback-1592-thread-1-processing-n:127.0.0.1:33193_solr) [n:127.0.0.1:33193_solr    ] o.a.s.c.a.OverseerTriggerThread Refreshing /autoscaling.json with znode version 2
   [junit4]   2> 658613 DEBUG (OverseerAutoScalingTriggerThread-99249964721897477-127.0.0.1:33193_solr-n_0000000000) [n:127.0.0.1:33193_solr    ] o.a.s.c.a.OverseerTriggerThread Processed trigger updates upto znodeVersion 2
   [junit4]   2> 658616 DEBUG (OverseerAutoScalingTriggerThread-99249964721897477-127.0.0.1:33193_solr-n_0000000000) [n:127.0.0.1:33193_solr    ] o.a.s.c.a.OverseerTriggerThread -- clean old nodeLost markers
   [junit4]   2> 658616 DEBUG (OverseerAutoScalingTriggerThread-99249964721897477-127.0.0.1:33193_solr-n_0000000000) [n:127.0.0.1:33193_solr    ] o.a.s.c.a.OverseerTriggerThread -- clean old nodeAdded markers
   [junit4]   2> 658616 DEBUG (OverseerAutoScalingTriggerThread-99249964721897477-127.0.0.1:33193_solr-n_0000000000) [n:127.0.0.1:33193_solr    ] o.a.s.c.a.OverseerTriggerThread Current znodeVersion 2, lastZnodeVersion 2
   [junit4]   2> 658675 INFO  (qtp16149775-5885) [n:127.0.0.1:33193_solr    ] o.a.s.h.a.CollectionsHandler Invoked Collection Action :overseerstatus with params action=OVERSEERSTATUS&wt=javabin&version=2 and sendToOCPQueue=true
   [junit4]   2> 658681 INFO  (qtp16149775-5885) [n:127.0.0.1:33193_solr    ] o.a.s.s.HttpSolrCall [admin] webapp=null path=/admin/collections params={action=OVERSEERSTATUS&wt=javabin&version=2} status=0 QTime=5
   [junit4]   2> 658688 INFO  (qtp16149775-5885) [n:127.0.0.1:33193_solr    ] o.a.s.s.HttpSolrCall [admin] webapp=null path=/admin/metrics params={prefix=CORE.coreName&wt=javabin&version=2&group=solr.core} status=0 QTime=0
   [junit4]   2> 658730 INFO  (qtp26461558-5900) [n:127.0.0.1:40483_solr    ] o.a.s.s.HttpSolrCall [admin] webapp=null path=/admin/metrics params={prefix=CORE.coreName&wt=javabin&version=2&group=solr.core} status=0 QTime=0
   [junit4]   2> 658731 DEBUG (qtp16149775-5893) [n:127.0.0.1:33193_solr    ] o.a.s.c.a.AutoScalingHandler Verified autoscaling configuration
   [junit4]   2> 658731 INFO  (qtp16149775-5893) [n:127.0.0.1:33193_solr    ] o.a.s.s.HttpSolrCall [admin] webapp=null path=/admin/autoscaling params={wt=javabin&version=2} status=0 QTime=47
   [junit4]   2> 658731 DEBUG (zkCallback-1592-thread-1-processing-n:127.0.0.1:33193_solr) [n:127.0.0.1:33193_solr    ] o.a.s.c.a.OverseerTriggerThread Refreshing /autoscaling.json with znode version 3
   [junit4]   2> 658732 INFO  (zkCallback-1592-thread-1-processing-n:127.0.0.1:33193_solr) [n:127.0.0.1:33193_solr    ] o.a.s.c.a.TriggerIntegrationTest TestEventQueueAction instantiated
   [junit4]   2> 658733 DEBUG (zkCallback-1592-thread-1-processing-n:127.0.0.1:33193_solr) [n:127.0.0.1:33193_solr    ] o.a.s.c.a.NodeAddedTrigger Initial livenodes: [127.0.0.1:40483_solr, 127.0.0.1:33193_solr]
   [junit4]   2> 658733 DEBUG (zkCallback-1592-thread-1-processing-n:127.0.0.1:33193_solr) [n:127.0.0.1:33193_solr    ] o.a.s.c.a.NodeAddedTrigger NodeAddedTrigger node_added_trigger1 instantiated with properties: {event=nodeAdded, waitFor=1, actions=[{name=test, class=org.apache.solr.cloud.autoscaling.TriggerIntegrationTest$TestEventQueueAction}], enabled=true}
   [junit4]   2> 658733 DEBUG (OverseerAutoScalingTriggerThread-99249964721897477-127.0.0.1:33193_solr-n_0000000000) [n:127.0.0.1:33193_solr    ] o.a.s.c.a.OverseerTriggerThread Processed trigger updates upto znodeVersion 3
   [junit4]   2> 658734 DEBUG (OverseerAutoScalingTriggerThread-99249964721897477-127.0.0.1:33193_solr-n_0000000000) [n:127.0.0.1:33193_solr    ] o.a.s.c.a.TriggerIntegrationTest TestTriggerAction init
   [junit4]   2> 658734 DEBUG (OverseerAutoScalingTriggerThread-99249964721897477-127.0.0.1:33193_solr-n_0000000000) [n:127.0.0.1:33193_solr    ] o.a.s.c.a.OverseerTriggerThread -- clean old nodeLost markers
   [junit4]   2> 658734 DEBUG (OverseerAutoScalingTriggerThread-99249964721897477-127.0.0.1:33193_solr-n_0000000000) [n:127.0.0.1:33193_solr    ] o.a.s.c.a.OverseerTriggerThread Current znodeVersion 3, lastZnodeVersion 3
   [junit4]   2> 658734 DEBUG (ScheduledTrigger-2148-thread-1) [n:127.0.0.1:33193_solr    ] o.a.s.c.a.NodeAddedTrigger Running NodeAddedTrigger node_added_trigger1
   [junit4]   2> 658734 DEBUG (ScheduledTrigger-2148-thread-1) [n:127.0.0.1:33193_solr    ] o.a.s.c.a.NodeAddedTrigger Found livenodes: 2
   [junit4]   2> 658736 INFO  (TEST-TriggerIntegrationTest.testEventQueue-seed#[8257B112E10D42BA]) [    ] o.e.j.s.Server jetty-9.3.20.v20170531
   [junit4]   2> 658737 INFO  (TEST-TriggerIntegrationTest.testEventQueue-seed#[8257B112E10D42BA]) [    ] o.e.j.s.h.ContextHandler Started o.e.j.s.ServletContextHandler@1142e6{/solr,null,AVAILABLE}
   [junit4]   2> 658738 INFO  (TEST-TriggerIntegrationTest.testEventQueue-seed#[8257B112E10D42BA]) [    ] o.e.j.s.AbstractConnector Started ServerConnector@d1ad9a{SSL,[ssl, http/1.1]}{127.0.0.1:37475}
   [junit4]   2> 658738 INFO  (TEST-TriggerIntegrationTest.testEventQueue-seed#[8257B112E10D42BA]) [    ] o.e.j.s.Server Started @659756ms
   [junit4]   2> 658738 INFO  (TEST-TriggerIntegrationTest.testEventQueue-seed#[8257B112E10D42BA]) [    ] o.a.s.c.s.e.JettySolrRunner Jetty properties: {hostContext=/solr, hostPort=37475}
   [junit4]   2> 658738 ERROR (TEST-TriggerIntegrationTest.testEventQueue-seed#[8257B112E10D42BA]) [    ] o.a.s.u.StartupLoggingUtils Missing Java Option solr.log.dir. Logging may be missing or incomplete.
   [junit4]   2> 658738 INFO  (TEST-TriggerIntegrationTest.testEventQueue-seed#[8257B112E10D42BA]) [    ] o.a.s.s.SolrDispatchFilter  ___      _       Welcome to Apache Solr™ version 8.0.0
   [junit4]   2> 658739 INFO  (TEST-TriggerIntegrationTest.testEventQueue-seed#[8257B112E10D42BA]) [    ] o.a.s.s.SolrDispatchFilter / __| ___| |_ _   Starting in cloud mode on port null
   [junit4]   2> 658739 INFO  (TEST-TriggerIntegrationTest.testEventQueue-seed#[8257B112E10D42BA]) [    ] o.a.s.s.SolrDispatchFilter \__ \/ _ \ | '_|  Install dir: null
   [junit4]   2> 658739 INFO  (TEST-TriggerIntegrationTest.testEventQueue-seed#[8257B112E10D42BA]) [    ] o.a.s.s.SolrDispatchFilter |___/\___/_|_|    Start time: 2017-12-28T04:11:16.956Z
   [junit4]   2> 658742 INFO  (zkConnectionManagerCallback-1606-thread-1) [    ] o.a.s.c.c.ConnectionManager zkClient has connected
   [junit4]   2> 658743 INFO  (TEST-TriggerIntegrationTest.testEventQueue-seed#[8257B112E10D42BA]) [    ] o.a.s.s.SolrDispatchFilter solr.xml found in ZooKeeper. Loading...
   [junit4]   2> 658759 INFO  (TEST-TriggerIntegrationTest.testEventQueue-seed#[8257B112E10D42BA]) [    ] o.a.s.c.ZkContainer Zookeeper client=127.0.0.1:35093/solr
   [junit4]   2> 658762 INFO  (zkConnectionManagerCallback-1610-thread-1) [    ] o.a.s.c.c.ConnectionManager zkClient has connected
   [junit4]   2> 658764 INFO  (zkConnectionManagerCallback-1612-thread-1-processing-n:127.0.0.1:37475_solr) [n:127.0.0.1:37475_solr    ] o.a.s.c.c.ConnectionManager zkClient has connected
   [junit4]   2> 658772 INFO  (TEST-TriggerIntegrationTest.testEventQueue-seed#[8257B112E10D42BA]) [n:127.0.0.1:37475_solr    ] o.a.s.c.c.ZkStateReader Updated live nodes from ZooKeeper... (0) -> (2)
   [junit4]   2> 658773 INFO  (TEST-TriggerIntegrationTest.testEventQueue-seed#[8257B112E10D42BA]) [n:127.0.0.1:37475_solr    ] o.a.s.c.Overseer Overseer (id=null) closing
   [junit4]   2> 658775 INFO  (TEST-TriggerIntegrationTest.testEventQueue-seed#[8257B112E10D42BA]) [n:127.0.0.1:37475_solr    ] o.a.s.c.ZkController Register node as live in ZooKeeper:/live_nodes/127.0.0.1:37475_solr
   [junit4]   2> 658777 INFO  (zkCallback-1591-thread-1-processing-n:127.0.0.1:40483_solr) [n:127.0.0.1:40483_solr    ] o.a.s.c.c.ZkStateReader Updated live nodes from ZooKeeper... (2) -> (3)
   [junit4]   2> 658777 INFO  (zkCallback-1592-thread-1-processing-n:127.0.0.1:33193_solr) [n:127.0.0.1:33193_solr    ] o.a.s.c.c.ZkStateReader Updated live nodes from ZooKeeper... (2) -> (3)
   [junit4]   2> 658778 INFO  (zkCallback-1611-thread-1-processing-n:127.0.0.1:37475_solr) [n:127.0.0.1:37475_solr    ] o.a.s.c.c.ZkStateReader Updated live nodes from ZooKeeper... (2) -> (3)
   [junit4]   2> 658779 INFO  (zkCallback-1603-thread-1) [    ] o.a.s.c.c.ZkStateReader Updated live nodes from ZooKeeper... (2) -> (3)
   [junit4]   2> 659027 INFO  (TEST-TriggerIntegrationTest.testEventQueue-seed#[8257B112E10D42BA]) [n:127.0.0.1:37475_solr    ] o.a.s.m.r.SolrJmxReporter JMX monitoring for 'solr_37475.solr.node' (registry 'solr.node') enabled at server: com.sun.jmx.mbeanserver.JmxMBeanServer@1ada017
   [junit4]   2> 659040 INFO  (TEST-TriggerIntegrationTest.testEventQueue-seed#[8257B112E10D42BA]) [n:127.0.0.1:37475_solr    ] o.a.s.m.r.SolrJmxReporter JMX monitoring for 'solr_37475.solr.jvm' (registry 'solr.jvm') enabled at server: com.sun.jmx.mbeanserver.JmxMBeanServer@1ada017
   [junit4]   2> 659040 INFO  (TEST-TriggerIntegrationTest.testEventQueue-seed#[8257B112E10D42BA]) [n:127.0.0.1:37475_solr    ] o.a.s.m.r.SolrJmxReporter JMX monitoring for 'solr_37475.solr.jetty' (registry 'solr.jetty') enabled at server: com.sun.jmx.mbeanserver.JmxMBeanServer@1ada017
   [junit4]   2> 659042 INFO  (TEST-TriggerIntegrationTest.testEventQueue-seed#[8257B112E10D42BA]) [n:127.0.0.1:37475_solr    ] o.a.s.c.CorePropertiesLocator Found 0 core definitions underneath /home/jenkins/workspace/Lucene-Solr-master-Linux/solr/build/solr-core/test/J1/temp/solr.cloud.autoscaling.TriggerIntegrationTest_8257B112E10D42BA-001/tempDir-001/node3/.
   [junit4]   2> 659736 DEBUG (ScheduledTrigger-2148-thread-2) [n:127.0.0.1:33193_solr    ] o.a.s.c.a.NodeAddedTrigger Running NodeAddedTrigger node_added_trigger1
   [junit4]   2> 659736 DEBUG (ScheduledTrigger-2148-thread-2) [n:127.0.0.1:33193_solr    ] o.a.s.c.a.NodeAddedTrigger Found livenodes: 3
   [junit4]   2> 659736 DEBUG (ScheduledTrigger-2148-thread-2) [n:127.0.0.1:33193_solr    ] o.a.s.c.a.NodeAddedTrigger Tracking new node: 127.0.0.1:37475_solr at time 2135419925353853
   [junit4]   2> 660680 INFO  (OverseerCollectionConfigSetProcessor-99249964721897477-127.0.0.1:33193_solr-n_0000000000) [n:127.0.0.1:33193_solr    ] o.a.s.c.OverseerTaskQueue Response ZK path: /overseer/collection-queue-work/qnr-0000000000 doesn't exist.  Requestor may have disconnected from ZooKeeper
   [junit4]   2> 660737 DEBUG (ScheduledTrigger-2148-thread-2) [n:127.0.0.1:33193_solr    ] o.a.s.c.a.NodeAddedTrigger Running NodeAddedTrigger node_added_trigger1
   [junit4]   2> 660737 DEBUG (ScheduledTrigger-2148-thread-2) [n:127.0.0.1:33193_solr    ] o.a.s.c.a.NodeAddedTrigger Found livenodes: 3
   [junit4]   2> 660737 DEBUG (ScheduledTrigger-2148-thread-2) [n:127.0.0.1:33193_solr    ] o.a.s.c.a.NodeAddedTrigger NodeAddedTrigger node_added_trigger1 firing registered processor for nodes: [127.0.0.1:37475_solr] added at times [2135419925353853], now=2135420926384604
   [junit4]   2> 660737 DEBUG (ScheduledTrigger-2148-thread-2) [n:127.0.0.1:33193_solr    ] o.a.s.c.a.ScheduledTriggers ++++++++ Cooldown inactive - processing event: {
   [junit4]   2>   "id":"796273218d57dT8s7uzzb43u62n6bqvaatpj3z7",
   [junit4]   2>   "source":"node_added_trigger1",
   [junit4]   2>   "eventTime":2135419925353853,
   [junit4]   2>   "eventType":"NODEADDED",
   [junit4]   2>   "properties":{
   [junit4]   2>     "eventTimes":[2135419925353853],
   [junit4]   2>     "nodeNames":["127.0.0.1:37475_solr"]}}
   [junit4]   2> 660738 INFO  (ScheduledTrigger-2148-thread-2) [n:127.0.0.1:33193_solr    ] o.a.s.c.a.SystemLogListener Collection .system does not exist, disabling logging.
   [junit4]   2> 660738 DEBUG (AutoscalingActionExecutor-2149-thread-1-processing-n:127.0.0.1:33193_solr) [n:127.0.0.1:33193_solr    ] o.a.s.c.a.ScheduledTriggers -- processing actions for {
   [junit4]   2>   "id":"796273218d57dT8s7uzzb43u62n6bqvaatpj3z7",
   [junit4]   2>   "source":"node_added_trigger1",
   [junit4]   2>   "eventTime":2135419925353853,
   [junit4]   2>   "eventType":"NODEADDED",
   [junit4]   2>   "properties":{
   [junit4]   2>     "eventTimes":[2135419925353853],
   [junit4]   2>     "_enqueue_time_":2135420926591871,
   [junit4]   2>     "nodeNames":["127.0.0.1:37475_solr"]}}
   [junit4]   2> 660738 INFO  (AutoscalingActionExecutor-2149-thread-1-processing-n:127.0.0.1:33193_solr) [n:127.0.0.1:33193_solr    ] o.a.s.c.a.TriggerIntegrationTest -- event: {
   [junit4]   2>   "id":"796273218d57dT8s7uzzb43u62n6bqvaatpj3z7",
   [junit4]   2>   "source":"node_added_trigger1",
   [junit4]   2>   "eventTime":2135419925353853,
   [junit4]   2>   "eventType":"NODEADDED",
   [junit4]   2>   "properties":{
   [junit4]   2>     "eventTimes":[2135419925353853],
   [junit4]   2>     "_enqueue_time_":2135420926591871,
   [junit4]   2>     "nodeNames":["127.0.0.1:37475_solr"]}}
   [junit4]   2> 660739 INFO  (TEST-TriggerIntegrationTest.testEventQueue-seed#[8257B112E10D42BA]) [    ] o.e.j.s.AbstractConnector Stopped ServerConnector@1a8d00a{SSL,[ssl, http/1.1]}{127.0.0.1:0}
   [junit4]   2> 660740 INFO  (TEST-TriggerIntegrationTest.testEventQueue-seed#[8257B112E10D42BA]) [    ] o.a.s.c.CoreContainer Shutting down CoreContainer instance=10161137
   [junit4]   2> 660740 INFO  (TEST-TriggerIntegrationTest.testEventQueue-seed#[8257B112E10D42BA]) [    ] o.a.s.m.SolrMetricManager Closing metric reporters for registry=solr.node, tag=null
   [junit4]   2> 660740 INFO  (TEST-TriggerIntegrationTest.testEventQueue-seed#[8257B112E10D42BA]) [    ] o.a.s.m.r.SolrJmxReporter Closing reporter [org.apache.solr.metrics.reporters.SolrJmxReporter@451527: rootName = solr_33193, domain = solr.node, service url = null, agent id = null] for registry solr.node / com.codahale.metrics.MetricRegistry@504c82
   [junit4]   2> 660744 DEBUG (AutoscalingActionExecutor-2149-thread-1-processing-n:127.0.0.1:33193_solr) [n:127.0.0.1:33193_solr    ] o.a.s.c.a.ScheduledTriggers -- processing took 5 ms for event id=796273218d57dT8s7uzzb43u62n6bqvaatpj3z7
   [junit4]   2> 660749 INFO  (TEST-TriggerIntegrationTest.testEventQueue-seed#[8257B112E10D42BA]) [    ] o.a.s.m.SolrMetricManager Closing metric reporters for registry=solr.jvm, tag=null
   [junit4]   2> 660750 INFO  (TEST-TriggerIntegrationTest.testEventQueue-seed#[8257B112E10D42BA]) [    ] o.a.s.m.r.SolrJmxReporter Closing reporter [org.apache.solr.metrics.reporters.SolrJmxReporter@48b2e1: rootName = solr_33193, domain = solr.jvm, service url = null, agent id = null] for registry solr.jvm / com.codahale.metrics.MetricRegistry@1c58a8b
   [junit4]   2> 660757 INFO  (TEST-TriggerIntegrationTest.testEventQueue-seed#[8257B112E10D42BA]) [    ] o.a.s.m.SolrMetricManager Closing metric reporters for registry=solr.jetty, tag=null
   [junit4]   2> 660758 INFO  (TEST-TriggerIntegrationTest.testEventQueue-seed#[8257B112E10D42BA]) [    ] o.a.s.m.r.SolrJmxReporter Closing reporter [org.apache.solr.metrics.reporters.SolrJmxReporter@12d53de: rootName = solr_33193, domain = solr.jetty, service url = null, agent id = null] for registry solr.jetty / com.codahale.metrics.MetricRegistry@1fa076b
   [junit4]   2> 660759 INFO  (TEST-TriggerIntegrationTest.testEventQueue-seed#[8257B112E10D42BA]) [    ] o.a.s.c.ZkController Remove node as live in ZooKeeper:/live_nodes/127.0.0.1:33193_solr
   [junit4]   2> 660759 INFO  (TEST-TriggerIntegrationTest.testEventQueue-seed#[8257B112E10D42BA]) [    ] o.a.s.m.SolrMetricManager Closing metric reporters for registry=solr.cluster, tag=null
   [junit4]   2> 660760 INFO  (TEST-TriggerIntegrationTest.testEventQueue-seed#[8257B112E10D42BA]) [    ] o.a.s.c.TransientSolrCoreCacheDefault Allocating transient cache for 2147483647 transient cores
   [junit4]   2> 660760 INFO  (zkCallback-1591-thread-1-processing-n:127.0.0.1:40483_solr) [n:127.0.0.1:40483_solr    ] o.a.s.c.c.ZkStateReader Updated live nodes from ZooKeeper... (3) -> (2)
   [junit4]   2> 660760 INFO  (zkCallback-1603-thread-1) [    ] o.a.s.c.c.ZkStateReader Updated live nodes from ZooKeeper... (3) -> (2)
   [junit4]   2> 660760 INFO  (TEST-TriggerIntegrationTest.testEventQueue-seed#[8257B112E10D42BA]) [    ] o.a.s.c.Overseer Overseer (id=99249964721897477-127.0.0.1:33193_solr-n_0000000000) closing
   [junit4]   2> 660760 INFO  (zkCallback-1592-thread-1-processing-n:127.0.0.1:33193_solr) [n:127.0.0.1:33193_solr    ] o.a.s.c.c.ZkStateReader Updated live nodes from ZooKeeper... (3) -> (2)
   [junit4]   2> 660760 INFO  (OverseerStateUpdate-99249964721897477-127.0.0.1:33193_solr-n_0000000000) [n:127.0.0.1:33193_solr    ] o.a.s.c.Overseer Overseer Loop exiting : 127.0.0.1:33193_solr
   [junit4]   2> 660760 INFO  (zkCallback-1611-thread-1-processing-n:127.0.0.1:37475_solr) [n:127.0.0.1:37475_solr    ] o.a.s.c.c.ZkStateReader Updated live nodes from ZooKeeper... (3) -> (2)
   [junit4]   2> 660760 WARN  (OverseerAutoScalingTriggerThread-99249964721897477-127.0.0.1:33193_solr-n_0000000000) [n:127.0.0.1:33193_solr    ] o.a.s.c.a.OverseerTriggerThread OverseerTriggerThread woken up but we are closed, exiting.
   [junit4]   2> 660761 DEBUG (TEST-TriggerIntegrationTest.testEventQueue-seed#[8257B112E10D42BA]) [    ] o.a.s.c.a.OverseerTriggerThread OverseerTriggerThread has been closed explicitly
   [junit4]   2> 660762 INFO  (TEST-TriggerIntegrationTest.testEventQueue-seed#[8257B112E10D42BA]) [    ] o.e.j.s.h.ContextHandler Stopped o.e.j.s.ServletContextHandler@49ebd2{/solr,null,UNAVAILABLE}
   [junit4]   2> 660762 INFO  (zkCallback-1591-thread-1-processing-n:127.0.0.1:40483_solr) [n:127.0.0.1:40483_solr    ] o.a.s.c.OverseerElectionContext I am going to be the leader 127.0.0.1:40483_solr
   [junit4]   2> 660763 INFO  (zkCallback-1591-thread-1-processing-n:127.0.0.1:40483_solr) [n:127.0.0.1:40483_solr    ] o.a.s.c.Overseer Overseer (id=99249964721897478-127.0.0.1:40483_solr-n_0000000001) starting
   [junit4]   2> 660774 DEBUG (OverseerAutoScalingTriggerThread-99249964721897478-127.0.0.1:40483_solr-n_0000000001) [n:127.0.0.1:40483_solr    ] o.a.s.c.a.OverseerTriggerThread Adding .autoAddReplicas trigger
   [junit4]   2> 660775 DEBUG (OverseerAutoScalingTriggerThread-99249964721897478-127.0.0.1:40483_solr-n_0000000001) [n:127.0.0.1:40483_solr    ] o.a.s.c.a.OverseerTriggerThread Refreshing /autoscaling.json with znode version 4
   [junit4]   2> 660775 INFO  (OverseerAutoScalingTriggerThread-99249964721897478-127.0.0.1:40483_solr-n_0000000001) [n:127.0.0.1:40483_solr    ] o.a.s.c.a.TriggerIntegrationTest TestEventQueueAction instantiated
   [junit4]   2> 660775 DEBUG (OverseerAutoScalingTriggerThread-99249964721897478-127.0.0.1:40483_solr-n_0000000001) [n:127.0.0.1:40483_solr    ] o.a.s.c.a.NodeAddedTrigger Initial livenodes: [127.0.0.1:37475_solr, 127.0.0.1:40483_solr]
   [junit4]   2> 660775 DEBUG (OverseerAutoScalingTriggerThread-99249964721897478-127.0.0.1:40483_solr-n_0000000001) [n:127.0.0.1:40483_solr    ] o.a.s.c.a.NodeAddedTrigger NodeAddedTrigger node_added_trigger1 instantiated with properties: {event=nodeAdded, waitFor=1, actions=[{name=test, class=org.apache.solr.cloud.autoscaling.TriggerIntegrationTest$TestEventQueueAction}], enabled=true}
   [junit4]   2> 660775 DEBUG (OverseerAutoScalingTriggerThread-99249964721897478-127.0.0.1:40483_solr-n_0000000001) [n:127.0.0.1:40483_solr    ] o.a.s.c.a.NodeLostTrigger Initial livenodes: [127.0.0.1:37475_solr, 127.0.0.1:40483_solr]
   [junit4]   2> 660775 DEBUG (OverseerAutoScalingTriggerThread-99249964721897478-127.0.0.1:40483_solr-n_0000000001) [n:127.0.0.1:40483_solr    ] o.a.s.c.a.OverseerTriggerThread Current znodeVersion 4, lastZnodeVersion -1
   [junit4]   2> 660775 DEBUG (OverseerAutoScalingTriggerThread-99249964721897478-127.0.0.1:40483_solr-n_0000000001) [n:127.0.0.1:40483_solr    ] o.a.s.c.a.OverseerTriggerThread Processed trigger updates upto znodeVersion 4
   [junit4]   2> 660779 DEBUG (OverseerAutoScalingTriggerThread-99249964721897478-127.0.0.1:40483_solr-n_0000000001) [n:127.0.0.1:40483_solr    ] o.a.s.c.a.TriggerIntegrationTest TestTriggerAction init
   [junit4]   2> 660782 DEBUG (ScheduledTrigger-2163-thread-1) [n:127.0.0.1:40483_solr    ] o.a.s.c.a.NodeLostTrigger Running NodeLostTrigger: .auto_add_replicas with currently live nodes: 2
   [junit4]   2> 660782 DEBUG (OverseerAutoScalingTriggerThread-99249964721897478-127.0.0.1:40483_solr-n_0000000001) [n:127.0.0.1:40483_solr    ] o.a.s.c.a.OverseerTriggerThread Current znodeVersion 4, lastZnodeVersion 4
   [junit4]   2> 660783 DEBUG (ScheduledTrigger-2163-thread-2) [n:127.0.0.1:40483_solr    ] o.a.s.c.a.NodeAddedTrigger Running NodeAddedTrigger node_added_trigger1
   [junit4]   2> 660783 DEBUG (ScheduledTrigger-2163-thread-2) [n:127.0.0.1:40483_solr    ] o.a.s.c.a.NodeAddedTrigger Found livenodes: 2
   [junit4]   2> 661783 DEBUG (ScheduledTrigger-2163-thread-1) [n:127.0.0.1:40483_solr    ] o.a.s.c.a.NodeLostTrigger Running NodeLostTrigger: .auto_add_replicas with currently live nodes: 2
   [junit4]   2> 661784 DEBUG (ScheduledTrigger-2163-thread-3) [n:127.0.0.1:40483_solr    ] o.a.s.c.a.NodeAddedTrigger Running NodeAddedTrigger node_added_trigger1
   [junit4]   2> 661784 DEBUG (ScheduledTrigger-2163-thread-3) [n:127.0.0.1:40483_solr    ] o.a.s.c.a.NodeAddedTrigger Found livenodes: 2
   [junit4]   2> 662785 DEBUG (ScheduledTrigger-2163-thread-4) [n:127.0.0.1:40483_solr    ] o.a.s.c.a.NodeAddedTrigger Running NodeAddedTrigger node_added_trigger1
   [junit4]   2> 662785 DEBUG (ScheduledTrigger-2163-thread-4) [n:127.0.0.1:40483_solr    ] o.a.s.c.a.NodeAddedTrigger Found livenodes: 2
   [junit4]   2> 662785 DEBUG (ScheduledTrigger-2163-thread-2) [n:127.0.0.1:40483_solr    ] o.a.s.c.a.NodeLostTrigger Running NodeLostTrigger: .auto_add_replicas with currently live nodes: 2
   [junit4]   2> 663785 DEBUG (ScheduledTrigger-2163-thread-4) [n:127.0.0.1:40483_solr    ] o.a.s.c.a.NodeAddedTrigger Running NodeAddedTrigger node_added_trigger1
   [junit4]   2> 663785 DEBUG (ScheduledTrigger-2163-thread-3) [n:127.0.0.1:40483_solr    ] o.a.s.c.a.NodeLostTrigger Running NodeLostTrigger: .auto_add_replicas with currently live nodes: 2
   [junit4]   2> 663785 DEBUG (ScheduledTrigger-2163-thread-4) [n:127.0.0.1:40483_solr    ] o.a.s.c.a.NodeAddedTrigger Found livenodes: 2
   [junit4]   2> 664786 DEBUG (ScheduledTrigger-2163-thread-2) [n:127.0.0.1:40483_solr    ] o.a.s.c.a.NodeAddedTrigger Running NodeAddedTrigger node_added_trigger1
   [junit4]   2> 664786 DEBUG (ScheduledTrigger-2163-thread-3) [n:127.0.0.1:40483_solr    ] o.a.s.c.a.NodeLostTrigger Running NodeLostTrigger: .auto_add_replicas with currently live nodes: 2
   [junit4]   2> 664786 DEBUG (ScheduledTrigger-2163-thread-2) [n:127.0.0.1:40483_solr    ] o.a.s.c.a.NodeAddedTrigger Found livenodes: 2
   [junit4]   2> 665786 DEBUG (ScheduledTrigger-2163-thread-4) [n:127.0.0.1:40483_solr    ] o.a.s.c.a.NodeAddedTrigger Running NodeAddedTrigger node_added_trigger1
   [junit4]   2> 665786 DEBUG (ScheduledTrigger-2163-thread-4) [n:127.0.0.1:40483_solr    ] o.a.s.c.a.NodeAddedTrigger Found livenodes: 2
   [junit4]   2> 665786 DEBUG (ScheduledTrigger-2163-thread-3) [n:127.0.0.1:40483_solr    ] o.a.s.c.a.NodeLostTrigger Running NodeLostTrigger: .auto_add_replicas with currently live nodes: 2
   [junit4]   2> 666786 DEBUG (ScheduledTrigger-2163-thread-4) [n:127.0.0.1:40483_solr    ] o.a.s.c.a.NodeAddedTrigger Running NodeAddedTrigger node_added_trigger1
   [junit4]   2> 666786 DEBUG (ScheduledTrigger-2163-thread-4) [n:127.0.0.1:40483_solr    ] o.a.s.c.a.NodeAddedTrigger Found livenodes: 2
   [junit4]   2> 666787 DEBUG (ScheduledTrigger-2163-thread-4) [n:127.0.0.1:40483_solr    ] o.a.s.c.a.NodeLostTrigger Running NodeLostTrigger: .auto_add_replicas with currently live nodes: 2
   [junit4]   2> 667787 DEBUG (ScheduledTrigger-2163-thread-4) [n:127.0.0.1:40483_solr    ] o.a.s.c.a.NodeAddedTrigger Running NodeAddedTrigger node_added_trigger1
   [junit4]   2> 667787 DEBUG (ScheduledTrigger-2163-thread-3) [n:127.0.0.1:40483_solr    ] o.a.s.c.a.NodeLostTrigger Running NodeLostTrigger: .auto_add_replicas with currently live nodes: 2
   [junit4]   2> 667787 DEBUG (ScheduledTrigger-2163-thread-4) [n:127.0.0.1:40483_solr    ] o.a.s.c.a.NodeAddedTrigger Found livenodes: 2
   [junit4]   2> 668763 INFO  (TEST-TriggerIntegrationTest.testEventQueue-seed#[8257B112E10D42BA]) [    ] o.a.s.SolrTestCaseJ4 ###Ending testEventQueue
   [junit4]   2> NOTE: reproduce with: ant test  -Dtestcase=TriggerIntegrationTest -Dtests.method=testEventQueue -Dtests.seed=8257B112E10D42BA -Dtests.multiplier=3 -Dtests.slow=true -Dtests.locale=nn-NO -Dtests.timezone=America/Bogota -Dtests.asserts=true -Dtests.file.encoding=UTF-8
   [junit4] FAILURE 10.2s J1 | TriggerIntegrationTest.testEventQueue <<<
   [junit4]    > Throwable #1: java.lang.AssertionError: action wasn't interrupted
   [junit4]    > 	at __randomizedtesting.SeedInfo.seed([8257B112E10D42BA:4BE2F3BCE86A844F]:0)
   [junit4]    > 	at org.apache.solr.cloud.autoscaling.TriggerIntegrationTest.testEventQueue(TriggerIntegrationTest.java:711)
   [junit4]    > 	at java.lang.Thread.run(Thread.java:748)
   [junit4]   2> 668775 INFO  (TEST-TriggerIntegrationTest.testNodeMarkersRegistration-seed#[8257B112E10D42BA]) [    ] o.a.s.SolrTestCaseJ4 ###Starting testNodeMarkersRegistration
   [junit4]   2> 668775 INFO  (TEST-TriggerIntegrationTest.testNodeMarkersRegistration-seed#[8257B112E10D42BA]) [    ] o.a.s.c.a.TriggerIntegrationTest /autoscaling.json reset, new znode version 5
   [junit4]   2> 668775 DEBUG (zkCallback-1591-thread-1-processing-n:127.0.0.1:40483_solr) [n:127.0.0.1:40483_solr    ] o.a.s.c.a.OverseerTriggerThread Refreshing /autoscaling.json with znode version 5
   [junit4]   2> 668775 DEBUG (OverseerAutoScalingTriggerThread-99249964721897478-127.0.0.1:40483_solr-n_0000000001) [n:127.0.0.1:40483_solr    ] o.a.s.c.a.OverseerTriggerThread Processed trigger updates upto znodeVersion 5
   [junit4]   2> 668777 DEBUG (OverseerAutoScalingTriggerThread-99249964721897478-127.0.0.1:40483_solr-n_0000000001) [n:127.0.0.1:40483_solr    ] o.a.s.c.a.OverseerTriggerThread -- clean old nodeLost markers
   [junit4]   2> 668777 DEBUG (OverseerAutoScalingTriggerThread-99249964721897478-127.0.0.1:40483_solr-n_0000000001) [n:127.0.0.1:40483_solr    ] o.a.s.c.a.OverseerTriggerThread -- clean old nodeAdded markers
   [junit4]   2> 668777 DEBUG (OverseerAutoScalingTriggerThread-99249964721897478-127.0.0.1:40483_solr-n_0000000001) [n:127.0.0.1:40483_solr    ] o.a.s.c.a.OverseerTriggerThread Current znodeVersion 5, lastZnodeVersion 5
   [junit4]   2> 668822 INFO  (qtp18805272-5954) [n:127.0.0.1:37475_solr    ] o.a.s.h.a.CollectionsHandler Invoked Collection Action :overseerstatus with params action=OVERSEERSTATUS&wt=javabin&version=2 and sendToOCPQueue=true
   [junit4]   2> 668828 INFO  (qtp18805272-5954) [n:127.0.0.1:37475_solr    ] o.a.s.s.HttpSolrCall [admin] webapp=null path=/admin/collections params={action=OVERSEERSTATUS&wt=javabin&version=2} status=0 QTime=5
   [junit4]   2> 668831 INFO  (TEST-TriggerIntegrationTest.testNodeMarkersRegistration-seed#[8257B112E10D42BA]) [    ] o.e.j.s.Server jetty-9.3.20.v20170531
   [junit4]   2> 668832 INFO  (TEST-TriggerIntegrationTest.testNodeMarkersRegistration-seed#[8257B112E10D42BA]) [    ] o.e.j.s.h.ContextHandler Started o.e.j.s.ServletContextHandler@acaab5{/solr,null,AVAILABLE}
   [junit4]   2> 668832 INFO  (TEST-TriggerIntegrationTest.testNodeMarkersRegistration-seed#[8257B112E10D42BA]) [    ] o.e.j.s.AbstractConnector Started ServerConnector@14662c8{SSL,[ssl, http/1.1]}{127.0.0.1:38319}
   [junit4]   2> 668832 INFO  (TEST-TriggerIntegrationTest.testNodeMarkersRegistration-seed#[8257B112E10D42BA]) [    ] o.e.j.s.Server Started @669850ms
   [junit4]   2> 668832 INFO  (TEST-TriggerIntegrationTest.testNodeMarkersRegistration-seed#[8257B112E10D42BA]) [    ] o.a.s.c.s.e.JettySolrRunner Jetty properties: {hostContext=/solr, hostPort=38319}
   [junit4]   2> 668833 ERROR (TEST-TriggerIntegrationTest.testNodeMarkersRegistration-seed#[8257B112E10D42BA]) [    ] o.a.s.u.StartupLoggingUtils Missing Java Option solr.log.dir. Logging may be missing or incomplete.
   [junit4]   2> 668833 INFO  (TEST-TriggerIntegrationTest.testNodeMarkersRegistration-seed#[8257B112E10D42BA]) [    ] o.a.s.s.SolrDispatchFilter  ___      _       Welcome to Apache Solr™ version 8.0.0
   [junit4]   2> 668833 INFO  (TEST-TriggerIntegrationTest.testNodeMarkersRegistration-seed#[8257B112E10D42BA]) [    ] o.a.s.s.SolrDispatchFilter / __| ___| |_ _   Starting in cloud mode on port null
   [junit4]   2> 668833 INFO  (TEST-TriggerIntegrationTest.testNodeMarkersRegistration-seed#[8257B112E10D42BA]) [    ] o.a.s.s.SolrDispatchFilter \__ \/ _ \ | '_|  Install dir: null
   [junit4]   2> 668833 INFO  (TEST-TriggerIntegrationTest.testNodeMarkersRegistration-seed#[8257B112E10D42BA]) [    ] o.a.s.s.SolrDispatchFilter |___/\___/_|_|    Start time: 2017-12-28T04:11:27.050Z
   [junit4]   2> 668834 INFO  (zkConnectionManagerCallback-1616-thread-1) [    ] o.a.s.c.c.ConnectionManager zkClient has connected
   [junit4]   2> 668835 INFO  (TEST-TriggerIntegrationTest.testNodeMarkersRegistration-seed#[8257B112E10D42BA]) [    ] o.a.s.s.SolrDispatchFilter solr.xml found in ZooKeeper. Loading...
   [junit4]   2> 668845 INFO  (TEST-TriggerIntegrationTest.testNodeMarkersRegistration-seed#[8257B112E10D42BA]) [    ] o.a.s.c.ZkContainer Zookeeper client=127.0.0.1:35093/solr
   [junit4]   2> 668846 INFO  (zkConnectionManagerCallback-1620-thread-1) [    ] o.a.s.c.c.ConnectionManager zkClient has connected
   [junit4]   2> 668848 INFO  (zkConnectionManagerCallback-1622-thread-1-processing-n:127.0.0.1:38319_solr) [n:127.0.0.1:38319_solr    ] o.a.s.c.c.ConnectionManager zkClient has connected
   [junit4]   2> 668852 INFO  (TEST-TriggerIntegrationTest.testNodeMarkersRegistration-seed#[8257B112E10D42BA]) [n:127.0.0.1:38319_solr    ] o.a.s.c.c.ZkStateReader Updated live nodes from ZooKeeper... (0) -> (2)
   [junit4]   2> 668853 INFO  (TEST-TriggerIntegrationTest.testNodeMarkersRegistration-seed#[8257B112E10D42BA]) [n:127.0.0.1:38319_solr    ] o.a.s.c.Overseer Overseer (id=null) closing
   [junit4]   2> 668856 INFO  (TEST-TriggerIntegrationTest.testNodeMarkersRegistration-seed#[8257B112E10D42BA]) [n:127.0.0.1:38319_solr    ] o.a.s.c.ZkController Register node as live in ZooKeeper:/live_nodes/127.0.0.1:38319_solr
   [junit4]   2> 668858 INFO  (zkCallback-1603-thread-1) [    ] o.a.s.c.c.ZkStateReader Updated live nodes from ZooKeeper... (2) -> (3)
   [junit4]   2> 668858 INFO  (zkCallback-1591-thread-1-processing-n:127.0.0.1:40483_solr) [n:127.0.0.1:40483_solr    ] o.a.s.c.c.ZkStateReader Updated live nodes from ZooKeeper... (2) -> (3)
   [junit4]   2> 668858 INFO  (zkCallback-1611-thread-1-processing-n:127.0.0.1:37475_solr) [n:127.0.0.1:37475_solr    ] o.a.s.c.c.ZkStateReader Updated live nodes from ZooKeeper... (2) -> (3)
   [junit4]   2> 668858 INFO  (zkCallback-1621-thread-1-processing-n:127.0.0.1:38319_solr) [n:127.0.0.1:38319_solr    ] o.a.s.c.c.ZkStateReader Updated live nodes from ZooKeeper... (2) -> (3)
   [junit4]   2> 669057 INFO  (TEST-TriggerIntegrationTest.testNodeMarkersRegistration-seed#[8257B112E10D42BA]) [n:127.0.0.1:38319_solr    ] o.a.s.m.r.SolrJmxReporter JMX monitoring for 'solr_38319.solr.node' (registry 'solr.node') enabled at server: com.sun.jmx.mbeanserver.JmxMBeanServer@1ada017
   [junit4]   2> 669070 INFO  (TEST-TriggerIntegrationTest.testNodeMarkersRegistration-seed#[8257B112E10D42BA]) [n:127.0.0.1:38319_solr    ] o.a.s.m.r.SolrJmxReporter JMX monitoring for 'solr_38319.solr.jvm' (registry 'solr.jvm') enabled at server: com.sun.jmx.mbeanserver.JmxMBeanServer@1ada017
   [junit4]   2> 669070 INFO  (TEST-TriggerIntegrationTest.testNodeMarkersRegistration-seed#[8257B112E10D42BA]) [n:127.0.0.1:38319_solr    ] o.a.s.m.r.SolrJmxReporter JMX monitoring for 'solr_38319.solr.jetty' (registry 'solr.jetty') enabled at server: com.sun.jmx.mbeanserver.JmxMBeanServer@1ada017
   [junit4]   2> 669072 INFO  (TEST-TriggerIntegrationTest.testNodeMarkersRegistration-seed#[8257B112E10D42BA]) [n:127.0.0.1:38319_solr    ] o.a.s.c.CorePropertiesLocator Found 0 core definitions underneath /home/jenkins/workspace/Lucene-Solr-master-Linux/solr/build/solr-core/test/J1/temp/solr.cloud.autoscaling.TriggerIntegrationTest_8257B112E10D42BA-001/tempDir-001/node4/.
   [junit4]   2> 669117 INFO  (TEST-TriggerIntegrationTest.testNodeMarkersRegistration-seed#[8257B112E10D42BA]) [    ] o.a.s.c.a.TriggerIntegrationTest ====== KILL OVERSEER 1
   [junit4]   2> 669118 INFO  (TEST-TriggerIntegrationTest.testNodeMarkersRegistration-seed#[8257B112E10D42BA]) [    ] o.e.j.s.AbstractConnector Stopped ServerConnector@afe07f{SSL,[ssl, http/1.1]}{127.0.0.1:0}
   [junit4]   2> 669118 INFO  (TEST-TriggerIntegrationTest.testNodeMarkersRegistration-seed#[8257B112E10D42BA]) [    ] o.a.s.c.CoreContainer Shutting down CoreContainer instance=15849993
   [junit4]   2> 669118 INFO  (TEST-TriggerIntegrationTest.testNodeMarkersRegistration-seed#[8257B112E10D42BA]) [    ] o.a.s.m.SolrMetricManager Closing metric reporters for registry=solr.node, tag=null
   [junit4]   2> 669118 INFO  (TEST-TriggerIntegrationTest.testNodeMarkersRegistration-seed#[8257B112E10D42BA]) [    ] o.a.s.m.r.SolrJmxReporter Closing reporter [org.apache.solr.metrics.reporters.SolrJmxReporter@4fd268: rootName = solr_40483, domain = solr.node, service url = null, agent id = null] for registry solr.node / com.codahale.metrics.MetricRegistry@de040a
   [junit4]   2> 669128 INFO  (TEST-TriggerIntegrationTest.testNodeMarkersRegistration-seed#[8257B112E10D42BA]) [    ] o.a.s.m.SolrMetricManager Closing metric reporters for registry=solr.jvm, tag=null
   [junit4]   2> 669128 INFO  (TEST-TriggerIntegrationTest.testNodeMarkersRegistration-seed#[8257B112E10D42BA]) [    ] o.a.s.m.r.SolrJmxReporter Closing reporter [org.apache.solr.metrics.reporters.SolrJmxReporter@161e528: rootName = solr_40483, domain = solr.jvm, service url = null, agent id = null] for registry solr.jvm / com.codahale.metrics.MetricRegistry@1c58a8b
   [junit4]   2> 669136 INFO  (TEST-TriggerIntegrationTest.testNodeMarkersRegistration-seed#[8257B112E10D42BA]) [    ] o.a.s.m.SolrMetricManager Closing metric reporters for registry=solr.jetty, tag=null
   [junit4]   2> 669136 INFO  (TEST-TriggerIntegrationTest.testNodeMarkersRegistration-seed#[8257B112E10D42BA]) [    ] o.a.s.m.r.SolrJmxReporter Closing reporter [org.apache.solr.metrics.reporters.SolrJmxReporter@3c8a8e: rootName = solr_40483, domain = solr.jetty, service url = null, agent id = null] for registry solr.jetty / com.codahale.metrics.MetricRegistry@1fa076b
   [junit4]   2> 669137 INFO  (TEST-TriggerIntegrationTest.testNodeMarkersRegistration-seed#[8257B112E10D42BA]) [    ] o.a.s.c.ZkController Remove node as live in ZooKeeper:/live_nodes/127.0.0.1:40483_solr
   [junit4]   2> 669138 INFO  (TEST-TriggerIntegrationTest.testNodeMarkersRegistration-seed#[8257B112E10D42BA]) [    ] o.a.s.m.SolrMetricManager Closing metric reporters for registry=solr.cluster, tag=null
   [junit4]   2> 669138 INFO  (zkCallback-1611-thread-1-processing-n:127.0.0.1:37475_solr) [n:127.0.0.1:37475_solr    ] o.a.s.c.c.ZkStateReader Updated live nodes from ZooKeeper... (3) -> (2)
   [junit4]   2> 669138 INFO  (zkCallback-1591-thread-1-processing-n:127.0.0.1:40483_solr) [n:127.0.0.1:40483_solr    ] o.a.s.c.c.ZkStateReader Updated live nodes from ZooKeeper... (3) -> (2)
   [junit4]   2> 669138 INFO  (zkCallback-1603-thread-1) [    ] o.a.s.c.c.ZkStateReader Updated live nodes from ZooKeeper... (3) -> (2)
   [junit4]   2> 669138 INFO  (TEST-TriggerIntegrationTest.testNodeMarkersRegistration-seed#[8257B112E10D42BA]) [    ] o.a.s.c.TransientSolrCoreCacheDefault Allocating transient cache for 2147483647 transient cores
   [junit4]   2> 669138 INFO  (zkCallback-1621-thread-1-processing-n:127.0.0.1:38319_solr) [n:127.0.0.1:38319_solr    ] o.a.s.c.c.ZkStateReader Updated live nodes from ZooKeeper... (3) -> (2)
   [junit4]   2> 669138 INFO  (TEST-TriggerIntegrationTest.testNodeMarkersRegistration-seed#[8257B112E10D42BA]) [    ] o.a.s.c.Overseer Overseer (id=99249964721897478-127.0.0.1:40483_solr-n_0000000001) closing
   [junit4]   2> 669138 INFO  (OverseerStateUpdate-99249964721897478-127.0.0.1:40483_solr-n_0000000001) [n:127.0.0.1:40483_solr    ] o.a.s.c.Overseer Overseer Loop exiting : 127.0.0.1:40483_solr
   [junit4]   2> 669138 WARN  (OverseerAutoScalingTriggerThread-99249964721897478-127.0.0.1:40483_solr-n_0000000001) [n:127.0.0.1:40483_solr    ] o.a.s.c.a.OverseerTriggerThread OverseerTriggerThread woken up but we are closed, exiting.
   [junit4]   2> 669139 DEBUG (TEST-TriggerIntegrationTest.testNodeMarkersRegistration-seed#[8257B112E10D42BA]) [    ] o.a.s.c.a.OverseerTriggerThread OverseerTriggerThread has been closed explicitly
   [junit4]   2> 669147 INFO  (zkCallback-1611-thread-1-processing-n:127.0.0.1:37475_solr) [n:127.0.0.1:37475_solr    ] o.a.s.c.OverseerElectionContext I am going to be the leader 127.0.0.1:37475_solr
   [junit4]   2> 669147 INFO  (TEST-TriggerIntegrationTest.testNodeMarkersRegistration-seed#[8257B112E10D42BA]) [    ] o.e.j.s.h.ContextHandler Stopped o.e.j.s.ServletContextHandler@1ea6a02{/solr,null,UNAVAILABLE}
   [junit4]   2> 669148 INFO  (zkCallback-1611-thread-1-processing-n:127.0.0.1:37475_solr) [n:127.0.0.1:37475_solr    ] o.a.s.c.Overseer Overseer (id=99249964721897483-127.0.0.1:37475_solr-n_0000000002) starting
   [junit4]   2> 669155 DEBUG (OverseerAutoScalingTriggerThread-99249964721897483-127.0.0.1:37475_solr-n_0000000002) [n:127.0.0.1:37475_solr    ] o.a.s.c.a.OverseerTriggerThread Adding .autoAddReplicas trigger
   [junit4]   2> 669156 DEBUG (OverseerAutoScalingTriggerThread-99249964721897483-127.0.0.1:37475_solr-n_0000000002) [n:127.0.0.1:37475_solr    ] o.a.s.c.a.OverseerTriggerThread Refreshing /autoscaling.json with znode version 6
   [junit4]   2> 669157 DEBUG (OverseerAutoScalingTriggerThread-99249964721897483-127.0.0.1:37475_solr-n_0000000002) [n:127.0.0.1:37475_solr    ] o.a.s.c.a.NodeLostTrigger Initial livenodes: [127.0.0.1:37475_solr, 127.0.0.1:38319_solr]
   [junit4]   2> 669157 DEBUG (OverseerAutoScalingTriggerThread-99249964721897483-127.0.0.1:37475_solr-n_0000000002) [n:127.0.0.1:37475_solr    ] o.a.s.c.a.OverseerTriggerThread Current znodeVersion 6, lastZnodeVersion -1
   [junit4]   2> 669157 DEBUG (OverseerAutoScalingTriggerThread-99249964721897483-127.0.0.1:37475_solr-n_0000000002) [n:127.0.0.1:37475_solr    ] o.a.s.c.a.OverseerTriggerThread Processed trigger updates upto znodeVersion 6
   [junit4]   2> 669158 DEBUG (OverseerAutoScalingTriggerThread-99249964721897483-127.0.0.1:37475_solr-n_0000000002) [n:127.0.0.1:37475_solr    ] o.a.s.c.a.OverseerTriggerThread -- clean old nodeAdded markers
   [junit4]   2> 669158 DEBUG (OverseerAutoScalingTriggerThread-99249964721897483-127.0.0.1:37475_solr-n_0000000002) [n:127.0.0.1:37475_solr    ] o.a.s.c.a.OverseerTriggerThread Current znodeVersion 6, lastZnodeVersion 6
   [junit4]   2> 669158 DEBUG (ScheduledTrigger-2174-thread-1) [n:127.0.0.1:37475_solr    ] o.a.s.c.a.NodeLostTrigger Running NodeLostTrigger: .auto_add_replicas with currently live nodes: 2
   [junit4]   2> 670159 DEBUG (ScheduledTrigger-2174-thread-1) [n:127.0.0.1:37475_solr    ] o.a.s.c.a.NodeLostTrigger Running NodeLostTrigger: .auto_add_replicas with currently live nodes: 2
   [junit4]   2> 671160 DEBUG (ScheduledTrigger-2174-thread-2) [n:127.0.0.1:37475_solr    ] o.a.s.c.a.NodeLostTrigger Running NodeLostTrigger: .auto_add_replicas with currently live nodes: 2
   [junit4]   2> 672160 DEBUG (ScheduledTrigger-2174-thread-1) [n:127.0.0.1:37475_solr    ] o.a.s.c.a.NodeLostTrigger Running NodeLostTrigger: .auto_add_replicas with currently live nodes: 2
   [junit4]   2> 673161 DEBUG (ScheduledTrigger-2174-thread-1) [n:127.0.0.1:37475_solr    ] o.a.s.c.a.NodeLostTrigger Running NodeLostTrigger: .auto_add_replicas with currently live nodes: 2
   [junit4]   2> 674148 INFO  (TEST-TriggerIntegrationTest.testNodeMarkersRegistration-seed#[8257B112E10D42BA]) [    ] o.a.s.c.a.TriggerIntegrationTest ====== ADD TRIGGERS
   [junit4]   2> 674161 DEBUG (ScheduledTrigger-2174-thread-1) [n:127.0.0.1:37475_solr    ] o.a.s.c.a.NodeLostTrigger Running NodeLostTrigger: .auto_add_replicas with currently live nodes: 2
   [junit4]   2> 674212 INFO  (qtp18805272-5949) [n:127.0.0.1:37475_solr    ] o.a.s.s.HttpSolrCall [admin] webapp=null path=/admin/metrics params={prefix=CORE.coreName&wt=javabin&version=2&group=solr.core} status=0 QTime=0
   [junit4]   2> 674217 INFO  (qtp12193200-5993) [n:127.0.0.1:38319_solr    ] o.a.s.s.HttpSolrCall [admin] webapp=null path=/admin/metrics params={prefix=CORE.coreName&wt=javabin&version=2&group=solr.core} status=0 QTime=0
   [junit4]   2> 674217 DEBUG (qtp12193200-5986) [n:127.0.0.1:38319_solr    ] o.a.s.c.a.AutoScalingHandler Verified autoscaling configuration
   [junit4]   2> 674218 INFO  (qtp12193200-5986) [n:127.0.0.1:38319_solr    ] o.a.s.s.HttpSolrCall [admin] webapp=null path=/cluster/autoscaling params={wt=javabin&version=2} status=0 QTime=11
   [junit4]   2> 674218 DEBUG (zkCallback-1611-thread-1-processing-n:127.0.0.1:37475_solr) [n:127.0.0.1:37475_solr    ] o.a.s.c.a.OverseerTriggerThread Refreshing /autoscaling.json with znode version 7
   [junit4]   2> 674225 DEBUG (zkCallback-1611-thread-1-processing-n:127.0.0.1:37475_solr) [n:127.0.0.1:37475_solr    ] o.a.s.c.a.NodeLostTrigger Initial livenodes: [127.0.0.1:37475_solr, 127.0.0.1:38319_solr]
   [junit4]   2> 674226 DEBUG (zkCallback-1611-thread-1-processing-n:127.0.0.1:37475_solr) [n:127.0.0.1:37475_solr    ] o.a.s.c.a.NodeAddedTrigger Initial livenodes: [127.0.0.1:37475_solr, 127.0.0.1:38319_solr]
   [junit4]   2> 674226 DEBUG (zkCallback-1611-thread-1-processing-n:127.0.0.1:37475_solr) [n:127.0.0.1:37475_solr    ] o.a.s.c.a.NodeAddedTrigger NodeAddedTrigger node_added_trigger instantiated with properties: {event=nodeAdded, waitFor=1, actions=[{name=test, class=org.apache.solr.cloud.autoscaling.TriggerIntegrationTest$TestEventMarkerAction}], enabled=true}
   [junit4]   2> 674226 DEBUG (OverseerAutoScalingTriggerThread-99249964721897483-127.0.0.1:37475_solr-n_0000000002) [n:127.0.0.1:37475_solr    ] o.a.s.c.a.OverseerTriggerThread Processed trigger updates upto znodeVersion 7
   [junit4]   2> 674227 INFO  (OverseerAutoScalingTriggerThread-99249964721897483-127.0.0.1:37475_solr-n_0000000002) [n:127.0.0.1:37475_solr    ] o.a.s.c.a.TriggerIntegrationTest TestEventMarkerAction init
   [junit4]   2> 674228 DEBUG (OverseerAutoScalingTriggerThread-99249964721897483-127.0.0.1:37475_solr-n_0000000002) [n:127.0.0.1:37475_solr    ] o.a.s.c.a.OverseerTriggerThread Current znodeVersion 7, lastZnodeVersion 7
   [junit4]   2> 674228 DEBUG (ScheduledTrigger-2174-thread-3) [n:127.0.0.1:37475_solr    ] o.a.s.c.a.NodeAddedTrigger Running NodeAddedTrigger node_added_trigger
   [junit4]   2> 674228 DEBUG (ScheduledTrigger-2174-thread-3) [n:127.0.0.1:37475_solr    ] o.a.s.c.a.NodeAddedTrigger Found livenodes: 2
   [junit4]   2> 674233 INFO  (qtp18805272-5949) [n:127.0.0.1:37475_solr    ] o.a.s.s.HttpSolrCall [admin] webapp=null path=/admin/metrics params={prefix=CORE.coreName&wt=javabin&version=2&group=solr.core} status=0 QTime=0
   [junit4]   2> 674238 INFO  (qtp12193200-5992) [n:127.0.0.1:38319_solr    ] o.a.s.s.HttpSolrCall [admin] webapp=null path=/admin/metrics params={prefix=CORE.coreName&wt=javabin&version=2&group=solr.core} status=0 QTime=0
   [junit4]   2> 674239 DEBUG (qtp18805272-5955) [n:127.0.0.1:37475_solr    ] o.a.s.c.a.AutoScalingHandler Verified autoscaling configuration
   [junit4]   2> 674239 INFO  (qtp18805272-5955) [n:127.0.0.1:37475_solr    ] o.a.s.s.HttpSolrCall [admin] webapp=null path=/cluster/autoscaling params={wt=javabin&version=2} status=0 QTime=11
   [junit4]   2> 674240 DEBUG (zkCallback-1611-thread-1-processing-n:127.0.0.1:37475_solr) [n:127.0.0.1:37475_solr    ] o.a.s.c.a.OverseerTriggerThread Refreshing /autoscaling.json with znode version 8
   [junit4]   2> 674240 DEBUG (zkCallback-1611-thread-1-processing-n:127.0.0.1:37475_solr) [n:127.0.0.1:37475_solr    ] o.a.s.c.a.NodeLostTrigger Initial livenodes: [127.0.0.1:37475_solr, 127.0.0.1:38319_solr]
   [junit4]   2> 674240 DEBUG (zkCallback-1611-thread-1-processing-n:127.0.0.1:37475_solr) [n:127.0.0.1:37475_solr    ] o.a.s.c.a.NodeLostTrigger Initial livenodes: [127.0.0.1:37475_solr, 127.0.0.1:38319_solr]
   [junit4]   2> 674241 DEBUG (zkCallback-1611-thread-1-processing-n:127.0.0.1:37475_solr) [n:127.0.0.1:37475_solr    ] o.a.s.c.a.NodeAddedTrigger Initial livenodes: [127.0.0.1:37475_solr, 127.0.0.1:38319_solr]
   [junit4]   2> 674241 DEBUG (zkCallback-1611-thread-1-processing-n:127.0.0.1:37475_solr) [n:127.0.0.1:37475_solr    ] o.a.s.c.a.NodeAddedTrigger NodeAddedTrigger node_added_trigger instantiated with properties: {event=nodeAdded, waitFor=1, actions=[{name=test, class=org.apache.solr.cloud.autoscaling.TriggerIntegrationTest$TestEventMarkerAction}], enabled=true}
   [junit4]   2> 674241 DEBUG (OverseerAutoScalingTriggerThread-99249964721897483-127.0.0.1:37475_solr-n_0000000002) [n:127.0.0.1:37475_solr    ] o.a.s.c.a.OverseerTriggerThread Processed trigger updates upto znodeVersion 8
   [junit4]   2> 674242 INFO  (OverseerAutoScalingTriggerThread-99249964721897483-127.0.0.1:37475_solr-n_0000000002) [n:127.0.0.1:37475_solr    ] o.a.s.c.a.TriggerIntegrationTest TestEventMarkerAction init
   [junit4]   2> 674242 DEBUG (ScheduledTrigger-2174-thread-1) [n:127.0.0.1:37475_solr    ] o.a.s.c.a.NodeLostTrigger Running NodeLostTrigger: node_lost_trigger with currently live nodes: 2
   [junit4]   2> 674242 DEBUG (OverseerAutoScalingTriggerThread-99249964721897483-127.0.0.1:37475_solr-n_0000000002) [n:127.0.0.1:37475_solr    ] o.a.s.c.a.OverseerTriggerThread Current znodeVersion 8, lastZnodeVersion 8
   [junit4]   2> 674243 INFO  (qtp18805272-5950) [n:127.0.0.1:37475_solr    ] o.a.s.h.a.CollectionsHandler Invoked Collection Action :overseerstatus with params action=OVERSEERSTATUS&wt=javabin&version=2 and sendToOCPQueue=true
   [junit4]   2> 674252 INFO  (qtp18805272-5950) [n:127.0.0.1:37475_solr    ] o.a.s.s.HttpSolrCall [admin] webapp=null path=/admin/collections params={action=OVERSEERSTATUS&wt=javabin&version=2} status=0 QTime=8
   [junit4]   2> 674254 INFO  (TEST-TriggerIntegrationTest.testNodeMarkersRegistration-seed#[8257B112E10D42BA]) [    ] o.a.s.c.a.TriggerIntegrationTest ====== ADD NODE 1
   [junit4]   2> 674260 INFO  (TEST-TriggerIntegrationTest.testNodeMarkersRegistration-seed#[8257B112E10D42BA]) [    ] o.e.j.s.Server jetty-9.3.20.v20170531
   [junit4]   2> 674265 INFO  (TEST-TriggerIntegrationTest.testNodeMarkersRegistration-seed#[8257B112E10D42BA]) [    ] o.e.j.s.h.ContextHandler Started o.e.j.s.ServletContextHandler@620990{/solr,null,AVAILABLE}
   [junit4]   2> 674266 INFO  (TEST-TriggerIntegrationTest.testNodeMarkersRegistration-seed#[8257B112E10D42BA]) [    ] o.e.j.s.AbstractConnector Started ServerConnector@1264aeb{SSL,[ssl, http/1.1]}{127.0.0.1:35091}
   [junit4]   2> 674266 INFO  (TEST-TriggerIntegrationTest.testNodeMarkersRegistration-seed#[8257B112E10D42BA]) [    ] o.e.j.s.Server Started @675284ms
   [junit4]   2> 674266 INFO  (TEST-TriggerIntegrationTest.testNodeMarkersRegistration-seed#[8257B112E10D42BA]) [    ] o.a.s.c.s.e.JettySolrRunner Jetty properties: {hostContext=/solr, hostPort=35091}
   [junit4]   2> 674266 ERROR (TEST-TriggerIntegrationTest.testNodeMarkersRegistration-seed#[8257B112E10D42BA]) [    ] o.a.s.u.StartupLoggingUtils Missing Java Option solr.log.dir. Logging may be missing or incomplete.
   [junit4]   2> 674266 INFO  (TEST-TriggerIntegrationTest.testNodeMarkersRegistration-seed#[8257B112E10D42BA]) [    ] o.a.s.s.SolrDispatchFilter  ___      _       Welcome to Apache Solr™ version 8.0.0
   [junit4]   2> 674266 INFO  (TEST-TriggerIntegrationTest.testNodeMarkersRegistration-seed#[8257B112E10D42BA]) [    ] o.a.s.s.SolrDispatchFilter / __| ___| |_ _   Starting in cloud mode on port null
   [junit4]   2> 674266 INFO  (TEST-TriggerIntegrationTest.testNodeMarkersRegistration-seed#[8257B112E10D42BA]) [    ] o.a.s.s.SolrDispatchFilter \__ \/ _ \ | '_|  Install dir: null
   [junit4]   2> 674267 INFO  (TEST-TriggerIntegrationTest.testNodeMarkersRegistration-seed#[8257B112E10D42BA]) [    ] o.a.s.s.SolrDispatchFilter |___/\___/_|_|    Start time: 2017-12-28T04:11:32.484Z
   [junit4]   2> 674270 INFO  (zkConnectionManagerCallback-1626-thread-1) [    ] o.a.s.c.c.ConnectionManager zkClient has connected
   [junit4]   2> 674271 INFO  (TEST-TriggerIntegrationTest.testNodeMarkersRegistration-seed#[8257B112E10D42BA]) [    ] o.a.s.s.SolrDispatchFilter solr.xml found in ZooKeeper. Loading...
   [junit4]   2> 674289 INFO  (TEST-TriggerIntegrationTest.testNodeMarkersRegistration-seed#[8257B112E10D42BA]) [    ] o.a.s.c.ZkContainer Zookeeper client=127.0.0.1:35093/solr
   [junit4]   2> 674293 INFO  (zkConnectionManagerCallback-1630-thread-1) [    ] o.a.s.c.c.ConnectionManager zkClient has connected
   [junit4]   2> 674302 INFO  (zkConnectionManagerCallback-1632-thread-1-processing-n:127.0.0.1:35091_solr) [n:127.0.0.1:35091_solr    ] o.a.s.c.c.ConnectionManager zkClient has connected
   [junit4]   2> 674307 INFO  (TEST-TriggerIntegrationTest.testNodeMarkersRegistration-seed#[8257B112E10D42BA]) [n:127.0.0.1:35091_solr    ] o.a.s.c.c.ZkStateReader Updated live nodes from ZooKeeper... (0) -> (2)
   [junit4]   2> 674308 INFO  (TEST-TriggerIntegrationTest.testNodeMarkersRegistration-seed#[8257B112E10D42BA]) [n:127.0.0.1:35091_solr    ] o.a.s.c.Overseer Overseer (id=null) closing
   [junit4]   2> 674310 INFO  (TEST-TriggerIntegrationTest.testNodeMarkersRegistration-seed#[8257B112E10D42BA]) [n:127.0.0.1:35091_solr    ] o.a.s.c.ZkController Register node as live in ZooKeeper:/live_nodes/127.0.0.1:35091_solr
   [junit4]   2> 674315 INFO  (zkCallback-1621-thread-1-processing-n:127.0.0.1:38319_solr) [n:127.0.0.1:38319_solr    ] o.a.s.c.c.ZkStateReader Updated live nodes from ZooKeeper... (2) -> (3)
   [junit4]   2> 674315 INFO  (zkCallback-1611-thread-1-processing-n:127.0.0.1:37475_solr) [n:127.0.0.1:37475_solr    ] o.a.s.c.c.ZkStateReader Updated live nodes from ZooKeeper... (2) -> (3)
   [junit4]   2> 674315 INFO  (zkCallback-1603-thread-1) [    ] o.a.s.c.c.ZkStateReader Updated live nodes from ZooKeeper... (2) -> (3)
   [junit4]   2> 674316 INFO  (zkCallback-1631-thread-1-processing-n:127.0.0.1:35091_solr) [n:127.0.0.1:35091_solr    ] o.a.s.c.c.ZkStateReader Updated live nodes from ZooKeeper... (2) -> (3)
   [junit4]   2> 674611 INFO  (TEST-TriggerIntegrationTest.testNodeMarkersRegistration-seed#[8257B112E10D42BA]) [n:127.0.0.1:35091_solr    ] o.a.s.m.r.SolrJmxReporter JMX monitoring for 'solr_35091.solr.node' (registry 'solr.node') enabled at server: com.sun.jmx.mbeanserver.JmxMBeanServer@1ada017
   [junit4]   2> 674635 INFO  (TEST-TriggerIntegrationTest.testNodeMarkersRegistration-seed#[8257B112E10D42BA]) [n:127.0.0.1:35091_solr    ] o.a.s.m.r.SolrJmxReporter JMX monitoring for 'solr_35091.solr.jvm' (registry 'solr.jvm') enabled at server: com.sun.jmx.mbeanserver.JmxMBeanServer@1ada017
   [junit4]   2> 674635 INFO  (TEST-TriggerIntegrationTest.testNodeMarkersRegistration-seed#[8257B112E10D42BA]) [n:127.0.0.1:35091_solr    ] o.a.s.m.r.SolrJmxReporter JMX monitoring for 'solr_35091.solr.jetty' (registry 'solr.jetty') enabled at server: com.sun.jmx.mbeanserver.JmxMBeanServer@1ada017
   [junit4]   2> 674638 INFO  (TEST-TriggerIntegrationTest.testNodeMarkersRegistration-seed#[8257B112E10D42BA]) [n:127.0.0.1:35091_solr    ] o.a.s.c.CorePropertiesLocator Found 0 core definitions underneath /home/jenkins/workspace/Lucene-Solr-master-Linux/solr/build/solr-core/test/J1/temp/solr.cloud.autoscaling.TriggerIntegrationTest_8257B112E10D42BA-001/tempDir-001/node5/.
   [junit4]   2> 675161 DEBUG (ScheduledTrigger-2174-thread-2) [n:127.0.0.1:37475_solr    ] o.a.s.c.a.NodeLostTrigger Running NodeLostTrigger: .auto_add_replicas with currently live nodes: 3
   [junit4]   2> 675229 DEBUG (ScheduledTrigger-2174-thread-4) [n:127.0.0.1:37475_solr    ] o.a.s.c.a.NodeAddedTrigger Running NodeAddedTrigger node_added_trigger
   [junit4]   2> 675230 DEBUG (ScheduledTrigger-2174-thread-4) [n:127.0.0.1:37475_solr    ] o.a.s.c.a.NodeAddedTrigger Found livenodes: 3
   [junit4]   2> 675230 DEBUG (ScheduledTrigger-2174-thread-4) [n:127.0.0.1:37475_solr    ] o.a.s.c.a.NodeAddedTrigger Tracking new node: 127.0.0.1:35091_solr at time 2135435419162869
   [junit4]   2> 675244 DEBUG (ScheduledTrigger-2174-thread-3) [n:127.0.0.1:37475_solr    ] o.a.s.c.a.NodeLostTrigger Running NodeLostTrigger: node_lost_trigger with currently live nodes: 3
   [junit4]   2> 676163 DEBUG (ScheduledTrigger-2174-thread-1) [n:127.0.0.1:37475_solr    ] o.a.s.c.a.NodeLostTrigger Running NodeLostTrigger: .auto_add_replicas with currently live nodes: 3
   [junit4]   2> 676230 DEBUG (ScheduledTrigger-2174-thread-2) [n:127.0.0.1:37475_solr    ] o.a.s.c.a.NodeAddedTrigger Running NodeAddedTrigger node_added_trigger
   [junit4]   2> 676230 DEBUG (ScheduledTrigger-2174-thread-2) [n:127.0.0.1:37475_solr    ] o.a.s.c.a.NodeAddedTrigger Found livenodes: 3
   [junit4]   2> 676230 DEBUG (ScheduledTrigger-2174-thread-2) [n:127.0.0.1:37475_solr    ] o.a.s.c.a.NodeAddedTrigger NodeAddedTrigger node_added_trigger firing registered processor for nodes: [127.0.0.1:35091_solr] added at times [2135435419162869], now=2135436420038904
   [junit4]   2> 676231 DEBUG (ScheduledTrigger-2174-thread-2) [n:127.0.0.1:37475_solr    ] o.a.s.c.a.ScheduledTriggers ++++++++ Cooldown inactive - processing event: {
   [junit4]   2>   "id":"7962acd9998f5T8s7uzzb43u62n6bqvaatpj3z9",
   [junit4]   2>   "source":"node_added_trigger",
   [junit4]   2>   "eventTime":2135435419162869,
   [junit4]   2>   "eventType":"NODEADDED",
   [junit4]   2>   "properties":{
   [junit4]   2>     "eventTimes":[2135435419162869],
   [junit4]   2>     "nodeNames":["127.0.0.1:35091_solr"]}}
   [junit4]   2> 676231 INFO  (ScheduledTrigger-2174-thread-2) [n:127.0.0.1:37475_solr    ] o.a.s.c.a.SystemLogListener Collection .system does not exist, disabling logging.
   [junit4]   2> 676232 DEBUG (AutoscalingActionExecutor-2175-thread-1-processing-n:127.0.0.1:37475_solr) [n:127.0.0.1:37475_solr    ] o.a.s.c.a.ScheduledTriggers -- processing actions for {
   [junit4]   2>   "id":"7962acd9998f5T8s7uzzb43u62n6bqvaatpj3z9",
   [junit4]   2>   "source":"node_added_trigger",
   [junit4]   2>   "eventTime":2135435419162869,
   [junit4]   2>   "eventType":"NODEADDED",
   [junit4]   2>   "properties":{
   [junit4]   2>     "eventTimes":[2135435419162869],
   [junit4]   2>     "_enqueue_time_":2135436420213685,
   [junit4]   2>     "nodeNames":["127.0.0.1:35091_solr"]}}
   [junit4]   2> 676232 DEBUG (AutoscalingActionExecutor-2175-thread-1-processing-n:127.0.0.1:37475_solr) [n:127.0.0.1:37475_solr    ] o.a.s.c.a.ScheduledTriggers -- processing took 0 ms for event id=7962acd9998f5T8s7uzzb43u62n6bqvaatpj3z9
   [junit4]   2> 676245 DEBUG (ScheduledTrigger-2174-thread-4) [n:127.0.0.1:37475_solr    ] o.a.s.c.a.NodeLostTrigger Running NodeLostTrigger: node_lost_trigger with currently live nodes: 3
   [junit4]   2> 676250 INFO  (OverseerCollectionConfigSetProcessor-99249964721897483-127.0.0.1:37475_solr-n_0000000002) [n:127.0.0.1:37475_solr    ] o.a.s.c.OverseerTaskQueue Response ZK path: /overseer/collection-queue-work/qnr-0000000004 doesn't exist.  Requestor may have disconnected from ZooKeeper
   [junit4]   2> 677163 DEBUG (ScheduledTrigger-2174-thread-3) [n:127.0.0.1:37475_solr    ] o.a.s.c.a.NodeLostTrigger Running NodeLostTrigger: .auto_add_replicas with currently live nodes: 3
   [junit4]   2> 677232 DEBUG (ScheduledTrigger-2174-thread-1) [n:127.0.0.1:37475_solr    ] o.a.s.c.a.NodeAddedTrigger Running NodeAddedTrigger node_added_trigger
   [junit4]   2> 677233 DEBUG (ScheduledTrigger-2174-thread-1) [n:127.0.0.1:37475_solr    ] o.a.s.c.a.NodeAddedTrigger Found livenodes: 3
   [junit4]   2> 677246 DEBUG (ScheduledTrigger-2174-thread-2) [n:127.0.0.1:37475_solr    ] o.a.s.c.a.NodeLostTrigger Running NodeLostTrigger: node_lost_trigger with currently live nodes: 3
   [junit4]   2> 678164 DEBUG (ScheduledTrigger-2174-thread-4) [n:127.0.0.1:37475_solr    ] o.a.s.c.a.NodeLostTrigger Running NodeLostTrigger: .auto_add_replicas with currently live nodes: 3
   [junit4]   2> 678233 DEBUG (ScheduledTrigger-2174-thread-3) [n:127.0.0.1:37475_solr    ] o.a.s.c.a.NodeAddedTrigger Running NodeAddedTrigger node_added_trigger
   [junit4]   2> 678233 DEBUG (ScheduledTrigger-2174-thread-3) [n:127.0.0.1:37475_solr    ] o.a.s.c.a.NodeAddedTrigger Found livenodes: 3
   [junit4]   2> 678246 DEBUG (ScheduledTrigger-2174-thread-1) [n:127.0.0.1:37475_solr    ] o.a.s.c.a.NodeLostTrigger Running NodeLostTrigger: node_lost_trigger with currently live nodes: 3
   [junit4]   2> 679164 DEBUG (ScheduledTrigger-2174-thread-2) [n:127.0.0.1:37475_solr    ] o.a.s.c.a.NodeLostTrigger Running NodeLostTrigger: .auto_add_replicas with currently live nodes: 3
   [junit4]   2> 679233 DEBUG (ScheduledTrigger-2174-thread-4) [n:127.0.0.1:37475_solr    ] o.a.s.c.a.NodeAddedTrigger Running NodeAddedTrigger node_added_trigger
   [junit4]   2> 679233 DEBUG (ScheduledTrigger-2174-thread-4) [n:127.0.0.1:37475_solr    ] o.a.s.c.a.NodeAddedTrigger Found livenodes: 3
   [junit4]   2> 679246 DEBUG (ScheduledTrigger-2174-thread-3) [n:127.0.0.1:37475_solr    ] o.a.s.c.a.NodeLostTrigger Running NodeLostTrigger: node_lost_trigger with currently live nodes: 3
   [junit4]   2> 679699 INFO  (TEST-TriggerIntegrationTest.testNodeMarkersRegistration-seed#[8257B112E10D42BA]) [    ] o.a.s.c.a.TriggerIntegrationTest ====== KILL OVERSEER 2
   [junit4]   2> 679700 INFO  (TEST-TriggerIntegrationTest.testNodeMarkersRegistration-seed#[8257B112E10D42BA]) [    ] o.e.j.s.AbstractConnector Stopped ServerConnector@d1ad9a{SSL,[ssl, http/1.1]}{127.0.0.1:0}
   [junit4]   2> 679700 INFO  (TEST-TriggerIntegrationTest.testNodeMarkersRegistration-seed#[8257B112E10D42BA]) [    ] o.a.s.c.CoreContainer Shutting down CoreContainer instance=2604898
   [junit4]   2> 679700 INFO  (TEST-TriggerIntegrationTest.testNodeMarkersRegistration-seed#[8257B112E10D42BA]) [    ] o.a.s.m.SolrMetricManager Closing metric reporters for registry=solr.node, tag=null
   [junit4]   2> 679700 INFO  (TEST-TriggerIntegrationTest.testNodeMarkersRegistration-seed#[8257B112E10D42BA]) [    ] o.a.s.m.r.SolrJmxReporter Closing reporter [org.apache.solr.metrics.reporters.SolrJmxReporter@f4f97b: rootName = solr_37475, domain = solr.node, service url = null, agent id = null] for registry solr.node / com.codahale.metrics.MetricRegistry@10d1908
   [junit4]   2> 679707 INFO  (TEST-TriggerIntegrationTest.testNodeMarkersRegistration-seed#[8257B112E10D42BA]) [    ] o.a.s.m.SolrMetricManager Closing metric reporters for registry=solr.jvm, tag=null
   [junit4]   2> 679707 INFO  (TEST-TriggerIntegrationTest.testNodeMarkersRegistration-seed#[8257B112E10D42BA]) [    ] o.a.s.m.r.SolrJmxReporter Closing reporter [org.apache.solr.metrics.reporters.SolrJmxReporter@b1771f: rootName = solr_37475, domain = solr.jvm, service url = null, agent id = null] for registry solr.jvm / com.codahale.metrics.MetricRegistry@1c58a8b
   [junit4]   2> 679712 INFO  (TEST-TriggerIntegrationTest.testNodeMarkersRegistration-seed#[8257B112E10D42BA]) [    ] o.a.s.m.SolrMetricManager Closing metric reporters for registry=solr.jetty, tag=null
   [junit4]   2> 679712 INFO  (TEST-TriggerIntegrationTest.testNodeMarkersRegistration-seed#[8257B112E10D42BA]) [    ] o.a.s.m.r.SolrJmxReporter Closing reporter [org.apache.solr.metrics.reporters.SolrJmxReporter@abe68c: rootName = solr_37475, domain = solr.jetty, service url = null, agent id = null] for registry solr.jetty / com.codahale.metrics.MetricRegistry@1fa076b
   [junit4]   2> 679713 INFO  (TEST-TriggerIntegrationTest.testNodeMarkersRegistration-seed#[8257B112E10D42BA]) [    ] o.a.s.c.ZkController Remove node as live in ZooKeeper:/live_nodes/127.0.0.1:37475_solr
   [junit4]   2> 679714 INFO  (TEST-TriggerIntegrationTest.testNodeMarkersRegistration-seed#[8257B112E10D42BA]) [    ] o.a.s.m.SolrMetricManager Closing metric reporters for registry=solr.cluster, tag=null
   [junit4]   2> 679714 INFO  (TEST-TriggerIntegrationTest.testNodeMarkersRegistration-seed#[8257B112E10D42BA]) [    ] o.a.s.c.TransientSolrCoreCacheDefault Allocating transient cache for 2147483647 transient cores
   [junit4]   2> 679714 INFO  (TEST-TriggerIntegrationTest.testNodeMarkersRegistration-seed#[8257B112E10D42BA]) [    ] o.a.s.c.Overseer Overseer (id=99249964721897483-127.0.0.1:37475_solr-n_0000000002) closing
   [junit4]   2> 679714 INFO  (OverseerStateUpdate-99249964721897483-127.0.0.1:37475_solr-n_0000000002) [n:127.0.0.1:37475_solr    ] o.a.s.c.Overseer Overseer Loop exiting : 127.0.0.1:37475_solr
   [junit4]   2> 679714 WARN  (OverseerAutoScalingTriggerThread-99249964721897483-127.0.0.1:37475_solr-n_0000000002) [n:127.0.0.1:37475_solr    ] o.a.s.c.a.OverseerTriggerThread OverseerTriggerThread woken up but we are closed, exiting.
   [junit4]   2> 679715 INFO  (zkCallback-1621-thread-1-processing-n:127.0.0.1:38319_solr) [n:127.0.0.1:38319_solr    ] o.a.s.c.c.ZkStateReader Updated live nodes from ZooKeeper... (3) -> (2)
   [junit4]   2> 679715 INFO  (zkCallback-1603-thread-1) [    ] o.a.s.c.c.ZkStateReader Updated live nodes from ZooKeeper... (3) -> (2)
   [junit4]   2> 679716 INFO  (zkCallback-1631-thread-1-processing-n:127.0.0.1:35091_solr) [n:127.0.0.1:35091_solr    ] o.a.s.c.c.ZkStateReader Updated live nodes from ZooKeeper... (3) -> (2)
   [junit4]   2> 679716 DEBUG (TEST-TriggerIntegrationTest.testNodeMarkersRegistration-seed#[8257B112E10D42BA]) [    ] o.a.s.c.a.OverseerTriggerThread OverseerTriggerThread has been closed explicitly
   [junit4]   2> 679716 INFO  (zkCallback-1611-thread-1-processing-n:127.0.0.1:37475_solr) [n:127.0.0.1:37475_solr    ] o.a.s.c.c.ZkStateReader Updated live nodes from ZooKeeper... (3) -> (2)
   [junit4]   2> 679717 INFO  (zkCallback-1621-thread-1-processing-n:127.0.0.1:38319_solr) [n:127.0.0.1:38319_solr    ] o.a.s.c.OverseerElectionContext I am going to be the leader 127.0.0.1:38319_solr
   [junit4]   2> 679717 INFO  (TEST-TriggerIntegrationTest.testNodeMarkersRegistration-seed#[8257B112E10D42BA]) [    ] o.e.j.s.h.ContextHandler Stopped o.e.j.s.ServletContextHandler@1142e6{/solr,null,UNAVAILABLE}
   [junit4]   2> 679717 INFO  (zkCallback-1621-thread-1-processing-n:127.0.0.1:38319_solr) [n:127.0.0.1:38319_solr    ] o.a.s.c.Overseer Overseer (id=99249964721897486-127.0.0.1:38319_solr-n_0000000003) starting
   [junit4]   2> 679721 DEBUG (OverseerAutoScalingTriggerThread-99249964721897486-127.0.0.1:38319_solr-n_0000000003) [n:127.0.0.1:38319_solr    ] o.a.s.c.a.OverseerTriggerThread Refreshing /autoscaling.json with znode version 8
   [junit4]   2> 679721 DEBUG (OverseerAutoScalingTriggerThread-99249964721897486-127.0.0.1:38319_solr-n_0000000003) [n:127.0.0.1:38319_solr    ] o.a.s.c.a.NodeLostTrigger Initial livenodes: [127.0.0.1:35091_solr, 127.0.0.1:38319_solr]
   [junit4]   2> 679721 DEBUG (OverseerAutoScalingTriggerThread-99249964721897486-127.0.0.1:38319_solr-n_0000000003) [n:127.0.0.1:38319_solr    ] o.a.s.c.a.NodeLostTrigger Initial livenodes: [127.0.0.1:35091_solr, 127.0.0.1:38319_solr]
   [junit4]   2> 679721 DEBUG (OverseerAutoScalingTriggerThread-99249964721897486-127.0.0.1:38319_solr-n_0000000003) [n:127.0.0.1:38319_solr    ] o.a.s.c.a.NodeAddedTrigger Initial livenodes: [127.0.0.1:35091_solr, 127.0.0.1:38319_solr]
   [junit4]   2> 679721 DEBUG (OverseerAutoScalingTriggerThread-99249964721897486-127.0.0.1:38319_solr-n_0000000003) [n:127.0.0.1:38319_solr    ] o.a.s.c.a.NodeAddedTrigger NodeAddedTrigger node_added_trigger instantiated with properties: {event=nodeAdded, waitFor=1, actions=[{name=test, class=org.apache.solr.cloud.autoscaling.TriggerIntegrationTest$TestEventMarkerAction}], enabled=true}
   [junit4]   2> 679721 DEBUG (OverseerAutoScalingTriggerThread-99249964721897486-127.0.0.1:38319_solr-n_0000000003) [n:127.0.0.1:38319_solr    ] o.a.s.c.a.OverseerTriggerThread Current znodeVersion 8, lastZnodeVersion -1
   [junit4]   2> 679721 DEBUG (OverseerAutoScalingTriggerThread-99249964721897486-127.0.0.1:38319_solr-n_0000000003) [n:127.0.0.1:38319_solr    ] o.a.s.c.a.OverseerTriggerThread Processed trigger updates upto znodeVersion 8
   [junit4]   2> 679722 INFO  (OverseerAutoScalingTriggerThread-99249964721897486-127.0.0.1:38319_solr-n_0000000003) [n:127.0.0.1:38319_solr    ] o.a.s.c.a.TriggerIntegrationTest TestEventMarkerAction init
   [junit4]   2> 679722 DEBUG (OverseerAutoScalingTriggerThread-99249964721897486-127.0.0.1:38319_solr-n_0000000003) [n:127.0.0.1:38319_solr    ] o.a.s.c.a.NodeLostTrigger Adding lost node from marker path: 127.0.0.1:37475_solr
   [junit4]   2> 679723 INFO  (OverseerAutoScalingTriggerThread-99249964721897486-127.0.0.1:38319_solr-n_0000000003) [n:127.0.0.1:38319_solr    ] o.a.s.c.a.TriggerIntegrationTest TestEventMarkerAction init
   [junit4]   2> 679723 DEBUG (ScheduledTrigger-2185-thread-1) [n:127.0.0.1:38319_solr    ] o.a.s.c.a.NodeLostTrigger Running NodeLostTrigger: node_lost_trigger with currently live nodes: 2
   [junit4]   2> 679723 DEBUG (ScheduledTrigger-2185-thread-1) [n:127.0.0.1:38319_solr    ] o.a.s.c.a.NodeLostTrigger Tracking lost node: 127.0.0.1:37475_solr
   [junit4]   2> 679723 DEBUG (OverseerAutoScalingTriggerThread-99249964721897486-127.0.0.1:38319_solr-n_0000000003) [n:127.0.0.1:38319_solr    ] o.a.s.c.a.OverseerTriggerThread Current znodeVersion 8, lastZnodeVersion 8
   [junit4]   2> 679724 DEBUG (ScheduledTrigger-2185-thread-2) [n:127.0.0.1:38319_solr    ] o.a.s.c.a.NodeAddedTrigger Running NodeAddedTrigger node_added_trigger
   [junit4]   2> 679724 DEBUG (ScheduledTrigger-2185-thread-2) [n:127.0.0.1:38319_solr    ] o.a.s.c.a.NodeAddedTrigger Found livenodes: 2
   [junit4]   2> 679724 DEBUG (ScheduledTrigger-2185-thread-3) [n:127.0.0.1:38319_solr    ] o.a.s.c.a.NodeLostTrigger Running NodeLostTrigger: .auto_add_replicas with currently live nodes: 2
   [junit4]   2> 679724 DEBUG (ScheduledTrigger-2185-thread-3) [n:127.0.0.1:38319_solr    ] o.a.s.c.a.NodeLostTrigger Tracking lost node: 127.0.0.1:37475_solr
   [junit4]   2> 680724 DEBUG (ScheduledTrigger-2185-thread-1) [n:127.0.0.1:38319_solr    ] o.a.s.c.a.NodeLostTrigger Running NodeLostTrigger: node_lost_trigger with currently live nodes: 2
   [junit4]   2> 680724 DEBUG (ScheduledTrigger-2185-thread-1) [n:127.0.0.1:38319_solr    ] o.a.s.c.a.NodeLostTrigger NodeLostTrigger firing registered processor for lost nodes: [127.0.0.1:37475_solr]
   [junit4]   2> 680724 DEBUG (ScheduledTrigger-2185-thread-1) [n:127.0.0.1:38319_solr    ] o.a.s.c.a.ScheduledTriggers ++++++++ Cooldown inactive - processing event: {
   [junit4]   2>   "id":"7962bd96fba70T8s7uzzb43u62n6bqvaatpj3zb",
   [junit4]   2>   "source":"node_lost_trigger",
   [junit4]   2>   "eventTime":2135439912712816,
   [junit4]   2>   "eventType":"NODELOST",
   [junit4]   2>   "properties":{
   [junit4]   2>     "eventTimes":[2135439912712816],
   [junit4]   2>     "nodeNames"

[...truncated too long message...]

27.0.0.1:39335_ c:testcollection s:shard1  x:testcollection_shard1_replica_p2] o.a.s.h.ReplicationHandler Index fetch failed :org.apache.solr.common.SolrException: No registered leader was found after waiting for 4000ms , collection: testcollection slice: shard1 saw state=DocCollection(testcollection//collections/testcollection/state.json/6)={
   [junit4]   2>   "pullReplicas":"1",
   [junit4]   2>   "replicationFactor":"1",
   [junit4]   2>   "shards":{
   [junit4]   2>     "shard1":{
   [junit4]   2>       "range":"80000000-ffffffff",
   [junit4]   2>       "state":"active",
   [junit4]   2>       "replicas":{
   [junit4]   2>         "core_node5":{
   [junit4]   2>           "core":"testcollection_shard1_replica_p2",
   [junit4]   2>           "base_url":"https://127.0.0.1:39335",
   [junit4]   2>           "node_name":"127.0.0.1:39335_",
   [junit4]   2>           "state":"active",
   [junit4]   2>           "type":"PULL"},
   [junit4]   2>         "core_node6":{
   [junit4]   2>           "core":"testcollection_shard1_replica_n1",
   [junit4]   2>           "base_url":"https://127.0.0.1:36847",
   [junit4]   2>           "node_name":"127.0.0.1:36847_",
   [junit4]   2>           "state":"active",
   [junit4]   2>           "type":"NRT",
   [junit4]   2>           "leader":"true",
   [junit4]   2>           "property.preferredleader":"true"}}},
   [junit4]   2>     "shard2":{
   [junit4]   2>       "range":"0-7fffffff",
   [junit4]   2>       "state":"active",
   [junit4]   2>       "replicas":{
   [junit4]   2>         "core_node7":{
   [junit4]   2>           "core":"testcollection_shard2_replica_n3",
   [junit4]   2>           "base_url":"https://127.0.0.1:40747",
   [junit4]   2>           "node_name":"127.0.0.1:40747_",
   [junit4]   2>           "state":"active",
   [junit4]   2>           "type":"NRT",
   [junit4]   2>           "leader":"true"},
   [junit4]   2>         "core_node8":{
   [junit4]   2>           "core":"testcollection_shard2_replica_p4",
   [junit4]   2>           "base_url":"https://127.0.0.1:36847",
   [junit4]   2>           "node_name":"127.0.0.1:36847_",
   [junit4]   2>           "state":"active",
   [junit4]   2>           "type":"PULL"}}}},
   [junit4]   2>   "router":{"name":"compositeId"},
   [junit4]   2>   "maxShardsPerNode":"2",
   [junit4]   2>   "autoAddReplicas":"false",
   [junit4]   2>   "nrtReplicas":"1",
   [junit4]   2>   "tlogReplicas":"0"} with live_nodes=[]
   [junit4]   2> 	at org.apache.solr.common.cloud.ZkStateReader.getLeaderRetry(ZkStateReader.java:771)
   [junit4]   2> 	at org.apache.solr.common.cloud.ZkStateReader.getLeaderRetry(ZkStateReader.java:755)
   [junit4]   2> 	at org.apache.solr.handler.IndexFetcher.getLeaderReplica(IndexFetcher.java:684)
   [junit4]   2> 	at org.apache.solr.handler.IndexFetcher.fetchLatestIndex(IndexFetcher.java:380)
   [junit4]   2> 	at org.apache.solr.handler.IndexFetcher.fetchLatestIndex(IndexFetcher.java:345)
   [junit4]   2> 	at org.apache.solr.handler.ReplicationHandler.doFetch(ReplicationHandler.java:420)
   [junit4]   2> 	at org.apache.solr.handler.ReplicationHandler.lambda$setupPolling$12(ReplicationHandler.java:1159)
   [junit4]   2> 	at java.util.concurrent.Executors$RunnableAdapter.call(Executors.java:511)
   [junit4]   2> 	at java.util.concurrent.FutureTask.runAndReset(FutureTask.java:308)
   [junit4]   2> 	at java.util.concurrent.ScheduledThreadPoolExecutor$ScheduledFutureTask.access$301(ScheduledThreadPoolExecutor.java:180)
   [junit4]   2> 	at java.util.concurrent.ScheduledThreadPoolExecutor$ScheduledFutureTask.run(ScheduledThreadPoolExecutor.java:294)
   [junit4]   2> 	at java.util.concurrent.ThreadPoolExecutor.runWorker(ThreadPoolExecutor.java:1149)
   [junit4]   2> 	at java.util.concurrent.ThreadPoolExecutor$Worker.run(ThreadPoolExecutor.java:624)
   [junit4]   2> 	at java.lang.Thread.run(Thread.java:748)
   [junit4]   2> 
   [junit4]   2> 1373674 INFO  (Thread-2693) [    ] o.a.s.c.ZkTestServer connecting to 127.0.0.1:44001 44001
   [junit4]   2> 1373675 WARN  (Thread-2693) [    ] o.a.s.c.ZkTestServer Watch limit violations: 
   [junit4]   2> Maximum concurrent create/delete watches above limit:
   [junit4]   2> 
   [junit4]   2> 	15	/solr/aliases.json
   [junit4]   2> 	3	/solr/security.json
   [junit4]   2> 	3	/solr/configs/conf1
   [junit4]   2> 	2	/solr/collections/collection1/state.json
   [junit4]   2> 
   [junit4]   2> Maximum concurrent data watches above limit:
   [junit4]   2> 
   [junit4]   2> 	15	/solr/clusterstate.json
   [junit4]   2> 	15	/solr/clusterprops.json
   [junit4]   2> 	3	/solr/autoscaling.json
   [junit4]   2> 	3	/solr/collections/testcollection/state.json
   [junit4]   2> 	2	/solr/overseer_elect/election/99250008276992013-127.0.0.1:39335_-n_0000000002
   [junit4]   2> 
   [junit4]   2> Maximum concurrent children watches above limit:
   [junit4]   2> 
   [junit4]   2> 	15	/solr/live_nodes
   [junit4]   2> 	15	/solr/collections
   [junit4]   2> 	3	/solr/autoscaling/events/.auto_add_replicas
   [junit4]   2> 	3	/solr/overseer/collection-queue-work
   [junit4]   2> 	3	/solr/overseer/queue-work
   [junit4]   2> 
   [junit4]   2> NOTE: reproduce with: ant test  -Dtestcase=TestCollectionAPI -Dtests.method=test -Dtests.seed=8257B112E10D42BA -Dtests.multiplier=3 -Dtests.slow=true -Dtests.locale=ca -Dtests.timezone=Europe/Kiev -Dtests.asserts=true -Dtests.file.encoding=UTF-8
   [junit4] FAILURE 51.1s J2 | TestCollectionAPI.test <<<
   [junit4]    > Throwable #1: java.lang.AssertionError: Property 'preferredleader' with value null not set correctly for collection/replica pair: testcollection/core_node7 property map is {core=testcollection_shard2_replica_n3, base_url=https://127.0.0.1:40747, node_name=127.0.0.1:40747_, state=active, type=NRT, leader=true}.
   [junit4]    > 	at __randomizedtesting.SeedInfo.seed([8257B112E10D42BA:A038EC84FF12F42]:0)
   [junit4]    > 	at org.apache.solr.cloud.ReplicaPropertiesBase.verifyPropertyVal(ReplicaPropertiesBase.java:95)
   [junit4]    > 	at org.apache.solr.cloud.TestCollectionAPI.replicaPropTest(TestCollectionAPI.java:428)
   [junit4]    > 	at org.apache.solr.cloud.TestCollectionAPI.test(TestCollectionAPI.java:92)
   [junit4]    > 	at org.apache.solr.BaseDistributedSearchTestCase$ShardsRepeatRule$ShardsFixedStatement.callStatement(BaseDistributedSearchTestCase.java:993)
   [junit4]    > 	at org.apache.solr.BaseDistributedSearchTestCase$ShardsRepeatRule$ShardsStatement.evaluate(BaseDistributedSearchTestCase.java:968)
   [junit4]    > 	at java.lang.Thread.run(Thread.java:748)
   [junit4]   2> NOTE: leaving temporary files on disk at: /home/jenkins/workspace/Lucene-Solr-master-Linux/solr/build/solr-core/test/J2/temp/solr.cloud.TestCollectionAPI_8257B112E10D42BA-001
   [junit4]   2> NOTE: test params are: codec=Asserting(Lucene70): {id=PostingsFormat(name=LuceneVarGapDocFreqInterval)}, docValues:{_version_=DocValuesFormat(name=Lucene70)}, maxPointsInLeafNode=1862, maxMBSortInHeap=6.960155467480703, sim=Asserting(org.apache.lucene.search.similarities.AssertingSimilarity@16d12ab), locale=ca, timezone=Europe/Kiev
   [junit4]   2> NOTE: Linux 4.10.0-40-generic i386/Oracle Corporation 1.8.0_144 (32-bit)/cpus=8,threads=1,free=122783192,total=337838080
   [junit4]   2> NOTE: All tests run in this JVM: [TestCoreDiscovery, DistributedFacetPivotSmallAdvancedTest, TestLegacyNumericUtils, TestBlendedInfixSuggestions, TestExecutePlanAction, SolrCLIZkUtilsTest, TestValueSourceCache, TestSolrCoreParser, ExitableDirectoryReaderTest, ClusterStateTest, LegacyCloudClusterPropTest, RequiredFieldsTest, DisMaxRequestHandlerTest, TestCustomSort, TestEmbeddedSolrServerConstructors, TestTolerantUpdateProcessorCloud, OverseerTest, TestReloadAndDeleteDocs, CdcrReplicationHandlerTest, TestSolrCoreSnapshots, TestDeleteCollectionOnDownNodes, EchoParamsTest, ZkNodePropsTest, ClassificationUpdateProcessorFactoryTest, TemplateUpdateProcessorTest, NumberUtilsTest, BigEndianAscendingWordSerializerTest, StatsComponentTest, DocValuesMissingTest, TestStressUserVersions, TestQueryTypes, DeleteNodeTest, TestFieldCacheSort, AsyncCallRequestStatusResponseTest, SparseHLLTest, TestRTimerTree, TestStressInPlaceUpdates, TestExclusionRuleCollectionAccess, TestIndexSearcher, TestHttpShardHandlerFactory, CustomCollectionTest, TestUniqueKeyFieldResource, AlternateDirectoryTest, TestExtendedDismaxParser, ConnectionReuseTest, HdfsSyncSliceTest, TestHashPartitioner, TimeZoneUtilsTest, TestSolrQueryResponse, TestUseDocValuesAsStored2, TestSolrConfigHandlerCloud, TestManagedSchemaAPI, UniqFieldsUpdateProcessorFactoryTest, ReplaceNodeTest, TestManagedResourceStorage, TestExactStatsCache, TestSchemaSimilarityResource, TestConfigSetsAPIExclusivity, TestRawResponseWriter, TestRandomFlRTGCloud, TestDocTermOrds, TestGraphMLResponseWriter, TestScoreJoinQPScore, SuggestComponentTest, DistribJoinFromCollectionTest, TestQuerySenderListener, RankQueryTest, ChaosMonkeyNothingIsSafeTest, XmlUpdateRequestHandlerTest, OverseerRolesTest, TestCoreAdminApis, DirectSolrSpellCheckerTest, TestSystemIdResolver, JavabinLoaderTest, UtilsToolTest, TestFieldCollectionResource, DistanceFunctionTest, TestLockTree, TestPKIAuthenticationPlugin, TestLMJelinekMercerSimilarityFactory, TestStreamBody, TestPartialUpdateDeduplication, TestCloudRecovery, TolerantUpdateProcessorTest, SolrCoreCheckLockOnStartupTest, TestHdfsBackupRestoreCore, SimpleMLTQParserTest, HdfsChaosMonkeySafeLeaderTest, HdfsAutoAddReplicasIntegrationTest, TestMultiWordSynonyms, TestTrie, MoveReplicaHDFSFailoverTest, TestExceedMaxTermLength, WordBreakSolrSpellCheckerTest, TestJsonFacets, CloneFieldUpdateProcessorFactoryTest, TestCustomStream, CopyFieldTest, XsltUpdateRequestHandlerTest, HdfsRecoverLeaseTest, TestCSVResponseWriter, SuggesterWFSTTest, HdfsUnloadDistributedZkTest, CoreAdminHandlerTest, HttpPartitionTest, TestSolrCoreProperties, TestCollectionAPI]
   [junit4] Completed [333/765 (2!)] on J2 in 51.12s, 1 test, 1 failure <<< FAILURES!

[...truncated 45279 lines...]

Mime
View raw message