lucene-dev mailing list archives

Site index · List index
Message view « Date » · « Thread »
Top « Date » · « Thread »
From Policeman Jenkins Server <jenk...@thetaphi.de>
Subject [JENKINS-EA] Lucene-Solr-7.2-Linux (64bit/jdk-10-ea+32) - Build # 84 - Still Unstable!
Date Tue, 19 Dec 2017 06:03:01 GMT
Build: https://jenkins.thetaphi.de/job/Lucene-Solr-7.2-Linux/84/
Java: 64bit/jdk-10-ea+32 -XX:+UseCompressedOops -XX:+UseG1GC

3 tests failed.
FAILED:  junit.framework.TestSuite.org.apache.solr.client.solrj.impl.CloudSolrClientTest

Error Message:
Error from server at https://127.0.0.1:33555/solr: create the collection time out:180s

Stack Trace:
org.apache.solr.client.solrj.impl.HttpSolrClient$RemoteSolrException: Error from server at https://127.0.0.1:33555/solr: create the collection time out:180s
	at __randomizedtesting.SeedInfo.seed([DB2DF2D8228BAF27]:0)
	at org.apache.solr.client.solrj.impl.HttpSolrClient.executeMethod(HttpSolrClient.java:643)
	at org.apache.solr.client.solrj.impl.HttpSolrClient.request(HttpSolrClient.java:255)
	at org.apache.solr.client.solrj.impl.HttpSolrClient.request(HttpSolrClient.java:244)
	at org.apache.solr.client.solrj.impl.LBHttpSolrClient.doRequest(LBHttpSolrClient.java:483)
	at org.apache.solr.client.solrj.impl.LBHttpSolrClient.request(LBHttpSolrClient.java:413)
	at org.apache.solr.client.solrj.impl.CloudSolrClient.sendRequest(CloudSolrClient.java:1103)
	at org.apache.solr.client.solrj.impl.CloudSolrClient.requestWithRetryOnStaleState(CloudSolrClient.java:883)
	at org.apache.solr.client.solrj.impl.CloudSolrClient.request(CloudSolrClient.java:816)
	at org.apache.solr.client.solrj.SolrRequest.process(SolrRequest.java:194)
	at org.apache.solr.client.solrj.SolrRequest.process(SolrRequest.java:211)
	at org.apache.solr.client.solrj.impl.CloudSolrClientTest.setupCluster(CloudSolrClientTest.java:103)
	at java.base/jdk.internal.reflect.NativeMethodAccessorImpl.invoke0(Native Method)
	at java.base/jdk.internal.reflect.NativeMethodAccessorImpl.invoke(NativeMethodAccessorImpl.java:62)
	at java.base/jdk.internal.reflect.DelegatingMethodAccessorImpl.invoke(DelegatingMethodAccessorImpl.java:43)
	at java.base/java.lang.reflect.Method.invoke(Method.java:564)
	at com.carrotsearch.randomizedtesting.RandomizedRunner.invoke(RandomizedRunner.java:1737)
	at com.carrotsearch.randomizedtesting.RandomizedRunner$6.evaluate(RandomizedRunner.java:874)
	at com.carrotsearch.randomizedtesting.RandomizedRunner$7.evaluate(RandomizedRunner.java:890)
	at com.carrotsearch.randomizedtesting.rules.StatementAdapter.evaluate(StatementAdapter.java:36)
	at com.carrotsearch.randomizedtesting.rules.SystemPropertiesRestoreRule$1.evaluate(SystemPropertiesRestoreRule.java:57)
	at org.apache.lucene.util.AbstractBeforeAfterRule$1.evaluate(AbstractBeforeAfterRule.java:45)
	at com.carrotsearch.randomizedtesting.rules.StatementAdapter.evaluate(StatementAdapter.java:36)
	at org.apache.lucene.util.TestRuleStoreClassName$1.evaluate(TestRuleStoreClassName.java:41)
	at com.carrotsearch.randomizedtesting.rules.NoShadowingOrOverridesOnMethodsRule$1.evaluate(NoShadowingOrOverridesOnMethodsRule.java:40)
	at com.carrotsearch.randomizedtesting.rules.NoShadowingOrOverridesOnMethodsRule$1.evaluate(NoShadowingOrOverridesOnMethodsRule.java:40)
	at com.carrotsearch.randomizedtesting.rules.StatementAdapter.evaluate(StatementAdapter.java:36)
	at com.carrotsearch.randomizedtesting.rules.StatementAdapter.evaluate(StatementAdapter.java:36)
	at org.apache.lucene.util.TestRuleAssertionsRequired$1.evaluate(TestRuleAssertionsRequired.java:53)
	at org.apache.lucene.util.TestRuleMarkFailure$1.evaluate(TestRuleMarkFailure.java:47)
	at org.apache.lucene.util.TestRuleIgnoreAfterMaxFailures$1.evaluate(TestRuleIgnoreAfterMaxFailures.java:64)
	at org.apache.lucene.util.TestRuleIgnoreTestSuites$1.evaluate(TestRuleIgnoreTestSuites.java:54)
	at com.carrotsearch.randomizedtesting.rules.StatementAdapter.evaluate(StatementAdapter.java:36)
	at com.carrotsearch.randomizedtesting.ThreadLeakControl$StatementRunner.run(ThreadLeakControl.java:368)
	at java.base/java.lang.Thread.run(Thread.java:844)


FAILED:  org.apache.solr.cloud.TestAuthenticationFramework.testBasics

Error Message:
Error from server at http://127.0.0.1:36479/solr/testcollection_shard1_replica_n2: Expected mime type application/octet-stream but got text/html. <html> <head> <meta http-equiv="Content-Type" content="text/html;charset=ISO-8859-1"/> <title>Error 404 </title> </head> <body> <h2>HTTP ERROR: 404</h2> <p>Problem accessing /solr/testcollection_shard1_replica_n2/update. Reason: <pre>    Can not find: /solr/testcollection_shard1_replica_n2/update</pre></p> <hr /><a href="http://eclipse.org/jetty">Powered by Jetty:// 9.3.20.v20170531</a><hr/> </body> </html> 

Stack Trace:
org.apache.solr.client.solrj.impl.CloudSolrClient$RouteException: Error from server at http://127.0.0.1:36479/solr/testcollection_shard1_replica_n2: Expected mime type application/octet-stream but got text/html. <html>
<head>
<meta http-equiv="Content-Type" content="text/html;charset=ISO-8859-1"/>
<title>Error 404 </title>
</head>
<body>
<h2>HTTP ERROR: 404</h2>
<p>Problem accessing /solr/testcollection_shard1_replica_n2/update. Reason:
<pre>    Can not find: /solr/testcollection_shard1_replica_n2/update</pre></p>
<hr /><a href="http://eclipse.org/jetty">Powered by Jetty:// 9.3.20.v20170531</a><hr/>
</body>
</html>

	at __randomizedtesting.SeedInfo.seed([E3340D8A2BA66CA3:DEECA3A6134832D3]:0)
	at org.apache.solr.client.solrj.impl.CloudSolrClient.directUpdate(CloudSolrClient.java:549)
	at org.apache.solr.client.solrj.impl.CloudSolrClient.sendRequest(CloudSolrClient.java:1012)
	at org.apache.solr.client.solrj.impl.CloudSolrClient.requestWithRetryOnStaleState(CloudSolrClient.java:883)
	at org.apache.solr.client.solrj.impl.CloudSolrClient.requestWithRetryOnStaleState(CloudSolrClient.java:945)
	at org.apache.solr.client.solrj.impl.CloudSolrClient.requestWithRetryOnStaleState(CloudSolrClient.java:945)
	at org.apache.solr.client.solrj.impl.CloudSolrClient.requestWithRetryOnStaleState(CloudSolrClient.java:945)
	at org.apache.solr.client.solrj.impl.CloudSolrClient.requestWithRetryOnStaleState(CloudSolrClient.java:945)
	at org.apache.solr.client.solrj.impl.CloudSolrClient.requestWithRetryOnStaleState(CloudSolrClient.java:945)
	at org.apache.solr.client.solrj.impl.CloudSolrClient.request(CloudSolrClient.java:816)
	at org.apache.solr.client.solrj.SolrRequest.process(SolrRequest.java:194)
	at org.apache.solr.client.solrj.request.UpdateRequest.commit(UpdateRequest.java:233)
	at org.apache.solr.cloud.TestAuthenticationFramework.collectionCreateSearchDeleteTwice(TestAuthenticationFramework.java:126)
	at org.apache.solr.cloud.TestAuthenticationFramework.testBasics(TestAuthenticationFramework.java:74)
	at java.base/jdk.internal.reflect.NativeMethodAccessorImpl.invoke0(Native Method)
	at java.base/jdk.internal.reflect.NativeMethodAccessorImpl.invoke(NativeMethodAccessorImpl.java:62)
	at java.base/jdk.internal.reflect.DelegatingMethodAccessorImpl.invoke(DelegatingMethodAccessorImpl.java:43)
	at java.base/java.lang.reflect.Method.invoke(Method.java:564)
	at com.carrotsearch.randomizedtesting.RandomizedRunner.invoke(RandomizedRunner.java:1737)
	at com.carrotsearch.randomizedtesting.RandomizedRunner$8.evaluate(RandomizedRunner.java:934)
	at com.carrotsearch.randomizedtesting.RandomizedRunner$9.evaluate(RandomizedRunner.java:970)
	at com.carrotsearch.randomizedtesting.RandomizedRunner$10.evaluate(RandomizedRunner.java:984)
	at com.carrotsearch.randomizedtesting.rules.SystemPropertiesRestoreRule$1.evaluate(SystemPropertiesRestoreRule.java:57)
	at org.apache.lucene.util.TestRuleSetupTeardownChained$1.evaluate(TestRuleSetupTeardownChained.java:49)
	at org.apache.lucene.util.AbstractBeforeAfterRule$1.evaluate(AbstractBeforeAfterRule.java:45)
	at org.apache.lucene.util.TestRuleThreadAndTestName$1.evaluate(TestRuleThreadAndTestName.java:48)
	at org.apache.lucene.util.TestRuleIgnoreAfterMaxFailures$1.evaluate(TestRuleIgnoreAfterMaxFailures.java:64)
	at org.apache.lucene.util.TestRuleMarkFailure$1.evaluate(TestRuleMarkFailure.java:47)
	at com.carrotsearch.randomizedtesting.rules.StatementAdapter.evaluate(StatementAdapter.java:36)
	at com.carrotsearch.randomizedtesting.ThreadLeakControl$StatementRunner.run(ThreadLeakControl.java:368)
	at com.carrotsearch.randomizedtesting.ThreadLeakControl.forkTimeoutingTask(ThreadLeakControl.java:817)
	at com.carrotsearch.randomizedtesting.ThreadLeakControl$3.evaluate(ThreadLeakControl.java:468)
	at com.carrotsearch.randomizedtesting.RandomizedRunner.runSingleTest(RandomizedRunner.java:943)
	at com.carrotsearch.randomizedtesting.RandomizedRunner$5.evaluate(RandomizedRunner.java:829)
	at com.carrotsearch.randomizedtesting.RandomizedRunner$6.evaluate(RandomizedRunner.java:879)
	at com.carrotsearch.randomizedtesting.RandomizedRunner$7.evaluate(RandomizedRunner.java:890)
	at com.carrotsearch.randomizedtesting.rules.StatementAdapter.evaluate(StatementAdapter.java:36)
	at com.carrotsearch.randomizedtesting.rules.SystemPropertiesRestoreRule$1.evaluate(SystemPropertiesRestoreRule.java:57)
	at org.apache.lucene.util.AbstractBeforeAfterRule$1.evaluate(AbstractBeforeAfterRule.java:45)
	at com.carrotsearch.randomizedtesting.rules.StatementAdapter.evaluate(StatementAdapter.java:36)
	at org.apache.lucene.util.TestRuleStoreClassName$1.evaluate(TestRuleStoreClassName.java:41)
	at com.carrotsearch.randomizedtesting.rules.NoShadowingOrOverridesOnMethodsRule$1.evaluate(NoShadowingOrOverridesOnMethodsRule.java:40)
	at com.carrotsearch.randomizedtesting.rules.NoShadowingOrOverridesOnMethodsRule$1.evaluate(NoShadowingOrOverridesOnMethodsRule.java:40)
	at com.carrotsearch.randomizedtesting.rules.StatementAdapter.evaluate(StatementAdapter.java:36)
	at com.carrotsearch.randomizedtesting.rules.StatementAdapter.evaluate(StatementAdapter.java:36)
	at org.apache.lucene.util.TestRuleAssertionsRequired$1.evaluate(TestRuleAssertionsRequired.java:53)
	at org.apache.lucene.util.TestRuleMarkFailure$1.evaluate(TestRuleMarkFailure.java:47)
	at org.apache.lucene.util.TestRuleIgnoreAfterMaxFailures$1.evaluate(TestRuleIgnoreAfterMaxFailures.java:64)
	at org.apache.lucene.util.TestRuleIgnoreTestSuites$1.evaluate(TestRuleIgnoreTestSuites.java:54)
	at com.carrotsearch.randomizedtesting.rules.StatementAdapter.evaluate(StatementAdapter.java:36)
	at com.carrotsearch.randomizedtesting.ThreadLeakControl$StatementRunner.run(ThreadLeakControl.java:368)
	at java.base/java.lang.Thread.run(Thread.java:844)
Caused by: org.apache.solr.client.solrj.impl.HttpSolrClient$RemoteSolrException: Error from server at http://127.0.0.1:36479/solr/testcollection_shard1_replica_n2: Expected mime type application/octet-stream but got text/html. <html>
<head>
<meta http-equiv="Content-Type" content="text/html;charset=ISO-8859-1"/>
<title>Error 404 </title>
</head>
<body>
<h2>HTTP ERROR: 404</h2>
<p>Problem accessing /solr/testcollection_shard1_replica_n2/update. Reason:
<pre>    Can not find: /solr/testcollection_shard1_replica_n2/update</pre></p>
<hr /><a href="http://eclipse.org/jetty">Powered by Jetty:// 9.3.20.v20170531</a><hr/>
</body>
</html>

	at org.apache.solr.client.solrj.impl.HttpSolrClient.executeMethod(HttpSolrClient.java:607)
	at org.apache.solr.client.solrj.impl.HttpSolrClient.request(HttpSolrClient.java:255)
	at org.apache.solr.client.solrj.impl.HttpSolrClient.request(HttpSolrClient.java:244)
	at org.apache.solr.client.solrj.impl.LBHttpSolrClient.doRequest(LBHttpSolrClient.java:483)
	at org.apache.solr.client.solrj.impl.LBHttpSolrClient.request(LBHttpSolrClient.java:413)
	at org.apache.solr.client.solrj.impl.CloudSolrClient.lambda$directUpdate$0(CloudSolrClient.java:526)
	at java.base/java.util.concurrent.FutureTask.run(FutureTask.java:264)
	at org.apache.solr.common.util.ExecutorUtil$MDCAwareThreadPoolExecutor.lambda$execute$0(ExecutorUtil.java:188)
	at java.base/java.util.concurrent.ThreadPoolExecutor.runWorker(ThreadPoolExecutor.java:1135)
	at java.base/java.util.concurrent.ThreadPoolExecutor$Worker.run(ThreadPoolExecutor.java:635)
	... 1 more


FAILED:  org.apache.solr.schema.TestManagedSchemaAPI.test

Error Message:
Error from server at https://127.0.0.1:39207/solr: create the collection time out:180s

Stack Trace:
org.apache.solr.client.solrj.impl.HttpSolrClient$RemoteSolrException: Error from server at https://127.0.0.1:39207/solr: create the collection time out:180s
	at __randomizedtesting.SeedInfo.seed([E3340D8A2BA66CA3:6B603250855A015B]:0)
	at org.apache.solr.client.solrj.impl.HttpSolrClient.executeMethod(HttpSolrClient.java:643)
	at org.apache.solr.client.solrj.impl.HttpSolrClient.request(HttpSolrClient.java:255)
	at org.apache.solr.client.solrj.impl.HttpSolrClient.request(HttpSolrClient.java:244)
	at org.apache.solr.client.solrj.impl.LBHttpSolrClient.doRequest(LBHttpSolrClient.java:483)
	at org.apache.solr.client.solrj.impl.LBHttpSolrClient.request(LBHttpSolrClient.java:413)
	at org.apache.solr.client.solrj.impl.CloudSolrClient.sendRequest(CloudSolrClient.java:1103)
	at org.apache.solr.client.solrj.impl.CloudSolrClient.requestWithRetryOnStaleState(CloudSolrClient.java:883)
	at org.apache.solr.client.solrj.impl.CloudSolrClient.request(CloudSolrClient.java:816)
	at org.apache.solr.client.solrj.SolrRequest.process(SolrRequest.java:194)
	at org.apache.solr.client.solrj.SolrRequest.process(SolrRequest.java:211)
	at org.apache.solr.schema.TestManagedSchemaAPI.test(TestManagedSchemaAPI.java:54)
	at java.base/jdk.internal.reflect.NativeMethodAccessorImpl.invoke0(Native Method)
	at java.base/jdk.internal.reflect.NativeMethodAccessorImpl.invoke(NativeMethodAccessorImpl.java:62)
	at java.base/jdk.internal.reflect.DelegatingMethodAccessorImpl.invoke(DelegatingMethodAccessorImpl.java:43)
	at java.base/java.lang.reflect.Method.invoke(Method.java:564)
	at com.carrotsearch.randomizedtesting.RandomizedRunner.invoke(RandomizedRunner.java:1737)
	at com.carrotsearch.randomizedtesting.RandomizedRunner$8.evaluate(RandomizedRunner.java:934)
	at com.carrotsearch.randomizedtesting.RandomizedRunner$9.evaluate(RandomizedRunner.java:970)
	at com.carrotsearch.randomizedtesting.RandomizedRunner$10.evaluate(RandomizedRunner.java:984)
	at com.carrotsearch.randomizedtesting.rules.SystemPropertiesRestoreRule$1.evaluate(SystemPropertiesRestoreRule.java:57)
	at org.apache.lucene.util.TestRuleSetupTeardownChained$1.evaluate(TestRuleSetupTeardownChained.java:49)
	at org.apache.lucene.util.AbstractBeforeAfterRule$1.evaluate(AbstractBeforeAfterRule.java:45)
	at org.apache.lucene.util.TestRuleThreadAndTestName$1.evaluate(TestRuleThreadAndTestName.java:48)
	at org.apache.lucene.util.TestRuleIgnoreAfterMaxFailures$1.evaluate(TestRuleIgnoreAfterMaxFailures.java:64)
	at org.apache.lucene.util.TestRuleMarkFailure$1.evaluate(TestRuleMarkFailure.java:47)
	at com.carrotsearch.randomizedtesting.rules.StatementAdapter.evaluate(StatementAdapter.java:36)
	at com.carrotsearch.randomizedtesting.ThreadLeakControl$StatementRunner.run(ThreadLeakControl.java:368)
	at com.carrotsearch.randomizedtesting.ThreadLeakControl.forkTimeoutingTask(ThreadLeakControl.java:817)
	at com.carrotsearch.randomizedtesting.ThreadLeakControl$3.evaluate(ThreadLeakControl.java:468)
	at com.carrotsearch.randomizedtesting.RandomizedRunner.runSingleTest(RandomizedRunner.java:943)
	at com.carrotsearch.randomizedtesting.RandomizedRunner$5.evaluate(RandomizedRunner.java:829)
	at com.carrotsearch.randomizedtesting.RandomizedRunner$6.evaluate(RandomizedRunner.java:879)
	at com.carrotsearch.randomizedtesting.RandomizedRunner$7.evaluate(RandomizedRunner.java:890)
	at com.carrotsearch.randomizedtesting.rules.StatementAdapter.evaluate(StatementAdapter.java:36)
	at com.carrotsearch.randomizedtesting.rules.SystemPropertiesRestoreRule$1.evaluate(SystemPropertiesRestoreRule.java:57)
	at org.apache.lucene.util.AbstractBeforeAfterRule$1.evaluate(AbstractBeforeAfterRule.java:45)
	at com.carrotsearch.randomizedtesting.rules.StatementAdapter.evaluate(StatementAdapter.java:36)
	at org.apache.lucene.util.TestRuleStoreClassName$1.evaluate(TestRuleStoreClassName.java:41)
	at com.carrotsearch.randomizedtesting.rules.NoShadowingOrOverridesOnMethodsRule$1.evaluate(NoShadowingOrOverridesOnMethodsRule.java:40)
	at com.carrotsearch.randomizedtesting.rules.NoShadowingOrOverridesOnMethodsRule$1.evaluate(NoShadowingOrOverridesOnMethodsRule.java:40)
	at com.carrotsearch.randomizedtesting.rules.StatementAdapter.evaluate(StatementAdapter.java:36)
	at com.carrotsearch.randomizedtesting.rules.StatementAdapter.evaluate(StatementAdapter.java:36)
	at org.apache.lucene.util.TestRuleAssertionsRequired$1.evaluate(TestRuleAssertionsRequired.java:53)
	at org.apache.lucene.util.TestRuleMarkFailure$1.evaluate(TestRuleMarkFailure.java:47)
	at org.apache.lucene.util.TestRuleIgnoreAfterMaxFailures$1.evaluate(TestRuleIgnoreAfterMaxFailures.java:64)
	at org.apache.lucene.util.TestRuleIgnoreTestSuites$1.evaluate(TestRuleIgnoreTestSuites.java:54)
	at com.carrotsearch.randomizedtesting.rules.StatementAdapter.evaluate(StatementAdapter.java:36)
	at com.carrotsearch.randomizedtesting.ThreadLeakControl$StatementRunner.run(ThreadLeakControl.java:368)
	at java.base/java.lang.Thread.run(Thread.java:844)




Build Log:
[...truncated 12816 lines...]
   [junit4] Suite: org.apache.solr.schema.TestManagedSchemaAPI
   [junit4]   2> Creating dataDir: /home/jenkins/workspace/Lucene-Solr-7.2-Linux/solr/build/solr-core/test/J1/temp/solr.schema.TestManagedSchemaAPI_E3340D8A2BA66CA3-001/init-core-data-001
   [junit4]   2> 1238803 WARN  (SUITE-TestManagedSchemaAPI-seed#[E3340D8A2BA66CA3]-worker) [    ] o.a.s.SolrTestCaseJ4 startTrackingSearchers: numOpens=423 numCloses=423
   [junit4]   2> 1238803 INFO  (SUITE-TestManagedSchemaAPI-seed#[E3340D8A2BA66CA3]-worker) [    ] o.a.s.SolrTestCaseJ4 Using PointFields (NUMERIC_POINTS_SYSPROP=true) w/NUMERIC_DOCVALUES_SYSPROP=false
   [junit4]   2> 1238804 INFO  (SUITE-TestManagedSchemaAPI-seed#[E3340D8A2BA66CA3]-worker) [    ] o.a.s.SolrTestCaseJ4 Randomized ssl (true) and clientAuth (true) via: @org.apache.solr.util.RandomizeSSL(reason="", ssl=0.0/0.0, value=0.0/0.0, clientAuth=0.0/0.0)
   [junit4]   2> 1238805 INFO  (SUITE-TestManagedSchemaAPI-seed#[E3340D8A2BA66CA3]-worker) [    ] o.a.s.SolrTestCaseJ4 SecureRandom sanity checks: test.solr.allowed.securerandom=null & java.security.egd=file:/dev/./urandom
   [junit4]   2> 1238805 INFO  (SUITE-TestManagedSchemaAPI-seed#[E3340D8A2BA66CA3]-worker) [    ] o.a.s.c.MiniSolrCloudCluster Starting cluster of 2 servers in /home/jenkins/workspace/Lucene-Solr-7.2-Linux/solr/build/solr-core/test/J1/temp/solr.schema.TestManagedSchemaAPI_E3340D8A2BA66CA3-001/tempDir-001
   [junit4]   2> 1238805 INFO  (SUITE-TestManagedSchemaAPI-seed#[E3340D8A2BA66CA3]-worker) [    ] o.a.s.c.ZkTestServer STARTING ZK TEST SERVER
   [junit4]   2> 1238806 INFO  (Thread-2308) [    ] o.a.s.c.ZkTestServer client port:0.0.0.0/0.0.0.0:0
   [junit4]   2> 1238806 INFO  (Thread-2308) [    ] o.a.s.c.ZkTestServer Starting server
   [junit4]   2> 1238809 ERROR (Thread-2308) [    ] o.a.z.s.ZooKeeperServer ZKShutdownHandler is not registered, so ZooKeeper server won't take any action on ERROR or SHUTDOWN server state changes
   [junit4]   2> 1238906 INFO  (SUITE-TestManagedSchemaAPI-seed#[E3340D8A2BA66CA3]-worker) [    ] o.a.s.c.ZkTestServer start zk server on port:39231
   [junit4]   2> 1238907 INFO  (zkConnectionManagerCallback-2334-thread-1) [    ] o.a.s.c.c.ConnectionManager zkClient has connected
   [junit4]   2> 1238914 INFO  (jetty-launcher-2331-thread-1) [    ] o.e.j.s.Server jetty-9.3.20.v20170531
   [junit4]   2> 1238914 INFO  (jetty-launcher-2331-thread-2) [    ] o.e.j.s.Server jetty-9.3.20.v20170531
   [junit4]   2> 1238915 INFO  (jetty-launcher-2331-thread-1) [    ] o.e.j.s.h.ContextHandler Started o.e.j.s.ServletContextHandler@52547fa{/solr,null,AVAILABLE}
   [junit4]   2> 1238915 INFO  (jetty-launcher-2331-thread-2) [    ] o.e.j.s.h.ContextHandler Started o.e.j.s.ServletContextHandler@603a5058{/solr,null,AVAILABLE}
   [junit4]   2> 1238916 INFO  (jetty-launcher-2331-thread-1) [    ] o.e.j.s.AbstractConnector Started ServerConnector@6f079d15{SSL,[ssl, http/1.1]}{127.0.0.1:39207}
   [junit4]   2> 1238916 INFO  (jetty-launcher-2331-thread-1) [    ] o.e.j.s.Server Started @1241223ms
   [junit4]   2> 1238916 INFO  (jetty-launcher-2331-thread-1) [    ] o.a.s.c.s.e.JettySolrRunner Jetty properties: {hostContext=/solr, hostPort=39207}
   [junit4]   2> 1238916 ERROR (jetty-launcher-2331-thread-1) [    ] o.a.s.u.StartupLoggingUtils Missing Java Option solr.log.dir. Logging may be missing or incomplete.
   [junit4]   2> 1238916 INFO  (jetty-launcher-2331-thread-1) [    ] o.a.s.s.SolrDispatchFilter  ___      _       Welcome to Apache Solr? version 7.2.0
   [junit4]   2> 1238916 INFO  (jetty-launcher-2331-thread-1) [    ] o.a.s.s.SolrDispatchFilter / __| ___| |_ _   Starting in cloud mode on port null
   [junit4]   2> 1238916 INFO  (jetty-launcher-2331-thread-1) [    ] o.a.s.s.SolrDispatchFilter \__ \/ _ \ | '_|  Install dir: null
   [junit4]   2> 1238916 INFO  (jetty-launcher-2331-thread-1) [    ] o.a.s.s.SolrDispatchFilter |___/\___/_|_|    Start time: 2017-12-19T05:30:06.135940Z
   [junit4]   2> 1238917 INFO  (jetty-launcher-2331-thread-2) [    ] o.e.j.s.AbstractConnector Started ServerConnector@61220e76{SSL,[ssl, http/1.1]}{127.0.0.1:40251}
   [junit4]   2> 1238917 INFO  (jetty-launcher-2331-thread-2) [    ] o.e.j.s.Server Started @1241224ms
   [junit4]   2> 1238917 INFO  (jetty-launcher-2331-thread-2) [    ] o.a.s.c.s.e.JettySolrRunner Jetty properties: {hostContext=/solr, hostPort=40251}
   [junit4]   2> 1238917 ERROR (jetty-launcher-2331-thread-2) [    ] o.a.s.u.StartupLoggingUtils Missing Java Option solr.log.dir. Logging may be missing or incomplete.
   [junit4]   2> 1238917 INFO  (jetty-launcher-2331-thread-2) [    ] o.a.s.s.SolrDispatchFilter  ___      _       Welcome to Apache Solr? version 7.2.0
   [junit4]   2> 1238917 INFO  (jetty-launcher-2331-thread-2) [    ] o.a.s.s.SolrDispatchFilter / __| ___| |_ _   Starting in cloud mode on port null
   [junit4]   2> 1238917 INFO  (jetty-launcher-2331-thread-2) [    ] o.a.s.s.SolrDispatchFilter \__ \/ _ \ | '_|  Install dir: null
   [junit4]   2> 1238917 INFO  (jetty-launcher-2331-thread-2) [    ] o.a.s.s.SolrDispatchFilter |___/\___/_|_|    Start time: 2017-12-19T05:30:06.136595Z
   [junit4]   2> 1238935 INFO  (zkConnectionManagerCallback-2336-thread-1) [    ] o.a.s.c.c.ConnectionManager zkClient has connected
   [junit4]   2> 1238935 INFO  (zkConnectionManagerCallback-2338-thread-1) [    ] o.a.s.c.c.ConnectionManager zkClient has connected
   [junit4]   2> 1238935 INFO  (jetty-launcher-2331-thread-1) [    ] o.a.s.s.SolrDispatchFilter solr.xml found in ZooKeeper. Loading...
   [junit4]   2> 1238935 INFO  (jetty-launcher-2331-thread-2) [    ] o.a.s.s.SolrDispatchFilter solr.xml found in ZooKeeper. Loading...
   [junit4]   2> 1238945 INFO  (jetty-launcher-2331-thread-2) [    ] o.a.s.c.ZkContainer Zookeeper client=127.0.0.1:39231/solr
   [junit4]   2> 1238945 INFO  (jetty-launcher-2331-thread-1) [    ] o.a.s.c.ZkContainer Zookeeper client=127.0.0.1:39231/solr
   [junit4]   2> 1238953 INFO  (zkConnectionManagerCallback-2346-thread-1) [    ] o.a.s.c.c.ConnectionManager zkClient has connected
   [junit4]   2> 1238953 INFO  (zkConnectionManagerCallback-2344-thread-1) [    ] o.a.s.c.c.ConnectionManager zkClient has connected
   [junit4]   2> 1238954 WARN  (NIOServerCxn.Factory:0.0.0.0/0.0.0.0:0) [    ] o.a.z.s.NIOServerCnxn caught end of stream exception
   [junit4]   2> EndOfStreamException: Unable to read additional data from client sessionid 0x1606d401b4a0004, likely client has closed socket
   [junit4]   2> 	at org.apache.zookeeper.server.NIOServerCnxn.doIO(NIOServerCnxn.java:239)
   [junit4]   2> 	at org.apache.zookeeper.server.NIOServerCnxnFactory.run(NIOServerCnxnFactory.java:203)
   [junit4]   2> 	at java.base/java.lang.Thread.run(Thread.java:844)
   [junit4]   2> 1238959 INFO  (zkConnectionManagerCallback-2348-thread-1) [    ] o.a.s.c.c.ConnectionManager zkClient has connected
   [junit4]   2> 1238969 INFO  (zkConnectionManagerCallback-2350-thread-1) [    ] o.a.s.c.c.ConnectionManager zkClient has connected
   [junit4]   2> 1238973 INFO  (jetty-launcher-2331-thread-2) [    ] o.a.s.c.Overseer Overseer (id=null) closing
   [junit4]   2> 1238974 INFO  (jetty-launcher-2331-thread-2) [    ] o.a.s.c.OverseerElectionContext I am going to be the leader 127.0.0.1:40251_solr
   [junit4]   2> 1238974 INFO  (jetty-launcher-2331-thread-2) [    ] o.a.s.c.Overseer Overseer (id=99199313905319942-127.0.0.1:40251_solr-n_0000000000) starting
   [junit4]   2> 1238985 INFO  (jetty-launcher-2331-thread-2) [    ] o.a.s.c.ZkController Register node as live in ZooKeeper:/live_nodes/127.0.0.1:40251_solr
   [junit4]   2> 1238989 INFO  (zkCallback-2349-thread-1) [    ] o.a.s.c.c.ZkStateReader Updated live nodes from ZooKeeper... (0) -> (1)
   [junit4]   2> 1238995 INFO  (jetty-launcher-2331-thread-1) [    ] o.a.s.c.c.ZkStateReader Updated live nodes from ZooKeeper... (0) -> (1)
   [junit4]   2> 1238995 INFO  (jetty-launcher-2331-thread-1) [    ] o.a.s.c.Overseer Overseer (id=null) closing
   [junit4]   2> 1238996 INFO  (jetty-launcher-2331-thread-1) [    ] o.a.s.c.ZkController Register node as live in ZooKeeper:/live_nodes/127.0.0.1:39207_solr
   [junit4]   2> 1238997 INFO  (zkCallback-2349-thread-1) [    ] o.a.s.c.c.ZkStateReader Updated live nodes from ZooKeeper... (1) -> (2)
   [junit4]   2> 1239001 INFO  (zkCallback-2347-thread-1) [    ] o.a.s.c.c.ZkStateReader Updated live nodes from ZooKeeper... (1) -> (2)
   [junit4]   2> 1239022 INFO  (jetty-launcher-2331-thread-2) [    ] o.a.s.m.r.SolrJmxReporter JMX monitoring for 'solr_40251.solr.node' (registry 'solr.node') enabled at server: com.sun.jmx.mbeanserver.JmxMBeanServer@d3f8e40
   [junit4]   2> 1239027 INFO  (jetty-launcher-2331-thread-2) [    ] o.a.s.m.r.SolrJmxReporter JMX monitoring for 'solr_40251.solr.jvm' (registry 'solr.jvm') enabled at server: com.sun.jmx.mbeanserver.JmxMBeanServer@d3f8e40
   [junit4]   2> 1239027 INFO  (jetty-launcher-2331-thread-2) [    ] o.a.s.m.r.SolrJmxReporter JMX monitoring for 'solr_40251.solr.jetty' (registry 'solr.jetty') enabled at server: com.sun.jmx.mbeanserver.JmxMBeanServer@d3f8e40
   [junit4]   2> 1239029 INFO  (jetty-launcher-2331-thread-2) [    ] o.a.s.c.CorePropertiesLocator Found 0 core definitions underneath /home/jenkins/workspace/Lucene-Solr-7.2-Linux/solr/build/solr-core/test/J1/temp/solr.schema.TestManagedSchemaAPI_E3340D8A2BA66CA3-001/tempDir-001/node2/.
   [junit4]   2> 1239035 INFO  (jetty-launcher-2331-thread-1) [    ] o.a.s.m.r.SolrJmxReporter JMX monitoring for 'solr_39207.solr.node' (registry 'solr.node') enabled at server: com.sun.jmx.mbeanserver.JmxMBeanServer@d3f8e40
   [junit4]   2> 1239044 INFO  (jetty-launcher-2331-thread-1) [    ] o.a.s.m.r.SolrJmxReporter JMX monitoring for 'solr_39207.solr.jvm' (registry 'solr.jvm') enabled at server: com.sun.jmx.mbeanserver.JmxMBeanServer@d3f8e40
   [junit4]   2> 1239044 INFO  (jetty-launcher-2331-thread-1) [    ] o.a.s.m.r.SolrJmxReporter JMX monitoring for 'solr_39207.solr.jetty' (registry 'solr.jetty') enabled at server: com.sun.jmx.mbeanserver.JmxMBeanServer@d3f8e40
   [junit4]   2> 1239045 INFO  (jetty-launcher-2331-thread-1) [    ] o.a.s.c.CorePropertiesLocator Found 0 core definitions underneath /home/jenkins/workspace/Lucene-Solr-7.2-Linux/solr/build/solr-core/test/J1/temp/solr.schema.TestManagedSchemaAPI_E3340D8A2BA66CA3-001/tempDir-001/node1/.
   [junit4]   2> 1239058 INFO  (zkConnectionManagerCallback-2355-thread-1) [    ] o.a.s.c.c.ConnectionManager zkClient has connected
   [junit4]   2> 1239060 INFO  (zkConnectionManagerCallback-2359-thread-1) [    ] o.a.s.c.c.ConnectionManager zkClient has connected
   [junit4]   2> 1239060 INFO  (SUITE-TestManagedSchemaAPI-seed#[E3340D8A2BA66CA3]-worker) [    ] o.a.s.c.c.ZkStateReader Updated live nodes from ZooKeeper... (0) -> (2)
   [junit4]   2> 1239061 INFO  (SUITE-TestManagedSchemaAPI-seed#[E3340D8A2BA66CA3]-worker) [    ] o.a.s.c.s.i.ZkClientClusterStateProvider Cluster at 127.0.0.1:39231/solr ready
   [junit4]   2> 1239068 INFO  (TEST-TestManagedSchemaAPI.test-seed#[E3340D8A2BA66CA3]) [    ] o.a.s.SolrTestCaseJ4 ###Starting test
   [junit4]   2> 1239089 INFO  (qtp1012192315-10348) [    ] o.a.s.h.a.CollectionsHandler Invoked Collection Action :create with params replicationFactor=2&collection.configName=conf1&name=testschemaapi&nrtReplicas=2&action=CREATE&numShards=1&wt=javabin&version=2 and sendToOCPQueue=true
   [junit4]   2> 1239091 INFO  (OverseerThreadFactory-4075-thread-1) [    ] o.a.s.c.CreateCollectionCmd Create collection testschemaapi
   [junit4]   2> 1239194 INFO  (OverseerStateUpdate-99199313905319942-127.0.0.1:40251_solr-n_0000000000) [    ] o.a.s.c.o.SliceMutator createReplica() {
   [junit4]   2>   "operation":"ADDREPLICA",
   [junit4]   2>   "collection":"testschemaapi",
   [junit4]   2>   "shard":"shard1",
   [junit4]   2>   "core":"testschemaapi_shard1_replica_n1",
   [junit4]   2>   "state":"down",
   [junit4]   2>   "base_url":"https://127.0.0.1:40251/solr",
   [junit4]   2>   "type":"NRT",
   [junit4]   2>   "waitForFinalState":"false"} 
   [junit4]   2> 1239195 INFO  (OverseerStateUpdate-99199313905319942-127.0.0.1:40251_solr-n_0000000000) [    ] o.a.s.c.o.SliceMutator createReplica() {
   [junit4]   2>   "operation":"ADDREPLICA",
   [junit4]   2>   "collection":"testschemaapi",
   [junit4]   2>   "shard":"shard1",
   [junit4]   2>   "core":"testschemaapi_shard1_replica_n2",
   [junit4]   2>   "state":"down",
   [junit4]   2>   "base_url":"https://127.0.0.1:39207/solr",
   [junit4]   2>   "type":"NRT",
   [junit4]   2>   "waitForFinalState":"false"} 
   [junit4]   2> 1239409 INFO  (qtp1012192315-10350) [    ] o.a.s.h.a.CoreAdminOperation core create command qt=/admin/cores&coreNodeName=core_node4&collection.configName=conf1&newCollection=true&name=testschemaapi_shard1_replica_n2&action=CREATE&numShards=1&collection=testschemaapi&shard=shard1&wt=javabin&version=2&replicaType=NRT
   [junit4]   2> 1239409 INFO  (qtp1012192315-10350) [    ] o.a.s.c.TransientSolrCoreCacheDefault Allocating transient cache for 2147483647 transient cores
   [junit4]   2> 1239417 INFO  (qtp1052556356-10343) [    ] o.a.s.h.a.CoreAdminOperation core create command qt=/admin/cores&coreNodeName=core_node3&collection.configName=conf1&newCollection=true&name=testschemaapi_shard1_replica_n1&action=CREATE&numShards=1&collection=testschemaapi&shard=shard1&wt=javabin&version=2&replicaType=NRT
   [junit4]   2> 1239417 INFO  (qtp1052556356-10343) [    ] o.a.s.c.TransientSolrCoreCacheDefault Allocating transient cache for 2147483647 transient cores
   [junit4]   2> 1239519 INFO  (zkCallback-2347-thread-1) [    ] o.a.s.c.c.ZkStateReader A cluster state change: [WatchedEvent state:SyncConnected type:NodeDataChanged path:/collections/testschemaapi/state.json] for collection [testschemaapi] has occurred - updating... (live nodes size: [2])
   [junit4]   2> 1239519 INFO  (zkCallback-2349-thread-1) [    ] o.a.s.c.c.ZkStateReader A cluster state change: [WatchedEvent state:SyncConnected type:NodeDataChanged path:/collections/testschemaapi/state.json] for collection [testschemaapi] has occurred - updating... (live nodes size: [2])
   [junit4]   2> 1239519 INFO  (zkCallback-2349-thread-2) [    ] o.a.s.c.c.ZkStateReader A cluster state change: [WatchedEvent state:SyncConnected type:NodeDataChanged path:/collections/testschemaapi/state.json] for collection [testschemaapi] has occurred - updating... (live nodes size: [2])
   [junit4]   2> 1239519 INFO  (zkCallback-2347-thread-2) [    ] o.a.s.c.c.ZkStateReader A cluster state change: [WatchedEvent state:SyncConnected type:NodeDataChanged path:/collections/testschemaapi/state.json] for collection [testschemaapi] has occurred - updating... (live nodes size: [2])
   [junit4]   2> 1240414 INFO  (qtp1012192315-10350) [    ] o.a.s.c.SolrConfig Using Lucene MatchVersion: 7.2.0
   [junit4]   2> 1240417 INFO  (qtp1012192315-10350) [    ] o.a.s.s.IndexSchema [testschemaapi_shard1_replica_n2] Schema name=minimal
   [junit4]   2> 1240418 INFO  (qtp1012192315-10350) [    ] o.a.s.s.IndexSchema Loaded schema minimal/1.1 with uniqueid field id
   [junit4]   2> 1240418 INFO  (qtp1012192315-10350) [    ] o.a.s.c.CoreContainer Creating SolrCore 'testschemaapi_shard1_replica_n2' using configuration from collection testschemaapi, trusted=true
   [junit4]   2> 1240419 INFO  (qtp1012192315-10350) [    ] o.a.s.m.r.SolrJmxReporter JMX monitoring for 'solr_39207.solr.core.testschemaapi.shard1.replica_n2' (registry 'solr.core.testschemaapi.shard1.replica_n2') enabled at server: com.sun.jmx.mbeanserver.JmxMBeanServer@d3f8e40
   [junit4]   2> 1240419 INFO  (qtp1012192315-10350) [    ] o.a.s.c.SolrCore solr.RecoveryStrategy.Builder
   [junit4]   2> 1240419 INFO  (qtp1012192315-10350) [    ] o.a.s.c.SolrCore [[testschemaapi_shard1_replica_n2] ] Opening new SolrCore at [/home/jenkins/workspace/Lucene-Solr-7.2-Linux/solr/build/solr-core/test/J1/temp/solr.schema.TestManagedSchemaAPI_E3340D8A2BA66CA3-001/tempDir-001/node1/testschemaapi_shard1_replica_n2], dataDir=[/home/jenkins/workspace/Lucene-Solr-7.2-Linux/solr/build/solr-core/test/J1/temp/solr.schema.TestManagedSchemaAPI_E3340D8A2BA66CA3-001/tempDir-001/node1/./testschemaapi_shard1_replica_n2/data/]
   [junit4]   2> 1240423 INFO  (qtp1052556356-10343) [    ] o.a.s.c.SolrConfig Using Lucene MatchVersion: 7.2.0
   [junit4]   2> 1240426 INFO  (qtp1052556356-10343) [    ] o.a.s.s.IndexSchema [testschemaapi_shard1_replica_n1] Schema name=minimal
   [junit4]   2> 1240426 INFO  (qtp1052556356-10343) [    ] o.a.s.s.IndexSchema Loaded schema minimal/1.1 with uniqueid field id
   [junit4]   2> 1240427 INFO  (qtp1052556356-10343) [    ] o.a.s.c.CoreContainer Creating SolrCore 'testschemaapi_shard1_replica_n1' using configuration from collection testschemaapi, trusted=true
   [junit4]   2> 1240427 INFO  (qtp1052556356-10343) [    ] o.a.s.m.r.SolrJmxReporter JMX monitoring for 'solr_40251.solr.core.testschemaapi.shard1.replica_n1' (registry 'solr.core.testschemaapi.shard1.replica_n1') enabled at server: com.sun.jmx.mbeanserver.JmxMBeanServer@d3f8e40
   [junit4]   2> 1240427 INFO  (qtp1052556356-10343) [    ] o.a.s.c.SolrCore solr.RecoveryStrategy.Builder
   [junit4]   2> 1240427 INFO  (qtp1052556356-10343) [    ] o.a.s.c.SolrCore [[testschemaapi_shard1_replica_n1] ] Opening new SolrCore at [/home/jenkins/workspace/Lucene-Solr-7.2-Linux/solr/build/solr-core/test/J1/temp/solr.schema.TestManagedSchemaAPI_E3340D8A2BA66CA3-001/tempDir-001/node2/testschemaapi_shard1_replica_n1], dataDir=[/home/jenkins/workspace/Lucene-Solr-7.2-Linux/solr/build/solr-core/test/J1/temp/solr.schema.TestManagedSchemaAPI_E3340D8A2BA66CA3-001/tempDir-001/node2/./testschemaapi_shard1_replica_n1/data/]
   [junit4]   2> 1240446 INFO  (qtp1012192315-10350) [    ] o.a.s.u.UpdateHandler Using UpdateLog implementation: org.apache.solr.update.UpdateLog
   [junit4]   2> 1240446 INFO  (qtp1012192315-10350) [    ] o.a.s.u.UpdateLog Initializing UpdateLog: dataDir=null defaultSyncLevel=FLUSH numRecordsToKeep=100 maxNumLogsToKeep=10 numVersionBuckets=65536
   [junit4]   2> 1240447 INFO  (qtp1012192315-10350) [    ] o.a.s.u.CommitTracker Hard AutoCommit: disabled
   [junit4]   2> 1240447 INFO  (qtp1012192315-10350) [    ] o.a.s.u.CommitTracker Soft AutoCommit: disabled
   [junit4]   2> 1240448 INFO  (qtp1012192315-10350) [    ] o.a.s.s.SolrIndexSearcher Opening [Searcher@3460a3bf[testschemaapi_shard1_replica_n2] main]
   [junit4]   2> 1240448 INFO  (qtp1012192315-10350) [    ] o.a.s.r.ManagedResourceStorage Configured ZooKeeperStorageIO with znodeBase: /configs/conf1
   [junit4]   2> 1240449 INFO  (qtp1012192315-10350) [    ] o.a.s.r.ManagedResourceStorage Loaded null at path _rest_managed.json using ZooKeeperStorageIO:path=/configs/conf1
   [junit4]   2> 1240449 INFO  (qtp1012192315-10350) [    ] o.a.s.s.ZkIndexSchemaReader Creating ZooKeeper watch for the managed schema at /configs/conf1/managed-schema
   [junit4]   2> 1240449 INFO  (qtp1012192315-10350) [    ] o.a.s.s.ZkIndexSchemaReader Current schema version 0 is already the latest
   [junit4]   2> 1240449 INFO  (qtp1012192315-10350) [    ] o.a.s.h.ReplicationHandler Commits will be reserved for 10000ms.
   [junit4]   2> 1240450 INFO  (searcherExecutor-4080-thread-1) [    ] o.a.s.c.SolrCore [testschemaapi_shard1_replica_n2] Registered new searcher Searcher@3460a3bf[testschemaapi_shard1_replica_n2] main{ExitableDirectoryReader(UninvertingDirectoryReader())}
   [junit4]   2> 1240450 INFO  (qtp1012192315-10350) [    ] o.a.s.u.UpdateLog Could not find max version in index or recent updates, using new clock 1587189024207929344
   [junit4]   2> 1240453 INFO  (qtp1012192315-10350) [    ] o.a.s.c.ShardLeaderElectionContext Waiting until we see more replicas up for shard shard1: total=2 found=1 timeoutin=9999ms
   [junit4]   2> 1240453 INFO  (qtp1052556356-10343) [    ] o.a.s.u.UpdateHandler Using UpdateLog implementation: org.apache.solr.update.UpdateLog
   [junit4]   2> 1240453 INFO  (qtp1052556356-10343) [    ] o.a.s.u.UpdateLog Initializing UpdateLog: dataDir=null defaultSyncLevel=FLUSH numRecordsToKeep=100 maxNumLogsToKeep=10 numVersionBuckets=65536
   [junit4]   2> 1240453 INFO  (qtp1052556356-10343) [    ] o.a.s.u.CommitTracker Hard AutoCommit: disabled
   [junit4]   2> 1240453 INFO  (qtp1052556356-10343) [    ] o.a.s.u.CommitTracker Soft AutoCommit: disabled
   [junit4]   2> 1240454 INFO  (qtp1052556356-10343) [    ] o.a.s.s.SolrIndexSearcher Opening [Searcher@139f3f68[testschemaapi_shard1_replica_n1] main]
   [junit4]   2> 1240455 INFO  (qtp1052556356-10343) [    ] o.a.s.r.ManagedResourceStorage Configured ZooKeeperStorageIO with znodeBase: /configs/conf1
   [junit4]   2> 1240455 INFO  (qtp1052556356-10343) [    ] o.a.s.r.ManagedResourceStorage Loaded null at path _rest_managed.json using ZooKeeperStorageIO:path=/configs/conf1
   [junit4]   2> 1240455 INFO  (qtp1052556356-10343) [    ] o.a.s.s.ZkIndexSchemaReader Creating ZooKeeper watch for the managed schema at /configs/conf1/managed-schema
   [junit4]   2> 1240455 INFO  (qtp1052556356-10343) [    ] o.a.s.s.ZkIndexSchemaReader Current schema version 0 is already the latest
   [junit4]   2> 1240456 INFO  (qtp1052556356-10343) [    ] o.a.s.h.ReplicationHandler Commits will be reserved for 10000ms.
   [junit4]   2> 1240456 INFO  (searcherExecutor-4081-thread-1) [    ] o.a.s.c.SolrCore [testschemaapi_shard1_replica_n1] Registered new searcher Searcher@139f3f68[testschemaapi_shard1_replica_n1] main{ExitableDirectoryReader(UninvertingDirectoryReader())}
   [junit4]   2> 1240456 INFO  (qtp1052556356-10343) [    ] o.a.s.u.UpdateLog Could not find max version in index or recent updates, using new clock 1587189024214220800
   [junit4]   2> 1240953 INFO  (qtp1012192315-10350) [    ] o.a.s.c.ShardLeaderElectionContext Enough replicas found to continue.
   [junit4]   2> 1240953 INFO  (qtp1012192315-10350) [    ] o.a.s.c.ShardLeaderElectionContext I may be the new leader - try and sync
   [junit4]   2> 1240953 INFO  (qtp1012192315-10350) [    ] o.a.s.c.SyncStrategy Sync replicas to https://127.0.0.1:39207/solr/testschemaapi_shard1_replica_n2/
   [junit4]   2> 1240954 INFO  (qtp1012192315-10350) [    ] o.a.s.u.PeerSync PeerSync: core=testschemaapi_shard1_replica_n2 url=https://127.0.0.1:39207/solr START replicas=[https://127.0.0.1:40251/solr/testschemaapi_shard1_replica_n1/] nUpdates=100
   [junit4]   2> 1240958 INFO  (qtp1052556356-10358) [    ] o.a.s.c.S.Request [testschemaapi_shard1_replica_n1]  webapp=/solr path=/get params={distrib=false&qt=/get&fingerprint=false&getVersions=100&wt=javabin&version=2} status=0 QTime=0
   [junit4]   2> 1241254 INFO  (qtp1012192315-10350) [    ] o.a.s.u.PeerSync PeerSync: core=testschemaapi_shard1_replica_n2 url=https://127.0.0.1:39207/solr DONE.  We have no versions.  sync failed.
   [junit4]   2> 1241254 INFO  (qtp1012192315-10350) [    ] o.a.s.c.SyncStrategy Leader's attempt to sync with shard failed, moving to the next candidate
   [junit4]   2> 1241254 INFO  (qtp1012192315-10350) [    ] o.a.s.c.ShardLeaderElectionContext We failed sync, but we have no versions - we can't sync in that case - we were active before, so become leader anyway
   [junit4]   2> 1241254 INFO  (qtp1012192315-10350) [    ] o.a.s.c.ShardLeaderElectionContext Found all replicas participating in election, clear LIR
   [junit4]   2> 1241256 INFO  (qtp1012192315-10350) [    ] o.a.s.c.ShardLeaderElectionContext I am the new leader: https://127.0.0.1:39207/solr/testschemaapi_shard1_replica_n2/ shard1
   [junit4]   2> 1419091 ERROR (qtp1012192315-10348) [    ] o.a.s.h.RequestHandlerBase org.apache.solr.common.SolrException: create the collection time out:180s
   [junit4]   2> 	at org.apache.solr.handler.admin.CollectionsHandler.handleResponse(CollectionsHandler.java:314)
   [junit4]   2> 	at org.apache.solr.handler.admin.CollectionsHandler.invokeAction(CollectionsHandler.java:246)
   [junit4]   2> 	at org.apache.solr.handler.admin.CollectionsHandler.handleRequestBody(CollectionsHandler.java:224)
   [junit4]   2> 	at org.apache.solr.handler.RequestHandlerBase.handleRequest(RequestHandlerBase.java:177)
   [junit4]   2> 	at org.apache.solr.servlet.HttpSolrCall.handleAdmin(HttpSolrCall.java:735)
   [junit4]   2> 	at org.apache.solr.servlet.HttpSolrCall.handleAdminRequest(HttpSolrCall.java:716)
   [junit4]   2> 	at org.apache.solr.servlet.HttpSolrCall.call(HttpSolrCall.java:497)
   [junit4]   2> 	at org.apache.solr.servlet.SolrDispatchFilter.doFilter(SolrDispatchFilter.java:382)
   [junit4]   2> 	at org.apache.solr.servlet.SolrDispatchFilter.doFilter(SolrDispatchFilter.java:326)
   [junit4]   2> 	at org.eclipse.jetty.servlet.ServletHandler$CachedChain.doFilter(ServletHandler.java:1759)
   [junit4]   2> 	at org.apache.solr.client.solrj.embedded.JettySolrRunner$DebugFilter.doFilter(JettySolrRunner.java:139)
   [junit4]   2> 	at org.eclipse.jetty.servlet.ServletHandler$CachedChain.doFilter(ServletHandler.java:1759)
   [junit4]   2> 	at org.eclipse.jetty.servlet.ServletHandler.doHandle(ServletHandler.java:582)
   [junit4]   2> 	at org.eclipse.jetty.server.session.SessionHandler.doHandle(SessionHandler.java:224)
   [junit4]   2> 	at org.eclipse.jetty.server.handler.ContextHandler.doHandle(ContextHandler.java:1180)
   [junit4]   2> 	at org.eclipse.jetty.servlet.ServletHandler.doScope(ServletHandler.java:512)
   [junit4]   2> 	at org.eclipse.jetty.server.session.SessionHandler.doScope(SessionHandler.java:185)
   [junit4]   2> 	at org.eclipse.jetty.server.handler.ContextHandler.doScope(ContextHandler.java:1112)
   [junit4]   2> 	at org.eclipse.jetty.server.handler.ScopedHandler.handle(ScopedHandler.java:141)
   [junit4]   2> 	at org.eclipse.jetty.server.handler.gzip.GzipHandler.handle(GzipHandler.java:493)
   [junit4]   2> 	at org.eclipse.jetty.server.handler.HandlerWrapper.handle(HandlerWrapper.java:134)
   [junit4]   2> 	at org.eclipse.jetty.server.Server.handle(Server.java:534)
   [junit4]   2> 	at org.eclipse.jetty.server.HttpChannel.handle(HttpChannel.java:320)
   [junit4]   2> 	at org.eclipse.jetty.server.HttpConnection.onFillable(HttpConnection.java:251)
   [junit4]   2> 	at org.eclipse.jetty.io.AbstractConnection$ReadCallback.succeeded(AbstractConnection.java:283)
   [junit4]   2> 	at org.eclipse.jetty.io.FillInterest.fillable(FillInterest.java:108)
   [junit4]   2> 	at org.eclipse.jetty.io.ssl.SslConnection.onFillable(SslConnection.java:251)
   [junit4]   2> 	at org.eclipse.jetty.io.AbstractConnection$ReadCallback.succeeded(AbstractConnection.java:283)
   [junit4]   2> 	at org.eclipse.jetty.io.FillInterest.fillable(FillInterest.java:108)
   [junit4]   2> 	at org.eclipse.jetty.io.SelectChannelEndPoint$2.run(SelectChannelEndPoint.java:93)
   [junit4]   2> 	at org.eclipse.jetty.util.thread.strategy.ExecuteProduceConsume.executeProduceConsume(ExecuteProduceConsume.java:303)
   [junit4]   2> 	at org.eclipse.jetty.util.thread.strategy.ExecuteProduceConsume.produceConsume(ExecuteProduceConsume.java:148)
   [junit4]   2> 	at org.eclipse.jetty.util.thread.strategy.ExecuteProduceConsume.run(ExecuteProduceConsume.java:136)
   [junit4]   2> 	at org.eclipse.jetty.util.thread.QueuedThreadPool.runJob(QueuedThreadPool.java:671)
   [junit4]   2> 	at org.eclipse.jetty.util.thread.QueuedThreadPool$2.run(QueuedThreadPool.java:589)
   [junit4]   2> 	at java.base/java.lang.Thread.run(Thread.java:844)
   [junit4]   2> 
   [junit4]   2> 1419092 INFO  (qtp1012192315-10348) [    ] o.a.s.s.HttpSolrCall [admin] webapp=null path=/admin/collections params={replicationFactor=2&collection.configName=conf1&name=testschemaapi&nrtReplicas=2&action=CREATE&numShards=1&wt=javabin&version=2} status=500 QTime=180002
   [junit4]   2> 1419092 ERROR (qtp1012192315-10348) [    ] o.a.s.s.HttpSolrCall null:org.apache.solr.common.SolrException: create the collection time out:180s
   [junit4]   2> 	at org.apache.solr.handler.admin.CollectionsHandler.handleResponse(CollectionsHandler.java:314)
   [junit4]   2> 	at org.apache.solr.handler.admin.CollectionsHandler.invokeAction(CollectionsHandler.java:246)
   [junit4]   2> 	at org.apache.solr.handler.admin.CollectionsHandler.handleRequestBody(CollectionsHandler.java:224)
   [junit4]   2> 	at org.apache.solr.handler.RequestHandlerBase.handleRequest(RequestHandlerBase.java:177)
   [junit4]   2> 	at org.apache.solr.servlet.HttpSolrCall.handleAdmin(HttpSolrCall.java:735)
   [junit4]   2> 	at org.apache.solr.servlet.HttpSolrCall.handleAdminRequest(HttpSolrCall.java:716)
   [junit4]   2> 	at org.apache.solr.servlet.HttpSolrCall.call(HttpSolrCall.java:497)
   [junit4]   2> 	at org.apache.solr.servlet.SolrDispatchFilter.doFilter(SolrDispatchFilter.java:382)
   [junit4]   2> 	at org.apache.solr.servlet.SolrDispatchFilter.doFilter(SolrDispatchFilter.java:326)
   [junit4]   2> 	at org.eclipse.jetty.servlet.ServletHandler$CachedChain.doFilter(ServletHandler.java:1759)
   [junit4]   2> 	at org.apache.solr.client.solrj.embedded.JettySolrRunner$DebugFilter.doFilter(JettySolrRunner.java:139)
   [junit4]   2> 	at org.eclipse.jetty.servlet.ServletHandler$CachedChain.doFilter(ServletHandler.java:1759)
   [junit4]   2> 	at org.eclipse.jetty.servlet.ServletHandler.doHandle(ServletHandler.java:582)
   [junit4]   2> 	at org.eclipse.jetty.server.session.SessionHandler.doHandle(SessionHandler.java:224)
   [junit4]   2> 	at org.eclipse.jetty.server.handler.ContextHandler.doHandle(ContextHandler.java:1180)
   [junit4]   2> 	at org.eclipse.jetty.servlet.ServletHandler.doScope(ServletHandler.java:512)
   [junit4]   2> 	at org.eclipse.jetty.server.session.SessionHandler.doScope(SessionHandler.java:185)
   [junit4]   2> 	at org.eclipse.jetty.server.handler.ContextHandler.doScope(ContextHandler.java:1112)
   [junit4]   2> 	at org.eclipse.jetty.server.handler.ScopedHandler.handle(ScopedHandler.java:141)
   [junit4]   2> 	at org.eclipse.jetty.server.handler.gzip.GzipHandler.handle(GzipHandler.java:493)
   [junit4]   2> 	at org.eclipse.jetty.server.handler.HandlerWrapper.handle(HandlerWrapper.java:134)
   [junit4]   2> 	at org.eclipse.jetty.server.Server.handle(Server.java:534)
   [junit4]   2> 	at org.eclipse.jetty.server.HttpChannel.handle(HttpChannel.java:320)
   [junit4]   2> 	at org.eclipse.jetty.server.HttpConnection.onFillable(HttpConnection.java:251)
   [junit4]   2> 	at org.eclipse.jetty.io.AbstractConnection$ReadCallback.succeeded(AbstractConnection.java:283)
   [junit4]   2> 	at org.eclipse.jetty.io.FillInterest.fillable(FillInterest.java:108)
   [junit4]   2> 	at org.eclipse.jetty.io.ssl.SslConnection.onFillable(SslConnection.java:251)
   [junit4]   2> 	at org.eclipse.jetty.io.AbstractConnection$ReadCallback.succeeded(AbstractConnection.java:283)
   [junit4]   2> 	at org.eclipse.jetty.io.FillInterest.fillable(FillInterest.java:108)
   [junit4]   2> 	at org.eclipse.jetty.io.SelectChannelEndPoint$2.run(SelectChannelEndPoint.java:93)
   [junit4]   2> 	at org.eclipse.jetty.util.thread.strategy.ExecuteProduceConsume.executeProduceConsume(ExecuteProduceConsume.java:303)
   [junit4]   2> 	at org.eclipse.jetty.util.thread.strategy.ExecuteProduceConsume.produceConsume(ExecuteProduceConsume.java:148)
   [junit4]   2> 	at org.eclipse.jetty.util.thread.strategy.ExecuteProduceConsume.run(ExecuteProduceConsume.java:136)
   [junit4]   2> 	at org.eclipse.jetty.util.thread.QueuedThreadPool.runJob(QueuedThreadPool.java:671)
   [junit4]   2> 	at org.eclipse.jetty.util.thread.QueuedThreadPool$2.run(QueuedThreadPool.java:589)
   [junit4]   2> 	at java.base/java.lang.Thread.run(Thread.java:844)
   [junit4]   2> 
   [junit4]   2> 1419093 INFO  (TEST-TestManagedSchemaAPI.test-seed#[E3340D8A2BA66CA3]) [    ] o.a.s.SolrTestCaseJ4 ###Ending test
   [junit4]   2> NOTE: reproduce with: ant test  -Dtestcase=TestManagedSchemaAPI -Dtests.method=test -Dtests.seed=E3340D8A2BA66CA3 -Dtests.multiplier=3 -Dtests.slow=true -Dtests.locale=kde-TZ -Dtests.timezone=EST -Dtests.asserts=true -Dtests.file.encoding=ISO-8859-1
   [junit4] ERROR    180s J1 | TestManagedSchemaAPI.test <<<
   [junit4]    > Throwable #1: org.apache.solr.client.solrj.impl.HttpSolrClient$RemoteSolrException: Error from server at https://127.0.0.1:39207/solr: create the collection time out:180s
   [junit4]    > 	at __randomizedtesting.SeedInfo.seed([E3340D8A2BA66CA3:6B603250855A015B]:0)
   [junit4]    > 	at org.apache.solr.client.solrj.impl.HttpSolrClient.executeMethod(HttpSolrClient.java:643)
   [junit4]    > 	at org.apache.solr.client.solrj.impl.HttpSolrClient.request(HttpSolrClient.java:255)
   [junit4]    > 	at org.apache.solr.client.solrj.impl.HttpSolrClient.request(HttpSolrClient.java:244)
   [junit4]    > 	at org.apache.solr.client.solrj.impl.LBHttpSolrClient.doRequest(LBHttpSolrClient.java:483)
   [junit4]    > 	at org.apache.solr.client.solrj.impl.LBHttpSolrClient.request(LBHttpSolrClient.java:413)
   [junit4]    > 	at org.apache.solr.client.solrj.impl.CloudSolrClient.sendRequest(CloudSolrClient.java:1103)
   [junit4]    > 	at org.apache.solr.client.solrj.impl.CloudSolrClient.requestWithRetryOnStaleState(CloudSolrClient.java:883)
   [junit4]    > 	at org.apache.solr.client.solrj.impl.CloudSolrClient.request(CloudSolrClient.java:816)
   [junit4]    > 	at org.apache.solr.client.solrj.SolrRequest.process(SolrRequest.java:194)
   [junit4]    > 	at org.apache.solr.client.solrj.SolrRequest.process(SolrRequest.java:211)
   [junit4]    > 	at org.apache.solr.schema.TestManagedSchemaAPI.test(TestManagedSchemaAPI.java:54)
   [junit4]    > 	at java.base/jdk.internal.reflect.NativeMethodAccessorImpl.invoke0(Native Method)
   [junit4]    > 	at java.base/jdk.internal.reflect.NativeMethodAccessorImpl.invoke(NativeMethodAccessorImpl.java:62)
   [junit4]    > 	at java.base/jdk.internal.reflect.DelegatingMethodAccessorImpl.invoke(DelegatingMethodAccessorImpl.java:43)
   [junit4]    > 	at java.base/java.lang.reflect.Method.invoke(Method.java:564)
   [junit4]    > 	at java.base/java.lang.Thread.run(Thread.java:844)
   [junit4]   2> 1419100 INFO  (jetty-closer-2332-thread-2) [    ] o.e.j.s.AbstractConnector Stopped ServerConnector@6f079d15{SSL,[ssl, http/1.1]}{127.0.0.1:0}
   [junit4]   2> 1419100 ERROR (OverseerThreadFactory-4075-thread-1) [    ] o.a.s.c.OverseerCollectionMessageHandler Error from shard: https://127.0.0.1:39207/solr
   [junit4]   2> org.apache.solr.client.solrj.SolrServerException: IOException occured when talking to server at: https://127.0.0.1:39207/solr
   [junit4]   2> 	at org.apache.solr.client.solrj.impl.HttpSolrClient.executeMethod(HttpSolrClient.java:657)
   [junit4]   2> 	at org.apache.solr.client.solrj.impl.HttpSolrClient.request(HttpSolrClient.java:255)
   [junit4]   2> 	at org.apache.solr.client.solrj.impl.HttpSolrClient.request(HttpSolrClient.java:244)
   [junit4]   2> 	at org.apache.solr.client.solrj.SolrClient.request(SolrClient.java:1219)
   [junit4]   2> 	at org.apache.solr.handler.component.HttpShardHandler.lambda$submit$0(HttpShardHandler.java:172)
   [junit4]   2> 	at java.base/java.util.concurrent.FutureTask.run(FutureTask.java:264)
   [junit4]   2> 	at java.base/java.util.concurrent.Executors$RunnableAdapter.call(Executors.java:514)
   [junit4]   2> 	at java.base/java.util.concurrent.FutureTask.run(FutureTask.java:264)
   [junit4]   2> 	at com.codahale.metrics.InstrumentedExecutorService$InstrumentedRunnable.run(InstrumentedExecutorService.java:176)
   [junit4]   2> 	at org.apache.solr.common.util.ExecutorUtil$MDCAwareThreadPoolExecutor.lambda$execute$0(ExecutorUtil.java:188)
   [junit4]   2> 	at java.base/java.util.concurrent.ThreadPoolExecutor.runWorker(ThreadPoolExecutor.java:1135)
   [junit4]   2> 	at java.base/java.util.concurrent.ThreadPoolExecutor$Worker.run(ThreadPoolExecutor.java:635)
   [junit4]   2> 	at java.base/java.lang.Thread.run(Thread.java:844)
   [junit4]   2> Caused by: org.apache.http.NoHttpResponseException: 127.0.0.1:39207 failed to respond
   [junit4]   2> 	at org.apache.http.impl.conn.DefaultHttpResponseParser.parseHead(DefaultHttpResponseParser.java:141)
   [junit4]   2> 	at org.apache.http.impl.conn.DefaultHttpResponseParser.parseHead(DefaultHttpResponseParser.java:56)
   [junit4]   2> 	at org.apache.http.impl.io.AbstractMessageParser.parse(AbstractMessageParser.java:259)
   [junit4]   2> 	at org.apache.http.impl.DefaultBHttpClientConnection.receiveResponseHeader(DefaultBHttpClientConnection.java:163)
   [junit4]   2> 	at org.apache.http.impl.conn.CPoolProxy.receiveResponseHeader(CPoolProxy.java:165)
   [junit4]   2> 	at org.apache.http.protocol.HttpRequestExecutor.doReceiveResponse(HttpRequestExecutor.java:273)
   [junit4]   2> 	at org.apache.http.protocol.HttpRequestExecutor.execute(HttpRequestExecutor.java:125)
   [junit4]   2> 	at org.apache.solr.util.stats.InstrumentedHttpRequestExecutor.execute(InstrumentedHttpRequestExecutor.java:118)
   [junit4]   2> 	at org.apache.http.impl.execchain.MainClientExec.execute(MainClientExec.java:272)
   [junit4]   2> 	at org.apache.http.impl.execchain.ProtocolExec.execute(ProtocolExec.java:185)
   [junit4]   2> 	at org.apache.http.impl.execchain.RetryExec.execute(RetryExec.java:89)
   [junit4]   2> 	at org.apache.http.impl.execchain.RedirectExec.execute(RedirectExec.java:111)
   [junit4]   2> 	at org.apache.http.impl.client.InternalHttpClient.doExecute(InternalHttpClient.java:185)
   [junit4]   2> 	at org.apache.http.impl.client.CloseableHttpClient.execute(CloseableHttpClient.java:83)
   [junit4]   2> 	at org.apache.http.impl.client.CloseableHttpClient.execute(CloseableHttpClient.java:56)
   [junit4]   2> 	at org.apache.solr.client.solrj.impl.HttpSolrClient.executeMethod(HttpSolrClient.java:542)
   [junit4]   2> 	... 12 more
   [junit4]   2> 1419100 INFO  (jetty-closer-2332-thread-1) [    ] o.e.j.s.AbstractConnector Stopped ServerConnector@61220e76{SSL,[ssl, http/1.1]}{127.0.0.1:0}
   [junit4]   2> 1419105 ERROR (OverseerThreadFactory-4075-thread-1) [    ] o.a.s.c.OverseerCollectionMessageHandler Error from shard: https://127.0.0.1:40251/solr
   [junit4]   2> org.apache.solr.client.solrj.SolrServerException: IOException occured when talking to server at: https://127.0.0.1:40251/solr
   [junit4]   2> 	at org.apache.solr.client.solrj.impl.HttpSolrClient.executeMethod(HttpSolrClient.java:657)
   [junit4]   2> 	at org.apache.solr.client.solrj.impl.HttpSolrClient.request(HttpSolrClient.java:255)
   [junit4]   2> 	at org.apache.solr.client.solrj.impl.HttpSolrClient.request(HttpSolrClient.java:244)
   [junit4]   2> 	at org.apache.solr.client.solrj.SolrClient.request(SolrClient.java:1219)
   [junit4]   2> 	at org.apache.solr.handler.component.HttpShardHandler.lambda$submit$0(HttpShardHandler.java:172)
   [junit4]   2> 	at java.base/java.util.concurrent.FutureTask.run(FutureTask.java:264)
   [junit4]   2> 	at java.base/java.util.concurrent.Executors$RunnableAdapter.call(Executors.java:514)
   [junit4]   2> 	at java.base/java.util.concurrent.FutureTask.run(FutureTask.java:264)
   [junit4]   2> 	at com.codahale.metrics.InstrumentedExecutorService$InstrumentedRunnable.run(InstrumentedExecutorService.java:176)
   [junit4]   2> 	at org.apache.solr.common.util.ExecutorUtil$MDCAwareThreadPoolExecutor.lambda$execute$0(ExecutorUtil.java:188)
   [junit4]   2> 	at java.base/java.util.concurrent.ThreadPoolExecutor.runWorker(ThreadPoolExecutor.java:1135)
   [junit4]   2> 	at java.base/java.util.concurrent.ThreadPoolExecutor$Worker.run(ThreadPoolExecutor.java:635)
   [junit4]   2> 	at java.base/java.lang.Thread.run(Thread.java:844)
   [junit4]   2> Caused by: org.apache.http.NoHttpResponseException: 127.0.0.1:40251 failed to respond
   [junit4]   2> 	at org.apache.http.impl.conn.DefaultHttpResponseParser.parseHead(DefaultHttpResponseParser.java:141)
   [junit4]   2> 	at org.apache.http.impl.conn.DefaultHttpResponseParser.parseHead(DefaultHttpResponseParser.java:56)
   [junit4]   2> 	at org.apache.http.impl.io.AbstractMessageParser.parse(AbstractMessageParser.java:259)
   [junit4]   2> 	at org.apache.http.impl.DefaultBHttpClientConnection.receiveResponseHeader(DefaultBHttpClientConnection.java:163)
   [junit4]   2> 	at org.apache.http.impl.conn.CPoolProxy.receiveResponseHeader(CPoolProxy.java:165)
   [junit4]   2> 	at org.apache.http.protocol.HttpRequestExecutor.doReceiveResponse(HttpRequestExecutor.java:273)
   [junit4]   2> 	at org.apache.http.protocol.HttpRequestExecutor.execute(HttpRequestExecutor.java:125)
   [junit4]   2> 	at org.apache.solr.util.stats.InstrumentedHttpRequestExecutor.execute(InstrumentedHttpRequestExecutor.java:118)
   [junit4]   2> 	at org.apache.http.impl.execchain.MainClientExec.execute(MainClientExec.java:272)
   [junit4]   2> 	at org.apache.http.impl.execchain.ProtocolExec.execute(ProtocolExec.java:185)
   [junit4]   2> 	at org.apache.http.impl.execchain.RetryExec.execute(RetryExec.java:89)
   [junit4]   2> 	at org.apache.http.impl.execchain.RedirectExec.execute(RedirectExec.java:111)
   [junit4]   2> 	at org.apache.http.impl.client.InternalHttpClient.doExecute(InternalHttpClient.java:185)
   [junit4]   2> 	at org.apache.http.impl.client.CloseableHttpClient.execute(CloseableHttpClient.java:83)
   [junit4]   2> 	at org.apache.http.impl.client.CloseableHttpClient.execute(CloseableHttpClient.java:56)
   [junit4]   2> 	at org.apache.solr.client.solrj.impl.HttpSolrClient.executeMethod(HttpSolrClient.java:542)
   [junit4]   2> 	... 12 more
   [junit4]   2> 1419105 INFO  (jetty-closer-2332-thread-1) [    ] o.a.s.c.CoreContainer Shutting down CoreContainer instance=1228629021
   [junit4]   2> 1419106 ERROR (OverseerThreadFactory-4075-thread-1) [    ] o.a.s.c.OverseerCollectionMessageHandler Cleaning up collection [testschemaapi].
   [junit4]   2> 1419100 INFO  (jetty-closer-2332-thread-2) [    ] o.a.s.c.CoreContainer Shutting down CoreContainer instance=447284821
   [junit4]   2> 1419106 INFO  (jetty-closer-2332-thread-2) [    ] o.a.s.m.SolrMetricManager Closing metric reporters for registry=solr.node, tag=null
   [junit4]   2> 1419106 INFO  (jetty-closer-2332-thread-2) [    ] o.a.s.m.r.SolrJmxReporter Closing reporter [org.apache.solr.metrics.reporters.SolrJmxReporter@3fd90ce7: rootName = solr_39207, domain = solr.node, service url = null, agent id = null] for registry solr.node / com.codahale.metrics.MetricRegistry@4e4c73a2
   [junit4]   2> 1419106 INFO  (OverseerThreadFactory-4075-thread-1) [    ] o.a.s.c.OverseerCollectionMessageHandler Executing Collection Cmd : action=UNLOAD&deleteInstanceDir=true&deleteDataDir=true
   [junit4]   2> 1419108 ERROR (OverseerThreadFactory-4075-thread-1) [    ] o.a.s.c.OverseerCollectionMessageHandler Error from shard: https://127.0.0.1:40251/solr
   [junit4]   2> org.apache.solr.client.solrj.SolrServerException: Server refused connection at: https://127.0.0.1:40251/solr
   [junit4]   2> 	at org.apache.solr.client.solrj.impl.HttpSolrClient.executeMethod(HttpSolrClient.java:650)
   [junit4]   2> 	at org.apache.solr.client.solrj.impl.HttpSolrClient.request(HttpSolrClient.java:255)
   [junit4]   2> 	at org.apache.solr.client.solrj.impl.HttpSolrClient.request(HttpSolrClient.java:244)
   [junit4]   2> 	at org.apache.solr.client.solrj.SolrClient.request(SolrClient.java:1219)
   [junit4]   2> 	at org.apache.solr.handler.component.HttpShardHandler.lambda$submit$0(HttpShardHandler.java:172)
   [junit4]   2> 	at java.base/java.util.concurrent.FutureTask.run(FutureTask.java:264)
   [junit4]   2> 	at java.base/java.util.concurrent.Executors$RunnableAdapter.call(Executors.java:514)
   [junit4]   2> 	at java.base/java.util.concurrent.FutureTask.run(FutureTask.java:264)
   [junit4]   2> 	at com.codahale.metrics.InstrumentedExecutorService$InstrumentedRunnable.run(InstrumentedExecutorService.java:176)
   [junit4]   2> 	at org.apache.solr.common.util.ExecutorUtil$MDCAwareThreadPoolExecutor.lambda$execute$0(ExecutorUtil.java:188)
   [junit4]   2> 	at java.base/java.util.concurrent.ThreadPoolExecutor.runWorker(ThreadPoolExecutor.java:1135)
   [junit4]   2> 	at java.base/java.util.concurrent.ThreadPoolExecutor$Worker.run(ThreadPoolExecutor.java:635)
   [junit4]   2> 	at java.base/java.lang.Thread.run(Thread.java:844)
   [junit4]   2> Caused by: org.apache.http.conn.HttpHostConnectException: Connect to 127.0.0.1:40251 [/127.0.0.1] failed: Connection refused (Connection refused)
   [junit4]   2> 	at org.apache.http.impl.conn.DefaultHttpClientConnectionOperator.connect(DefaultHttpClientConnectionOperator.java:159)
   [junit4]   2> 	at org.apache.http.impl.conn.PoolingHttpClientConnectionManager.connect(PoolingHttpClientConnectionManager.java:359)
   [junit4]   2> 	at org.apache.http.impl.execchain.MainClientExec.establishRoute(MainClientExec.java:381)
   [junit4]   2> 	at org.apache.http.impl.execchain.MainClientExec.execute(MainClientExec.java:237)
   [junit4]   2> 	at org.apache.http.impl.execchain.ProtocolExec.execute(ProtocolExec.java:185)
   [junit4]   2> 	at org.apache.http.impl.execchain.RetryExec.execute(RetryExec.java:89)
   [junit4]   2> 	at org.apache.http.impl.execchain.RedirectExec.execute(RedirectExec.java:111)
   [junit4]   2> 	at org.apache.http.impl.client.InternalHttpClient.doExecute(InternalHttpClient.java:185)
   [junit4]   2> 	at org.apache.http.impl.client.CloseableHttpClient.execute(CloseableHttpClient.java:83)
   [junit4]   2> 	at org.apache.http.impl.client.CloseableHttpClient.execute(CloseableHttpClient.java:56)
   [junit4]   2> 	at org.apache.solr.client.solrj.impl.HttpSolrClient.executeMethod(HttpSolrClient.java:542)
   [junit4]   2> 	... 12 more
   [junit4]   2> Caused by: java.net.ConnectException: Connection refused (Connection refused)
   [junit4]   2> 	at java.base/java.net.PlainSocketImpl.socketConnect(Native Method)
   [junit4]   2> 	at java.base/java.net.AbstractPlainSocketImpl.doConnect(AbstractPlainSocketImpl.java:400)
   [junit4]   2> 	at java.base/java.net.AbstractPlainSocketImpl.connectToAddress(AbstractPlainSocketImpl.java:243)
   [junit4]   2> 	at java.base/java.net.AbstractPlainSocketImpl.connect(AbstractPlainSocketImpl.java:225)
   [junit4]   2> 	at java.base/java.net.SocksSocketImpl.connect(SocksSocketImpl.java:402)
   [junit4]   2> 	at java.base/java.net.Socket.connect(Socket.java:591)
   [junit4]   2> 	at org.apache.http.conn.ssl.SSLConnectionSocketFactory.connectSocket(SSLConnectionSocketFactory.java:339)
   [junit4]   2> 	at org.apache.http.impl.conn.DefaultHttpClientConnectionOperator.connect(DefaultHttpClientConnectionOperator.java:142)
   [junit4]   2> 	... 22 more
   [junit4]   2> 1419110 ERROR (OverseerThreadFactory-4075-thread-1) [    ] o.a.s.c.OverseerCollectionMessageHandler Error from shard: https://127.0.0.1:39207/solr
   [junit4]   2> org.apache.solr.client.solrj.SolrServerException: Server refused connection at: https://127.0.0.1:39207/solr
   [junit4]   2> 	at org.apache.solr.client.solrj.impl.HttpSolrClient.executeMethod(HttpSolrClient.java:650)
   [junit4]   2> 	at org.apache.solr.client.solrj.impl.HttpSolrClient.request(HttpSolrClient.java:255)
   [junit4]   2> 	at org.apache.solr.client.solrj.impl.HttpSolrClient.request(HttpSolrClient.java:244)
   [junit4]   2> 	at org.apache.solr.client.solrj.SolrClient.request(SolrClient.java:1219)
   [junit4]   2> 	at org.apache.solr.handler.component.HttpShardHandler.lambda$submit$0(HttpShardHandler.java:172)
   [junit4]   2> 	at java.base/java.util.concurrent.FutureTask.run(FutureTask.java:264)
   [junit4]   2> 	at java.base/java.util.concurrent.Executors$RunnableAdapter.call(Executors.java:514)
   [junit4]   2> 	at java.base/java.util.concurrent.FutureTask.run(FutureTask.java:264)
   [junit4]   2> 	at com.codahale.metrics.InstrumentedExecutorService$InstrumentedRunnable.run(InstrumentedExecutorService.java:176)
   [junit4]   2> 	at org.apache.solr.common.util.ExecutorUtil$MDCAwareThreadPoolExecutor.lambda$execute$0(ExecutorUtil.java:188)
   [junit4]   2> 	at java.base/java.util.concurrent.ThreadPoolExecutor.runWorker(ThreadPoolExecutor.java:1135)
   [junit4]   2> 	at java.base/java.util.concurrent.ThreadPoolExecutor$Worker.run(ThreadPoolExecutor.java:635)
   [junit4]   2> 	at java.base/java.lang.Thread.run(Thread.java:844)
   [junit4]   2> Caused by: org.apache.http.conn.HttpHostConnectException: Connect to 127.0.0.1:39207 [/127.0.0.1] failed: Connection refused (Connection refused)
   [junit4]   2> 	at org.apache.http.impl.conn.DefaultHttpClientConnectionOperator.connect(DefaultHttpClientConnectionOperator.java:159)
   [junit4]   2> 	at org.apache.http.impl.conn.PoolingHttpClientConnectionManager.connect(PoolingHttpClientConnectionManager.java:359)
   [junit4]   2> 	at org.apache.http.impl.execchain.MainClientExec.establishRoute(MainClientExec.java:381)
   [junit4]   2> 	at org.apache.http.impl.execchain.MainClientExec.execute(MainClientExec.java:237)
   [junit4]   2> 	at org.apache.http.impl.execchain.ProtocolExec.execute(ProtocolExec.java:185)
   [junit4]   2> 	at org.apache.http.impl.execchain.RetryExec.execute(RetryExec.java:89)
   [junit4]   2> 	at org.apache.http.impl.execchain.RedirectExec.execute(RedirectExec.java:111)
   [junit4]   2> 	at org.apache.http.impl.client.InternalHttpClient.doExecute(InternalHttpClient.java:185)
   [junit4]   2> 	at org.apache.http.impl.client.CloseableHttpClient.execute(CloseableHttpClient.java:83)
   [junit4]   2> 	at org.apache.http.impl.client.CloseableHttpClient.execute(CloseableHttpClient.java:56)
   [junit4]   2> 	at org.apache.solr.client.solrj.impl.HttpSolrClient.executeMethod(HttpSolrClient.java:542)
   [junit4]   2> 	... 12 more
   [junit4]   2> Caused by: java.net.ConnectException: Connection refused (Connection refused)
   [junit4]   2> 	at java.base/java.net.PlainSocketImpl.socketConnect(Native Method)
   [junit4]   2> 	at java.base/java.net.AbstractPlainSocketImpl.doConnect(AbstractPlainSocketImpl.java:400)
   [junit4]   2> 	at java.base/java.net.AbstractPlainSocketImpl.connectToAddress(AbstractPlainSocketImpl.java:243)
   [junit4]   2> 	at java.base/java.net.AbstractPlainSocketImpl.connect(AbstractPlainSocketImpl.java:225)
   [junit4]   2> 	at java.base/java.net.SocksSocketImpl.connect(SocksSocketImpl.java:402)
   [junit4]   2> 	at java.base/java.net.Socket.connect(Socket.java:591)
   [junit4]   2> 	at org.apache.http.conn.ssl.SSLConnectionSocketFactory.connectSocket(SSLConnectionSocketFactory.java:339)
   [junit4]   2> 	at org.apache.http.impl.conn.DefaultHttpClientConnectionOperator.connect(DefaultHttpClientConnectionOperator.java:142)
   [junit4]   2> 	... 22 more
   [junit4]   2> 1419110 INFO  (jetty-closer-2332-thread-1) [    ] o.a.s.m.SolrMetricManager Closing metric reporters for registry=solr.node, tag=null
   [junit4]   2> 1419111 INFO  (jetty-closer-2332-thread-1) [    ] o.a.s.m.r.SolrJmxReporter Closing reporter [org.apache.solr.metrics.reporters.SolrJmxReporter@5142c78f: rootName = solr_40251, domain = solr.node, service url = null, agent id = null] for registry solr.node / com.codahale.metrics.MetricRegistry@75ec7951
   [junit4]   2> 1419115 INFO  (jetty-closer-2332-thread-2) [    ] o.a.s.m.SolrMetricManager Closing metric reporters for registry=solr.jvm, tag=null
   [junit4]   2> 1419115 INFO  (jetty-closer-2332-thread-2) [    ] o.a.s.m.r.SolrJmxReporter Closing reporter [org.apache.solr.metrics.reporters.SolrJmxReporter@6be40832: rootName = solr_39207, domain = solr.jvm, service url = null, agent id = null] for registry solr.jvm / com.codahale.metrics.MetricRegistry@38187395
   [junit4]   2> 1419115 INFO  (jetty-closer-2332-thread-1) [    ] o.a.s.m.SolrMetricManager Closing metric reporters for registry=solr.jvm, tag=null
   [junit4]   2> 1419115 INFO  (jetty-closer-2332-thread-1) [    ] o.a.s.m.r.SolrJmxReporter Closing reporter [org.apache.solr.metrics.reporters.SolrJmxReporter@52950432: rootName = solr_40251, domain = solr.jvm, service url = null, agent id = null] for registry solr.jvm / com.codahale.metrics.MetricRegistry@38187395
   [junit4]   2> 1419119 INFO  (jetty-closer-2332-thread-1) [    ] o.a.s.m.SolrMetricManager Closing metric reporters for registry=solr.jetty, tag=null
   [junit4]   2> 1419119 INFO  (jetty-closer-2332-thread-1) [    ] o.a.s.m.r.SolrJmxReporter Closing reporter [org.apache.solr.metrics.reporters.SolrJmxReporter@7a71c058: rootName = solr_40251, domain = solr.jetty, service url = null, agent id = null] for registry solr.jetty / com.codahale.metrics.MetricRegistry@6d709af4
   [junit4]   2> 1419119 INFO  (jetty-closer-2332-thread-1) [    ] o.a.s.c.ZkController Remove node as live in ZooKeeper:/live_nodes/127.0.0.1:40251_solr
   [junit4]   2> 1419120 INFO  (jetty-closer-2332-thread-1) [    ] o.a.s.m.SolrMetricManager Closing metric reporters for registry=solr.cluster, tag=null
   [junit4]   2> 1419120 INFO  (zkCallback-2347-thread-3) [    ] o.a.s.c.c.ZkStateReader Updated live nodes from ZooKeeper... (2) -> (1)
   [junit4]   2> 1419120 INFO  (zkCallback-2349-thread-4) [    ] o.a.s.c.c.ZkStateReader Updated live nodes from ZooKeeper... (2) -> (1)
   [junit4]   2> 1419120 INFO  (jetty-closer-2332-thread-2) [    ] o.a.s.m.SolrMetricManager Closing metric reporters for registry=solr.jetty, tag=null
   [junit4]   2> 1419120 INFO  (jetty-closer-2332-thread-2) [    ] o.a.s.m.r.SolrJmxReporter Closing reporter [org.apache.solr.metrics.reporters.SolrJmxReporter@78f32616: rootName = solr_39207, domain = solr.jetty, service url = null, agent id = null] for registry solr.jetty / com.codahale.metrics.MetricRegistry@6d709af4
   [junit4]   2> 1419121 INFO  (jetty-closer-2332-thread-2) [    ] o.a.s.c.ZkController Remove node as live in ZooKeeper:/live_nodes/127.0.0.1:39207_solr
   [junit4]   2> 1419121 INFO  (jetty-closer-2332-thread-2) [    ] o.a.s.m.SolrMetricManager Closing metric reporters for registry=solr.cluster, tag=null
   [junit4]   2> 1419121 INFO  (zkCallback-2347-thread-3) [    ] o.a.s.c.c.ZkStateReader Updated live nodes from ZooKeeper... (1) -> (0)
   [junit4]   2> 1419122 INFO  (zkCallback-2349-thread-4) [    ] o.a.s.c.c.ZkStateReader Updated live nodes from ZooKeeper... (1) -> (0)
   [junit4]   2> 1419125 INFO  (coreCloseExecutor-4090-thread-1) [    ] o.a.s.c.SolrCore [testschemaapi_shard1_replica_n1]  CLOSING SolrCore org.apache.solr.core.SolrCore@31b99ec4
   [junit4]   2> 1419125 INFO  (coreCloseExecutor-4090-thread-1) [    ] o.a.s.m.SolrMetricManager Closing metric reporters for registry=solr.core.testschemaapi.shard1.replica_n1, tag=834248388
   [junit4]   2> 1419125 INFO  (coreCloseExecutor-4091-thread-1) [    ] o.a.s.c.SolrCore [testschemaapi_shard1_replica_n2]  CLOSING SolrCore org.apache.solr.core.SolrCore@6914908a
   [junit4]   2> 1419125 INFO  (coreCloseExecutor-4090-thread-1) [    ] o.a.s.m.r.SolrJmxReporter Closing reporter [org.apache.solr.metrics.reporters.SolrJmxReporter@186a6bb0: rootName = solr_40251, domain = solr.core.testschemaapi.shard1.replica_n1, service url = null, agent id = null] for registry solr.core.testschemaapi.shard1.replica_n1 / com.codahale.metrics.MetricRegistry@21dd8d63
   [junit4]   2> 1419125 INFO  (coreCloseExecutor-4091-thread-1) [    ] o.a.s.m.SolrMetricManager Closing metric reporters for registry=solr.core.testschemaapi.shard1.replica_n2, tag=1762955402
   [junit4]   2> 1419125 INFO  (coreCloseExecutor-4091-thread-1) [    ] o.a.s.m.r.SolrJmxReporter Closing reporter [org.apache.solr.metrics.reporters.SolrJmxReporter@7b2aa2e: rootName = solr_39207, domain = solr.core.testschemaapi.shard1.replica_n2, service url = null, agent id = null] for registry solr.core.testschemaapi.shard1.replica_n2 / com.codahale.metrics.MetricRegistry@4241dcdf
   [junit4]   2> 1419131 INFO  (coreCloseExecutor-4090-thread-1) [    ] o.a.s.m.SolrMetricManager Closing metric reporters for registry=solr.collection.testschemaapi.shard1.leader, tag=834248388
   [junit4]   2> 1419136 INFO  (coreCloseExecutor-4091-thread-1) [    ] o.a.s.m.SolrMetricManager Closing metric reporters for registry=solr.collection.testschemaapi.shard1.leader, tag=1762955402
   [junit4]   2> 1419141 INFO  (jetty-closer-2332-thread-1) [    ] o.a.s.c.Overseer Overseer (id=99199313905319942-127.0.0.1:40251_solr-n_0000000000) closing
   [junit4]   2> 1419141 INFO  (OverseerStateUpdate-99199313905319942-127.0.0.1:40251_solr-n_0000000000) [    ] o.a.s.c.Overseer Overseer Loop exiting : 127.0.0.1:40251_solr
   [junit4]   2> 1419145 INFO  (jetty-closer-2332-thread-2) [    ] o.e.j.s.h.ContextHandler Stopped o.e.j.s.ServletContextHandler@52547fa{/solr,null,UNAVAILABLE}
   [junit4]   2> 1419171 ERROR (qtp1012192315-10350) [    ] o.a.s.c.ZkController Error getting leader from zk
   [junit4]   2> org.apache.solr.common.SolrException: No registered leader was found after waiting for 1220000ms , collection: testschemaapi slice: shard1 saw state=DocCollection(testschemaapi//collections/testschemaapi/state.json/2)={
   [junit4]   2>   "pullReplicas":"0",
   [junit4]   2>   "replicationFactor":"2",
   [junit4]   2>   "shards":{"shard1":{
   [junit4]   2>       "range":"80000000-7fffffff",
   [junit4]   2>       "state":"active",
   [junit4]   2>       "replicas":{
   [junit4]   2>         "core_node3":{
   [junit4]   2>           "core":"testschemaapi_shard1_replica_n1",
   [junit4]   2>           "base_url":"https://127.0.0.1:40251/solr",
   [junit4]   2>           "node_name":"127.0.0.1:40251_solr",
   [junit4]   2>           "state":"down",
   [junit4]   2>           "type":"NRT"},
   [junit4]   2>         "core_node4":{
   [junit4]   2>           "core":"testschemaapi_shard1_replica_n2",
   [junit4]   2>           "base_url":"https://127.0.0.1:39207/solr",
   [junit4]   2>           "node_name":"127.0.0.1:39207_solr",
   [junit4]   2>           "state":"down",
   [junit4]   2>           "type":"NRT"}}}},
   [junit4]   2>   "router":{"name":"compositeId"},
   [junit4]   2>   "maxShardsPerNode":"1",
   [junit4]   2>   "autoAddReplicas":"false",
   [junit4]   2>   "nrtReplicas":"2",
   [junit4]   2>   "tlogReplicas":"0"} with live_nodes=[]
   [junit4]   2> 	at org.apache.solr.common.cloud.ZkStateReader.getLeaderRetry(ZkStateReader.java:772)
   [junit4]   2> 	at org.apache.solr.common.cloud.ZkStateReader.getLeaderUrl(ZkStateReader.java:737)
   [junit4]   2> 	at org.apache.solr.cloud.ZkController.getLeader(ZkController.java:1178)
   [junit4]   2> 	at org.apache.solr.cloud.ZkController.register(ZkController.java:1079)
   [junit4]   2> 	at org.apache.solr.cloud.ZkController.register(ZkController.java:1014)
   [junit4]   2> 	at org.apache.solr.core.ZkContainer.lambda$registerInZk$0(ZkContainer.java:181)
   [junit4]   2> 	at org.apache.solr.core.ZkContainer.registerInZk(ZkContainer.java:208)
   [junit4]   2> 	at org.apache.solr.core.CoreContainer.registerCore(CoreContainer.java:886)
   [junit4]   2> 	at org.apache.solr.core.CoreContainer.createFromDescriptor(CoreContainer.java:1047)
   [junit4]   2> 	at org.apache.solr.core.CoreContainer.create(CoreContainer.java:948)
   [junit4]   2> 	at org.apache.solr.handler.admin.CoreAdminOperation.lambda$static$0(CoreAdminOperation.java:91)
   [junit4]   2> 	at org.apache.solr.handler.admin.CoreAdminOperation.execute(CoreAdminOperation.java:384)
   [junit4]   2> 	at org.apache.solr.handler.admin.CoreAdminHandler$CallInfo.call(CoreAdminHandler.java:389)
   [junit4]   2> 	at org.apache.solr.handler.admin.CoreAdminHandler.handleRequestBody(CoreAdminHandler.java:174)
   [junit4]   2> 	at org.apache.solr.handler.RequestHandlerBase.handleRequest(RequestHandlerBase.java:177)
   [junit4]   2> 	at org.apache.solr.servlet.HttpSolrCall.handleAdmin(HttpSolrCall.java:735)
   [junit4]   2> 	at org.apache.solr.servlet.HttpSolrCall.handleAdminRequest(HttpSolrCall.java:716)
   [junit4]   2> 	at org.apache.solr.servlet.HttpSolrCall.call(HttpSolrCall.java:497)
   [junit4]   2> 	at org.apache.solr.servlet.SolrDispatchFilter.doFilter(SolrDispatchFilter.java:382)
   [junit4]   2> 	at org.apache.solr.servlet.SolrDispatchFilter.doFilter(SolrDispatchFilter.java:326)
   [junit4]   2> 	at org.eclipse.jetty.servlet.ServletHandler$CachedChain.doFilter(ServletHandler.java:1759)
   [junit4]   2> 	at org.apache.solr.client.solrj.embedded.JettySolrRunner$DebugFilter.doFilter(JettySolrRunner.java:139)
   [junit4]   2> 	at org.eclipse.jetty.servlet.ServletHandler$CachedChain.doFilter(ServletHandler.java:1759)
   [junit4]   2> 	at org.eclipse.jetty.servlet.ServletHandler.doHandle(ServletHandler.java:582)
   [junit4]   2> 	at org.eclipse.jetty.server.session.SessionHandler.doHandle(SessionHandler.java:224)
   [junit4]   2> 	at org.eclipse.jetty.server.handler.ContextHandler.doHandle(ContextHandler.java:1180)
   [junit4]   2> 	at org.eclipse.jetty.servlet.ServletHandler.doScope(ServletHandler.java:512)
   [junit4]   2> 	at org.eclipse.jetty.server.session.SessionHandler.doScope(SessionHandler.java:185)
   [junit4]   2> 	at org.eclipse.jetty.server.handler.ContextHandler.doScope(ContextHandler.java:1112)
   [junit4]   2> 	at org.eclipse.jetty.server.handler.ScopedHandler.handle(ScopedHandler.java:141)
   [junit4]   2> 	at org.eclipse.jetty.server.handler.gzip.GzipHandler.handle(GzipHandler.java:426)
   [junit4]   2> 	at org.eclipse.jetty.server.handler.HandlerWrapper.handle(HandlerWrapper.java:134)
   [junit4]   2> 	at org.eclipse.jetty.server.Server.handle(Server.java:534)
   [junit4]   2> 	at org.eclipse.jetty.server.HttpChannel.handle(HttpChannel.java:320)
   [junit4]   2> 	at org.eclipse.jetty.server.HttpConnection.onFillable(HttpConnection.java:251)
   [junit4]   2> 	at org.eclipse.jetty.io.AbstractConnection$ReadCallback.succeeded(AbstractConnection.java:283)
   [junit4]   2> 	at org.eclipse.jetty.io.FillInterest.fillable(FillInterest.java:108)
   [junit4]   2> 	at org.eclipse.jetty.io.ssl.SslConnection.onFillable(SslConnection.java:251)
   [junit4]   2> 	at org.eclipse.jetty.io.AbstractConnection$ReadCallback.succeeded(AbstractConnection.java:283)
   [junit4]   2> 	at org.eclipse.jetty.io.FillInterest.fillable(FillInterest.java:108)
   [junit4]   2> 	at org.eclipse.jetty.io.SelectChannelEndPoint$2.run(SelectChannelEndPoint.java:93)
   [junit4]   2> 	at org.eclipse.jetty.util.thread.strategy.ExecuteProduceConsume.executeProduceConsume(ExecuteProduceConsume.java:303)
   [junit4]   2> 	at org.eclipse.jetty.util.thread.strategy.ExecuteProduceConsume.produceConsume(ExecuteProduceConsume.java:148)
   [junit4]   2> 	at org.eclipse.jetty.util.thread.strategy.ExecuteProduceConsume.run(ExecuteProduceConsume.java:136)
   [junit4]   2> 	at org.eclipse.jetty.util.thread.QueuedThreadPool.runJob(QueuedThreadPool.java:671)
   [junit4]   2> 	at org.eclipse.jetty.util.thread.QueuedThreadPool$2.run(QueuedThreadPool.java:589)
   [junit4]   2> 	at java.base/java.lang.Thread.run(Thread.java:844)
   [junit4]   2> 1419172 ERROR (qtp1012192315-10350) [    ] o.a.s.c.ZkContainer :org.apache.solr.common.SolrException: Error getting leader from zk for shard shard1
   [junit4]   2> 	at org.apache.solr.cloud.ZkController.getLeader(ZkController.java:1207)
   [junit4]   2> 	at org.apache.solr.cloud.ZkController.register(ZkController.java:1079)
   [junit4]   2> 	at org.apache.solr.cloud.ZkController.register(ZkController.java:1014)
   [junit4]   2> 	at org.apache.solr.core.ZkContainer.lambda$registerInZk$0(ZkContainer.java:181)
   [junit4]   2> 	at org.apache.solr.core.ZkContainer.registerInZk(ZkContainer.java:208)
   [junit4]   2> 	at org.apache.solr.core.CoreContainer.registerCore(CoreContainer.java:886)
   [junit4]   2> 	at org.apache.solr.core.CoreContainer.createFromDescriptor(CoreContainer.java:1047)
   [junit4]   2> 	at org.apache.solr.core.CoreContainer.create(CoreContainer.java:948)
   [junit4]   2> 	at org.apache.solr.handler.admin.CoreAdminOperation.lambda$static$0(CoreAdminOperation.java:91)
   [junit4]   2> 	at org.apache.solr.handler.admin.CoreAdminOperation.execute(CoreAdminOperation.java:384)
   [junit4]   2> 	at org.apache.solr.handler.admin.CoreAdminHandler$CallInfo.call(CoreAdminHandler.java:389)
   [junit4]   2> 	at org.apache.solr.handler.admin.CoreAdminHandler.handleRequestBody(CoreAdminHandler.java:174)
   [junit4]   2> 	at org.apache.solr.handler.RequestHandlerBase.handleRequest(RequestHandlerBase.java:177)
   [junit4]   2> 	at org.apache.solr.servlet.HttpSolrCall.handleAdmin(HttpSolrCall.java:735)
   [junit4]   2> 	at org.apache.solr.servlet.HttpSolrCall.handleAdminRequest(HttpSolrCall.java:716)
   [junit4]   2> 	at org.apache.solr.servlet.HttpSolrCall.call(HttpSolrCall.java:497)
   [junit4]   2> 	at org.apache.solr.servlet.SolrDispatchFilter.doFilter(SolrDispatchFilter.java:382)
   [junit4]   2> 	at org.apache.solr.servlet.SolrDispatchFilter.doFilter(SolrDispatchFilter.java:326)
   [junit4]   2> 	at org.eclipse.jetty.servlet.ServletHandler$CachedChain.doFilter(ServletHandler.java:1759)
   [junit4]   2> 	at org.apache.solr.client.solrj.embedded.JettySolrRunner$DebugFilter.doFilter(JettySolrRunner.java:139)
   [junit4]   2> 	at org.eclipse.jetty.servlet.ServletHandler$CachedChain.doFilter(ServletHandler.java:1759)
   [junit4]   2> 	at org.eclipse.jetty.servlet.ServletHandler.doHandle(ServletHandler.java:582)
   [junit4]   2> 	at org.eclipse.jetty.server.session.SessionHandler.doHandle(SessionHandler.java:224)
   [junit4]   2> 	at org.eclipse.jetty.server.handler.ContextHandler.doHandle(ContextHandler.java:1180)
   [junit4]   2> 	at org.eclipse.jetty.servlet.ServletHandler.doScope(ServletHandler.java:512)
   [junit4]   2> 	at org.eclipse.jetty.server.session.SessionHandler.doScope(SessionHandler.java:185)
   [junit4]   2> 	at org.eclipse.jetty.server.handler.ContextHandler.doScope(ContextHandler.java:1112)
   [junit4]   2> 	at org.eclipse.jetty.server.handler.ScopedHandler.handle(ScopedHandler.java:141)
   [junit4]   2> 	at org.eclipse.jetty.server.handler.gzip.GzipHandler.handle(GzipHandler.java:426)
   [junit4]   2> 	at org.eclipse.jetty.server.handler.HandlerWrapper.handle(HandlerWrapper.java:134)
   [junit4]   2> 	at org.eclipse.jetty.server.Server.handle(Server.java:534)
   [junit4]   2> 	at org.eclipse.jetty.server.HttpChannel.handle(HttpChannel.java:320)
   [junit4]   2> 	at org.eclipse.jetty.server.HttpConnection.onFillable(HttpConnection.java:251)
   [junit4]   2> 	at org.eclipse.jetty.io.AbstractConnection$ReadCallback.succeeded(AbstractConnection.java:283)
   [junit4]   2> 	at org.eclipse.jetty.io.FillInterest.fillable(FillInterest.java:108)
   [junit4]   2> 	at org.eclipse.jetty.io.ssl.SslConnection.onFillable(SslConnection.java:251)
   [junit4]   2> 	at org.eclipse.jetty.io.AbstractConnection$ReadCallback.succeeded(AbstractConnection.java:283)
   [junit4]   2> 	at org.eclipse.jetty.io.FillInterest.fillable(FillInterest.java:108)
   [junit4]   2> 	at org.eclipse.jetty.io.SelectChannelEndPoint$2.run(SelectChannelEndPoint.java:93)
   [junit4]   2> 	at org.eclipse.jetty.util.thread.strategy.ExecuteProduceConsume.executeProduceConsume(ExecuteProduceConsume.java:303)
   [junit4]   2> 	at org.eclipse.jetty.util.thread.strategy.ExecuteProduceConsume.produceConsume(ExecuteProduceConsume.java:148)
   [junit4]   2> 	at org.eclipse.jetty.util.thread.strategy.ExecuteProduceConsume.run(ExecuteProduceConsume.java:136)
   [junit4]   2> 	at org.eclipse.jetty.util.thread.QueuedThreadPool.runJob(QueuedThreadPool.java:671)
   [junit4]   2> 	at org.eclipse.jetty.util.thread.QueuedThreadPool$2.run(QueuedThreadPool.java:589)
   [junit4]   2> 	at java.base/java.lang.Thread.run(Thread.java:844)
   [junit4]   2> Caused by: org.apache.solr.common.SolrException: No registered leader was found after waiting for 1220000ms , collection: testschemaapi slice: shard1 saw state=DocCollection(testschemaapi//collections/testschemaapi/state.json/2)={
   [junit4]   2>   "pullReplicas":"0",
   [junit4]   2>   "replicationFactor":"2",
   [junit4]   2>   "shards":{"shard1":{
   [junit4]   2>       "range":"80000000-7fffffff",
   [junit4]   2>       "state":"active",
   [junit4]   2>       "replicas":{
   [junit4]   2>         "core_node3":{
   [junit4]   2>           "core":"testschemaapi_shard1_replica_n1",
   [junit4]   2>           "base_url":"https://127.0.0.1:40251/solr",
   [junit4]   2>           "node_name":"127.0.0.1:40251_solr",
   [junit4]   2>           "state":"down",
   [junit4]   2>           "type":"NRT"},
   [junit4]   2>         "core_node4":{
   [junit4]   2>           "core":"testschemaapi_shard1_replica_n2",
   [junit4]   2>           "base_url":"https://127.0.0.1:39207/solr",
   [junit4]   2>           "node_name":"127.0.0.1:39207_solr",
   [junit4]   2>           "state":"down",
   [junit4]   2>           "type":"NRT"}}}},
   [junit4]   2>   "router":{"name":"compositeId"},
   [junit4]   2>   "maxShardsPerNode":"1",
   [junit4]   2>   "autoAddReplicas":"false",
   [junit4]   2>   "nrtReplicas":"2",
   [junit4]   2>   "tlogReplicas":"0"} with live_nodes=[]
   [junit4]   2> 	at org.apache.solr.common.cloud.ZkStateReader.getLeaderRetry(ZkStateReader.java:772)
   [junit4]   2> 	at org.apache.solr.common.cloud.ZkStateReader.getLeaderUrl(ZkStateReader.java:737)
   [junit4]   2> 	at org.apache.solr.cloud.ZkController.getLeader(ZkController.java:1178)
   [junit4]   2> 	... 44 more
   [junit4]   2> 
   [junit4]   2> 1419183 INFO  (qtp1012192315-10350) [    ] o.a.s.s.HttpSolrCall [admin] webapp=null path=/admin/cores params={qt=/admin/cores&coreNodeName=core_node4&collection.configName=conf1&newCollection=true&name=testschemaapi_shard1_replica_n2&action=CREATE&numShards=1&collection=testschemaapi&shard=shard1&wt=javabin&version=2&replicaType=NRT} status=0 QTime=179774
   [junit4]   2> 1449156 INFO  (zkCallback-2349-thread-4) [    ] o.a.s.c.c.ZkStateReader A cluster state change: [WatchedEvent state:SyncConnected type:NodeDeleted path:/collections/testschemaapi/state.json] for collection [testschemaapi] has occurred - updating... (live nodes size: [0])
   [junit4]   2> 1449156 INFO  (zkCallback-2349-thread-5) [    ] o.a.s.c.c.ZkStateReader A cluster state change: [WatchedEvent state:SyncConnected type:NodeDeleted path:/collections/testschemaapi/state.json] for collection [testschemaapi] has occurred - updating... (live nodes size: [0])
   [junit4]   2> 1449157 ERROR (OverseerThreadFactory-4075-thread-1) [    ] o.a.s.c.OverseerCollectionMessageHandler Collection: testschemaapi operation: create failed:org.apache.solr.common.SolrException: Could not fully remove collection: testschemaapi
   [junit4]   2> 	at org.apache.solr.cloud.DeleteCollectionCmd.call(DeleteCollectionCmd.java:109)
   [junit4]   2> 	at org.apache.solr.cloud.OverseerCollectionMessageHandler.cleanupCollection(OverseerCollectionMessageHandler.java:679)
   [junit4]   2> 	at org.apache.solr.cloud.CreateCollectionCmd.call(CreateCollectionCmd.java:302)
   [junit4]   2> 	at org.apache.solr.cloud.OverseerCollectionMessageHandler.processMessage(OverseerCollectionMessageHandler.java:233)
   [junit4]   2> 	at org.apache.solr.cloud.OverseerTaskProcessor$Runner.run(OverseerTaskProcessor.java:464)
   [junit4]   2> 	at org.apache.solr.common.util.ExecutorUtil$MDCAwareThreadPoolExecutor.lambda$execute$0(ExecutorUtil.java:188)
   [junit4]   2> 	at java.base/java.util.concurrent.ThreadPoolExecutor.runWorker(ThreadPoolExecutor.java:1135)
   [junit4]   2> 	at java.base/java.util.concurrent.ThreadPoolExecutor$Worker.run(ThreadPoolExecutor.java:635)
   [junit4]   2> 	at java.base/java.lang.Thread.run(Thread.java:844)
   [junit4]   2> 
   [junit4]   2> 1449158 INFO  (OverseerThreadFactory-4075-thread-1) [    ] o.a.s.c.OverseerTaskQueue Response ZK path: /overseer/collection-queue-work/qnr-0000000000 doesn't exist.  Requestor may have disconnected from ZooKeeper
   [junit4]   2> 1449158 WARN  (OverseerAutoScalingTriggerThread-99199313905319942-127.0.0.1:40251_solr-n_0000000000) [    ] o.a.s.c.a.OverseerTriggerThread OverseerTriggerThread woken up but we are closed, exiting.
   [junit4]   2> 1449159 INFO  (jetty-closer-2332-thread-1) [    ] o.e.j.s.h.ContextHandler Stopped o.e.j.s.ServletContextHandler@603a5058{/solr,null,UNAVAILABLE}
   [junit4]   2> 1449206 ERROR (qtp1052556356-10343) [    ] o.a.s.c.ZkController Error getting leader from zk
   [junit4]   2> org.apache.solr.common.SolrException: No registered leader was found after waiting for 1220000ms , collection: testschemaapi slice: shard1 saw state=null with live_nodes=[]
   [junit4]   2> 	at org.apache.solr.common.cloud.ZkStateReader.getLeaderRetry(ZkStateReader.java:772)
   [junit4]   2> 	at org.apache.solr.common.cloud.ZkStateReader.getLeaderUrl(ZkStateReader.java:737)
   [junit4]   2> 	at org.apache.solr.cloud.ZkController.getLeader(ZkController.java:1178)
   [junit4]   2> 	at org.apache.solr.cloud.ZkController.register(ZkController.java:1079)
   [junit4]   2> 	at org.apache.solr.cloud.ZkController.register(ZkController.java:1014)
   [junit4]   2> 	at org.apache.solr.core.ZkContainer.lambda$registerInZk$0(ZkContainer.java:181)
   [junit4]   2> 	at org.apache.solr.core.ZkContainer.registerInZk(ZkContainer.java:208)
   [junit4]   2> 	at org.apache.solr.core.CoreContainer.registerCore(CoreContainer.java:886)
   [junit4]   2> 	at org.apache.solr.core.CoreContainer.createFromDescriptor(CoreContainer.java:1047)
   [junit4]   2> 	at org.apache.solr.core.CoreContainer.create(CoreContainer.java:948)
   [junit4]   2> 	at org.apache.solr.handler.adm

[...truncated too long message...]

e.solr.handler.admin.CoreAdminOperation.execute(CoreAdminOperation.java:384)
   [junit4]   2> 	at org.apache.solr.handler.admin.CoreAdminHandler$CallInfo.call(CoreAdminHandler.java:389)
   [junit4]   2> 	at org.apache.solr.handler.admin.CoreAdminHandler.handleRequestBody(CoreAdminHandler.java:174)
   [junit4]   2> 	at org.apache.solr.handler.RequestHandlerBase.handleRequest(RequestHandlerBase.java:177)
   [junit4]   2> 	at org.apache.solr.servlet.HttpSolrCall.handleAdmin(HttpSolrCall.java:735)
   [junit4]   2> 	at org.apache.solr.servlet.HttpSolrCall.handleAdminRequest(HttpSolrCall.java:716)
   [junit4]   2> 	at org.apache.solr.servlet.HttpSolrCall.call(HttpSolrCall.java:497)
   [junit4]   2> 	at org.apache.solr.servlet.SolrDispatchFilter.doFilter(SolrDispatchFilter.java:382)
   [junit4]   2> 	at org.apache.solr.servlet.SolrDispatchFilter.doFilter(SolrDispatchFilter.java:326)
   [junit4]   2> 	at org.eclipse.jetty.servlet.ServletHandler$CachedChain.doFilter(ServletHandler.java:1759)
   [junit4]   2> 	at org.apache.solr.client.solrj.embedded.JettySolrRunner$DebugFilter.doFilter(JettySolrRunner.java:139)
   [junit4]   2> 	at org.eclipse.jetty.servlet.ServletHandler$CachedChain.doFilter(ServletHandler.java:1759)
   [junit4]   2> 	at org.eclipse.jetty.servlet.ServletHandler.doHandle(ServletHandler.java:582)
   [junit4]   2> 	at org.eclipse.jetty.server.session.SessionHandler.doHandle(SessionHandler.java:224)
   [junit4]   2> 	at org.eclipse.jetty.server.handler.ContextHandler.doHandle(ContextHandler.java:1180)
   [junit4]   2> 	at org.eclipse.jetty.servlet.ServletHandler.doScope(ServletHandler.java:512)
   [junit4]   2> 	at org.eclipse.jetty.server.session.SessionHandler.doScope(SessionHandler.java:185)
   [junit4]   2> 	at org.eclipse.jetty.server.handler.ContextHandler.doScope(ContextHandler.java:1112)
   [junit4]   2> 	at org.eclipse.jetty.server.handler.ScopedHandler.handle(ScopedHandler.java:141)
   [junit4]   2> 	at org.eclipse.jetty.server.handler.gzip.GzipHandler.handle(GzipHandler.java:426)
   [junit4]   2> 	at org.eclipse.jetty.server.handler.HandlerWrapper.handle(HandlerWrapper.java:134)
   [junit4]   2> 	at org.eclipse.jetty.server.Server.handle(Server.java:534)
   [junit4]   2> 	at org.eclipse.jetty.server.HttpChannel.handle(HttpChannel.java:320)
   [junit4]   2> 	at org.eclipse.jetty.server.HttpConnection.onFillable(HttpConnection.java:251)
   [junit4]   2> 	at org.eclipse.jetty.io.AbstractConnection$ReadCallback.succeeded(AbstractConnection.java:283)
   [junit4]   2> 	at org.eclipse.jetty.io.FillInterest.fillable(FillInterest.java:108)
   [junit4]   2> 	at org.eclipse.jetty.io.ssl.SslConnection.onFillable(SslConnection.java:251)
   [junit4]   2> 	at org.eclipse.jetty.io.AbstractConnection$ReadCallback.succeeded(AbstractConnection.java:283)
   [junit4]   2> 	at org.eclipse.jetty.io.FillInterest.fillable(FillInterest.java:108)
   [junit4]   2> 	at org.eclipse.jetty.io.SelectChannelEndPoint$2.run(SelectChannelEndPoint.java:93)
   [junit4]   2> 	at org.eclipse.jetty.util.thread.strategy.ExecuteProduceConsume.executeProduceConsume(ExecuteProduceConsume.java:303)
   [junit4]   2> 	at org.eclipse.jetty.util.thread.strategy.ExecuteProduceConsume.produceConsume(ExecuteProduceConsume.java:148)
   [junit4]   2> 	at org.eclipse.jetty.util.thread.strategy.ExecuteProduceConsume.run(ExecuteProduceConsume.java:136)
   [junit4]   2> 	at org.eclipse.jetty.util.thread.QueuedThreadPool.runJob(QueuedThreadPool.java:671)
   [junit4]   2> 	at org.eclipse.jetty.util.thread.QueuedThreadPool$2.run(QueuedThreadPool.java:589)
   [junit4]   2> 	at java.base/java.lang.Thread.run(Thread.java:844)
   [junit4]   2> Caused by: org.apache.solr.common.SolrException: No registered leader was found after waiting for 1220000ms , collection: collection1 slice: shard2 saw state=null with live_nodes=[]
   [junit4]   2> 	at org.apache.solr.common.cloud.ZkStateReader.getLeaderRetry(ZkStateReader.java:772)
   [junit4]   2> 	at org.apache.solr.common.cloud.ZkStateReader.getLeaderUrl(ZkStateReader.java:737)
   [junit4]   2> 	at org.apache.solr.cloud.ZkController.getLeader(ZkController.java:1178)
   [junit4]   2> 	... 44 more
   [junit4]   2> 
   [junit4]   2> 282795 INFO  (qtp250092593-712) [    ] o.a.s.s.HttpSolrCall [admin] webapp=null path=/admin/cores params={qt=/admin/cores&coreNodeName=core_node4&collection.configName=conf&newCollection=true&name=collection1_shard2_replica_n2&action=CREATE&numShards=2&collection=collection1&shard=shard2&wt=javabin&version=2&replicaType=NRT} status=0 QTime=209786
   [junit4]   2> 282796 ERROR (SUITE-CloudSolrClientTest-seed#[DB2DF2D8228BAF27]-worker) [    ] o.a.z.s.ZooKeeperServer ZKShutdownHandler is not registered, so ZooKeeper server won't take any action on ERROR or SHUTDOWN server state changes
   [junit4]   2> 282796 INFO  (SUITE-CloudSolrClientTest-seed#[DB2DF2D8228BAF27]-worker) [    ] o.a.s.c.ZkTestServer connecting to 127.0.0.1:46577 46577
   [junit4]   2> 287910 INFO  (Thread-120) [    ] o.a.s.c.ZkTestServer connecting to 127.0.0.1:46577 46577
   [junit4]   2> 287910 WARN  (Thread-120) [    ] o.a.s.c.ZkTestServer Watch limit violations: 
   [junit4]   2> Maximum concurrent create/delete watches above limit:
   [junit4]   2> 
   [junit4]   2> 	4	/solr/aliases.json
   [junit4]   2> 	3	/solr/security.json
   [junit4]   2> 	2	/solr/configs/conf
   [junit4]   2> 
   [junit4]   2> Maximum concurrent data watches above limit:
   [junit4]   2> 
   [junit4]   2> 	6	/solr/collections/collection1/state.json
   [junit4]   2> 	4	/solr/clusterstate.json
   [junit4]   2> 	4	/solr/clusterprops.json
   [junit4]   2> 
   [junit4]   2> Maximum concurrent children watches above limit:
   [junit4]   2> 
   [junit4]   2> 	4	/solr/live_nodes
   [junit4]   2> 	4	/solr/collections
   [junit4]   2> 
   [junit4]   2> 287910 INFO  (SUITE-CloudSolrClientTest-seed#[DB2DF2D8228BAF27]-worker) [    ] o.a.s.SolrTestCaseJ4 ------------------------------------------------------- Done waiting for tracked resources to be released
   [junit4]   2> NOTE: test params are: codec=FastDecompressionCompressingStoredFields(storedFieldsFormat=CompressingStoredFieldsFormat(compressionMode=FAST_DECOMPRESSION, chunkSize=20352, maxDocsPerChunk=5, blockSize=8), termVectorsFormat=CompressingTermVectorsFormat(compressionMode=FAST_DECOMPRESSION, chunkSize=20352, blockSize=8)), sim=RandomSimilarity(queryNorm=true): {}, locale=es-AR, timezone=America/Argentina/Cordoba
   [junit4]   2> NOTE: Linux 4.10.0-40-generic amd64/Oracle Corporation 10-ea (64-bit)/cpus=8,threads=1,free=219688824,total=536870912
   [junit4]   2> NOTE: All tests run in this JVM: [SolrExampleStreamingBinaryTest, TestDelegationTokenRequest, LengthEvaluatorTest, RecursiveEvaluatorTest, UniformDistributionEvaluatorTest, JsonValidatorTest, CeilingEvaluatorTest, TestDocumentObjectBinder, SubtractEvaluatorTest, ConcatOperationTest, SolrExampleEmbeddedTest, MergeIndexesEmbeddedTest, NormalDistributionEvaluatorTest, RoundEvaluatorTest, CumulativeProbabilityEvaluatorTest, CorrelationEvaluatorTest, TestDelegationTokenResponse, QueryResponseTest, FacetFieldTest, ClientUtilsTest, HttpSolrClientSSLAuthConPoolTest, JDBCStreamTest, TestSolrProperties, SolrDocumentTest, SolrExampleJettyTest, TestBatchUpdate, SolrParamTest, TermsResponseTest, TestNamedListCodec, TestJavaBinCodec, SolrQueryTest, TestHash, ContentStreamTest, ModifiableSolrParamsTest, TestFastInputStream, TestXMLEscaping, DocumentAnalysisResponseTest, TestUpdateRequestCodec, FieldAnalysisResponseTest, NamedListTest, UsingSolrJRefGuideExamplesTest, CloudSolrClientMultiConstructorTest, CloudSolrClientTest]
   [junit4]   2> NOTE: reproduce with: ant test  -Dtestcase=CloudSolrClientTest -Dtests.seed=DB2DF2D8228BAF27 -Dtests.multiplier=3 -Dtests.slow=true -Dtests.locale=es-AR -Dtests.timezone=America/Argentina/Cordoba -Dtests.asserts=true -Dtests.file.encoding=US-ASCII
   [junit4] ERROR   0.00s J1 | CloudSolrClientTest (suite) <<<
   [junit4]    > Throwable #1: org.apache.solr.client.solrj.impl.HttpSolrClient$RemoteSolrException: Error from server at https://127.0.0.1:33555/solr: create the collection time out:180s
   [junit4]    > 	at __randomizedtesting.SeedInfo.seed([DB2DF2D8228BAF27]:0)
   [junit4]    > 	at org.apache.solr.client.solrj.impl.HttpSolrClient.executeMethod(HttpSolrClient.java:643)
   [junit4]    > 	at org.apache.solr.client.solrj.impl.HttpSolrClient.request(HttpSolrClient.java:255)
   [junit4]    > 	at org.apache.solr.client.solrj.impl.HttpSolrClient.request(HttpSolrClient.java:244)
   [junit4]    > 	at org.apache.solr.client.solrj.impl.LBHttpSolrClient.doRequest(LBHttpSolrClient.java:483)
   [junit4]    > 	at org.apache.solr.client.solrj.impl.LBHttpSolrClient.request(LBHttpSolrClient.java:413)
   [junit4]    > 	at org.apache.solr.client.solrj.impl.CloudSolrClient.sendRequest(CloudSolrClient.java:1103)
   [junit4]    > 	at org.apache.solr.client.solrj.impl.CloudSolrClient.requestWithRetryOnStaleState(CloudSolrClient.java:883)
   [junit4]    > 	at org.apache.solr.client.solrj.impl.CloudSolrClient.request(CloudSolrClient.java:816)
   [junit4]    > 	at org.apache.solr.client.solrj.SolrRequest.process(SolrRequest.java:194)
   [junit4]    > 	at org.apache.solr.client.solrj.SolrRequest.process(SolrRequest.java:211)
   [junit4]    > 	at org.apache.solr.client.solrj.impl.CloudSolrClientTest.setupCluster(CloudSolrClientTest.java:103)
   [junit4]    > 	at java.base/jdk.internal.reflect.NativeMethodAccessorImpl.invoke0(Native Method)
   [junit4]    > 	at java.base/jdk.internal.reflect.NativeMethodAccessorImpl.invoke(NativeMethodAccessorImpl.java:62)
   [junit4]    > 	at java.base/jdk.internal.reflect.DelegatingMethodAccessorImpl.invoke(DelegatingMethodAccessorImpl.java:43)
   [junit4]    > 	at java.base/java.lang.reflect.Method.invoke(Method.java:564)
   [junit4]    > 	at java.base/java.lang.Thread.run(Thread.java:844)
   [junit4] Completed [146/146 (1!)] on J1 in 215.54s, 0 tests, 1 error <<< FAILURES!

[...truncated 39252 lines...]

Mime
View raw message